Build failed in Hudson: Nutch-trunk #408

classic Classic list List threaded Threaded
3 messages Options
Reply | Threaded
Open this post in threaded view
|

Build failed in Hudson: Nutch-trunk #408

Apache Hudson Server
See http://hudson.zones.apache.org/hudson/job/Nutch-trunk/408/changes

------------------------------------------
[...truncated 6092 lines...]
init-plugin:

deps-jar:

compile:
     [echo] Compiling plugin: lib-regex-filter

jar:

init:

init-plugin:

deps-jar:

compile:
     [echo] Compiling plugin: lib-regex-filter

compile-test:

compile:
     [echo] Compiling plugin: urlfilter-automaton

compile-test:
    [javac] Compiling 1 source file to http://hudson.zones.apache.org/hudson/job/Nutch-trunk/ws/trunk/build/urlfilter-automaton/test 

jar:

deps-test:

init:

init-plugin:

deps-jar:

compile:
     [echo] Compiling plugin: lib-regex-filter

jar:

deps-test:

deploy:

copy-generated-lib:

deploy:

copy-generated-lib:

test:
     [echo] Testing plugin: urlfilter-automaton
    [junit] Running org.apache.nutch.urlfilter.automaton.TestAutomatonURLFilter
    [junit] Tests run: 1, Failures: 0, Errors: 0, Time elapsed: 13.499 sec

init:

init-plugin:

deps-jar:

init:

init-plugin:

deps-jar:

compile:
     [echo] Compiling plugin: lib-regex-filter

jar:

init:

init-plugin:

deps-jar:

compile:
     [echo] Compiling plugin: lib-regex-filter

compile-test:

compile:
     [echo] Compiling plugin: urlfilter-regex

compile-test:
    [javac] Compiling 1 source file to http://hudson.zones.apache.org/hudson/job/Nutch-trunk/ws/trunk/build/urlfilter-regex/test 

jar:

deps-test:

init:

init-plugin:

deps-jar:

compile:
     [echo] Compiling plugin: lib-regex-filter

jar:

deps-test:

deploy:

copy-generated-lib:

deploy:

copy-generated-lib:

test:
     [echo] Testing plugin: urlfilter-regex
    [junit] Running org.apache.nutch.urlfilter.regex.TestRegexURLFilter
    [junit] Tests run: 1, Failures: 0, Errors: 0, Time elapsed: 14.632 sec

init:

init-plugin:

deps-jar:

compile:
     [echo] Compiling plugin: urlfilter-suffix

compile-test:
    [javac] Compiling 1 source file to http://hudson.zones.apache.org/hudson/job/Nutch-trunk/ws/trunk/build/urlfilter-suffix/test 

jar:

deps-test:

deploy:

copy-generated-lib:

test:
     [echo] Testing plugin: urlfilter-suffix
    [junit] Running org.apache.nutch.urlfilter.suffix.TestSuffixURLFilter
    [junit] Tests run: 6, Failures: 0, Errors: 0, Time elapsed: 0.189 sec

init:

init-plugin:

deps-jar:

compile:
     [echo] Compiling plugin: urlnormalizer-basic

compile-test:
    [javac] Compiling 1 source file to http://hudson.zones.apache.org/hudson/job/Nutch-trunk/ws/trunk/build/urlnormalizer-basic/test 

jar:

deps-test:

deploy:

copy-generated-lib:

test:
     [echo] Testing plugin: urlnormalizer-basic
    [junit] Running org.apache.nutch.net.urlnormalizer.basic.TestBasicURLNormalizer
    [junit] Tests run: 1, Failures: 0, Errors: 0, Time elapsed: 0.231 sec

init:

init-plugin:

deps-jar:

compile:
     [echo] Compiling plugin: urlnormalizer-pass

compile-test:
    [javac] Compiling 1 source file to http://hudson.zones.apache.org/hudson/job/Nutch-trunk/ws/trunk/build/urlnormalizer-pass/test 

jar:

deps-test:

deploy:

copy-generated-lib:

test:
     [echo] Testing plugin: urlnormalizer-pass
    [junit] Running org.apache.nutch.net.urlnormalizer.pass.TestPassURLNormalizer
    [junit] Tests run: 1, Failures: 0, Errors: 0, Time elapsed: 0.184 sec

init:

init-plugin:

deps-jar:

compile:
     [echo] Compiling plugin: urlnormalizer-regex

compile-test:
    [javac] Compiling 1 source file to http://hudson.zones.apache.org/hudson/job/Nutch-trunk/ws/trunk/build/urlnormalizer-regex/test 
    [javac] Note: http://hudson.zones.apache.org/hudson/job/Nutch-trunk/ws/trunk/src/plugin/urlnormalizer-regex/src/test/org/apache/nutch/net/urlnormalizer/regex/TestRegexURLNormalizer.java  uses unchecked or unsafe operations.
    [javac] Note: Recompile with -Xlint:unchecked for details.

jar:

deps-test:

init:

init-plugin:

compile:

jar:
      [jar] Warning: skipping jar archive http://hudson.zones.apache.org/hudson/job/Nutch-trunk/ws/trunk/build/nutch-extensionpoints/nutch-extensionpoints.jar  because no files were included.

deps-test:

deploy:

copy-generated-lib:

deploy:

copy-generated-lib:

test:
     [echo] Testing plugin: urlnormalizer-regex
    [junit] Running org.apache.nutch.net.urlnormalizer.regex.TestRegexURLNormalizer
    [junit] Tests run: 2, Failures: 0, Errors: 0, Time elapsed: 1.327 sec
    [junit] Tests run: 7, Failures: 0, Errors: 2, Time elapsed: 291.663 sec
    [junit] Test org.apache.nutch.protocol.httpclient.TestProtocolHttpClient FAILED

BUILD FAILED
http://hudson.zones.apache.org/hudson/job/Nutch-trunk/ws/trunk/build.xml :303: The following error occurred while executing this line:
http://hudson.zones.apache.org/hudson/job/Nutch-trunk/ws/trunk/src/plugin/build.xml :92: The following error occurred while executing this line:
http://hudson.zones.apache.org/hudson/job/Nutch-trunk/ws/trunk/src/plugin/build-plugin.xml :200: Tests failed!

Total time: 14 minutes 5 seconds
ERROR: No artifacts found that match the file pattern "trunk/build/*.tar.gz". Configuration error?
ERROR: 'trunk/build/*.tar.gz' doesn't match anything: 'trunk' exists but not 'trunk/build/*.tar.gz'
Publishing Javadoc
Recording test results

Reply | Threaded
Open this post in threaded view
|

Build failed in Hudson: Nutch-trunk #409

Apache Hudson Server
See http://hudson.zones.apache.org/hudson/job/Nutch-trunk/409/changes

------------------------------------------
[...truncated 6092 lines...]
init-plugin:

deps-jar:

compile:
     [echo] Compiling plugin: lib-regex-filter

jar:

init:

init-plugin:

deps-jar:

compile:
     [echo] Compiling plugin: lib-regex-filter

compile-test:

compile:
     [echo] Compiling plugin: urlfilter-automaton

compile-test:
    [javac] Compiling 1 source file to http://hudson.zones.apache.org/hudson/job/Nutch-trunk/ws/trunk/build/urlfilter-automaton/test 

jar:

deps-test:

init:

init-plugin:

deps-jar:

compile:
     [echo] Compiling plugin: lib-regex-filter

jar:

deps-test:

deploy:

copy-generated-lib:

deploy:

copy-generated-lib:

test:
     [echo] Testing plugin: urlfilter-automaton
    [junit] Running org.apache.nutch.urlfilter.automaton.TestAutomatonURLFilter
    [junit] Tests run: 1, Failures: 0, Errors: 0, Time elapsed: 11.897 sec

init:

init-plugin:

deps-jar:

init:

init-plugin:

deps-jar:

compile:
     [echo] Compiling plugin: lib-regex-filter

jar:

init:

init-plugin:

deps-jar:

compile:
     [echo] Compiling plugin: lib-regex-filter

compile-test:

compile:
     [echo] Compiling plugin: urlfilter-regex

compile-test:
    [javac] Compiling 1 source file to http://hudson.zones.apache.org/hudson/job/Nutch-trunk/ws/trunk/build/urlfilter-regex/test 

jar:

deps-test:

init:

init-plugin:

deps-jar:

compile:
     [echo] Compiling plugin: lib-regex-filter

jar:

deps-test:

deploy:

copy-generated-lib:

deploy:

copy-generated-lib:

test:
     [echo] Testing plugin: urlfilter-regex
    [junit] Running org.apache.nutch.urlfilter.regex.TestRegexURLFilter
    [junit] Tests run: 1, Failures: 0, Errors: 0, Time elapsed: 21.79 sec

init:

init-plugin:

deps-jar:

compile:
     [echo] Compiling plugin: urlfilter-suffix

compile-test:
    [javac] Compiling 1 source file to http://hudson.zones.apache.org/hudson/job/Nutch-trunk/ws/trunk/build/urlfilter-suffix/test 

jar:

deps-test:

deploy:

copy-generated-lib:

test:
     [echo] Testing plugin: urlfilter-suffix
    [junit] Running org.apache.nutch.urlfilter.suffix.TestSuffixURLFilter
    [junit] Tests run: 6, Failures: 0, Errors: 0, Time elapsed: 0.268 sec

init:

init-plugin:

deps-jar:

compile:
     [echo] Compiling plugin: urlnormalizer-basic

compile-test:
    [javac] Compiling 1 source file to http://hudson.zones.apache.org/hudson/job/Nutch-trunk/ws/trunk/build/urlnormalizer-basic/test 

jar:

deps-test:

deploy:

copy-generated-lib:

test:
     [echo] Testing plugin: urlnormalizer-basic
    [junit] Running org.apache.nutch.net.urlnormalizer.basic.TestBasicURLNormalizer
    [junit] Tests run: 1, Failures: 0, Errors: 0, Time elapsed: 0.03 sec

init:

init-plugin:

deps-jar:

compile:
     [echo] Compiling plugin: urlnormalizer-pass

compile-test:
    [javac] Compiling 1 source file to http://hudson.zones.apache.org/hudson/job/Nutch-trunk/ws/trunk/build/urlnormalizer-pass/test 

jar:

deps-test:

deploy:

copy-generated-lib:

test:
     [echo] Testing plugin: urlnormalizer-pass
    [junit] Running org.apache.nutch.net.urlnormalizer.pass.TestPassURLNormalizer
    [junit] Tests run: 1, Failures: 0, Errors: 0, Time elapsed: 0.175 sec

init:

init-plugin:

deps-jar:

compile:
     [echo] Compiling plugin: urlnormalizer-regex

compile-test:
    [javac] Compiling 1 source file to http://hudson.zones.apache.org/hudson/job/Nutch-trunk/ws/trunk/build/urlnormalizer-regex/test 
    [javac] Note: http://hudson.zones.apache.org/hudson/job/Nutch-trunk/ws/trunk/src/plugin/urlnormalizer-regex/src/test/org/apache/nutch/net/urlnormalizer/regex/TestRegexURLNormalizer.java  uses unchecked or unsafe operations.
    [javac] Note: Recompile with -Xlint:unchecked for details.

jar:

deps-test:

init:

init-plugin:

compile:

jar:
      [jar] Warning: skipping jar archive http://hudson.zones.apache.org/hudson/job/Nutch-trunk/ws/trunk/build/nutch-extensionpoints/nutch-extensionpoints.jar  because no files were included.

deps-test:

deploy:

copy-generated-lib:

deploy:

copy-generated-lib:

test:
     [echo] Testing plugin: urlnormalizer-regex
    [junit] Running org.apache.nutch.net.urlnormalizer.regex.TestRegexURLNormalizer
    [junit] Tests run: 2, Failures: 0, Errors: 0, Time elapsed: 0.979 sec
    [junit] Tests run: 7, Failures: 0, Errors: 1, Time elapsed: 277.225 sec
    [junit] Test org.apache.nutch.protocol.httpclient.TestProtocolHttpClient FAILED

BUILD FAILED
http://hudson.zones.apache.org/hudson/job/Nutch-trunk/ws/trunk/build.xml :303: The following error occurred while executing this line:
http://hudson.zones.apache.org/hudson/job/Nutch-trunk/ws/trunk/src/plugin/build.xml :92: The following error occurred while executing this line:
http://hudson.zones.apache.org/hudson/job/Nutch-trunk/ws/trunk/src/plugin/build-plugin.xml :200: Tests failed!

Total time: 48 minutes 53 seconds
ERROR: No artifacts found that match the file pattern "trunk/build/*.tar.gz". Configuration error?
ERROR: 'trunk/build/*.tar.gz' doesn't match anything: 'trunk' exists but not 'trunk/build/*.tar.gz'
Publishing Javadoc
Recording test results

Reply | Threaded
Open this post in threaded view
|

Hudson build is back to normal: Nutch-trunk #410

Apache Hudson Server