Build failed in Hudson: Solr-3.x #59

classic Classic list List threaded Threaded
3 messages Options
Reply | Threaded
Open this post in threaded view
|

Build failed in Hudson: Solr-3.x #59

Apache Hudson Server
See <http://hudson.zones.apache.org/hudson/job/Solr-3.x/59/>

------------------------------------------
[...truncated 10272 lines...]
    [junit] Jul 8, 2010 7:32:34 AM org.apache.solr.handler.SnapPuller fetchLatestIndex
    [junit] SEVERE: Master at: http://localhost:49127/solr/replication is not available. Index fetch failed. Exception: Connection refused
    [junit] Jul 8, 2010 7:32:35 AM org.apache.solr.handler.SnapPuller fetchLatestIndex
    [junit] SEVERE: Master at: http://localhost:49127/solr/replication is not available. Index fetch failed. Exception: Connection refused
    [junit] Jul 8, 2010 7:32:36 AM org.apache.solr.handler.SnapPuller fetchLatestIndex
    [junit] SEVERE: Master at: http://localhost:49127/solr/replication is not available. Index fetch failed. Exception: Connection refused
    [junit] Jul 8, 2010 7:32:37 AM org.apache.solr.handler.SnapPuller fetchLatestIndex
    [junit] SEVERE: Master at: http://localhost:49127/solr/replication is not available. Index fetch failed. Exception: Connection refused
    [junit] Jul 8, 2010 7:32:38 AM org.apache.solr.handler.SnapPuller fetchLatestIndex
    [junit] SEVERE: Master at: http://localhost:49127/solr/replication is not available. Index fetch failed. Exception: Connection refused
    [junit] Jul 8, 2010 7:32:39 AM org.apache.solr.handler.SnapPuller fetchLatestIndex
    [junit] SEVERE: Master at: http://localhost:49127/solr/replication is not available. Index fetch failed. Exception: Connection refused
    [junit] ------------- ---------------- ---------------
    [junit] Testsuite: org.apache.solr.handler.XmlUpdateRequestHandlerTest
    [junit] Tests run: 1, Failures: 0, Errors: 0, Time elapsed: 6.072 sec
    [junit]
    [junit] Testsuite: org.apache.solr.handler.admin.LukeRequestHandlerTest
    [junit] Tests run: 1, Failures: 0, Errors: 0, Time elapsed: 7.327 sec
    [junit]
    [junit] Testsuite: org.apache.solr.handler.admin.SystemInfoHandlerTest
    [junit] Tests run: 1, Failures: 0, Errors: 0, Time elapsed: 0.607 sec
    [junit]
    [junit] Testsuite: org.apache.solr.handler.component.DistributedSpellCheckComponentTest
    [junit] Tests run: 1, Failures: 0, Errors: 0, Time elapsed: 51.919 sec
    [junit]
    [junit] Testsuite: org.apache.solr.handler.component.DistributedTermsComponentTest
    [junit] Tests run: 1, Failures: 0, Errors: 0, Time elapsed: 44.123 sec
    [junit]
    [junit] Testsuite: org.apache.solr.handler.component.QueryElevationComponentTest
    [junit] Tests run: 4, Failures: 0, Errors: 0, Time elapsed: 11.591 sec
    [junit]
    [junit] Testsuite: org.apache.solr.handler.component.SearchHandlerTest
    [junit] Tests run: 1, Failures: 0, Errors: 0, Time elapsed: 9.904 sec
    [junit]
    [junit] Testsuite: org.apache.solr.handler.component.SpellCheckComponentTest
    [junit] Tests run: 8, Failures: 0, Errors: 0, Time elapsed: 25.166 sec
    [junit]
    [junit] Testsuite: org.apache.solr.handler.component.StatsComponentTest
    [junit] Tests run: 1, Failures: 0, Errors: 0, Time elapsed: 29.664 sec
    [junit]
    [junit] Testsuite: org.apache.solr.handler.component.TermVectorComponentTest
    [junit] Tests run: 5, Failures: 0, Errors: 0, Time elapsed: 14.711 sec
    [junit]
    [junit] ------------- Standard Output ---------------
    [junit] TVs:{doc-0={uniqueKey=0,test_basictv={anoth={tf=1},titl={tf=2}},test_offtv={anoth={tf=1},titl={tf=2}},test_posofftv={anoth={tf=1},titl={tf=2}},test_postv={anoth={tf=1},titl={tf=2}}},uniqueKeyFieldName=id}
    [junit] TVs: {warnings={noTermVectors=[test_notv],noPositions=[test_basictv, test_offtv],noOffsets=[test_basictv, test_postv]},doc-0={uniqueKey=0,test_posofftv={anoth={tf=1,offsets={start=20,end=27},df=2,tf-idf=0.5},titl={tf=2,offsets={start=10,end=15,start=28,end=33},df=1,tf-idf=2.0}},test_basictv={anoth={},titl={}},test_postv={anoth={tf=1,positions={position=1},df=2,tf-idf=0.5},titl={tf=2,positions={position=0,position=2},df=1,tf-idf=2.0}},test_offtv={anoth={tf=1,df=2,tf-idf=0.5},titl={tf=2,df=1,tf-idf=2.0}}},uniqueKeyFieldName=id}
    [junit] ------------- ---------------- ---------------
    [junit] ------------- Standard Error -----------------
    [junit] Jul 8, 2010 7:37:00 AM org.apache.solr.common.SolrException log
    [junit] SEVERE: org.apache.solr.common.SolrException: undefined field: foo
    [junit] at org.apache.solr.handler.component.TermVectorComponent.process(TermVectorComponent.java:145)
    [junit] at org.apache.solr.handler.component.SearchHandler.handleRequestBody(SearchHandler.java:195)
    [junit] at org.apache.solr.handler.RequestHandlerBase.handleRequest(RequestHandlerBase.java:131)
    [junit] at org.apache.solr.handler.component.TermVectorComponentTest.testNoFields(TermVectorComponentTest.java:332)
    [junit] at sun.reflect.NativeMethodAccessorImpl.invoke0(Native Method)
    [junit] at sun.reflect.NativeMethodAccessorImpl.invoke(NativeMethodAccessorImpl.java:39)
    [junit] at sun.reflect.DelegatingMethodAccessorImpl.invoke(DelegatingMethodAccessorImpl.java:25)
    [junit] at java.lang.reflect.Method.invoke(Method.java:592)
    [junit] at org.junit.runners.model.FrameworkMethod$1.runReflectiveCall(FrameworkMethod.java:44)
    [junit] at org.junit.internal.runners.model.ReflectiveCallable.run(ReflectiveCallable.java:15)
    [junit] at org.junit.runners.model.FrameworkMethod.invokeExplosively(FrameworkMethod.java:41)
    [junit] at org.junit.internal.runners.statements.InvokeMethod.evaluate(InvokeMethod.java:20)
    [junit] at org.junit.rules.TestWatchman$1.evaluate(TestWatchman.java:48)
    [junit] at org.junit.internal.runners.statements.RunBefores.evaluate(RunBefores.java:28)
    [junit] at org.junit.internal.runners.statements.RunAfters.evaluate(RunAfters.java:31)
    [junit] at org.junit.runners.BlockJUnit4ClassRunner.runChild(BlockJUnit4ClassRunner.java:76)
    [junit] at org.junit.runners.BlockJUnit4ClassRunner.runChild(BlockJUnit4ClassRunner.java:50)
    [junit] at org.junit.runners.ParentRunner$3.run(ParentRunner.java:193)
    [junit] at org.junit.runners.ParentRunner$1.schedule(ParentRunner.java:52)
    [junit] at org.junit.runners.ParentRunner.runChildren(ParentRunner.java:191)
    [junit] at org.junit.runners.ParentRunner.access$000(ParentRunner.java:42)
    [junit] at org.junit.runners.ParentRunner$2.evaluate(ParentRunner.java:184)
    [junit] at org.junit.internal.runners.statements.RunBefores.evaluate(RunBefores.java:28)
    [junit] at org.junit.internal.runners.statements.RunAfters.evaluate(RunAfters.java:31)
    [junit] at org.junit.runners.ParentRunner.run(ParentRunner.java:236)
    [junit] at junit.framework.JUnit4TestAdapter.run(JUnit4TestAdapter.java:39)
    [junit] at org.apache.tools.ant.taskdefs.optional.junit.JUnitTestRunner.run(JUnitTestRunner.java:421)
    [junit] at org.apache.tools.ant.taskdefs.optional.junit.JUnitTestRunner.launch(JUnitTestRunner.java:912)
    [junit] at org.apache.tools.ant.taskdefs.optional.junit.JUnitTestRunner.main(JUnitTestRunner.java:766)
    [junit]
    [junit] ------------- ---------------- ---------------
    [junit] Testsuite: org.apache.solr.handler.component.TermsComponentTest
    [junit] Tests run: 13, Failures: 0, Errors: 0, Time elapsed: 10.689 sec
    [junit]
    [junit] Testsuite: org.apache.solr.highlight.FastVectorHighlighterTest
    [junit] Tests run: 2, Failures: 0, Errors: 0, Time elapsed: 12.062 sec
    [junit]
    [junit] Testsuite: org.apache.solr.highlight.HighlighterConfigTest
    [junit] Tests run: 1, Failures: 0, Errors: 0, Time elapsed: 12.204 sec
    [junit]
    [junit] Testsuite: org.apache.solr.highlight.HighlighterTest
    [junit] Tests run: 23, Failures: 0, Errors: 0, Time elapsed: 14.198 sec
    [junit]
    [junit] Testsuite: org.apache.solr.request.JSONWriterTest
    [junit] Tests run: 3, Failures: 0, Errors: 0, Time elapsed: 21.269 sec
    [junit]
    [junit] Testsuite: org.apache.solr.request.SimpleFacetsLegacySortTest
    [junit] Tests run: 1, Failures: 0, Errors: 0, Time elapsed: 14.905 sec
    [junit]
    [junit] Testsuite: org.apache.solr.request.SimpleFacetsTest
    [junit] Tests run: 6, Failures: 0, Errors: 0, Time elapsed: 54.475 sec
    [junit]
    [junit] Testsuite: org.apache.solr.request.TestBinaryResponseWriter
    [junit] Tests run: 1, Failures: 0, Errors: 0, Time elapsed: 12.37 sec
    [junit]
    [junit] Testsuite: org.apache.solr.request.TestFaceting
    [junit] Tests run: 3, Failures: 0, Errors: 0, Time elapsed: 74.182 sec
    [junit]
    [junit] Testsuite: org.apache.solr.request.TestWriterPerf
    [junit] Tests run: 1, Failures: 0, Errors: 0, Time elapsed: 8.268 sec
    [junit]
    [junit] ------------- Standard Output ---------------
    [junit] writer xml, size=7185, encodeRate=23, decodeRate=35
    [junit] writer json, size=4475, encodeRate=37, decodeRate=N/A
    [junit] writer javabin, size=1991, encodeRate=52, decodeRate=54
    [junit] ------------- ---------------- ---------------
    [junit] Testsuite: org.apache.solr.schema.BadIndexSchemaTest
    [junit] Tests run: 1, Failures: 0, Errors: 0, Time elapsed: 3.054 sec
    [junit]
    [junit] Testsuite: org.apache.solr.schema.CopyFieldTest
    [junit] Tests run: 6, Failures: 0, Errors: 0, Time elapsed: 15.085 sec
    [junit]
    [junit] Testsuite: org.apache.solr.schema.DateFieldTest
    [junit] Tests run: 6, Failures: 0, Errors: 0, Time elapsed: 1.437 sec
    [junit]
    [junit] Testsuite: org.apache.solr.schema.IndexSchemaTest
    [junit] Tests run: 5, Failures: 0, Errors: 0, Time elapsed: 13.939 sec
    [junit]
    [junit] Testsuite: org.apache.solr.schema.LegacyDateFieldTest
    [junit] Tests run: 4, Failures: 0, Errors: 0, Time elapsed: 0.823 sec
    [junit]
    [junit] Testsuite: org.apache.solr.schema.NotRequiredUniqueKeyTest
    [junit] Tests run: 1, Failures: 0, Errors: 0, Time elapsed: 8.188 sec
    [junit]
    [junit] ------------- Standard Error -----------------
    [junit] Jul 8, 2010 7:42:23 AM org.apache.solr.schema.IndexSchema readSchema
    [junit] SEVERE: uniqueKey should not be multivalued
    [junit] ------------- ---------------- ---------------
    [junit] Testsuite: org.apache.solr.schema.PolyFieldTest
    [junit] Tests run: 5, Failures: 0, Errors: 0, Time elapsed: 8.727 sec
    [junit]
    [junit] Testsuite: org.apache.solr.schema.RequiredFieldsTest
    [junit] Tests run: 3, Failures: 0, Errors: 0, Time elapsed: 10.389 sec
    [junit]
    [junit] ------------- Standard Error -----------------
    [junit] Jul 8, 2010 7:42:48 AM org.apache.solr.schema.IndexSchema readSchema
    [junit] SEVERE: uniqueKey should not be multivalued
    [junit] ------------- ---------------- ---------------
    [junit] Testsuite: org.apache.solr.schema.TestBinaryField
    [junit] Tests run: 1, Failures: 0, Errors: 0, Time elapsed: 6.567 sec
    [junit]
    [junit] Testsuite: org.apache.solr.schema.UUIDFieldTest
    [junit] Tests run: 1, Failures: 0, Errors: 0, Time elapsed: 1.213 sec
    [junit]
    [junit] Testsuite: org.apache.solr.search.FunctionQParserTest
    [junit] Tests run: 1, Failures: 0, Errors: 0, Time elapsed: 8.263 sec
    [junit]
    [junit] Testsuite: org.apache.solr.search.QueryParsingTest
    [junit] Tests run: 2, Failures: 0, Errors: 0, Time elapsed: 14.456 sec
    [junit]
    [junit] Testsuite: org.apache.solr.search.TestDocSet
    [junit] Tests run: 2, Failures: 0, Errors: 0, Time elapsed: 6.981 sec
    [junit]
    [junit] Testsuite: org.apache.solr.search.TestExtendedDismaxParser
    [junit] Tests run: 1, Failures: 0, Errors: 0, Time elapsed: 9.487 sec
    [junit]
    [junit] Testsuite: org.apache.solr.search.TestFastLRUCache
    [junit] Tests run: 2, Failures: 0, Errors: 0, Time elapsed: 0.637 sec
    [junit]
    [junit] Testsuite: org.apache.solr.search.TestIndexSearcher
    [junit] Tests run: 1, Failures: 0, Errors: 0, Time elapsed: 10.578 sec
    [junit]
    [junit] Testsuite: org.apache.solr.search.TestQueryTypes
    [junit] Tests run: 1, Failures: 0, Errors: 0, Time elapsed: 10.794 sec
    [junit]
    [junit] Testsuite: org.apache.solr.search.TestQueryUtils
    [junit] Tests run: 1, Failures: 0, Errors: 0, Time elapsed: 15.352 sec
    [junit]
    [junit] Testsuite: org.apache.solr.search.TestRangeQuery
    [junit] Tests run: 2, Failures: 0, Errors: 0, Time elapsed: 89.572 sec
    [junit]
    [junit] Testsuite: org.apache.solr.search.TestSearchPerf
    [junit] Tests run: 1, Failures: 0, Errors: 0, Time elapsed: 4.257 sec
    [junit]
FATAL: command execution failed
hudson.util.IOException2: Failed to join the process
        at hudson.Proc$RemoteProc.join(Proc.java:355)
        at hudson.Launcher$ProcStarter.join(Launcher.java:280)
        at hudson.tasks.CommandInterpreter.perform(CommandInterpreter.java:83)
        at hudson.tasks.CommandInterpreter.perform(CommandInterpreter.java:58)
        at hudson.tasks.BuildStepMonitor$1.perform(BuildStepMonitor.java:19)
        at hudson.model.AbstractBuild$AbstractRunner.perform(AbstractBuild.java:601)
        at hudson.model.Build$RunnerImpl.build(Build.java:174)
        at hudson.model.Build$RunnerImpl.doRun(Build.java:138)
        at hudson.model.AbstractBuild$AbstractRunner.run(AbstractBuild.java:416)
        at hudson.model.Run.run(Run.java:1257)
        at hudson.model.FreeStyleBuild.run(FreeStyleBuild.java:46)
        at hudson.model.ResourceController.execute(ResourceController.java:88)
        at hudson.model.Executor.run(Executor.java:127)
Caused by: java.util.concurrent.ExecutionException: hudson.remoting.RequestAbortedException: java.io.IOException: Unexpected termination of the channel
        at hudson.remoting.Request$1.get(Request.java:218)
        at hudson.remoting.Request$1.get(Request.java:172)
        at hudson.remoting.FutureAdapter.get(FutureAdapter.java:55)
        at hudson.Proc$RemoteProc.join(Proc.java:347)
        ... 12 more
Caused by: hudson.remoting.RequestAbortedException: java.io.IOException: Unexpected termination of the channel
        at hudson.remoting.Request.abort(Request.java:257)
        at hudson.remoting.Channel.terminate(Channel.java:602)
        at hudson.remoting.Channel$ReaderThread.run(Channel.java:893)
Caused by: java.io.IOException: Unexpected termination of the channel
        at hudson.remoting.Channel$ReaderThread.run(Channel.java:875)
Caused by: java.io.EOFException
        at java.io.ObjectInputStream$BlockDataInputStream.peekByte(ObjectInputStream.java:2554)
        at java.io.ObjectInputStream.readObject0(ObjectInputStream.java:1297)
        at java.io.ObjectInputStream.readObject(ObjectInputStream.java:351)
        at hudson.remoting.Channel$ReaderThread.run(Channel.java:869)
FATAL: Unable to delete script file /var/tmp/hudson6251949097325732896.sh
hudson.util.IOException2: remote file operation failed: /var/tmp/hudson6251949097325732896.sh at hudson.remoting.Channel@18b599e:lucene.zones.apache.org (Solaris 10)
        at hudson.FilePath.act(FilePath.java:749)
        at hudson.FilePath.act(FilePath.java:735)
        at hudson.FilePath.delete(FilePath.java:990)
        at hudson.tasks.CommandInterpreter.perform(CommandInterpreter.java:93)
        at hudson.tasks.CommandInterpreter.perform(CommandInterpreter.java:58)
        at hudson.tasks.BuildStepMonitor$1.perform(BuildStepMonitor.java:19)
        at hudson.model.AbstractBuild$AbstractRunner.perform(AbstractBuild.java:601)
        at hudson.model.Build$RunnerImpl.build(Build.java:174)
        at hudson.model.Build$RunnerImpl.doRun(Build.java:138)
        at hudson.model.AbstractBuild$AbstractRunner.run(AbstractBuild.java:416)
        at hudson.model.Run.run(Run.java:1257)
        at hudson.model.FreeStyleBuild.run(FreeStyleBuild.java:46)
        at hudson.model.ResourceController.execute(ResourceController.java:88)
        at hudson.model.Executor.run(Executor.java:127)
Caused by: hudson.remoting.ChannelClosedException: channel is already closed
        at hudson.remoting.Channel.send(Channel.java:412)
        at hudson.remoting.Request.call(Request.java:105)
        at hudson.remoting.Channel.call(Channel.java:555)
        at hudson.FilePath.act(FilePath.java:742)
        ... 13 more
FATAL: channel is already closed
hudson.remoting.ChannelClosedException: channel is already closed
        at hudson.remoting.Channel.send(Channel.java:412)
        at hudson.remoting.Request.call(Request.java:105)
        at hudson.remoting.Channel.call(Channel.java:555)
        at hudson.Launcher$RemoteLauncher.kill(Launcher.java:744)
        at hudson.model.AbstractBuild$AbstractRunner.run(AbstractBuild.java:421)
        at hudson.model.Run.run(Run.java:1257)
        at hudson.model.FreeStyleBuild.run(FreeStyleBuild.java:46)
        at hudson.model.ResourceController.execute(ResourceController.java:88)
        at hudson.model.Executor.run(Executor.java:127)


---------------------------------------------------------------------
To unsubscribe, e-mail: [hidden email]
For additional commands, e-mail: [hidden email]

Reply | Threaded
Open this post in threaded view
|

Build failed in Hudson: Solr-3.x #60

Apache Hudson Server
See <http://hudson.zones.apache.org/hudson/job/Solr-3.x/60/changes>

Changes:

[koji] SOLR-1985: FastVectorHighlighter: add wrapper class for Lucene's SingleFragListBuilder

[shaie] LUCENE-2421: fix clearLock to not fail on file deletion

------------------------------------------
[...truncated 6172 lines...]
    [junit] at sun.reflect.NativeMethodAccessorImpl.invoke(NativeMethodAccessorImpl.java:39)
    [junit] at sun.reflect.DelegatingMethodAccessorImpl.invoke(DelegatingMethodAccessorImpl.java:25)
    [junit] at java.lang.reflect.Method.invoke(Method.java:592)
    [junit] at org.junit.runners.model.FrameworkMethod$1.runReflectiveCall(FrameworkMethod.java:44)
    [junit] at org.junit.internal.runners.model.ReflectiveCallable.run(ReflectiveCallable.java:15)
    [junit] at org.junit.runners.model.FrameworkMethod.invokeExplosively(FrameworkMethod.java:41)
    [junit] at org.junit.internal.runners.statements.InvokeMethod.evaluate(InvokeMethod.java:20)
    [junit] at org.junit.rules.TestWatchman$1.evaluate(TestWatchman.java:48)
    [junit] at org.junit.internal.runners.statements.RunBefores.evaluate(RunBefores.java:28)
    [junit] at org.junit.internal.runners.statements.RunAfters.evaluate(RunAfters.java:31)
    [junit] at org.junit.runners.BlockJUnit4ClassRunner.runChild(BlockJUnit4ClassRunner.java:76)
    [junit] at org.junit.runners.BlockJUnit4ClassRunner.runChild(BlockJUnit4ClassRunner.java:50)
    [junit] at org.junit.runners.ParentRunner$3.run(ParentRunner.java:193)
    [junit] at org.junit.runners.ParentRunner$1.schedule(ParentRunner.java:52)
    [junit] at org.junit.runners.ParentRunner.runChildren(ParentRunner.java:191)
    [junit] at org.junit.runners.ParentRunner.access$000(ParentRunner.java:42)
    [junit] at org.junit.runners.ParentRunner$2.evaluate(ParentRunner.java:184)
    [junit] at org.junit.internal.runners.statements.RunBefores.evaluate(RunBefores.java:28)
    [junit] at org.junit.internal.runners.statements.RunAfters.evaluate(RunAfters.java:31)
    [junit] at org.junit.runners.ParentRunner.run(ParentRunner.java:236)
    [junit] at junit.framework.JUnit4TestAdapter.run(JUnit4TestAdapter.java:39)
    [junit] at org.apache.tools.ant.taskdefs.optional.junit.JUnitTestRunner.run(JUnitTestRunner.java:421)
    [junit] at org.apache.tools.ant.taskdefs.optional.junit.JUnitTestRunner.launch(JUnitTestRunner.java:912)
    [junit] at org.apache.tools.ant.taskdefs.optional.junit.JUnitTestRunner.main(JUnitTestRunner.java:766)
    [junit]
    [junit] ------------- ---------------- ---------------
    [junit] Testsuite: org.apache.solr.handler.component.TermsComponentTest
    [junit] Tests run: 13, Failures: 0, Errors: 0, Time elapsed: 7.851 sec
    [junit]
    [junit] Testsuite: org.apache.solr.highlight.FastVectorHighlighterTest
    [junit] Tests run: 2, Failures: 0, Errors: 0, Time elapsed: 7.647 sec
    [junit]
    [junit] Testsuite: org.apache.solr.highlight.HighlighterConfigTest
    [junit] Tests run: 1, Failures: 0, Errors: 0, Time elapsed: 7.691 sec
    [junit]
    [junit] Testsuite: org.apache.solr.highlight.HighlighterTest
    [junit] Tests run: 23, Failures: 0, Errors: 0, Time elapsed: 15.884 sec
    [junit]
    [junit] Testsuite: org.apache.solr.request.JSONWriterTest
    [junit] Tests run: 3, Failures: 0, Errors: 0, Time elapsed: 8.542 sec
    [junit]
    [junit] Testsuite: org.apache.solr.request.SimpleFacetsLegacySortTest
    [junit] Tests run: 1, Failures: 0, Errors: 0, Time elapsed: 9.075 sec
    [junit]
    [junit] Testsuite: org.apache.solr.request.SimpleFacetsTest
    [junit] Tests run: 6, Failures: 0, Errors: 0, Time elapsed: 27.949 sec
    [junit]
    [junit] Testsuite: org.apache.solr.request.TestBinaryResponseWriter
    [junit] Tests run: 1, Failures: 0, Errors: 0, Time elapsed: 4.782 sec
    [junit]
    [junit] Testsuite: org.apache.solr.request.TestFaceting
    [junit] Tests run: 3, Failures: 0, Errors: 0, Time elapsed: 37.939 sec
    [junit]
    [junit] Testsuite: org.apache.solr.request.TestWriterPerf
    [junit] Tests run: 1, Failures: 0, Errors: 0, Time elapsed: 5.248 sec
    [junit]
    [junit] ------------- Standard Output ---------------
    [junit] writer xml, size=7184, encodeRate=21, decodeRate=9
    [junit] writer json, size=4474, encodeRate=133, decodeRate=N/A
    [junit] writer javabin, size=1991, encodeRate=166, decodeRate=400
    [junit] ------------- ---------------- ---------------
    [junit] Testsuite: org.apache.solr.schema.BadIndexSchemaTest
    [junit] Tests run: 1, Failures: 0, Errors: 0, Time elapsed: 3.859 sec
    [junit]
    [junit] Testsuite: org.apache.solr.schema.CopyFieldTest
    [junit] Tests run: 6, Failures: 0, Errors: 0, Time elapsed: 9.144 sec
    [junit]
    [junit] Testsuite: org.apache.solr.schema.DateFieldTest
    [junit] Tests run: 6, Failures: 0, Errors: 0, Time elapsed: 0.899 sec
    [junit]
    [junit] Testsuite: org.apache.solr.schema.IndexSchemaTest
    [junit] Tests run: 5, Failures: 0, Errors: 0, Time elapsed: 8.567 sec
    [junit]
    [junit] Testsuite: org.apache.solr.schema.LegacyDateFieldTest
    [junit] Tests run: 4, Failures: 0, Errors: 0, Time elapsed: 0.78 sec
    [junit]
    [junit] Testsuite: org.apache.solr.schema.NotRequiredUniqueKeyTest
    [junit] Tests run: 1, Failures: 0, Errors: 0, Time elapsed: 3.391 sec
    [junit]
    [junit] ------------- Standard Error -----------------
    [junit] Jul 9, 2010 6:26:20 AM org.apache.solr.schema.IndexSchema readSchema
    [junit] SEVERE: uniqueKey should not be multivalued
    [junit] ------------- ---------------- ---------------
    [junit] Testsuite: org.apache.solr.schema.PolyFieldTest
    [junit] Tests run: 5, Failures: 0, Errors: 0, Time elapsed: 14.604 sec
    [junit]
    [junit] Testsuite: org.apache.solr.schema.RequiredFieldsTest
    [junit] Tests run: 3, Failures: 0, Errors: 0, Time elapsed: 8.85 sec
    [junit]
    [junit] ------------- Standard Error -----------------
    [junit] Jul 9, 2010 6:26:44 AM org.apache.solr.schema.IndexSchema readSchema
    [junit] SEVERE: uniqueKey should not be multivalued
    [junit] ------------- ---------------- ---------------
    [junit] Testsuite: org.apache.solr.schema.TestBinaryField
    [junit] Tests run: 1, Failures: 0, Errors: 0, Time elapsed: 6.278 sec
    [junit]
    [junit] Testsuite: org.apache.solr.schema.UUIDFieldTest
    [junit] Tests run: 1, Failures: 0, Errors: 0, Time elapsed: 1.303 sec
    [junit]
    [junit] Testsuite: org.apache.solr.search.FunctionQParserTest
    [junit] Tests run: 1, Failures: 0, Errors: 0, Time elapsed: 5.895 sec
    [junit]
    [junit] Testsuite: org.apache.solr.search.QueryParsingTest
    [junit] Tests run: 2, Failures: 0, Errors: 0, Time elapsed: 9.614 sec
    [junit]
    [junit] Testsuite: org.apache.solr.search.TestDocSet
    [junit] Tests run: 2, Failures: 0, Errors: 0, Time elapsed: 3.319 sec
    [junit]
    [junit] Testsuite: org.apache.solr.search.TestExtendedDismaxParser
    [junit] Tests run: 1, Failures: 0, Errors: 0, Time elapsed: 7.802 sec
    [junit]
    [junit] Testsuite: org.apache.solr.search.TestFastLRUCache
    [junit] Tests run: 2, Failures: 0, Errors: 0, Time elapsed: 0.997 sec
    [junit]
    [junit] Testsuite: org.apache.solr.search.TestIndexSearcher
    [junit] Tests run: 1, Failures: 0, Errors: 0, Time elapsed: 9.644 sec
    [junit]
    [junit] Testsuite: org.apache.solr.search.TestQueryTypes
    [junit] Tests run: 1, Failures: 0, Errors: 0, Time elapsed: 7.165 sec
    [junit]
    [junit] Testsuite: org.apache.solr.search.TestQueryUtils
    [junit] Tests run: 1, Failures: 0, Errors: 0, Time elapsed: 14.191 sec
    [junit]
    [junit] Testsuite: org.apache.solr.search.TestRangeQuery
    [junit] Tests run: 2, Failures: 0, Errors: 0, Time elapsed: 71.412 sec
    [junit]
    [junit] Testsuite: org.apache.solr.search.TestSearchPerf
    [junit] Tests run: 1, Failures: 0, Errors: 0, Time elapsed: 9.079 sec
    [junit]
    [junit] Testsuite: org.apache.solr.search.TestSort
    [junit] Tests run: 1, Failures: 0, Errors: 0, Time elapsed: 15.69 sec
    [junit]
    [junit] Testsuite: org.apache.solr.search.function.SortByFunctionTest
    [junit] Tests run: 1, Failures: 0, Errors: 0, Time elapsed: 14.327 sec
    [junit]
    [junit] Testsuite: org.apache.solr.search.function.TestFunctionQuery
    [junit] Tests run: 6, Failures: 0, Errors: 0, Time elapsed: 18.831 sec
    [junit]
    [junit] Testsuite: org.apache.solr.search.function.distance.DistanceFunctionTest
    [junit] Tests run: 2, Failures: 0, Errors: 0, Time elapsed: 5.648 sec
    [junit]
    [junit] Testsuite: org.apache.solr.servlet.CacheHeaderTest
    [junit] Tests run: 5, Failures: 0, Errors: 0, Time elapsed: 9.854 sec
    [junit]
    [junit] Testsuite: org.apache.solr.servlet.DirectSolrConnectionTest
    [junit] Tests run: 2, Failures: 0, Errors: 0, Time elapsed: 5.271 sec
    [junit]
    [junit] ------------- Standard Error -----------------
    [junit] Jul 9, 2010 6:30:42 AM org.apache.solr.schema.IndexSchema readSchema
    [junit] SEVERE: uniqueKey should not be multivalued
    [junit] Jul 9, 2010 6:30:46 AM org.apache.solr.schema.IndexSchema readSchema
    [junit] SEVERE: uniqueKey should not be multivalued
    [junit] ------------- ---------------- ---------------
    [junit] Testsuite: org.apache.solr.servlet.NoCacheHeaderTest
    [junit] Tests run: 3, Failures: 0, Errors: 0, Time elapsed: 11.806 sec
    [junit]
    [junit] Testsuite: org.apache.solr.servlet.SolrRequestParserTest
    [junit] Tests run: 4, Failures: 0, Errors: 0, Time elapsed: 4.807 sec
    [junit]
    [junit] Testsuite: org.apache.solr.spelling.FileBasedSpellCheckerTest
    [junit] Tests run: 3, Failures: 0, Errors: 0, Time elapsed: 8.483 sec
    [junit]
    [junit] Testsuite: org.apache.solr.spelling.IndexBasedSpellCheckerTest
    [junit] Tests run: 4, Failures: 0, Errors: 0, Time elapsed: 7.239 sec
    [junit]
    [junit] Testsuite: org.apache.solr.spelling.SpellingQueryConverterTest
    [junit] Tests run: 4, Failures: 0, Errors: 0, Time elapsed: 0.78 sec
    [junit]
    [junit]  xml response was: <?xml version="1.0" encoding="UTF-8"?>
    [junit] <response>
    [junit] <lst name="responseHeader"><int name="status">0</int><int name="QTime">3124</int></lst><result name="response" numFound="1" start="0"><doc><arr name="field_t"><str>what's inside?</str></arr><int name="id">529</int><int name="intDefault">42</int><arr name="multiDefault"><str>muLti-Default</str></arr><arr name="subject"><str>info</str></arr><date name="timestamp">2010-07-09T06:31:33.125Z</date></doc></result>
    [junit] </response>
    [junit]
    [junit]  request was: rows=20&start=0&q=id:529&qt=standard&version=2.2)
    [junit] Testsuite: org.apache.solr.update.AutoCommitTest
    [junit] Testcase: testMaxTime(org.apache.solr.update.AutoCommitTest): FAILED
    [junit] shouldn't find any query failed XPath: //result[@numFound=0]
    [junit]  xml response was: <?xml version="1.0" encoding="UTF-8"?>
    [junit] <response>
    [junit] <lst name="responseHeader"><int name="status">0</int><int name="QTime">3124</int></lst><result name="response" numFound="1" start="0"><doc><arr name="field_t"><str>what's inside?</str></arr><int name="id">529</int><int name="intDefault">42</int><arr name="multiDefault"><str>muLti-Default</str></arr><arr name="subject"><str>info</str></arr><date name="timestamp">2010-07-09T06:31:33.125Z</date></doc></result>
    [junit] </response>
    [junit]
    [junit]  request was: rows=20&start=0&q=id:529&qt=standard&version=2.2
    [junit] junit.framework.AssertionFailedError: shouldn't find any query failed XPath: //result[@numFound=0]
    [junit]  xml response was: <?xml version="1.0" encoding="UTF-8"?>
    [junit] <response>
    [junit] <lst name="responseHeader"><int name="status">0</int><int name="QTime">3124</int></lst><result name="response" numFound="1" start="0"><doc><arr name="field_t"><str>what's inside?</str></arr><int name="id">529</int><int name="intDefault">42</int><arr name="multiDefault"><str>muLti-Default</str></arr><arr name="subject"><str>info</str></arr><date name="timestamp">2010-07-09T06:31:33.125Z</date></doc></result>
    [junit] </response>
    [junit]
    [junit]  request was: rows=20&start=0&q=id:529&qt=standard&version=2.2
    [junit] at org.apache.solr.util.AbstractSolrTestCase.assertQ(AbstractSolrTestCase.java:236)
    [junit] at org.apache.solr.update.AutoCommitTest.testMaxTime(AutoCommitTest.java:174)
    [junit]
    [junit]
    [junit] Tests run: 1, Failures: 1, Errors: 0, Time elapsed: 10.281 sec
    [junit]
    [junit] Test org.apache.solr.update.AutoCommitTest FAILED
    [junit] Testsuite: org.apache.solr.update.DirectUpdateHandlerOptimizeTest
    [junit] Tests run: 1, Failures: 0, Errors: 0, Time elapsed: 11.459 sec
    [junit]
    [junit] Testsuite: org.apache.solr.update.DirectUpdateHandlerTest
    [junit] Tests run: 7, Failures: 0, Errors: 0, Time elapsed: 51.417 sec
    [junit]
    [junit] Testsuite: org.apache.solr.update.DocumentBuilderTest
    [junit] Tests run: 3, Failures: 0, Errors: 0, Time elapsed: 7.913 sec
    [junit]
    [junit] Testsuite: org.apache.solr.update.TestIndexingPerformance
    [junit] Tests run: 1, Failures: 0, Errors: 0, Time elapsed: 13.171 sec
    [junit]
    [junit] ------------- Standard Output ---------------
    [junit] includeDoc=true doc=[text, simple, text, test, text, how now brown cow, text, what's that?, text, radical!, text, what's all this about, anyway?, text, just how fast is this text indexing?]
    [junit] iter=1000 time=4524 throughput=221
    [junit] ------------- ---------------- ---------------
    [junit] Testsuite: org.apache.solr.update.processor.SignatureUpdateProcessorFactoryTest
    [junit] Tests run: 2, Failures: 0, Errors: 0, Time elapsed: 15.279 sec
    [junit]
    [junit] Testsuite: org.apache.solr.update.processor.UpdateRequestProcessorFactoryTest
    [junit] Tests run: 1, Failures: 0, Errors: 0, Time elapsed: 10.404 sec
    [junit]
    [junit] Testsuite: org.apache.solr.util.ArraysUtilsTest
    [junit] Tests run: 1, Failures: 0, Errors: 0, Time elapsed: 0.918 sec
    [junit]
    [junit] Testsuite: org.apache.solr.util.DateMathParserTest
    [junit] Tests run: 7, Failures: 0, Errors: 0, Time elapsed: 0.985 sec
    [junit]
    [junit] Testsuite: org.apache.solr.util.SolrPluginUtilsTest
    [junit] Tests run: 7, Failures: 0, Errors: 0, Time elapsed: 14.648 sec
    [junit]
    [junit] Testsuite: org.apache.solr.util.TestNumberUtils
    [junit] Tests run: 1, Failures: 0, Errors: 0, Time elapsed: 2.109 sec
    [junit]
    [junit] Testsuite: org.apache.solr.util.TestOpenBitSet
    [junit] Tests run: 3, Failures: 0, Errors: 0, Time elapsed: 2.698 sec
    [junit]
    [junit] Testsuite: org.apache.solr.util.TestUtils
    [junit] Tests run: 3, Failures: 0, Errors: 0, Time elapsed: 0.505 sec
    [junit]

BUILD FAILED
<http://hudson.zones.apache.org/hudson/job/Solr-3.x/ws/branch_3x/solr/build.xml>:390: The following error occurred while executing this line:
<http://hudson.zones.apache.org/hudson/job/Solr-3.x/ws/branch_3x/solr/build.xml>:477: Tests failed!

Total time: 40 minutes 14 seconds
[TASKS] Skipping publisher since build result is FAILURE
Publishing Javadoc
Archiving artifacts
Recording test results
Publishing Clover coverage report...
No Clover report will be published due to a Build Failure


---------------------------------------------------------------------
To unsubscribe, e-mail: [hidden email]
For additional commands, e-mail: [hidden email]

Reply | Threaded
Open this post in threaded view
|

Hudson build is back to normal : Solr-3.x #61

Apache Hudson Server
See <http://hudson.zones.apache.org/hudson/job/Solr-3.x/61/changes>



---------------------------------------------------------------------
To unsubscribe, e-mail: [hidden email]
For additional commands, e-mail: [hidden email]