Build failed in Hudson: Solr-trunk #341

classic Classic list List threaded Threaded
5 messages Options
Reply | Threaded
Open this post in threaded view
|

Build failed in Hudson: Solr-trunk #341

Apache Hudson Server
See http://hudson.zones.apache.org/hudson/job/Solr-trunk/341/changes

------------------------------------------
[...truncated 1114 lines...]
AU        client/ruby/solr-ruby/lib/solr/importer/xpath_mapper.rb
A         client/ruby/solr-ruby/lib/solr/importer/hpricot_mapper.rb
A         client/ruby/solr-ruby/lib/solr/xml.rb
AU        client/ruby/solr-ruby/lib/solr/importer.rb
A         client/ruby/solr-ruby/lib/solr/field.rb
AU        client/ruby/solr-ruby/lib/solr/solrtasks.rb
A         client/ruby/solr-ruby/lib/solr/request
A         client/ruby/solr-ruby/lib/solr/request/ping.rb
A         client/ruby/solr-ruby/lib/solr/request/spellcheck.rb
A         client/ruby/solr-ruby/lib/solr/request/select.rb
AU        client/ruby/solr-ruby/lib/solr/request/optimize.rb
AU        client/ruby/solr-ruby/lib/solr/request/standard.rb
A         client/ruby/solr-ruby/lib/solr/request/delete.rb
AU        client/ruby/solr-ruby/lib/solr/request/index_info.rb
A         client/ruby/solr-ruby/lib/solr/request/update.rb
A         client/ruby/solr-ruby/lib/solr/request/dismax.rb
AU        client/ruby/solr-ruby/lib/solr/request/modify_document.rb
A         client/ruby/solr-ruby/lib/solr/request/add_document.rb
A         client/ruby/solr-ruby/lib/solr/request/commit.rb
A         client/ruby/solr-ruby/lib/solr/request/base.rb
AU        client/ruby/solr-ruby/lib/solr/request.rb
A         client/ruby/solr-ruby/lib/solr/response
A         client/ruby/solr-ruby/lib/solr/response/ping.rb
A         client/ruby/solr-ruby/lib/solr/response/spellcheck.rb
AU        client/ruby/solr-ruby/lib/solr/response/select.rb
AU        client/ruby/solr-ruby/lib/solr/response/optimize.rb
A         client/ruby/solr-ruby/lib/solr/response/standard.rb
A         client/ruby/solr-ruby/lib/solr/response/xml.rb
A         client/ruby/solr-ruby/lib/solr/response/ruby.rb
A         client/ruby/solr-ruby/lib/solr/response/delete.rb
AU        client/ruby/solr-ruby/lib/solr/response/index_info.rb
A         client/ruby/solr-ruby/lib/solr/response/dismax.rb
AU        client/ruby/solr-ruby/lib/solr/response/modify_document.rb
A         client/ruby/solr-ruby/lib/solr/response/add_document.rb
A         client/ruby/solr-ruby/lib/solr/response/commit.rb
A         client/ruby/solr-ruby/lib/solr/response/base.rb
AU        client/ruby/solr-ruby/lib/solr.rb
A         client/ruby/solr-ruby/CHANGES.yml
A         client/ruby/solr-ruby/README
A         client/ruby/solr-ruby/examples
A         client/ruby/solr-ruby/examples/marc
AU        client/ruby/solr-ruby/examples/marc/marc_importer.rb
A         client/ruby/solr-ruby/examples/delicious_library
A         client/ruby/solr-ruby/examples/delicious_library/sample_export.txt
AU        client/ruby/solr-ruby/examples/delicious_library/dl_importer.rb
A         client/ruby/solr-ruby/examples/tang
AU        client/ruby/solr-ruby/examples/tang/tang_importer.rb
 U        
At revision 618196
no change for http://svn.apache.org/repos/asf/lucene/solr/trunk since the previous build
[trunk] $ /export/home/hudson/tools/ant/latest/bin/ant -Dversion=$BUILD_ID -Dtest.junit.output.format=xml nightly
Buildfile: build.xml

init-forrest-entities:
    [mkdir] Created dir: http://hudson.zones.apache.org/hudson/job/Solr-trunk/ws/trunk/build 

compile-common:
    [mkdir] Created dir: http://hudson.zones.apache.org/hudson/job/Solr-trunk/ws/trunk/build/common 
    [javac] Compiling 31 source files to http://hudson.zones.apache.org/hudson/job/Solr-trunk/ws/trunk/build/common 
    [javac] Note: Some input files use unchecked or unsafe operations.
    [javac] Note: Recompile with -Xlint:unchecked for details.

compile:
    [mkdir] Created dir: http://hudson.zones.apache.org/hudson/job/Solr-trunk/ws/trunk/build/core 
    [javac] Compiling 274 source files to http://hudson.zones.apache.org/hudson/job/Solr-trunk/ws/trunk/build/core 
    [javac] Note: Some input files use or override a deprecated API.
    [javac] Note: Recompile with -Xlint:deprecation for details.
    [javac] Note: Some input files use unchecked or unsafe operations.
    [javac] Note: Recompile with -Xlint:unchecked for details.

compile-solrj-core:
    [mkdir] Created dir: http://hudson.zones.apache.org/hudson/job/Solr-trunk/ws/trunk/build/client/solrj 
    [javac] Compiling 22 source files to http://hudson.zones.apache.org/hudson/job/Solr-trunk/ws/trunk/build/client/solrj 
    [javac] Note: http://hudson.zones.apache.org/hudson/job/Solr-trunk/ws/trunk/client/java/solrj/src/org/apache/solr/client/solrj/impl/CommonsHttpSolrServer.java  uses or overrides a deprecated API.
    [javac] Note: Recompile with -Xlint:deprecation for details.

compile-solrj:
    [javac] Compiling 2 source files to http://hudson.zones.apache.org/hudson/job/Solr-trunk/ws/trunk/build/client/solrj 

compileTests:
    [mkdir] Created dir: http://hudson.zones.apache.org/hudson/job/Solr-trunk/ws/trunk/build/tests 
    [javac] Compiling 77 source files to http://hudson.zones.apache.org/hudson/job/Solr-trunk/ws/trunk/build/tests 
    [javac] Note: Some input files use or override a deprecated API.
    [javac] Note: Recompile with -Xlint:deprecation for details.
    [javac] Note: Some input files use unchecked or unsafe operations.
    [javac] Note: Recompile with -Xlint:unchecked for details.

junit:
    [mkdir] Created dir: http://hudson.zones.apache.org/hudson/job/Solr-trunk/ws/trunk/build/test-results 
    [junit] Running org.apache.solr.BasicFunctionalityTest
    [junit] Tests run: 25, Failures: 0, Errors: 0, Time elapsed: 29.061 sec
    [junit] Running org.apache.solr.ConvertedLegacyTest
    [junit] Tests run: 1, Failures: 0, Errors: 0, Time elapsed: 25.179 sec
    [junit] Running org.apache.solr.DisMaxRequestHandlerTest
    [junit] Tests run: 3, Failures: 0, Errors: 0, Time elapsed: 7.934 sec
    [junit] Running org.apache.solr.EchoParamsTest
    [junit] Tests run: 4, Failures: 0, Errors: 0, Time elapsed: 2.521 sec
    [junit] Running org.apache.solr.OutputWriterTest
    [junit] Tests run: 3, Failures: 0, Errors: 0, Time elapsed: 4.099 sec
    [junit] Running org.apache.solr.SampleTest
    [junit] Tests run: 2, Failures: 0, Errors: 0, Time elapsed: 2.273 sec
    [junit] Running org.apache.solr.analysis.HTMLStripReaderTest
    [junit] Tests run: 9, Failures: 0, Errors: 0, Time elapsed: 0.745 sec
    [junit] Running org.apache.solr.analysis.TestBufferedTokenStream
    [junit] Tests run: 2, Failures: 0, Errors: 0, Time elapsed: 0.828 sec
    [junit] Running org.apache.solr.analysis.TestCapitalizationFilter
    [junit] Tests run: 1, Failures: 0, Errors: 0, Time elapsed: 0.518 sec
    [junit] Running org.apache.solr.analysis.TestHyphenatedWordsFilter
    [junit] Tests run: 1, Failures: 0, Errors: 0, Time elapsed: 0.568 sec
    [junit] Running org.apache.solr.analysis.TestKeepWordFilter
    [junit] Tests run: 1, Failures: 0, Errors: 0, Time elapsed: 0.576 sec
    [junit] Running org.apache.solr.analysis.TestPatternReplaceFilter
    [junit] Tests run: 5, Failures: 0, Errors: 0, Time elapsed: 1.396 sec
    [junit] Running org.apache.solr.analysis.TestPatternTokenizerFactory
    [junit] Tests run: 1, Failures: 0, Errors: 0, Time elapsed: 0.711 sec
    [junit] Running org.apache.solr.analysis.TestPhoneticFilter
    [junit] Tests run: 2, Failures: 0, Errors: 0, Time elapsed: 0.896 sec
    [junit] Running org.apache.solr.analysis.TestRemoveDuplicatesTokenFilter
    [junit] Tests run: 3, Failures: 0, Errors: 0, Time elapsed: 1.177 sec
    [junit] Running org.apache.solr.analysis.TestSynonymFilter
    [junit] Tests run: 7, Failures: 0, Errors: 0, Time elapsed: 2.133 sec
    [junit] Running org.apache.solr.analysis.TestTrimFilter
    [junit] Tests run: 1, Failures: 0, Errors: 0, Time elapsed: 0.521 sec
    [junit] Running org.apache.solr.analysis.TestWordDelimiterFilter
    [junit] Tests run: 4, Failures: 0, Errors: 0, Time elapsed: 12.177 sec
    [junit] Running org.apache.solr.common.SolrDocumentTest
    [junit] Tests run: 4, Failures: 0, Errors: 0, Time elapsed: 0.43 sec
    [junit] Running org.apache.solr.common.params.SolrParamTest
    [junit] Tests run: 1, Failures: 0, Errors: 0, Time elapsed: 0.314 sec
    [junit] Running org.apache.solr.common.util.ContentStreamTest
    [junit] Tests run: 3, Failures: 0, Errors: 0, Time elapsed: 0.238 sec
    [junit] Running org.apache.solr.common.util.IteratorChainTest
    [junit] Tests run: 7, Failures: 0, Errors: 0, Time elapsed: 0.189 sec
    [junit] Running org.apache.solr.common.util.TestXMLEscaping
    [junit] Tests run: 7, Failures: 0, Errors: 0, Time elapsed: 0.171 sec
    [junit] Running org.apache.solr.core.RequestHandlersTest
    [junit] Tests run: 2, Failures: 0, Errors: 0, Time elapsed: 4.641 sec
    [junit] Running org.apache.solr.core.ResourceLoaderTest
    [junit] Tests run: 1, Failures: 0, Errors: 0, Time elapsed: 0.172 sec
    [junit] Running org.apache.solr.core.SolrCoreTest
    [junit] Tests run: 1, Failures: 0, Errors: 0, Time elapsed: 2.472 sec
    [junit] Running org.apache.solr.core.TestBadConfig
    [junit] Tests run: 1, Failures: 0, Errors: 0, Time elapsed: 0.171 sec
    [junit] Running org.apache.solr.core.TestConfig
    [junit] Tests run: 1, Failures: 0, Errors: 0, Time elapsed: 2.49 sec
    [junit] Running org.apache.solr.core.TestQuerySenderListener
    [junit] Tests run: 1, Failures: 0, Errors: 0, Time elapsed: 2.599 sec
    [junit] Running org.apache.solr.handler.MoreLikeThisHandlerTest
    [junit] Tests run: 1, Failures: 0, Errors: 0, Time elapsed: 2.818 sec
    [junit] Running org.apache.solr.handler.SpellCheckerRequestHandlerTest
    [junit] Tests run: 5, Failures: 0, Errors: 0, Time elapsed: 4.767 sec
    [junit] Running org.apache.solr.handler.StandardRequestHandlerTest
    [junit] Tests run: 1, Failures: 0, Errors: 0, Time elapsed: 2.794 sec
    [junit] Running org.apache.solr.handler.TestCSVLoader
    [junit] Tests run: 4, Failures: 0, Errors: 0, Time elapsed: 10.826 sec
    [junit] Running org.apache.solr.handler.XmlUpdateRequestHandlerTest
    [junit] Tests run: 1, Failures: 0, Errors: 0, Time elapsed: 2.169 sec
    [junit] Running org.apache.solr.handler.admin.SystemInfoHandlerTest
    [junit] Tests run: 1, Failures: 0, Errors: 0, Time elapsed: 0.56 sec
    [junit] Running org.apache.solr.handler.component.QueryElevationComponentTest
    [junit] Tests run: 3, Failures: 0, Errors: 0, Time elapsed: 6.143 sec
    [junit] Running org.apache.solr.handler.component.SearchHandlerTest
    [junit] Tests run: 1, Failures: 0, Errors: 0, Time elapsed: 2.49 sec
    [junit] Running org.apache.solr.highlight.HighlighterTest
    [junit] Tests run: 15, Failures: 0, Errors: 0, Time elapsed: 19.092 sec
    [junit] Running org.apache.solr.request.JSONWriterTest
    [junit] Tests run: 1, Failures: 0, Errors: 0, Time elapsed: 2.163 sec
    [junit] Running org.apache.solr.schema.BadIndexSchemaTest
    [junit] Tests run: 1, Failures: 0, Errors: 0, Time elapsed: 1.386 sec
    [junit] Running org.apache.solr.schema.IndexSchemaTest
    [junit] Tests run: 1, Failures: 0, Errors: 0, Time elapsed: 2.938 sec
    [junit] Running org.apache.solr.schema.NotRequiredUniqueKeyTest
    [junit] Tests run: 1, Failures: 0, Errors: 0, Time elapsed: 1.21 sec
    [junit] Running org.apache.solr.schema.RequiredFieldsTest
    [junit] Tests run: 3, Failures: 0, Errors: 0, Time elapsed: 5.284 sec
    [junit] Running org.apache.solr.schema.UUIDFieldTest
    [junit] Tests run: 1, Failures: 0, Errors: 0, Time elapsed: 0.425 sec
    [junit] Running org.apache.solr.search.TestDocSet
    [junit] Tests run: 1, Failures: 0, Errors: 0, Time elapsed: 0.67 sec
    [junit] Running org.apache.solr.search.TestQueryTypes
    [junit] Tests run: 1, Failures: 0, Errors: 0, Time elapsed: 2.553 sec
    [junit] Running org.apache.solr.search.TestQueryUtils
    [junit] Tests run: 1, Failures: 0, Errors: 0, Time elapsed: 2.846 sec
    [junit] Running org.apache.solr.search.function.TestFunctionQuery
    [junit] Tests run: 2, Failures: 0, Errors: 0, Time elapsed: 6.333 sec
    [junit] Running org.apache.solr.servlet.DirectSolrConnectionTest
    [junit] Tests run: 2, Failures: 0, Errors: 0, Time elapsed: 1.928 sec
    [junit] Running org.apache.solr.servlet.SolrRequestParserTest
    [junit] Tests run: 4, Failures: 0, Errors: 0, Time elapsed: 5.937 sec
    [junit] Running org.apache.solr.update.AutoCommitTest
    [junit] <response>
    [junit] <lst name="responseHeader"><int name="status">0</int><int name="QTime">0</int></lst><result name="response" numFound="0" start="0"/>
    [junit] </response>
    [junit] )
    [junit] Tests run: 3, Failures: 1, Errors: 0, Time elapsed: 6.349 sec
    [junit] Test org.apache.solr.update.AutoCommitTest FAILED
    [junit] Running org.apache.solr.update.DirectUpdateHandlerTest
    [junit] Tests run: 1, Failures: 0, Errors: 0, Time elapsed: 2.487 sec
    [junit] Running org.apache.solr.update.DocumentBuilderTest
    [junit] Tests run: 2, Failures: 0, Errors: 0, Time elapsed: 2.981 sec
    [junit] Running org.apache.solr.update.processor.UpdateRequestProcessorFactoryTest
    [junit] Tests run: 1, Failures: 0, Errors: 0, Time elapsed: 1.979 sec
    [junit] Running org.apache.solr.util.DateMathParserTest
    [junit] Tests run: 7, Failures: 0, Errors: 0, Time elapsed: 0.22 sec
    [junit] Running org.apache.solr.util.SolrPluginUtilsTest
    [junit] Tests run: 5, Failures: 0, Errors: 0, Time elapsed: 6.491 sec
    [junit] Running org.apache.solr.util.TestCharArrayMap
    [junit] Tests run: 2, Failures: 0, Errors: 0, Time elapsed: 0.339 sec
    [junit] Running org.apache.solr.util.TestOpenBitSet
    [junit] Tests run: 3, Failures: 0, Errors: 0, Time elapsed: 0.994 sec
    [junit] Running org.apache.solr.util.TestUtils
    [junit] Tests run: 1, Failures: 0, Errors: 0, Time elapsed: 0.114 sec
    [junit] Running org.apache.solr.client.solrj.SolrExceptionTest
    [junit] Tests run: 1, Failures: 0, Errors: 0, Time elapsed: 1.185 sec
    [junit] Running org.apache.solr.client.solrj.SolrQueryTest
    [junit] Tests run: 1, Failures: 0, Errors: 0, Time elapsed: 0.12 sec
    [junit] Running org.apache.solr.client.solrj.embedded.LargeVolumeEmbeddedTest
    [junit] Tests run: 1, Failures: 0, Errors: 0, Time elapsed: 6.417 sec
    [junit] Running org.apache.solr.client.solrj.embedded.LargeVolumeJettyTest
    [junit] Tests run: 1, Failures: 0, Errors: 0, Time elapsed: 8.54 sec
    [junit] 2008-02-04 08:24:55.251::INFO:  Shutdown hook executing
    [junit] 2008-02-04 08:24:55.252::INFO:  Shutdown hook complete
    [junit] Running org.apache.solr.client.solrj.embedded.MultiCoreEmbeddedTest
    [junit] Tests run: 1, Failures: 0, Errors: 0, Time elapsed: 2.624 sec
    [junit] Running org.apache.solr.client.solrj.embedded.MultiCoreExampleJettyTest
    [junit] Tests run: 1, Failures: 0, Errors: 0, Time elapsed: 3.281 sec
    [junit] 2008-02-04 08:25:03.541::INFO:  Shutdown hook executing
    [junit] 2008-02-04 08:25:03.541::INFO:  Shutdown hook complete
    [junit] Running org.apache.solr.client.solrj.embedded.SolrExampleEmbeddedTest
    [junit] Tests run: 6, Failures: 0, Errors: 0, Time elapsed: 7.143 sec
    [junit] Running org.apache.solr.client.solrj.embedded.SolrExampleJettyTest
    [junit] Tests run: 6, Failures: 0, Errors: 0, Time elapsed: 11.907 sec
    [junit] 2008-02-04 08:25:26.416::INFO:  Shutdown hook executing
    [junit] 2008-02-04 08:25:26.417::INFO:  Shutdown hook complete
    [junit] 2008-02-04 08:25:27.425::INFO:  Shutdown hook complete
    [junit] 2008-02-04 08:25:28.435::INFO:  Shutdown hook complete
    [junit] 2008-02-04 08:25:29.445::INFO:  Shutdown hook complete
    [junit] 2008-02-04 08:25:30.455::INFO:  Shutdown hook complete
    [junit] 2008-02-04 08:25:31.465::INFO:  Shutdown hook complete
    [junit] Running org.apache.solr.client.solrj.util.ClientUtilsTest
    [junit] Tests run: 1, Failures: 0, Errors: 0, Time elapsed: 0.106 sec

BUILD FAILED
http://hudson.zones.apache.org/hudson/job/Solr-trunk/ws/trunk/build.xml :481: Tests failed!

Total time: 6 minutes 4 seconds
ERROR: No artifacts found that match the file pattern "trunk/dist/*.tgz, trunk/dist/*.zip". Configuration error?
Publishing Javadoc
Recording test results

Reply | Threaded
Open this post in threaded view
|

Re: Build failed in Hudson: Solr-trunk #341

Mike Klaas

On 4-Feb-08, at 12:25 AM, Apache Hudson Server wrote:

>     [junit] Running org.apache.solr.update.AutoCommitTest
>     [junit] <response>
>     [junit] <lst name="responseHeader"><int name="status">0</
> int><int name="QTime">0</int></lst><result name="response"  
> numFound="0" start="0"/>
>     [junit] </response>
>     [junit] )
>     [junit] Tests run: 3, Failures: 1, Errors: 0, Time elapsed:  
> 6.349 sec
>     [junit] Test org.apache.solr.update.AutoCommitTest FAILED

Shei├če, I thought I licked it this time.  I'll take another look at  
this soon.

-Mike
Reply | Threaded
Open this post in threaded view
|

Build failed in Hudson: Solr-trunk #342

Apache Hudson Server
In reply to this post by Apache Hudson Server
See http://hudson.zones.apache.org/hudson/job/Solr-trunk/342/changes

Changes:

[yonik] add test for custom query parser from solrconfig.xml

------------------------------------------
[...truncated 1110 lines...]
A         client/ruby/solr-ruby/lib/solr/importer
AU        client/ruby/solr-ruby/lib/solr/importer/delimited_file_source.rb
AU        client/ruby/solr-ruby/lib/solr/importer/solr_source.rb
AU        client/ruby/solr-ruby/lib/solr/importer/array_mapper.rb
AU        client/ruby/solr-ruby/lib/solr/importer/mapper.rb
AU        client/ruby/solr-ruby/lib/solr/importer/xpath_mapper.rb
A         client/ruby/solr-ruby/lib/solr/importer/hpricot_mapper.rb
A         client/ruby/solr-ruby/lib/solr/xml.rb
AU        client/ruby/solr-ruby/lib/solr/importer.rb
A         client/ruby/solr-ruby/lib/solr/field.rb
AU        client/ruby/solr-ruby/lib/solr/solrtasks.rb
A         client/ruby/solr-ruby/lib/solr/request
A         client/ruby/solr-ruby/lib/solr/request/ping.rb
A         client/ruby/solr-ruby/lib/solr/request/spellcheck.rb
A         client/ruby/solr-ruby/lib/solr/request/select.rb
AU        client/ruby/solr-ruby/lib/solr/request/optimize.rb
AU        client/ruby/solr-ruby/lib/solr/request/standard.rb
A         client/ruby/solr-ruby/lib/solr/request/delete.rb
AU        client/ruby/solr-ruby/lib/solr/request/index_info.rb
A         client/ruby/solr-ruby/lib/solr/request/update.rb
A         client/ruby/solr-ruby/lib/solr/request/dismax.rb
AU        client/ruby/solr-ruby/lib/solr/request/modify_document.rb
A         client/ruby/solr-ruby/lib/solr/request/add_document.rb
A         client/ruby/solr-ruby/lib/solr/request/commit.rb
A         client/ruby/solr-ruby/lib/solr/request/base.rb
AU        client/ruby/solr-ruby/lib/solr/request.rb
A         client/ruby/solr-ruby/lib/solr/response
A         client/ruby/solr-ruby/lib/solr/response/ping.rb
A         client/ruby/solr-ruby/lib/solr/response/spellcheck.rb
AU        client/ruby/solr-ruby/lib/solr/response/select.rb
AU        client/ruby/solr-ruby/lib/solr/response/optimize.rb
A         client/ruby/solr-ruby/lib/solr/response/standard.rb
A         client/ruby/solr-ruby/lib/solr/response/xml.rb
A         client/ruby/solr-ruby/lib/solr/response/ruby.rb
A         client/ruby/solr-ruby/lib/solr/response/delete.rb
AU        client/ruby/solr-ruby/lib/solr/response/index_info.rb
A         client/ruby/solr-ruby/lib/solr/response/dismax.rb
AU        client/ruby/solr-ruby/lib/solr/response/modify_document.rb
A         client/ruby/solr-ruby/lib/solr/response/add_document.rb
A         client/ruby/solr-ruby/lib/solr/response/commit.rb
A         client/ruby/solr-ruby/lib/solr/response/base.rb
AU        client/ruby/solr-ruby/lib/solr.rb
A         client/ruby/solr-ruby/CHANGES.yml
A         client/ruby/solr-ruby/README
A         client/ruby/solr-ruby/examples
A         client/ruby/solr-ruby/examples/marc
AU        client/ruby/solr-ruby/examples/marc/marc_importer.rb
A         client/ruby/solr-ruby/examples/delicious_library
A         client/ruby/solr-ruby/examples/delicious_library/sample_export.txt
AU        client/ruby/solr-ruby/examples/delicious_library/dl_importer.rb
A         client/ruby/solr-ruby/examples/tang
AU        client/ruby/solr-ruby/examples/tang/tang_importer.rb
 U        
At revision 618569
[trunk] $ /export/home/hudson/tools/ant/latest/bin/ant -Dversion=$BUILD_ID -Dtest.junit.output.format=xml nightly
Buildfile: build.xml

init-forrest-entities:
    [mkdir] Created dir: http://hudson.zones.apache.org/hudson/job/Solr-trunk/ws/trunk/build 

compile-common:
    [mkdir] Created dir: http://hudson.zones.apache.org/hudson/job/Solr-trunk/ws/trunk/build/common 
    [javac] Compiling 31 source files to http://hudson.zones.apache.org/hudson/job/Solr-trunk/ws/trunk/build/common 
    [javac] Note: Some input files use unchecked or unsafe operations.
    [javac] Note: Recompile with -Xlint:unchecked for details.

compile:
    [mkdir] Created dir: http://hudson.zones.apache.org/hudson/job/Solr-trunk/ws/trunk/build/core 
    [javac] Compiling 274 source files to http://hudson.zones.apache.org/hudson/job/Solr-trunk/ws/trunk/build/core 
    [javac] Note: Some input files use or override a deprecated API.
    [javac] Note: Recompile with -Xlint:deprecation for details.
    [javac] Note: Some input files use unchecked or unsafe operations.
    [javac] Note: Recompile with -Xlint:unchecked for details.

compile-solrj-core:
    [mkdir] Created dir: http://hudson.zones.apache.org/hudson/job/Solr-trunk/ws/trunk/build/client/solrj 
    [javac] Compiling 22 source files to http://hudson.zones.apache.org/hudson/job/Solr-trunk/ws/trunk/build/client/solrj 
    [javac] Note: http://hudson.zones.apache.org/hudson/job/Solr-trunk/ws/trunk/client/java/solrj/src/org/apache/solr/client/solrj/impl/CommonsHttpSolrServer.java  uses or overrides a deprecated API.
    [javac] Note: Recompile with -Xlint:deprecation for details.

compile-solrj:
    [javac] Compiling 2 source files to http://hudson.zones.apache.org/hudson/job/Solr-trunk/ws/trunk/build/client/solrj 

compileTests:
    [mkdir] Created dir: http://hudson.zones.apache.org/hudson/job/Solr-trunk/ws/trunk/build/tests 
    [javac] Compiling 78 source files to http://hudson.zones.apache.org/hudson/job/Solr-trunk/ws/trunk/build/tests 
    [javac] Note: Some input files use or override a deprecated API.
    [javac] Note: Recompile with -Xlint:deprecation for details.
    [javac] Note: Some input files use unchecked or unsafe operations.
    [javac] Note: Recompile with -Xlint:unchecked for details.

junit:
    [mkdir] Created dir: http://hudson.zones.apache.org/hudson/job/Solr-trunk/ws/trunk/build/test-results 
    [junit] Running org.apache.solr.BasicFunctionalityTest
    [junit] Tests run: 25, Failures: 0, Errors: 0, Time elapsed: 24.278 sec
    [junit] Running org.apache.solr.ConvertedLegacyTest
    [junit] Tests run: 1, Failures: 0, Errors: 0, Time elapsed: 11.056 sec
    [junit] Running org.apache.solr.DisMaxRequestHandlerTest
    [junit] Tests run: 3, Failures: 0, Errors: 0, Time elapsed: 4.775 sec
    [junit] Running org.apache.solr.EchoParamsTest
    [junit] Tests run: 4, Failures: 0, Errors: 0, Time elapsed: 2.814 sec
    [junit] Running org.apache.solr.OutputWriterTest
    [junit] Tests run: 3, Failures: 0, Errors: 0, Time elapsed: 2.299 sec
    [junit] Running org.apache.solr.SampleTest
    [junit] Tests run: 2, Failures: 0, Errors: 0, Time elapsed: 2.14 sec
    [junit] Running org.apache.solr.analysis.HTMLStripReaderTest
    [junit] Tests run: 9, Failures: 0, Errors: 0, Time elapsed: 0.725 sec
    [junit] Running org.apache.solr.analysis.TestBufferedTokenStream
    [junit] Tests run: 2, Failures: 0, Errors: 0, Time elapsed: 0.762 sec
    [junit] Running org.apache.solr.analysis.TestCapitalizationFilter
    [junit] Tests run: 1, Failures: 0, Errors: 0, Time elapsed: 0.563 sec
    [junit] Running org.apache.solr.analysis.TestHyphenatedWordsFilter
    [junit] Tests run: 1, Failures: 0, Errors: 0, Time elapsed: 0.566 sec
    [junit] Running org.apache.solr.analysis.TestKeepWordFilter
    [junit] Tests run: 1, Failures: 0, Errors: 0, Time elapsed: 0.443 sec
    [junit] Running org.apache.solr.analysis.TestPatternReplaceFilter
    [junit] Tests run: 5, Failures: 0, Errors: 0, Time elapsed: 1.134 sec
    [junit] Running org.apache.solr.analysis.TestPatternTokenizerFactory
    [junit] Tests run: 1, Failures: 0, Errors: 0, Time elapsed: 0.528 sec
    [junit] Running org.apache.solr.analysis.TestPhoneticFilter
    [junit] Tests run: 2, Failures: 0, Errors: 0, Time elapsed: 0.651 sec
    [junit] Running org.apache.solr.analysis.TestRemoveDuplicatesTokenFilter
    [junit] Tests run: 3, Failures: 0, Errors: 0, Time elapsed: 0.863 sec
    [junit] Running org.apache.solr.analysis.TestSynonymFilter
    [junit] Tests run: 7, Failures: 0, Errors: 0, Time elapsed: 1.283 sec
    [junit] Running org.apache.solr.analysis.TestTrimFilter
    [junit] Tests run: 1, Failures: 0, Errors: 0, Time elapsed: 0.435 sec
    [junit] Running org.apache.solr.analysis.TestWordDelimiterFilter
    [junit] Tests run: 4, Failures: 0, Errors: 0, Time elapsed: 6.405 sec
    [junit] Running org.apache.solr.common.SolrDocumentTest
    [junit] Tests run: 4, Failures: 0, Errors: 0, Time elapsed: 0.333 sec
    [junit] Running org.apache.solr.common.params.SolrParamTest
    [junit] Tests run: 1, Failures: 0, Errors: 0, Time elapsed: 0.123 sec
    [junit] Running org.apache.solr.common.util.ContentStreamTest
    [junit] Tests run: 3, Failures: 1, Errors: 0, Time elapsed: 8.331 sec
    [junit] Test org.apache.solr.common.util.ContentStreamTest FAILED
    [junit] Running org.apache.solr.common.util.IteratorChainTest
    [junit] Tests run: 7, Failures: 0, Errors: 0, Time elapsed: 0.132 sec
    [junit] Running org.apache.solr.common.util.TestXMLEscaping
    [junit] Tests run: 7, Failures: 0, Errors: 0, Time elapsed: 0.134 sec
    [junit] Running org.apache.solr.core.RequestHandlersTest
    [junit] Tests run: 2, Failures: 0, Errors: 0, Time elapsed: 4.272 sec
    [junit] Running org.apache.solr.core.ResourceLoaderTest
    [junit] Tests run: 1, Failures: 0, Errors: 0, Time elapsed: 0.155 sec
    [junit] Running org.apache.solr.core.SolrCoreTest
    [junit] Tests run: 1, Failures: 0, Errors: 0, Time elapsed: 2.113 sec
    [junit] Running org.apache.solr.core.TestBadConfig
    [junit] Tests run: 1, Failures: 0, Errors: 0, Time elapsed: 0.175 sec
    [junit] Running org.apache.solr.core.TestConfig
    [junit] Tests run: 1, Failures: 0, Errors: 0, Time elapsed: 2.224 sec
    [junit] Running org.apache.solr.core.TestQuerySenderListener
    [junit] Tests run: 1, Failures: 0, Errors: 0, Time elapsed: 2.325 sec
    [junit] Running org.apache.solr.handler.MoreLikeThisHandlerTest
    [junit] Tests run: 1, Failures: 0, Errors: 0, Time elapsed: 2.535 sec
    [junit] Running org.apache.solr.handler.SpellCheckerRequestHandlerTest
    [junit] Tests run: 5, Failures: 0, Errors: 0, Time elapsed: 5.913 sec
    [junit] Running org.apache.solr.handler.StandardRequestHandlerTest
    [junit] Tests run: 1, Failures: 0, Errors: 0, Time elapsed: 3.226 sec
    [junit] Running org.apache.solr.handler.TestCSVLoader
    [junit] Tests run: 4, Failures: 0, Errors: 0, Time elapsed: 11.222 sec
    [junit] Running org.apache.solr.handler.XmlUpdateRequestHandlerTest
    [junit] Tests run: 1, Failures: 0, Errors: 0, Time elapsed: 1.986 sec
    [junit] Running org.apache.solr.handler.admin.SystemInfoHandlerTest
    [junit] Tests run: 1, Failures: 0, Errors: 0, Time elapsed: 0.14 sec
    [junit] Running org.apache.solr.handler.component.QueryElevationComponentTest
    [junit] Tests run: 3, Failures: 0, Errors: 0, Time elapsed: 5.053 sec
    [junit] Running org.apache.solr.handler.component.SearchHandlerTest
    [junit] Tests run: 1, Failures: 0, Errors: 0, Time elapsed: 1.913 sec
    [junit] Running org.apache.solr.highlight.HighlighterTest
    [junit] Tests run: 15, Failures: 0, Errors: 0, Time elapsed: 14.639 sec
    [junit] Running org.apache.solr.request.JSONWriterTest
    [junit] Tests run: 1, Failures: 0, Errors: 0, Time elapsed: 2.666 sec
    [junit] Running org.apache.solr.schema.BadIndexSchemaTest
    [junit] Tests run: 1, Failures: 0, Errors: 0, Time elapsed: 1.351 sec
    [junit] Running org.apache.solr.schema.IndexSchemaTest
    [junit] Tests run: 1, Failures: 0, Errors: 0, Time elapsed: 3.248 sec
    [junit] Running org.apache.solr.schema.NotRequiredUniqueKeyTest
    [junit] Tests run: 1, Failures: 0, Errors: 0, Time elapsed: 1.316 sec
    [junit] Running org.apache.solr.schema.RequiredFieldsTest
    [junit] Tests run: 3, Failures: 0, Errors: 0, Time elapsed: 4.898 sec
    [junit] Running org.apache.solr.schema.UUIDFieldTest
    [junit] Tests run: 1, Failures: 0, Errors: 0, Time elapsed: 0.506 sec
    [junit] Running org.apache.solr.search.TestDocSet
    [junit] Tests run: 1, Failures: 0, Errors: 0, Time elapsed: 0.613 sec
    [junit] Running org.apache.solr.search.TestQueryTypes
    [junit] Tests run: 1, Failures: 0, Errors: 0, Time elapsed: 2.302 sec
    [junit] Running org.apache.solr.search.TestQueryUtils
    [junit] Tests run: 1, Failures: 0, Errors: 0, Time elapsed: 3.018 sec
    [junit] Running org.apache.solr.search.function.TestFunctionQuery
    [junit] Tests run: 2, Failures: 0, Errors: 0, Time elapsed: 5.227 sec
    [junit] Running org.apache.solr.servlet.DirectSolrConnectionTest
    [junit] Tests run: 2, Failures: 0, Errors: 0, Time elapsed: 1.793 sec
    [junit] Running org.apache.solr.servlet.SolrRequestParserTest
    [junit] Tests run: 4, Failures: 0, Errors: 0, Time elapsed: 12.392 sec
    [junit] Running org.apache.solr.update.AutoCommitTest
    [junit] Tests run: 3, Failures: 0, Errors: 0, Time elapsed: 8.614 sec
    [junit] Running org.apache.solr.update.DirectUpdateHandlerTest
    [junit] Tests run: 1, Failures: 0, Errors: 0, Time elapsed: 2.25 sec
    [junit] Running org.apache.solr.update.DocumentBuilderTest
    [junit] Tests run: 2, Failures: 0, Errors: 0, Time elapsed: 3.284 sec
    [junit] Running org.apache.solr.update.processor.UpdateRequestProcessorFactoryTest
    [junit] Tests run: 1, Failures: 0, Errors: 0, Time elapsed: 2.049 sec
    [junit] Running org.apache.solr.util.DateMathParserTest
    [junit] Tests run: 7, Failures: 0, Errors: 0, Time elapsed: 0.444 sec
    [junit] Running org.apache.solr.util.SolrPluginUtilsTest
    [junit] Tests run: 5, Failures: 0, Errors: 0, Time elapsed: 5.447 sec
    [junit] Running org.apache.solr.util.TestCharArrayMap
    [junit] Tests run: 2, Failures: 0, Errors: 0, Time elapsed: 0.349 sec
    [junit] Running org.apache.solr.util.TestOpenBitSet
    [junit] Tests run: 3, Failures: 0, Errors: 0, Time elapsed: 0.996 sec
    [junit] Running org.apache.solr.util.TestUtils
    [junit] Tests run: 1, Failures: 0, Errors: 0, Time elapsed: 0.099 sec
    [junit] Running org.apache.solr.client.solrj.SolrExceptionTest
    [junit] Tests run: 1, Failures: 0, Errors: 0, Time elapsed: 0.596 sec
    [junit] Running org.apache.solr.client.solrj.SolrQueryTest
    [junit] Tests run: 1, Failures: 0, Errors: 0, Time elapsed: 0.143 sec
    [junit] Running org.apache.solr.client.solrj.embedded.LargeVolumeEmbeddedTest
    [junit] Tests run: 1, Failures: 0, Errors: 0, Time elapsed: 4.093 sec
    [junit] Running org.apache.solr.client.solrj.embedded.LargeVolumeJettyTest
    [junit] Tests run: 1, Failures: 0, Errors: 0, Time elapsed: 4.162 sec
    [junit] 2008-02-05 08:20:53.563::INFO:  Shutdown hook executing
    [junit] 2008-02-05 08:20:53.563::INFO:  Shutdown hook complete
    [junit] Running org.apache.solr.client.solrj.embedded.MultiCoreEmbeddedTest
    [junit] Tests run: 1, Failures: 0, Errors: 0, Time elapsed: 4.33 sec
    [junit] Running org.apache.solr.client.solrj.embedded.MultiCoreExampleJettyTest
    [junit] Tests run: 1, Failures: 0, Errors: 0, Time elapsed: 3.099 sec
    [junit] 2008-02-05 08:21:04.297::INFO:  Shutdown hook executing
    [junit] 2008-02-05 08:21:04.297::INFO:  Shutdown hook complete
    [junit] Running org.apache.solr.client.solrj.embedded.SolrExampleEmbeddedTest
    [junit] Tests run: 6, Failures: 0, Errors: 0, Time elapsed: 6.942 sec
    [junit] Running org.apache.solr.client.solrj.embedded.SolrExampleJettyTest
    [junit] Tests run: 6, Failures: 0, Errors: 0, Time elapsed: 9.32 sec
    [junit] 2008-02-05 08:21:24.454::INFO:  Shutdown hook executing
    [junit] 2008-02-05 08:21:24.454::INFO:  Shutdown hook complete
    [junit] 2008-02-05 08:21:25.457::INFO:  Shutdown hook complete
    [junit] 2008-02-05 08:21:26.467::INFO:  Shutdown hook complete
    [junit] 2008-02-05 08:21:27.476::INFO:  Shutdown hook complete
    [junit] 2008-02-05 08:21:28.486::INFO:  Shutdown hook complete
    [junit] 2008-02-05 08:21:29.496::INFO:  Shutdown hook complete
    [junit] Running org.apache.solr.client.solrj.util.ClientUtilsTest
    [junit] Tests run: 1, Failures: 0, Errors: 0, Time elapsed: 0.105 sec

BUILD FAILED
http://hudson.zones.apache.org/hudson/job/Solr-trunk/ws/trunk/build.xml :481: Tests failed!

Total time: 5 minutes 15 seconds
ERROR: No artifacts found that match the file pattern "trunk/dist/*.tgz, trunk/dist/*.zip". Configuration error?
Publishing Javadoc
Recording test results

Reply | Threaded
Open this post in threaded view
|

Re: Build failed in Hudson: Solr-trunk #342

Ryan McKinley
>     [junit] Tests run: 3, Failures: 1, Errors: 0, Time elapsed: 8.331 sec
>     [junit] Test org.apache.solr.common.util.ContentStreamTest FAILED

haven't seen this one before -- this can happen if the netowork
connection is down, or can not connect to:
  http://svn.apache.org/repos/asf/lucene/solr/trunk/

ryan
Reply | Threaded
Open this post in threaded view
|

Hudson build is back to normal: Solr-trunk #343

Apache Hudson Server
In reply to this post by Apache Hudson Server