Build failed in Hudson: Solr-trunk #387

classic Classic list List threaded Threaded
5 messages Options
Reply | Threaded
Open this post in threaded view
|

Build failed in Hudson: Solr-trunk #387

Apache Hudson Server
See http://hudson.zones.apache.org/hudson/job/Solr-trunk/387/changes

Changes:

[ehatcher] Enlighted by Hoss' question, clarify a bit more about nesting Solr within a larger web application

[ehatcher] Clarify path-prefix in web.xml comments and javadocs

[ehatcher] Incorporate the prefixPath, if configured, on the forwards

[ehatcher] Typo fix

[ehatcher] Fix javadoc issue

------------------------------------------
[...truncated 1178 lines...]
A         client/ruby/solr-ruby/lib/solr/response/xml.rb
A         client/ruby/solr-ruby/lib/solr/response/ruby.rb
A         client/ruby/solr-ruby/lib/solr/response/delete.rb
AU        client/ruby/solr-ruby/lib/solr/response/index_info.rb
A         client/ruby/solr-ruby/lib/solr/response/dismax.rb
AU        client/ruby/solr-ruby/lib/solr/response/modify_document.rb
A         client/ruby/solr-ruby/lib/solr/response/add_document.rb
A         client/ruby/solr-ruby/lib/solr/response/commit.rb
A         client/ruby/solr-ruby/lib/solr/response/base.rb
AU        client/ruby/solr-ruby/lib/solr.rb
A         client/ruby/solr-ruby/CHANGES.yml
A         client/ruby/solr-ruby/README
A         client/ruby/solr-ruby/examples
A         client/ruby/solr-ruby/examples/marc
AU        client/ruby/solr-ruby/examples/marc/marc_importer.rb
A         client/ruby/solr-ruby/examples/delicious_library
A         client/ruby/solr-ruby/examples/delicious_library/sample_export.txt
AU        client/ruby/solr-ruby/examples/delicious_library/dl_importer.rb
A         client/ruby/solr-ruby/examples/tang
AU        client/ruby/solr-ruby/examples/tang/tang_importer.rb
 U        
At revision 640734
[trunk] $ /export/home/hudson/tools/ant/latest/bin/ant -Dversion=$BUILD_ID -Dtest.junit.output.format=xml nightly
Buildfile: build.xml

init-forrest-entities:
    [mkdir] Created dir: http://hudson.zones.apache.org/hudson/job/Solr-trunk/ws/trunk/build 

compile-common:
    [mkdir] Created dir: http://hudson.zones.apache.org/hudson/job/Solr-trunk/ws/trunk/build/common 
    [javac] Compiling 31 source files to http://hudson.zones.apache.org/hudson/job/Solr-trunk/ws/trunk/build/common 
    [javac] Note: Some input files use unchecked or unsafe operations.
    [javac] Note: Recompile with -Xlint:unchecked for details.

compile:
    [mkdir] Created dir: http://hudson.zones.apache.org/hudson/job/Solr-trunk/ws/trunk/build/core 
    [javac] Compiling 311 source files to http://hudson.zones.apache.org/hudson/job/Solr-trunk/ws/trunk/build/core 
    [javac] Note: Some input files use or override a deprecated API.
    [javac] Note: Recompile with -Xlint:deprecation for details.
    [javac] Note: Some input files use unchecked or unsafe operations.
    [javac] Note: Recompile with -Xlint:unchecked for details.

compile-solrj-core:
    [mkdir] Created dir: http://hudson.zones.apache.org/hudson/job/Solr-trunk/ws/trunk/build/client/solrj 
    [javac] Compiling 22 source files to http://hudson.zones.apache.org/hudson/job/Solr-trunk/ws/trunk/build/client/solrj 
    [javac] Note: http://hudson.zones.apache.org/hudson/job/Solr-trunk/ws/trunk/client/java/solrj/src/org/apache/solr/client/solrj/impl/CommonsHttpSolrServer.java  uses or overrides a deprecated API.
    [javac] Note: Recompile with -Xlint:deprecation for details.

compile-solrj:
    [javac] Compiling 2 source files to http://hudson.zones.apache.org/hudson/job/Solr-trunk/ws/trunk/build/client/solrj 

compileTests:
    [mkdir] Created dir: http://hudson.zones.apache.org/hudson/job/Solr-trunk/ws/trunk/build/tests 
    [javac] Compiling 88 source files to http://hudson.zones.apache.org/hudson/job/Solr-trunk/ws/trunk/build/tests 
    [javac] Note: Some input files use or override a deprecated API.
    [javac] Note: Recompile with -Xlint:deprecation for details.
    [javac] Note: Some input files use unchecked or unsafe operations.
    [javac] Note: Recompile with -Xlint:unchecked for details.

junit:
    [mkdir] Created dir: http://hudson.zones.apache.org/hudson/job/Solr-trunk/ws/trunk/build/test-results 
    [junit] Running org.apache.solr.BasicFunctionalityTest
    [junit] Tests run: 25, Failures: 0, Errors: 0, Time elapsed: 50.016 sec
    [junit] Running org.apache.solr.ConvertedLegacyTest
    [junit] Tests run: 1, Failures: 0, Errors: 0, Time elapsed: 22.118 sec
    [junit] Running org.apache.solr.DisMaxRequestHandlerTest
    [junit] Tests run: 3, Failures: 0, Errors: 0, Time elapsed: 27.1 sec
    [junit] Running org.apache.solr.EchoParamsTest
    [junit] Tests run: 4, Failures: 0, Errors: 0, Time elapsed: 11.173 sec
    [junit] Running org.apache.solr.OutputWriterTest
    [junit] Tests run: 3, Failures: 0, Errors: 0, Time elapsed: 5.374 sec
    [junit] Running org.apache.solr.SampleTest
    [junit] Tests run: 2, Failures: 0, Errors: 0, Time elapsed: 3.532 sec
    [junit] Running org.apache.solr.TestDistributedSearch
    [junit] Tests run: 1, Failures: 0, Errors: 1, Time elapsed: 6.326 sec
    [junit] 2008-03-25 11:08:29.407::INFO:  Shutdown hook executing
    [junit] 2008-03-25 11:08:29.511::INFO:  Shutdown hook complete
    [junit] Test org.apache.solr.TestDistributedSearch FAILED
    [junit] Running org.apache.solr.analysis.HTMLStripReaderTest
    [junit] Tests run: 9, Failures: 0, Errors: 0, Time elapsed: 0.924 sec
    [junit] Running org.apache.solr.analysis.TestBufferedTokenStream
    [junit] Tests run: 2, Failures: 0, Errors: 0, Time elapsed: 3.089 sec
    [junit] Running org.apache.solr.analysis.TestCapitalizationFilter
    [junit] Tests run: 2, Failures: 0, Errors: 0, Time elapsed: 1.391 sec
    [junit] Running org.apache.solr.analysis.TestHyphenatedWordsFilter
    [junit] Tests run: 1, Failures: 0, Errors: 0, Time elapsed: 1.291 sec
    [junit] Running org.apache.solr.analysis.TestKeepWordFilter
    [junit] Tests run: 1, Failures: 0, Errors: 0, Time elapsed: 2.28 sec
    [junit] Running org.apache.solr.analysis.TestPatternReplaceFilter
    [junit] Tests run: 5, Failures: 0, Errors: 0, Time elapsed: 3.332 sec
    [junit] Running org.apache.solr.analysis.TestPatternTokenizerFactory
    [junit] Tests run: 1, Failures: 0, Errors: 0, Time elapsed: 2.237 sec
    [junit] Running org.apache.solr.analysis.TestPhoneticFilter
    [junit] Tests run: 2, Failures: 0, Errors: 0, Time elapsed: 1.776 sec
    [junit] Running org.apache.solr.analysis.TestRemoveDuplicatesTokenFilter
    [junit] Tests run: 3, Failures: 0, Errors: 0, Time elapsed: 2.742 sec
    [junit] Running org.apache.solr.analysis.TestSynonymFilter
    [junit] Tests run: 7, Failures: 0, Errors: 0, Time elapsed: 3.457 sec
    [junit] Running org.apache.solr.analysis.TestTrimFilter
    [junit] Tests run: 1, Failures: 0, Errors: 0, Time elapsed: 2.146 sec
    [junit] Running org.apache.solr.analysis.TestWordDelimiterFilter
    [junit] Tests run: 4, Failures: 0, Errors: 0, Time elapsed: 14.416 sec
    [junit] Running org.apache.solr.common.SolrDocumentTest
    [junit] Tests run: 4, Failures: 0, Errors: 0, Time elapsed: 0.453 sec
    [junit] Running org.apache.solr.common.params.SolrParamTest
    [junit] Tests run: 1, Failures: 0, Errors: 0, Time elapsed: 0.432 sec
    [junit] Running org.apache.solr.common.util.ContentStreamTest
    [junit] Tests run: 3, Failures: 0, Errors: 0, Time elapsed: 5.761 sec
    [junit] Running org.apache.solr.common.util.IteratorChainTest
    [junit] Tests run: 7, Failures: 0, Errors: 0, Time elapsed: 0.583 sec
    [junit] Running org.apache.solr.common.util.TestXMLEscaping
    [junit] Tests run: 7, Failures: 0, Errors: 0, Time elapsed: 0.576 sec
    [junit] Running org.apache.solr.core.RequestHandlersTest
    [junit] Tests run: 2, Failures: 0, Errors: 0, Time elapsed: 9.686 sec
    [junit] Running org.apache.solr.core.ResourceLoaderTest
    [junit] Tests run: 2, Failures: 0, Errors: 0, Time elapsed: 0.488 sec
    [junit] Running org.apache.solr.core.SolrCoreTest
    [junit] Tests run: 1, Failures: 0, Errors: 0, Time elapsed: 4.108 sec
    [junit] Running org.apache.solr.core.TestBadConfig
    [junit] Tests run: 1, Failures: 0, Errors: 0, Time elapsed: 0.626 sec
    [junit] Running org.apache.solr.core.TestConfig
    [junit] Tests run: 2, Failures: 0, Errors: 0, Time elapsed: 8.111 sec
    [junit] Running org.apache.solr.core.TestQuerySenderListener
    [junit] Tests run: 1, Failures: 0, Errors: 0, Time elapsed: 8.227 sec
    [junit] Running org.apache.solr.handler.AnalysisRequestHandlerTest
    [junit] Tests run: 1, Failures: 0, Errors: 0, Time elapsed: 4.233 sec
    [junit] Running org.apache.solr.handler.MoreLikeThisHandlerTest
    [junit] Tests run: 1, Failures: 0, Errors: 0, Time elapsed: 6.976 sec
    [junit] Running org.apache.solr.handler.SpellCheckerRequestHandlerTest
    [junit] Tests run: 5, Failures: 0, Errors: 0, Time elapsed: 15.492 sec
    [junit] Running org.apache.solr.handler.StandardRequestHandlerTest
    [junit] Tests run: 1, Failures: 0, Errors: 0, Time elapsed: 11.505 sec
    [junit] Running org.apache.solr.handler.TestCSVLoader
    [junit] Tests run: 4, Failures: 0, Errors: 0, Time elapsed: 36.103 sec
    [junit] Running org.apache.solr.handler.XmlUpdateRequestHandlerTest
    [junit] Tests run: 1, Failures: 0, Errors: 0, Time elapsed: 20.851 sec
    [junit] Running org.apache.solr.handler.admin.SystemInfoHandlerTest
    [junit] Tests run: 1, Failures: 0, Errors: 0, Time elapsed: 1.533 sec
    [junit] Running org.apache.solr.handler.component.QueryElevationComponentTest
    [junit] Tests run: 3, Failures: 0, Errors: 0, Time elapsed: 47.962 sec
    [junit] Running org.apache.solr.handler.component.SearchHandlerTest
    [junit] Tests run: 1, Failures: 0, Errors: 0, Time elapsed: 5.783 sec
    [junit] Running org.apache.solr.highlight.HighlighterConfigTest
    [junit] Tests run: 1, Failures: 0, Errors: 0, Time elapsed: 7.764 sec
    [junit] Running org.apache.solr.highlight.HighlighterTest
    [junit] Tests run: 15, Failures: 0, Errors: 0, Time elapsed: 46.595 sec
    [junit] Running org.apache.solr.request.JSONWriterTest
    [junit] Tests run: 1, Failures: 0, Errors: 0, Time elapsed: 5.381 sec
    [junit] Running org.apache.solr.schema.BadIndexSchemaTest
    [junit] Tests run: 1, Failures: 0, Errors: 0, Time elapsed: 1.582 sec
    [junit] Running org.apache.solr.schema.IndexSchemaTest
    [junit] Tests run: 1, Failures: 0, Errors: 0, Time elapsed: 12.381 sec
    [junit] Running org.apache.solr.schema.NotRequiredUniqueKeyTest
    [junit] Tests run: 1, Failures: 0, Errors: 0, Time elapsed: 3.648 sec
    [junit] Running org.apache.solr.schema.RequiredFieldsTest
    [junit] Tests run: 3, Failures: 0, Errors: 0, Time elapsed: 15.965 sec
    [junit] Running org.apache.solr.schema.UUIDFieldTest
    [junit] Tests run: 1, Failures: 0, Errors: 0, Time elapsed: 1.059 sec
    [junit] Running org.apache.solr.search.TestDocSet
    [junit] Tests run: 1, Failures: 0, Errors: 0, Time elapsed: 5.498 sec
    [junit] Running org.apache.solr.search.TestQueryTypes
    [junit] Tests run: 1, Failures: 0, Errors: 0, Time elapsed: 23.192 sec
    [junit] Running org.apache.solr.search.TestQueryUtils
    [junit] Tests run: 1, Failures: 0, Errors: 0, Time elapsed: 20.561 sec
    [junit] Running org.apache.solr.search.function.TestFunctionQuery
    [junit] Tests run: 2, Failures: 0, Errors: 0, Time elapsed: 24.995 sec
    [junit] Running org.apache.solr.servlet.CacheHeaderTest
    [junit] Tests run: 3, Failures: 0, Errors: 0, Time elapsed: 20.853 sec
    [junit] 2008-03-25 11:21:06.483::INFO:  Shutdown hook executing
    [junit] 2008-03-25 11:21:06.483::INFO:  Shutdown hook complete
    [junit] 2008-03-25 11:21:07.490::INFO:  Shutdown hook complete
    [junit] 2008-03-25 11:21:08.500::INFO:  Shutdown hook complete
    [junit] Running org.apache.solr.servlet.DirectSolrConnectionTest
    [junit] Tests run: 2, Failures: 0, Errors: 0, Time elapsed: 20.307 sec
    [junit] Running org.apache.solr.servlet.NoCacheHeaderTest
    [junit] Tests run: 3, Failures: 0, Errors: 0, Time elapsed: 28.692 sec
    [junit] 2008-03-25 11:22:01.178::INFO:  Shutdown hook executing
    [junit] 2008-03-25 11:22:01.179::INFO:  Shutdown hook complete
    [junit] 2008-03-25 11:22:02.186::INFO:  Shutdown hook complete
    [junit] 2008-03-25 11:22:03.196::INFO:  Shutdown hook complete
    [junit] Running org.apache.solr.servlet.SolrRequestParserTest
    [junit] Tests run: 4, Failures: 0, Errors: 0, Time elapsed: 18.583 sec
    [junit] Running org.apache.solr.update.AutoCommitTest
    [junit] <response>
    [junit] <lst name="responseHeader"><int name="status">0</int><int name="QTime">0</int></lst><result name="response" numFound="0" start="0"/>
    [junit] </response>
    [junit] )
    [junit] Tests run: 3, Failures: 1, Errors: 0, Time elapsed: 12.988 sec
    [junit] Test org.apache.solr.update.AutoCommitTest FAILED
    [junit] Running org.apache.solr.update.DirectUpdateHandlerTest
    [junit] Tests run: 1, Failures: 0, Errors: 0, Time elapsed: 7.04 sec
    [junit] Running org.apache.solr.update.DocumentBuilderTest
    [junit] Tests run: 2, Failures: 0, Errors: 0, Time elapsed: 10.419 sec
    [junit] Running org.apache.solr.update.processor.UpdateRequestProcessorFactoryTest
    [junit] Tests run: 1, Failures: 0, Errors: 0, Time elapsed: 8.821 sec
    [junit] Running org.apache.solr.util.DateMathParserTest
    [junit] Tests run: 7, Failures: 0, Errors: 0, Time elapsed: 0.519 sec
    [junit] Running org.apache.solr.util.SolrPluginUtilsTest
    [junit] Tests run: 5, Failures: 0, Errors: 0, Time elapsed: 25.968 sec
    [junit] Running org.apache.solr.util.TestCharArrayMap
    [junit] Tests run: 2, Failures: 0, Errors: 0, Time elapsed: 1.348 sec
    [junit] Running org.apache.solr.util.TestOpenBitSet
    [junit] Tests run: 3, Failures: 0, Errors: 0, Time elapsed: 4.321 sec
    [junit] Running org.apache.solr.util.TestUtils
    [junit] Tests run: 1, Failures: 0, Errors: 0, Time elapsed: 0.372 sec
    [junit] Running org.apache.solr.client.solrj.SolrExceptionTest
    [junit] Tests run: 1, Failures: 0, Errors: 0, Time elapsed: 1.826 sec
    [junit] Running org.apache.solr.client.solrj.SolrQueryTest
    [junit] Tests run: 1, Failures: 0, Errors: 0, Time elapsed: 0.521 sec
    [junit] Running org.apache.solr.client.solrj.embedded.JettyWebappTest
    [junit] Tests run: 1, Failures: 0, Errors: 0, Time elapsed: 14.723 sec
    [junit] 2008-03-25 11:24:17.567::INFO:  Shutdown hook executing
    [junit] 2008-03-25 11:24:19.216::INFO:  Shutdown hook complete
    [junit] Running org.apache.solr.client.solrj.embedded.LargeVolumeEmbeddedTest
    [junit] Tests run: 1, Failures: 0, Errors: 0, Time elapsed: 5.792 sec
    [junit] Running org.apache.solr.client.solrj.embedded.LargeVolumeJettyTest
    [junit] Tests run: 1, Failures: 0, Errors: 0, Time elapsed: 10.28 sec
    [junit] 2008-03-25 11:24:40.692::INFO:  Shutdown hook executing
    [junit] 2008-03-25 11:24:40.692::INFO:  Shutdown hook complete
    [junit] Running org.apache.solr.client.solrj.embedded.MultiCoreEmbeddedTest
    [junit] Tests run: 1, Failures: 0, Errors: 0, Time elapsed: 6.385 sec
    [junit] Running org.apache.solr.client.solrj.embedded.MultiCoreExampleJettyTest
    [junit] Tests run: 1, Failures: 0, Errors: 0, Time elapsed: 26.304 sec
    [junit] 2008-03-25 11:25:21.256::INFO:  Shutdown hook executing
    [junit] 2008-03-25 11:25:21.256::INFO:  Shutdown hook complete
    [junit] Running org.apache.solr.client.solrj.embedded.SolrExampleEmbeddedTest
    [junit] Tests run: 6, Failures: 0, Errors: 0, Time elapsed: 21.497 sec
    [junit] Running org.apache.solr.client.solrj.embedded.SolrExampleJettyTest
    [junit] Tests run: 6, Failures: 0, Errors: 0, Time elapsed: 216.647 sec
    [junit] 2008-03-25 11:29:36.178::INFO:  Shutdown hook executing
    [junit] 2008-03-25 11:29:36.178::INFO:  Shutdown hook complete
    [junit] 2008-03-25 11:29:37.189::INFO:  Shutdown hook complete
    [junit] 2008-03-25 11:29:38.197::INFO:  Shutdown hook complete
    [junit] 2008-03-25 11:29:39.207::INFO:  Shutdown hook complete
    [junit] 2008-03-25 11:29:40.217::INFO:  Shutdown hook complete
    [junit] 2008-03-25 11:29:41.227::INFO:  Shutdown hook complete
    [junit] Running org.apache.solr.client.solrj.response.QueryResponseTest
    [junit] Tests run: 1, Failures: 0, Errors: 0, Time elapsed: 0.393 sec
    [junit] Running org.apache.solr.client.solrj.util.ClientUtilsTest
    [junit] Tests run: 1, Failures: 0, Errors: 0, Time elapsed: 0.308 sec

BUILD FAILED
http://hudson.zones.apache.org/hudson/job/Solr-trunk/ws/trunk/build.xml :498: Tests failed!

Total time: 201 minutes 9 seconds
ERROR: No artifacts found that match the file pattern "trunk/dist/*.tgz, trunk/dist/*.zip". Configuration error?
ERROR: 'trunk/dist/*.tgz' doesn't match anything: 'trunk' exists but not 'trunk/dist/*.tgz'
Publishing Javadoc
Recording test results

Reply | Threaded
Open this post in threaded view
|

Build failed in Hudson: Solr-trunk #388

Apache Hudson Server
See http://hudson.zones.apache.org/hudson/job/Solr-trunk/388/changes

Changes:

[ehatcher] Fix JSPs that refered to removed SolrMultiCore

[ehatcher] Fix a couple of multicore related issues in both index.jsp pages

[ryan] SOLR-350 -- fixing more jsp references...  added tests to check "/solr/" and "/solr/admin/threaddump.jsp"

[ryan] make SolrServer serializable

[ryan] SOLR-350 -- removed static access for SolrMultiCore.  Also adding a new constructor to MultiCore

------------------------------------------
[...truncated 1184 lines...]
A         client/ruby/solr-ruby/lib/solr/response/commit.rb
A         client/ruby/solr-ruby/lib/solr/response/base.rb
AU        client/ruby/solr-ruby/lib/solr.rb
A         client/ruby/solr-ruby/CHANGES.yml
A         client/ruby/solr-ruby/README
A         client/ruby/solr-ruby/examples
A         client/ruby/solr-ruby/examples/marc
AU        client/ruby/solr-ruby/examples/marc/marc_importer.rb
A         client/ruby/solr-ruby/examples/delicious_library
A         client/ruby/solr-ruby/examples/delicious_library/sample_export.txt
AU        client/ruby/solr-ruby/examples/delicious_library/dl_importer.rb
A         client/ruby/solr-ruby/examples/tang
AU        client/ruby/solr-ruby/examples/tang/tang_importer.rb
 U        
At revision 641192
[trunk] $ /export/home/hudson/tools/ant/latest/bin/ant -Dversion=$BUILD_ID -Dtest.junit.output.format=xml nightly
Buildfile: build.xml

init-forrest-entities:
    [mkdir] Created dir: http://hudson.zones.apache.org/hudson/job/Solr-trunk/ws/trunk/build 

compile-common:
    [mkdir] Created dir: http://hudson.zones.apache.org/hudson/job/Solr-trunk/ws/trunk/build/common 
    [javac] Compiling 31 source files to http://hudson.zones.apache.org/hudson/job/Solr-trunk/ws/trunk/build/common 
    [javac] Note: Some input files use unchecked or unsafe operations.
    [javac] Note: Recompile with -Xlint:unchecked for details.

compile:
    [mkdir] Created dir: http://hudson.zones.apache.org/hudson/job/Solr-trunk/ws/trunk/build/core 
    [javac] Compiling 310 source files to http://hudson.zones.apache.org/hudson/job/Solr-trunk/ws/trunk/build/core 
    [javac] Note: Some input files use or override a deprecated API.
    [javac] Note: Recompile with -Xlint:deprecation for details.
    [javac] Note: Some input files use unchecked or unsafe operations.
    [javac] Note: Recompile with -Xlint:unchecked for details.

compile-solrj-core:
    [mkdir] Created dir: http://hudson.zones.apache.org/hudson/job/Solr-trunk/ws/trunk/build/client/solrj 
    [javac] Compiling 22 source files to http://hudson.zones.apache.org/hudson/job/Solr-trunk/ws/trunk/build/client/solrj 
    [javac] Note: http://hudson.zones.apache.org/hudson/job/Solr-trunk/ws/trunk/client/java/solrj/src/org/apache/solr/client/solrj/impl/CommonsHttpSolrServer.java  uses or overrides a deprecated API.
    [javac] Note: Recompile with -Xlint:deprecation for details.

compile-solrj:
    [javac] Compiling 2 source files to http://hudson.zones.apache.org/hudson/job/Solr-trunk/ws/trunk/build/client/solrj 

compileTests:
    [mkdir] Created dir: http://hudson.zones.apache.org/hudson/job/Solr-trunk/ws/trunk/build/tests 
    [javac] Compiling 88 source files to http://hudson.zones.apache.org/hudson/job/Solr-trunk/ws/trunk/build/tests 
    [javac] Note: Some input files use or override a deprecated API.
    [javac] Note: Recompile with -Xlint:deprecation for details.
    [javac] Note: Some input files use unchecked or unsafe operations.
    [javac] Note: Recompile with -Xlint:unchecked for details.

junit:
    [mkdir] Created dir: http://hudson.zones.apache.org/hudson/job/Solr-trunk/ws/trunk/build/test-results 
    [junit] Running org.apache.solr.BasicFunctionalityTest
    [junit] Tests run: 25, Failures: 0, Errors: 0, Time elapsed: 87.629 sec
    [junit] Running org.apache.solr.ConvertedLegacyTest
    [junit] Tests run: 1, Failures: 0, Errors: 0, Time elapsed: 22.348 sec
    [junit] Running org.apache.solr.DisMaxRequestHandlerTest
    [junit] Tests run: 3, Failures: 0, Errors: 0, Time elapsed: 20.021 sec
    [junit] Running org.apache.solr.EchoParamsTest
    [junit] Tests run: 4, Failures: 0, Errors: 0, Time elapsed: 9.19 sec
    [junit] Running org.apache.solr.OutputWriterTest
    [junit] Tests run: 3, Failures: 0, Errors: 0, Time elapsed: 12.876 sec
    [junit] Running org.apache.solr.SampleTest
    [junit] Tests run: 2, Failures: 0, Errors: 0, Time elapsed: 14.366 sec
    [junit] Running org.apache.solr.TestDistributedSearch
    [junit] Tests run: 1, Failures: 0, Errors: 0, Time elapsed: 122.483 sec
    [junit] 2008-03-26 08:16:40.759::INFO:  Shutdown hook executing
    [junit] 2008-03-26 08:16:40.760::INFO:  Shutdown hook complete
    [junit] 2008-03-26 08:16:41.776::INFO:  Shutdown hook complete
    [junit] 2008-03-26 08:16:42.786::INFO:  Shutdown hook complete
    [junit] 2008-03-26 08:16:43.796::INFO:  Shutdown hook complete
    [junit] 2008-03-26 08:16:44.806::INFO:  Shutdown hook complete
    [junit] 2008-03-26 08:16:45.816::INFO:  Shutdown hook complete
    [junit] 2008-03-26 08:16:46.820::INFO:  Shutdown hook complete
    [junit] 2008-03-26 08:16:47.825::INFO:  Shutdown hook complete
    [junit] 2008-03-26 08:16:48.835::INFO:  Shutdown hook complete
    [junit] Running org.apache.solr.analysis.HTMLStripReaderTest
    [junit] Tests run: 9, Failures: 0, Errors: 0, Time elapsed: 4.407 sec
    [junit] Running org.apache.solr.analysis.TestBufferedTokenStream
    [junit] Tests run: 2, Failures: 0, Errors: 0, Time elapsed: 3.09 sec
    [junit] Running org.apache.solr.analysis.TestCapitalizationFilter
    [junit] Tests run: 2, Failures: 0, Errors: 0, Time elapsed: 2.022 sec
    [junit] Running org.apache.solr.analysis.TestHyphenatedWordsFilter
    [junit] Tests run: 1, Failures: 0, Errors: 0, Time elapsed: 1.033 sec
    [junit] Running org.apache.solr.analysis.TestKeepWordFilter
    [junit] Tests run: 1, Failures: 0, Errors: 0, Time elapsed: 1.666 sec
    [junit] Running org.apache.solr.analysis.TestPatternReplaceFilter
    [junit] Tests run: 5, Failures: 0, Errors: 0, Time elapsed: 5.451 sec
    [junit] Running org.apache.solr.analysis.TestPatternTokenizerFactory
    [junit] Tests run: 1, Failures: 0, Errors: 0, Time elapsed: 2.749 sec
    [junit] Running org.apache.solr.analysis.TestPhoneticFilter
    [junit] Tests run: 2, Failures: 0, Errors: 0, Time elapsed: 5.073 sec
    [junit] Running org.apache.solr.analysis.TestRemoveDuplicatesTokenFilter
    [junit] Tests run: 3, Failures: 0, Errors: 0, Time elapsed: 8.025 sec
    [junit] Running org.apache.solr.analysis.TestSynonymFilter
    [junit] Tests run: 7, Failures: 0, Errors: 0, Time elapsed: 5.315 sec
    [junit] Running org.apache.solr.analysis.TestTrimFilter
    [junit] Tests run: 1, Failures: 0, Errors: 0, Time elapsed: 1.499 sec
    [junit] Running org.apache.solr.analysis.TestWordDelimiterFilter
    [junit] Tests run: 4, Failures: 0, Errors: 0, Time elapsed: 13.942 sec
    [junit] Running org.apache.solr.common.SolrDocumentTest
    [junit] Tests run: 4, Failures: 0, Errors: 0, Time elapsed: 0.435 sec
    [junit] Running org.apache.solr.common.params.SolrParamTest
    [junit] Tests run: 1, Failures: 0, Errors: 0, Time elapsed: 0.545 sec
    [junit] Running org.apache.solr.common.util.ContentStreamTest
    [junit] Tests run: 3, Failures: 0, Errors: 0, Time elapsed: 0.676 sec
    [junit] Running org.apache.solr.common.util.IteratorChainTest
    [junit] Tests run: 7, Failures: 0, Errors: 0, Time elapsed: 0.656 sec
    [junit] Running org.apache.solr.common.util.TestXMLEscaping
    [junit] Tests run: 7, Failures: 0, Errors: 0, Time elapsed: 0.536 sec
    [junit] Running org.apache.solr.core.RequestHandlersTest
    [junit] Tests run: 2, Failures: 0, Errors: 0, Time elapsed: 6.128 sec
    [junit] Running org.apache.solr.core.ResourceLoaderTest
    [junit] Tests run: 2, Failures: 0, Errors: 0, Time elapsed: 0.501 sec
    [junit] Running org.apache.solr.core.SolrCoreTest
    [junit] Tests run: 1, Failures: 0, Errors: 0, Time elapsed: 2.533 sec
    [junit] Running org.apache.solr.core.TestBadConfig
    [junit] Tests run: 1, Failures: 0, Errors: 0, Time elapsed: 0.492 sec
    [junit] Running org.apache.solr.core.TestConfig
    [junit] Tests run: 2, Failures: 0, Errors: 0, Time elapsed: 8.876 sec
    [junit] Running org.apache.solr.core.TestQuerySenderListener
    [junit] Tests run: 1, Failures: 0, Errors: 0, Time elapsed: 5.603 sec
    [junit] Running org.apache.solr.handler.AnalysisRequestHandlerTest
    [junit] Tests run: 1, Failures: 0, Errors: 0, Time elapsed: 4.771 sec
    [junit] Running org.apache.solr.handler.MoreLikeThisHandlerTest
    [junit] Tests run: 1, Failures: 0, Errors: 0, Time elapsed: 3.97 sec
    [junit] Running org.apache.solr.handler.SpellCheckerRequestHandlerTest
    [junit] Tests run: 5, Failures: 0, Errors: 0, Time elapsed: 10.507 sec
    [junit] Running org.apache.solr.handler.StandardRequestHandlerTest
    [junit] Tests run: 1, Failures: 0, Errors: 0, Time elapsed: 5.572 sec
    [junit] Running org.apache.solr.handler.TestCSVLoader
    [junit] Tests run: 4, Failures: 0, Errors: 0, Time elapsed: 20.196 sec
    [junit] Running org.apache.solr.handler.XmlUpdateRequestHandlerTest
    [junit] Tests run: 1, Failures: 0, Errors: 0, Time elapsed: 5.507 sec
    [junit] Running org.apache.solr.handler.admin.SystemInfoHandlerTest
    [junit] Tests run: 1, Failures: 0, Errors: 0, Time elapsed: 0.489 sec
    [junit] Running org.apache.solr.handler.component.QueryElevationComponentTest
    [junit] Tests run: 3, Failures: 0, Errors: 0, Time elapsed: 11.342 sec
    [junit] Running org.apache.solr.handler.component.SearchHandlerTest
    [junit] Tests run: 1, Failures: 0, Errors: 0, Time elapsed: 2.469 sec
    [junit] Running org.apache.solr.highlight.HighlighterConfigTest
    [junit] Tests run: 1, Failures: 0, Errors: 0, Time elapsed: 6.263 sec
    [junit] Running org.apache.solr.highlight.HighlighterTest
    [junit] Tests run: 15, Failures: 0, Errors: 0, Time elapsed: 42.503 sec
    [junit] Running org.apache.solr.request.JSONWriterTest
    [junit] Tests run: 1, Failures: 0, Errors: 0, Time elapsed: 14.457 sec
    [junit] Running org.apache.solr.schema.BadIndexSchemaTest
    [junit] Tests run: 1, Failures: 0, Errors: 0, Time elapsed: 3.807 sec
    [junit] Running org.apache.solr.schema.IndexSchemaTest
    [junit] Tests run: 1, Failures: 0, Errors: 0, Time elapsed: 5.2 sec
    [junit] Running org.apache.solr.schema.NotRequiredUniqueKeyTest
    [junit] Tests run: 1, Failures: 0, Errors: 0, Time elapsed: 2.962 sec
    [junit] Running org.apache.solr.schema.RequiredFieldsTest
    [junit] Tests run: 3, Failures: 0, Errors: 0, Time elapsed: 12.769 sec
    [junit] Running org.apache.solr.schema.UUIDFieldTest
    [junit] Tests run: 1, Failures: 0, Errors: 0, Time elapsed: 3.314 sec
    [junit] Running org.apache.solr.search.TestDocSet
    [junit] Tests run: 1, Failures: 0, Errors: 0, Time elapsed: 1.529 sec
    [junit] Running org.apache.solr.search.TestQueryTypes
    [junit] Tests run: 1, Failures: 0, Errors: 0, Time elapsed: 9.132 sec
    [junit] Running org.apache.solr.search.TestQueryUtils
    [junit] Tests run: 1, Failures: 0, Errors: 0, Time elapsed: 8.52 sec
    [junit] Running org.apache.solr.search.function.TestFunctionQuery
    [junit] Tests run: 2, Failures: 0, Errors: 0, Time elapsed: 10.75 sec
    [junit] Running org.apache.solr.servlet.CacheHeaderTest
    [junit] Tests run: 3, Failures: 0, Errors: 0, Time elapsed: 34.936 sec
    [junit] 2008-03-26 08:30:37.886::INFO:  Shutdown hook executing
    [junit] 2008-03-26 08:30:37.886::INFO:  Shutdown hook complete
    [junit] 2008-03-26 08:30:38.895::INFO:  Shutdown hook complete
    [junit] 2008-03-26 08:30:39.900::INFO:  Shutdown hook complete
    [junit] Running org.apache.solr.servlet.DirectSolrConnectionTest
    [junit] Tests run: 2, Failures: 0, Errors: 0, Time elapsed: 2.541 sec
    [junit] Running org.apache.solr.servlet.NoCacheHeaderTest
    [junit] Tests run: 3, Failures: 0, Errors: 0, Time elapsed: 41.934 sec
    [junit] 2008-03-26 08:31:27.215::INFO:  Shutdown hook executing
    [junit] 2008-03-26 08:31:27.215::INFO:  Shutdown hook complete
    [junit] 2008-03-26 08:31:28.218::INFO:  Shutdown hook complete
    [junit] 2008-03-26 08:31:29.279::INFO:  Shutdown hook complete
    [junit] Running org.apache.solr.servlet.SolrRequestParserTest
    [junit] Tests run: 4, Failures: 0, Errors: 0, Time elapsed: 1,503.125 sec
    [junit] Running org.apache.solr.update.AutoCommitTest
    [junit] <response>
    [junit] <lst name="responseHeader"><int name="status">0</int><int name="QTime">0</int></lst><result name="response" numFound="0" start="0"/>
    [junit] </response>
    [junit] )
    [junit] Tests run: 3, Failures: 1, Errors: 0, Time elapsed: 25.19 sec
    [junit] Test org.apache.solr.update.AutoCommitTest FAILED
    [junit] Running org.apache.solr.update.DirectUpdateHandlerTest
    [junit] Tests run: 1, Failures: 0, Errors: 0, Time elapsed: 16.041 sec
    [junit] Running org.apache.solr.update.DocumentBuilderTest
    [junit] Tests run: 2, Failures: 0, Errors: 0, Time elapsed: 14.366 sec
    [junit] Running org.apache.solr.update.processor.UpdateRequestProcessorFactoryTest
    [junit] Tests run: 1, Failures: 0, Errors: 0, Time elapsed: 8.429 sec
    [junit] Running org.apache.solr.util.DateMathParserTest
    [junit] Tests run: 7, Failures: 0, Errors: 0, Time elapsed: 1.219 sec
    [junit] Running org.apache.solr.util.SolrPluginUtilsTest
    [junit] Tests run: 5, Failures: 0, Errors: 0, Time elapsed: 18.768 sec
    [junit] Running org.apache.solr.util.TestCharArrayMap
    [junit] Tests run: 2, Failures: 0, Errors: 0, Time elapsed: 1.036 sec
    [junit] Running org.apache.solr.util.TestOpenBitSet
    [junit] Tests run: 3, Failures: 0, Errors: 0, Time elapsed: 8.282 sec
    [junit] Running org.apache.solr.util.TestUtils
    [junit] Tests run: 1, Failures: 0, Errors: 0, Time elapsed: 0.947 sec
    [junit] Running org.apache.solr.client.solrj.SolrExceptionTest
    [junit] Tests run: 1, Failures: 0, Errors: 0, Time elapsed: 1.167 sec
    [junit] Running org.apache.solr.client.solrj.SolrQueryTest
    [junit] Tests run: 1, Failures: 0, Errors: 0, Time elapsed: 0.784 sec
    [junit] Running org.apache.solr.client.solrj.embedded.JettyWebappTest
    [junit] Tests run: 1, Failures: 0, Errors: 0, Time elapsed: 27.244 sec
    [junit] 2008-03-26 08:59:53.911::INFO:  Shutdown hook executing
    [junit] 2008-03-26 08:59:55.432::INFO:  Shutdown hook complete
    [junit] Running org.apache.solr.client.solrj.embedded.LargeVolumeEmbeddedTest
    [junit] Tests run: 1, Failures: 0, Errors: 0, Time elapsed: 9.129 sec
    [junit] Running org.apache.solr.client.solrj.embedded.LargeVolumeJettyTest
    [junit] Tests run: 1, Failures: 0, Errors: 0, Time elapsed: 14.408 sec
    [junit] 2008-03-26 09:00:24.801::INFO:  Shutdown hook executing
    [junit] 2008-03-26 09:00:24.801::INFO:  Shutdown hook complete
    [junit] Running org.apache.solr.client.solrj.embedded.MultiCoreEmbeddedTest
    [junit] Tests run: 1, Failures: 0, Errors: 0, Time elapsed: 16.199 sec
    [junit] Running org.apache.solr.client.solrj.embedded.MultiCoreExampleJettyTest
    [junit] Tests run: 1, Failures: 0, Errors: 0, Time elapsed: 3.409 sec
    [junit] 2008-03-26 09:01:36.061::INFO:  Shutdown hook executing
    [junit] 2008-03-26 09:01:36.061::INFO:  Shutdown hook complete
    [junit] Running org.apache.solr.client.solrj.embedded.SolrExampleEmbeddedTest
    [junit] Tests run: 6, Failures: 0, Errors: 0, Time elapsed: 12.756 sec
    [junit] Running org.apache.solr.client.solrj.embedded.SolrExampleJettyTest
    [junit] Tests run: 6, Failures: 0, Errors: 0, Time elapsed: 33.872 sec
    [junit] 2008-03-26 09:06:33.450::INFO:  Shutdown hook executing
    [junit] 2008-03-26 09:06:33.450::INFO:  Shutdown hook complete
    [junit] 2008-03-26 09:06:34.459::INFO:  Shutdown hook complete
    [junit] 2008-03-26 09:06:35.559::INFO:  Shutdown hook complete
    [junit] 2008-03-26 09:06:36.569::INFO:  Shutdown hook complete
    [junit] 2008-03-26 09:06:37.578::INFO:  Shutdown hook complete
    [junit] 2008-03-26 09:06:38.760::INFO:  Shutdown hook complete
    [junit] Running org.apache.solr.client.solrj.response.QueryResponseTest
    [junit] Tests run: 1, Failures: 0, Errors: 0, Time elapsed: 0.478 sec
    [junit] Running org.apache.solr.client.solrj.util.ClientUtilsTest
    [junit] Tests run: 1, Failures: 0, Errors: 0, Time elapsed: 0.408 sec

BUILD FAILED
http://hudson.zones.apache.org/hudson/job/Solr-trunk/ws/trunk/build.xml :498: Tests failed!

Total time: 56 minutes 22 seconds
ERROR: No artifacts found that match the file pattern "trunk/dist/*.tgz, trunk/dist/*.zip". Configuration error?
ERROR: 'trunk/dist/*.tgz' doesn't match anything: 'trunk' exists but not 'trunk/dist/*.tgz'
Publishing Javadoc
Recording test results

Reply | Threaded
Open this post in threaded view
|

Build failed in Hudson: Solr-trunk #389

Apache Hudson Server
See http://hudson.zones.apache.org/hudson/job/Solr-trunk/389/changes

Changes:

[yonik] SOLR-511: add getInitArgs to RequestHandlerBase

[ryan] adding master/slave upgrade notice

[ryan] adding an upgrade note about the lucene format changes

[yonik] SOLR-512: set parameters on UpdateRequest

------------------------------------------
[...truncated 1185 lines...]
A         client/ruby/solr-ruby/lib/solr/response/base.rb
AU        client/ruby/solr-ruby/lib/solr.rb
A         client/ruby/solr-ruby/CHANGES.yml
A         client/ruby/solr-ruby/README
A         client/ruby/solr-ruby/examples
A         client/ruby/solr-ruby/examples/marc
AU        client/ruby/solr-ruby/examples/marc/marc_importer.rb
A         client/ruby/solr-ruby/examples/delicious_library
A         client/ruby/solr-ruby/examples/delicious_library/sample_export.txt
AU        client/ruby/solr-ruby/examples/delicious_library/dl_importer.rb
A         client/ruby/solr-ruby/examples/tang
AU        client/ruby/solr-ruby/examples/tang/tang_importer.rb
 U        
At revision 641731
[trunk] $ /export/home/hudson/tools/ant/latest/bin/ant -Dversion=$BUILD_ID -Dtest.junit.output.format=xml nightly
Buildfile: build.xml

init-forrest-entities:
    [mkdir] Created dir: http://hudson.zones.apache.org/hudson/job/Solr-trunk/ws/trunk/build 

compile-common:
    [mkdir] Created dir: http://hudson.zones.apache.org/hudson/job/Solr-trunk/ws/trunk/build/common 
    [javac] Compiling 31 source files to http://hudson.zones.apache.org/hudson/job/Solr-trunk/ws/trunk/build/common 
    [javac] Note: Some input files use unchecked or unsafe operations.
    [javac] Note: Recompile with -Xlint:unchecked for details.

compile:
    [mkdir] Created dir: http://hudson.zones.apache.org/hudson/job/Solr-trunk/ws/trunk/build/core 
    [javac] Compiling 310 source files to http://hudson.zones.apache.org/hudson/job/Solr-trunk/ws/trunk/build/core 
    [javac] Note: Some input files use or override a deprecated API.
    [javac] Note: Recompile with -Xlint:deprecation for details.
    [javac] Note: Some input files use unchecked or unsafe operations.
    [javac] Note: Recompile with -Xlint:unchecked for details.

compile-solrj-core:
    [mkdir] Created dir: http://hudson.zones.apache.org/hudson/job/Solr-trunk/ws/trunk/build/client/solrj 
    [javac] Compiling 22 source files to http://hudson.zones.apache.org/hudson/job/Solr-trunk/ws/trunk/build/client/solrj 
    [javac] Note: http://hudson.zones.apache.org/hudson/job/Solr-trunk/ws/trunk/client/java/solrj/src/org/apache/solr/client/solrj/impl/CommonsHttpSolrServer.java  uses or overrides a deprecated API.
    [javac] Note: Recompile with -Xlint:deprecation for details.

compile-solrj:
    [javac] Compiling 2 source files to http://hudson.zones.apache.org/hudson/job/Solr-trunk/ws/trunk/build/client/solrj 

compileTests:
    [mkdir] Created dir: http://hudson.zones.apache.org/hudson/job/Solr-trunk/ws/trunk/build/tests 
    [javac] Compiling 88 source files to http://hudson.zones.apache.org/hudson/job/Solr-trunk/ws/trunk/build/tests 
    [javac] Note: Some input files use or override a deprecated API.
    [javac] Note: Recompile with -Xlint:deprecation for details.
    [javac] Note: Some input files use unchecked or unsafe operations.
    [javac] Note: Recompile with -Xlint:unchecked for details.

junit:
    [mkdir] Created dir: http://hudson.zones.apache.org/hudson/job/Solr-trunk/ws/trunk/build/test-results 
    [junit] Running org.apache.solr.BasicFunctionalityTest
    [junit] Tests run: 25, Failures: 0, Errors: 0, Time elapsed: 41.613 sec
    [junit] Running org.apache.solr.ConvertedLegacyTest
    [junit] Tests run: 1, Failures: 0, Errors: 0, Time elapsed: 17.487 sec
    [junit] Running org.apache.solr.DisMaxRequestHandlerTest
    [junit] Tests run: 3, Failures: 0, Errors: 0, Time elapsed: 6.759 sec
    [junit] Running org.apache.solr.EchoParamsTest
    [junit] Tests run: 4, Failures: 0, Errors: 0, Time elapsed: 4.444 sec
    [junit] Running org.apache.solr.OutputWriterTest
    [junit] Tests run: 3, Failures: 0, Errors: 0, Time elapsed: 6.695 sec
    [junit] Running org.apache.solr.SampleTest
    [junit] Tests run: 2, Failures: 0, Errors: 0, Time elapsed: 14.692 sec
    [junit] Running org.apache.solr.TestDistributedSearch
    [junit] Tests run: 1, Failures: 0, Errors: 1, Time elapsed: 54.741 sec
    [junit] 2008-03-27 08:33:16.795::INFO:  Shutdown hook executing
    [junit] 2008-03-27 08:33:16.796::INFO:  Shutdown hook complete
    [junit] 2008-03-27 08:33:17.804::INFO:  Shutdown hook complete
    [junit] 2008-03-27 08:33:18.867::INFO:  Shutdown hook complete
    [junit] 2008-03-27 08:33:19.874::INFO:  Shutdown hook complete
    [junit] 2008-03-27 08:33:20.884::INFO:  Shutdown hook complete
    [junit] 2008-03-27 08:33:21.894::INFO:  Shutdown hook complete
    [junit] 2008-03-27 08:33:22.904::INFO:  Shutdown hook complete
    [junit] 2008-03-27 08:33:23.914::INFO:  Shutdown hook complete
    [junit] 2008-03-27 08:33:24.923::INFO:  Shutdown hook complete
    [junit] Test org.apache.solr.TestDistributedSearch FAILED
    [junit] Running org.apache.solr.analysis.HTMLStripReaderTest
    [junit] Tests run: 9, Failures: 0, Errors: 0, Time elapsed: 1.051 sec
    [junit] Running org.apache.solr.analysis.TestBufferedTokenStream
    [junit] Tests run: 2, Failures: 0, Errors: 0, Time elapsed: 3.559 sec
    [junit] Running org.apache.solr.analysis.TestCapitalizationFilter
    [junit] Tests run: 2, Failures: 0, Errors: 0, Time elapsed: 1.824 sec
    [junit] Running org.apache.solr.analysis.TestHyphenatedWordsFilter
    [junit] Tests run: 1, Failures: 0, Errors: 0, Time elapsed: 1.431 sec
    [junit] Running org.apache.solr.analysis.TestKeepWordFilter
    [junit] Tests run: 1, Failures: 0, Errors: 0, Time elapsed: 0.897 sec
    [junit] Running org.apache.solr.analysis.TestPatternReplaceFilter
    [junit] Tests run: 5, Failures: 0, Errors: 0, Time elapsed: 4.318 sec
    [junit] Running org.apache.solr.analysis.TestPatternTokenizerFactory
    [junit] Tests run: 1, Failures: 0, Errors: 0, Time elapsed: 4.84 sec
    [junit] Running org.apache.solr.analysis.TestPhoneticFilter
    [junit] Tests run: 2, Failures: 0, Errors: 0, Time elapsed: 1.818 sec
    [junit] Running org.apache.solr.analysis.TestRemoveDuplicatesTokenFilter
    [junit] Tests run: 3, Failures: 0, Errors: 0, Time elapsed: 7.041 sec
    [junit] Running org.apache.solr.analysis.TestSynonymFilter
    [junit] Tests run: 7, Failures: 0, Errors: 0, Time elapsed: 4.851 sec
    [junit] Running org.apache.solr.analysis.TestTrimFilter
    [junit] Tests run: 1, Failures: 0, Errors: 0, Time elapsed: 1.98 sec
    [junit] Running org.apache.solr.analysis.TestWordDelimiterFilter
    [junit] Tests run: 4, Failures: 0, Errors: 0, Time elapsed: 12.22 sec
    [junit] Running org.apache.solr.common.SolrDocumentTest
    [junit] Tests run: 4, Failures: 0, Errors: 0, Time elapsed: 0.369 sec
    [junit] Running org.apache.solr.common.params.SolrParamTest
    [junit] Tests run: 1, Failures: 0, Errors: 0, Time elapsed: 0.323 sec
    [junit] Running org.apache.solr.common.util.ContentStreamTest
    [junit] Tests run: 3, Failures: 0, Errors: 0, Time elapsed: 0.449 sec
    [junit] Running org.apache.solr.common.util.IteratorChainTest
    [junit] Tests run: 7, Failures: 0, Errors: 0, Time elapsed: 0.749 sec
    [junit] Running org.apache.solr.common.util.TestXMLEscaping
    [junit] Tests run: 7, Failures: 0, Errors: 0, Time elapsed: 0.384 sec
    [junit] Running org.apache.solr.core.RequestHandlersTest
    [junit] Tests run: 2, Failures: 0, Errors: 0, Time elapsed: 6.184 sec
    [junit] Running org.apache.solr.core.ResourceLoaderTest
    [junit] Tests run: 2, Failures: 0, Errors: 0, Time elapsed: 0.455 sec
    [junit] Running org.apache.solr.core.SolrCoreTest
    [junit] Tests run: 1, Failures: 0, Errors: 0, Time elapsed: 3.687 sec
    [junit] Running org.apache.solr.core.TestBadConfig
    [junit] Tests run: 1, Failures: 0, Errors: 0, Time elapsed: 0.465 sec
    [junit] Running org.apache.solr.core.TestConfig
    [junit] Tests run: 2, Failures: 0, Errors: 0, Time elapsed: 5.177 sec
    [junit] Running org.apache.solr.core.TestQuerySenderListener
    [junit] Tests run: 1, Failures: 0, Errors: 0, Time elapsed: 2.873 sec
    [junit] Running org.apache.solr.handler.AnalysisRequestHandlerTest
    [junit] Tests run: 1, Failures: 0, Errors: 0, Time elapsed: 3.378 sec
    [junit] Running org.apache.solr.handler.MoreLikeThisHandlerTest
    [junit] Tests run: 1, Failures: 0, Errors: 0, Time elapsed: 3.276 sec
    [junit] Running org.apache.solr.handler.SpellCheckerRequestHandlerTest
    [junit] Tests run: 5, Failures: 0, Errors: 0, Time elapsed: 5.029 sec
    [junit] Running org.apache.solr.handler.StandardRequestHandlerTest
    [junit] Tests run: 1, Failures: 0, Errors: 0, Time elapsed: 3.659 sec
    [junit] Running org.apache.solr.handler.TestCSVLoader
    [junit] Tests run: 4, Failures: 0, Errors: 0, Time elapsed: 10.255 sec
    [junit] Running org.apache.solr.handler.XmlUpdateRequestHandlerTest
    [junit] Tests run: 1, Failures: 0, Errors: 0, Time elapsed: 3.872 sec
    [junit] Running org.apache.solr.handler.admin.SystemInfoHandlerTest
    [junit] Tests run: 1, Failures: 0, Errors: 0, Time elapsed: 0.451 sec
    [junit] Running org.apache.solr.handler.component.QueryElevationComponentTest
    [junit] Tests run: 3, Failures: 0, Errors: 0, Time elapsed: 6.158 sec
    [junit] Running org.apache.solr.handler.component.SearchHandlerTest
    [junit] Tests run: 1, Failures: 0, Errors: 0, Time elapsed: 3.669 sec
    [junit] Running org.apache.solr.highlight.HighlighterConfigTest
    [junit] Tests run: 1, Failures: 0, Errors: 0, Time elapsed: 3.793 sec
    [junit] Running org.apache.solr.highlight.HighlighterTest
    [junit] Tests run: 15, Failures: 0, Errors: 0, Time elapsed: 19.361 sec
    [junit] Running org.apache.solr.request.JSONWriterTest
    [junit] Tests run: 1, Failures: 0, Errors: 0, Time elapsed: 3.099 sec
    [junit] Running org.apache.solr.schema.BadIndexSchemaTest
    [junit] Tests run: 1, Failures: 0, Errors: 0, Time elapsed: 1.938 sec
    [junit] Running org.apache.solr.schema.IndexSchemaTest
    [junit] Tests run: 1, Failures: 0, Errors: 0, Time elapsed: 3.602 sec
    [junit] Running org.apache.solr.schema.NotRequiredUniqueKeyTest
    [junit] Tests run: 1, Failures: 0, Errors: 0, Time elapsed: 2.295 sec
    [junit] Running org.apache.solr.schema.RequiredFieldsTest
    [junit] Tests run: 3, Failures: 0, Errors: 0, Time elapsed: 5.644 sec
    [junit] Running org.apache.solr.schema.UUIDFieldTest
    [junit] Tests run: 1, Failures: 0, Errors: 0, Time elapsed: 0.644 sec
    [junit] Running org.apache.solr.search.TestDocSet
    [junit] Tests run: 1, Failures: 0, Errors: 0, Time elapsed: 1.235 sec
    [junit] Running org.apache.solr.search.TestQueryTypes
    [junit] Tests run: 1, Failures: 0, Errors: 0, Time elapsed: 2.155 sec
    [junit] Running org.apache.solr.search.TestQueryUtils
    [junit] Tests run: 1, Failures: 0, Errors: 0, Time elapsed: 3.889 sec
    [junit] Running org.apache.solr.search.function.TestFunctionQuery
    [junit] Tests run: 2, Failures: 0, Errors: 0, Time elapsed: 6.436 sec
    [junit] Running org.apache.solr.servlet.CacheHeaderTest
    [junit] Tests run: 3, Failures: 0, Errors: 0, Time elapsed: 19.565 sec
    [junit] 2008-03-27 08:37:14.357::INFO:  Shutdown hook executing
    [junit] 2008-03-27 08:37:14.357::INFO:  Shutdown hook complete
    [junit] 2008-03-27 08:37:15.359::INFO:  Shutdown hook complete
    [junit] 2008-03-27 08:37:16.369::INFO:  Shutdown hook complete
    [junit] Running org.apache.solr.servlet.DirectSolrConnectionTest
    [junit] Tests run: 2, Failures: 0, Errors: 0, Time elapsed: 15.893 sec
    [junit] Running org.apache.solr.servlet.NoCacheHeaderTest
    [junit] Tests run: 3, Failures: 0, Errors: 0, Time elapsed: 18.185 sec
    [junit] 2008-03-27 08:37:59.459::INFO:  Shutdown hook executing
    [junit] 2008-03-27 08:37:59.460::INFO:  Shutdown hook complete
    [junit] 2008-03-27 08:38:00.462::INFO:  Shutdown hook complete
    [junit] 2008-03-27 08:38:01.472::INFO:  Shutdown hook complete
    [junit] Running org.apache.solr.servlet.SolrRequestParserTest
    [junit] Tests run: 4, Failures: 0, Errors: 0, Time elapsed: 5.09 sec
    [junit] Running org.apache.solr.update.AutoCommitTest
    [junit] <response>
    [junit] <lst name="responseHeader"><int name="status">0</int><int name="QTime">0</int></lst><result name="response" numFound="0" start="0"/>
    [junit] </response>
    [junit] )
    [junit] Tests run: 3, Failures: 1, Errors: 0, Time elapsed: 12.293 sec
    [junit] Test org.apache.solr.update.AutoCommitTest FAILED
    [junit] Running org.apache.solr.update.DirectUpdateHandlerTest
    [junit] Tests run: 1, Failures: 0, Errors: 0, Time elapsed: 5.01 sec
    [junit] Running org.apache.solr.update.DocumentBuilderTest
    [junit] Tests run: 2, Failures: 0, Errors: 0, Time elapsed: 7.079 sec
    [junit] Running org.apache.solr.update.processor.UpdateRequestProcessorFactoryTest
    [junit] Tests run: 1, Failures: 0, Errors: 0, Time elapsed: 11.954 sec
    [junit] Running org.apache.solr.util.DateMathParserTest
    [junit] Tests run: 7, Failures: 0, Errors: 0, Time elapsed: 0.368 sec
    [junit] Running org.apache.solr.util.SolrPluginUtilsTest
    [junit] Tests run: 5, Failures: 0, Errors: 0, Time elapsed: 14.691 sec
    [junit] Running org.apache.solr.util.TestCharArrayMap
    [junit] Tests run: 2, Failures: 0, Errors: 0, Time elapsed: 0.514 sec
    [junit] Running org.apache.solr.util.TestOpenBitSet
    [junit] Tests run: 3, Failures: 0, Errors: 0, Time elapsed: 1.313 sec
    [junit] Running org.apache.solr.util.TestUtils
    [junit] Tests run: 1, Failures: 0, Errors: 0, Time elapsed: 0.399 sec
    [junit] Running org.apache.solr.client.solrj.SolrExceptionTest
    [junit] Tests run: 1, Failures: 0, Errors: 0, Time elapsed: 0.994 sec
    [junit] Running org.apache.solr.client.solrj.SolrQueryTest
    [junit] Tests run: 1, Failures: 0, Errors: 0, Time elapsed: 0.325 sec
    [junit] Running org.apache.solr.client.solrj.embedded.JettyWebappTest
    [junit] Tests run: 1, Failures: 0, Errors: 0, Time elapsed: 4.969 sec
    [junit] 2008-03-27 08:39:25.237::INFO:  Shutdown hook executing
    [junit] 2008-03-27 08:39:25.303::INFO:  Shutdown hook complete
    [junit] Running org.apache.solr.client.solrj.embedded.LargeVolumeEmbeddedTest
    [junit] Tests run: 1, Failures: 0, Errors: 0, Time elapsed: 4.809 sec
    [junit] Running org.apache.solr.client.solrj.embedded.LargeVolumeJettyTest
    [junit] Tests run: 1, Failures: 0, Errors: 0, Time elapsed: 15.138 sec
    [junit] 2008-03-27 08:54:41.757::INFO:  Shutdown hook executing
    [junit] 2008-03-27 08:54:41.757::INFO:  Shutdown hook complete
    [junit] Running org.apache.solr.client.solrj.embedded.MultiCoreEmbeddedTest
    [junit] Tests run: 1, Failures: 0, Errors: 0, Time elapsed: 2.746 sec
    [junit] Running org.apache.solr.client.solrj.embedded.MultiCoreExampleJettyTest
    [junit] Tests run: 1, Failures: 0, Errors: 0, Time elapsed: 7.26 sec
    [junit] 2008-03-27 08:54:54.491::INFO:  Shutdown hook executing
    [junit] 2008-03-27 08:54:54.491::INFO:  Shutdown hook complete
    [junit] Running org.apache.solr.client.solrj.embedded.SolrExampleEmbeddedTest
    [junit] Tests run: 6, Failures: 0, Errors: 0, Time elapsed: 21.295 sec
    [junit] Running org.apache.solr.client.solrj.embedded.SolrExampleJettyTest
    [junit] Tests run: 6, Failures: 0, Errors: 0, Time elapsed: 57.719 sec
    [junit] 2008-03-27 08:56:17.737::INFO:  Shutdown hook executing
    [junit] 2008-03-27 08:56:17.737::INFO:  Shutdown hook complete
    [junit] 2008-03-27 08:56:18.740::INFO:  Shutdown hook complete
    [junit] 2008-03-27 08:56:19.750::INFO:  Shutdown hook complete
    [junit] 2008-03-27 08:56:20.760::INFO:  Shutdown hook complete
    [junit] 2008-03-27 08:56:21.769::INFO:  Shutdown hook complete
    [junit] 2008-03-27 08:56:22.779::INFO:  Shutdown hook complete
    [junit] Running org.apache.solr.client.solrj.response.QueryResponseTest
    [junit] Tests run: 1, Failures: 0, Errors: 0, Time elapsed: 0.372 sec
    [junit] Running org.apache.solr.client.solrj.util.ClientUtilsTest
    [junit] Tests run: 1, Failures: 0, Errors: 0, Time elapsed: 0.312 sec

BUILD FAILED
http://hudson.zones.apache.org/hudson/job/Solr-trunk/ws/trunk/build.xml :498: Tests failed!

Total time: 47 minutes 18 seconds
ERROR: No artifacts found that match the file pattern "trunk/dist/*.tgz, trunk/dist/*.zip". Configuration error?
ERROR: 'trunk/dist/*.tgz' doesn't match anything: 'trunk' exists but not 'trunk/dist/*.tgz'
Publishing Javadoc
Recording test results

Reply | Threaded
Open this post in threaded view
|

Build failed in Hudson: Solr-trunk #390

Apache Hudson Server
See http://hudson.zones.apache.org/hudson/job/Solr-trunk/390/changes

------------------------------------------
[...truncated 1181 lines...]
A         client/ruby/solr-ruby/lib/solr/response/dismax.rb
AU        client/ruby/solr-ruby/lib/solr/response/modify_document.rb
A         client/ruby/solr-ruby/lib/solr/response/add_document.rb
A         client/ruby/solr-ruby/lib/solr/response/commit.rb
A         client/ruby/solr-ruby/lib/solr/response/base.rb
AU        client/ruby/solr-ruby/lib/solr.rb
A         client/ruby/solr-ruby/CHANGES.yml
A         client/ruby/solr-ruby/README
A         client/ruby/solr-ruby/examples
A         client/ruby/solr-ruby/examples/marc
AU        client/ruby/solr-ruby/examples/marc/marc_importer.rb
A         client/ruby/solr-ruby/examples/delicious_library
A         client/ruby/solr-ruby/examples/delicious_library/sample_export.txt
AU        client/ruby/solr-ruby/examples/delicious_library/dl_importer.rb
A         client/ruby/solr-ruby/examples/tang
AU        client/ruby/solr-ruby/examples/tang/tang_importer.rb
 U        
At revision 642118
no change for http://svn.apache.org/repos/asf/lucene/solr/trunk since the previous build
[trunk] $ /export/home/hudson/tools/ant/latest/bin/ant -Dversion=$BUILD_ID -Dtest.junit.output.format=xml nightly
Buildfile: build.xml

init-forrest-entities:
    [mkdir] Created dir: http://hudson.zones.apache.org/hudson/job/Solr-trunk/ws/trunk/build 

compile-common:
    [mkdir] Created dir: http://hudson.zones.apache.org/hudson/job/Solr-trunk/ws/trunk/build/common 
    [javac] Compiling 31 source files to http://hudson.zones.apache.org/hudson/job/Solr-trunk/ws/trunk/build/common 
    [javac] Note: Some input files use unchecked or unsafe operations.
    [javac] Note: Recompile with -Xlint:unchecked for details.

compile:
    [mkdir] Created dir: http://hudson.zones.apache.org/hudson/job/Solr-trunk/ws/trunk/build/core 
    [javac] Compiling 310 source files to http://hudson.zones.apache.org/hudson/job/Solr-trunk/ws/trunk/build/core 
    [javac] Note: Some input files use or override a deprecated API.
    [javac] Note: Recompile with -Xlint:deprecation for details.
    [javac] Note: Some input files use unchecked or unsafe operations.
    [javac] Note: Recompile with -Xlint:unchecked for details.

compile-solrj-core:
    [mkdir] Created dir: http://hudson.zones.apache.org/hudson/job/Solr-trunk/ws/trunk/build/client/solrj 
    [javac] Compiling 22 source files to http://hudson.zones.apache.org/hudson/job/Solr-trunk/ws/trunk/build/client/solrj 
    [javac] Note: http://hudson.zones.apache.org/hudson/job/Solr-trunk/ws/trunk/client/java/solrj/src/org/apache/solr/client/solrj/impl/CommonsHttpSolrServer.java  uses or overrides a deprecated API.
    [javac] Note: Recompile with -Xlint:deprecation for details.

compile-solrj:
    [javac] Compiling 2 source files to http://hudson.zones.apache.org/hudson/job/Solr-trunk/ws/trunk/build/client/solrj 

compileTests:
    [mkdir] Created dir: http://hudson.zones.apache.org/hudson/job/Solr-trunk/ws/trunk/build/tests 
    [javac] Compiling 88 source files to http://hudson.zones.apache.org/hudson/job/Solr-trunk/ws/trunk/build/tests 
    [javac] Note: Some input files use or override a deprecated API.
    [javac] Note: Recompile with -Xlint:deprecation for details.
    [javac] Note: Some input files use unchecked or unsafe operations.
    [javac] Note: Recompile with -Xlint:unchecked for details.

junit:
    [mkdir] Created dir: http://hudson.zones.apache.org/hudson/job/Solr-trunk/ws/trunk/build/test-results 
    [junit] Running org.apache.solr.BasicFunctionalityTest
    [junit] Tests run: 25, Failures: 0, Errors: 0, Time elapsed: 119.23 sec
    [junit] Running org.apache.solr.ConvertedLegacyTest
    [junit] Tests run: 1, Failures: 0, Errors: 0, Time elapsed: 17.323 sec
    [junit] Running org.apache.solr.DisMaxRequestHandlerTest
    [junit] Tests run: 3, Failures: 0, Errors: 0, Time elapsed: 10.671 sec
    [junit] Running org.apache.solr.EchoParamsTest
    [junit] Tests run: 4, Failures: 0, Errors: 0, Time elapsed: 10.369 sec
    [junit] Running org.apache.solr.OutputWriterTest
    [junit] Tests run: 3, Failures: 0, Errors: 0, Time elapsed: 8.713 sec
    [junit] Running org.apache.solr.SampleTest
    [junit] Tests run: 2, Failures: 0, Errors: 0, Time elapsed: 2.207 sec
    [junit] Running org.apache.solr.TestDistributedSearch
    [junit] Tests run: 1, Failures: 0, Errors: 0, Time elapsed: 34.339 sec
    [junit] 2008-03-28 08:14:35.479::INFO:  Shutdown hook executing
    [junit] 2008-03-28 08:14:35.479::INFO:  Shutdown hook complete
    [junit] 2008-03-28 08:14:37.147::INFO:  Shutdown hook complete
    [junit] 2008-03-28 08:14:38.156::INFO:  Shutdown hook complete
    [junit] 2008-03-28 08:14:39.166::INFO:  Shutdown hook complete
    [junit] 2008-03-28 08:14:40.176::INFO:  Shutdown hook complete
    [junit] 2008-03-28 08:14:41.186::INFO:  Shutdown hook complete
    [junit] 2008-03-28 08:14:42.196::INFO:  Shutdown hook complete
    [junit] 2008-03-28 08:14:43.206::INFO:  Shutdown hook complete
    [junit] 2008-03-28 08:14:44.216::INFO:  Shutdown hook complete
    [junit] Running org.apache.solr.analysis.HTMLStripReaderTest
    [junit] Tests run: 9, Failures: 0, Errors: 0, Time elapsed: 0.832 sec
    [junit] Running org.apache.solr.analysis.TestBufferedTokenStream
    [junit] Tests run: 2, Failures: 0, Errors: 0, Time elapsed: 3.994 sec
    [junit] Running org.apache.solr.analysis.TestCapitalizationFilter
    [junit] Tests run: 2, Failures: 0, Errors: 0, Time elapsed: 6.85 sec
    [junit] Running org.apache.solr.analysis.TestHyphenatedWordsFilter
    [junit] Tests run: 1, Failures: 0, Errors: 0, Time elapsed: 1.366 sec
    [junit] Running org.apache.solr.analysis.TestKeepWordFilter
    [junit] Tests run: 1, Failures: 0, Errors: 0, Time elapsed: 2.016 sec
    [junit] Running org.apache.solr.analysis.TestPatternReplaceFilter
    [junit] Tests run: 5, Failures: 0, Errors: 0, Time elapsed: 6.463 sec
    [junit] Running org.apache.solr.analysis.TestPatternTokenizerFactory
    [junit] Tests run: 1, Failures: 0, Errors: 0, Time elapsed: 2.362 sec
    [junit] Running org.apache.solr.analysis.TestPhoneticFilter
    [junit] Tests run: 2, Failures: 0, Errors: 0, Time elapsed: 1.846 sec
    [junit] Running org.apache.solr.analysis.TestRemoveDuplicatesTokenFilter
    [junit] Tests run: 3, Failures: 0, Errors: 0, Time elapsed: 2.582 sec
    [junit] Running org.apache.solr.analysis.TestSynonymFilter
    [junit] Tests run: 7, Failures: 0, Errors: 0, Time elapsed: 3.329 sec
    [junit] Running org.apache.solr.analysis.TestTrimFilter
    [junit] Tests run: 1, Failures: 0, Errors: 0, Time elapsed: 0.844 sec
    [junit] Running org.apache.solr.analysis.TestWordDelimiterFilter
    [junit] Tests run: 4, Failures: 0, Errors: 0, Time elapsed: 10.898 sec
    [junit] Running org.apache.solr.common.SolrDocumentTest
    [junit] Tests run: 4, Failures: 0, Errors: 0, Time elapsed: 0.343 sec
    [junit] Running org.apache.solr.common.params.SolrParamTest
    [junit] Tests run: 1, Failures: 0, Errors: 0, Time elapsed: 0.4 sec
    [junit] Running org.apache.solr.common.util.ContentStreamTest
    [junit] Tests run: 3, Failures: 0, Errors: 0, Time elapsed: 0.822 sec
    [junit] Running org.apache.solr.common.util.IteratorChainTest
    [junit] Tests run: 7, Failures: 0, Errors: 0, Time elapsed: 0.419 sec
    [junit] Running org.apache.solr.common.util.TestXMLEscaping
    [junit] Tests run: 7, Failures: 0, Errors: 0, Time elapsed: 0.414 sec
    [junit] Running org.apache.solr.core.RequestHandlersTest
    [junit] Tests run: 2, Failures: 0, Errors: 0, Time elapsed: 18.252 sec
    [junit] Running org.apache.solr.core.ResourceLoaderTest
    [junit] Tests run: 2, Failures: 0, Errors: 0, Time elapsed: 0.402 sec
    [junit] Running org.apache.solr.core.SolrCoreTest
    [junit] Tests run: 1, Failures: 0, Errors: 0, Time elapsed: 5.207 sec
    [junit] Running org.apache.solr.core.TestBadConfig
    [junit] Tests run: 1, Failures: 0, Errors: 0, Time elapsed: 0.49 sec
    [junit] Running org.apache.solr.core.TestConfig
    [junit] Tests run: 2, Failures: 0, Errors: 0, Time elapsed: 5.25 sec
    [junit] Running org.apache.solr.core.TestQuerySenderListener
    [junit] Tests run: 1, Failures: 0, Errors: 0, Time elapsed: 2.87 sec
    [junit] Running org.apache.solr.handler.AnalysisRequestHandlerTest
    [junit] Tests run: 1, Failures: 0, Errors: 0, Time elapsed: 5.538 sec
    [junit] Running org.apache.solr.handler.MoreLikeThisHandlerTest
    [junit] Tests run: 1, Failures: 0, Errors: 0, Time elapsed: 4.195 sec
    [junit] Running org.apache.solr.handler.SpellCheckerRequestHandlerTest
    [junit] Tests run: 5, Failures: 0, Errors: 0, Time elapsed: 7.701 sec
    [junit] Running org.apache.solr.handler.StandardRequestHandlerTest
    [junit] Tests run: 1, Failures: 0, Errors: 0, Time elapsed: 4.095 sec
    [junit] Running org.apache.solr.handler.TestCSVLoader
    [junit] Tests run: 4, Failures: 0, Errors: 0, Time elapsed: 20.19 sec
    [junit] Running org.apache.solr.handler.XmlUpdateRequestHandlerTest
    [junit] Tests run: 1, Failures: 0, Errors: 0, Time elapsed: 5.194 sec
    [junit] Running org.apache.solr.handler.admin.SystemInfoHandlerTest
    [junit] Tests run: 1, Failures: 0, Errors: 0, Time elapsed: 0.366 sec
    [junit] Running org.apache.solr.handler.component.QueryElevationComponentTest
    [junit] Tests run: 3, Failures: 0, Errors: 0, Time elapsed: 9.887 sec
    [junit] Running org.apache.solr.handler.component.SearchHandlerTest
    [junit] Tests run: 1, Failures: 0, Errors: 0, Time elapsed: 3.267 sec
    [junit] Running org.apache.solr.highlight.HighlighterConfigTest
    [junit] Tests run: 1, Failures: 0, Errors: 0, Time elapsed: 6.027 sec
    [junit] Running org.apache.solr.highlight.HighlighterTest
    [junit] Tests run: 15, Failures: 0, Errors: 0, Time elapsed: 36.722 sec
    [junit] Running org.apache.solr.request.JSONWriterTest
    [junit] Tests run: 1, Failures: 0, Errors: 0, Time elapsed: 2.903 sec
    [junit] Running org.apache.solr.schema.BadIndexSchemaTest
    [junit] Tests run: 1, Failures: 0, Errors: 0, Time elapsed: 2.506 sec
    [junit] Running org.apache.solr.schema.IndexSchemaTest
    [junit] Tests run: 1, Failures: 0, Errors: 0, Time elapsed: 13.71 sec
    [junit] Running org.apache.solr.schema.NotRequiredUniqueKeyTest
    [junit] Tests run: 1, Failures: 0, Errors: 0, Time elapsed: 3.246 sec
    [junit] Running org.apache.solr.schema.RequiredFieldsTest
    [junit] Tests run: 3, Failures: 0, Errors: 0, Time elapsed: 28.853 sec
    [junit] Running org.apache.solr.schema.UUIDFieldTest
    [junit] Tests run: 1, Failures: 0, Errors: 0, Time elapsed: 2.742 sec
    [junit] Running org.apache.solr.search.TestDocSet
    [junit] Tests run: 1, Failures: 0, Errors: 0, Time elapsed: 2.404 sec
    [junit] Running org.apache.solr.search.TestQueryTypes
    [junit] Tests run: 1, Failures: 0, Errors: 0, Time elapsed: 5.91 sec
    [junit] Running org.apache.solr.search.TestQueryUtils
    [junit] Tests run: 1, Failures: 0, Errors: 0, Time elapsed: 10.009 sec
    [junit] Running org.apache.solr.search.function.TestFunctionQuery
    [junit] Tests run: 2, Failures: 0, Errors: 0, Time elapsed: 18.864 sec
    [junit] Running org.apache.solr.servlet.CacheHeaderTest
    [junit] Tests run: 3, Failures: 0, Errors: 1, Time elapsed: 25.485 sec
    [junit] 2008-03-28 08:44:57.484::INFO:  Shutdown hook executing
    [junit] 2008-03-28 08:44:57.484::INFO:  Shutdown hook complete
    [junit] 2008-03-28 08:44:58.497::INFO:  Shutdown hook complete
    [junit] 2008-03-28 08:44:59.505::INFO:  Shutdown hook complete
    [junit] Test org.apache.solr.servlet.CacheHeaderTest FAILED
    [junit] Running org.apache.solr.servlet.DirectSolrConnectionTest
    [junit] Tests run: 2, Failures: 0, Errors: 0, Time elapsed: 2.332 sec
    [junit] Running org.apache.solr.servlet.NoCacheHeaderTest
    [junit] Tests run: 3, Failures: 0, Errors: 0, Time elapsed: 34.657 sec
    [junit] 2008-03-28 08:45:39.446::INFO:  Shutdown hook executing
    [junit] 2008-03-28 08:45:39.446::INFO:  Shutdown hook complete
    [junit] 2008-03-28 08:45:40.450::INFO:  Shutdown hook complete
    [junit] 2008-03-28 08:45:41.459::INFO:  Shutdown hook complete
    [junit] Running org.apache.solr.servlet.SolrRequestParserTest
    [junit] Tests run: 4, Failures: 0, Errors: 0, Time elapsed: 14.246 sec
    [junit] Running org.apache.solr.update.AutoCommitTest
    [junit] Tests run: 3, Failures: 0, Errors: 0, Time elapsed: 14.063 sec
    [junit] Running org.apache.solr.update.DirectUpdateHandlerTest
    [junit] Tests run: 1, Failures: 0, Errors: 0, Time elapsed: 6.304 sec
    [junit] Running org.apache.solr.update.DocumentBuilderTest
    [junit] Tests run: 2, Failures: 0, Errors: 0, Time elapsed: 6.038 sec
    [junit] Running org.apache.solr.update.processor.UpdateRequestProcessorFactoryTest
    [junit] Tests run: 1, Failures: 0, Errors: 0, Time elapsed: 7.502 sec
    [junit] Running org.apache.solr.util.DateMathParserTest
    [junit] Tests run: 7, Failures: 0, Errors: 0, Time elapsed: 1.171 sec
    [junit] Running org.apache.solr.util.SolrPluginUtilsTest
    [junit] Tests run: 5, Failures: 0, Errors: 0, Time elapsed: 18.42 sec
    [junit] Running org.apache.solr.util.TestCharArrayMap
    [junit] Tests run: 2, Failures: 0, Errors: 0, Time elapsed: 0.892 sec
    [junit] Running org.apache.solr.util.TestOpenBitSet
    [junit] Tests run: 3, Failures: 0, Errors: 0, Time elapsed: 2.606 sec
    [junit] Running org.apache.solr.util.TestUtils
    [junit] Tests run: 1, Failures: 0, Errors: 0, Time elapsed: 0.58 sec
    [junit] Running org.apache.solr.client.solrj.SolrExceptionTest
    [junit] Tests run: 1, Failures: 0, Errors: 0, Time elapsed: 0.946 sec
    [junit] Running org.apache.solr.client.solrj.SolrQueryTest
    [junit] Tests run: 1, Failures: 0, Errors: 0, Time elapsed: 0.323 sec
    [junit] Running org.apache.solr.client.solrj.embedded.JettyWebappTest
    [junit] Tests run: 1, Failures: 0, Errors: 0, Time elapsed: 16.015 sec
    [junit] 2008-03-28 08:47:27.390::INFO:  Shutdown hook executing
    [junit] 2008-03-28 08:59:13.519::INFO:  Shutdown hook complete
    [junit] Running org.apache.solr.client.solrj.embedded.LargeVolumeEmbeddedTest
    [junit] Tests run: 1, Failures: 0, Errors: 0, Time elapsed: 10.894 sec
    [junit] Running org.apache.solr.client.solrj.embedded.LargeVolumeJettyTest
    [junit] Tests run: 1, Failures: 0, Errors: 0, Time elapsed: 22.374 sec
    [junit] 2008-03-28 08:59:50.368::INFO:  Shutdown hook executing
    [junit] 2008-03-28 08:59:50.368::INFO:  Shutdown hook complete
    [junit] Running org.apache.solr.client.solrj.embedded.MultiCoreEmbeddedTest
    [junit] Tests run: 1, Failures: 0, Errors: 0, Time elapsed: 13.748 sec
    [junit] Running org.apache.solr.client.solrj.embedded.MultiCoreExampleJettyTest
    [junit] Tests run: 1, Failures: 0, Errors: 0, Time elapsed: 15.35 sec
    [junit] 2008-03-28 09:00:26.392::INFO:  Shutdown hook executing
    [junit] 2008-03-28 09:00:26.392::INFO:  Shutdown hook complete
    [junit] Running org.apache.solr.client.solrj.embedded.SolrExampleEmbeddedTest
    [junit] Tests run: 6, Failures: 0, Errors: 0, Time elapsed: 34.644 sec
    [junit] Running org.apache.solr.client.solrj.embedded.SolrExampleJettyTest
    [junit] Tests run: 6, Failures: 0, Errors: 0, Time elapsed: 26.512 sec
    [junit] 2008-03-28 09:02:53.089::INFO:  Shutdown hook executing
    [junit] 2008-03-28 09:02:53.090::INFO:  Shutdown hook complete
    [junit] 2008-03-28 09:02:54.098::INFO:  Shutdown hook complete
    [junit] 2008-03-28 09:02:55.108::INFO:  Shutdown hook complete
    [junit] 2008-03-28 09:02:56.840::INFO:  Shutdown hook complete
    [junit] 2008-03-28 09:02:57.848::INFO:  Shutdown hook complete
    [junit] 2008-03-28 09:02:58.857::INFO:  Shutdown hook complete
    [junit] Running org.apache.solr.client.solrj.response.QueryResponseTest
    [junit] Tests run: 1, Failures: 0, Errors: 0, Time elapsed: 0.655 sec
    [junit] Running org.apache.solr.client.solrj.util.ClientUtilsTest
    [junit] Tests run: 1, Failures: 0, Errors: 0, Time elapsed: 0.436 sec

BUILD FAILED
http://hudson.zones.apache.org/hudson/job/Solr-trunk/ws/trunk/build.xml :498: Tests failed!

Total time: 53 minutes 19 seconds
ERROR: No artifacts found that match the file pattern "trunk/dist/*.tgz, trunk/dist/*.zip". Configuration error?
ERROR: 'trunk/dist/*.tgz' doesn't match anything: 'trunk' exists but not 'trunk/dist/*.tgz'
Publishing Javadoc
Recording test results

Reply | Threaded
Open this post in threaded view
|

Hudson build is back to normal: Solr-trunk #391

Apache Hudson Server