Build failed in Jenkins: Lucene-Solr-40-ReleaseSmoke #193

Previous Topic Next Topic
 
classic Classic list List threaded Threaded
6 messages Options
Reply | Threaded
Open this post in threaded view
|

Build failed in Jenkins: Lucene-Solr-40-ReleaseSmoke #193

Charlie Cron
See <http://sierranevada.servebeer.com/job/Lucene-Solr-40-ReleaseSmoke/193/>

------------------------------------------
[...truncated 41716 lines...]
prep-lucene-jars:

resolve-example:
     [echo] Building solr-example...

ivy-availability-check:

ivy-fail:

ivy-configure:
[ivy:configure] :: loading settings :: file = <http://sierranevada.servebeer.com/job/Lucene-Solr-40-ReleaseSmoke/ws/lucene/ivy-settings.xml>

resolve:
     [echo] Building solr-example-DIH...

ivy-availability-check:

ivy-fail:

ivy-configure:
[ivy:configure] :: loading settings :: file = <http://sierranevada.servebeer.com/job/Lucene-Solr-40-ReleaseSmoke/ws/lucene/ivy-settings.xml>

resolve:

resolve:

common.init:

compile-lucene-core:

ivy-availability-check:

ivy-fail:

ivy-configure:
[ivy:configure] :: loading settings :: file = <http://sierranevada.servebeer.com/job/Lucene-Solr-40-ReleaseSmoke/ws/lucene/ivy-settings.xml>

resolve:

init:

-clover.disable:

-clover.setup:

clover:

compile-core:

init:

-clover.disable:

-clover.setup:

clover:

common.compile-core:

common-solr.compile-core:

compile-core:

jar-core:
      [jar] Building jar: <http://sierranevada.servebeer.com/job/Lucene-Solr-40-ReleaseSmoke/ws/solr/build/contrib/solr-velocity/apache-solr-velocity-4.0.0.jar>

jar-src:
      [jar] Building jar: <http://sierranevada.servebeer.com/job/Lucene-Solr-40-ReleaseSmoke/ws/solr/build/contrib/solr-velocity/apache-solr-velocity-4.0.0-src.jar>

resolve-groovy:

define-lucene-javadoc-url:

check-lucene-core-javadocs-uptodate:

javadocs-lucene-core:

check-analyzers-common-javadocs-uptodate:

javadocs-analyzers-common:

check-analyzers-icu-javadocs-uptodate:

javadocs-analyzers-icu:

check-analyzers-kuromoji-javadocs-uptodate:

javadocs-analyzers-kuromoji:

check-analyzers-phonetic-javadocs-uptodate:

javadocs-analyzers-phonetic:

check-analyzers-smartcn-javadocs-uptodate:

javadocs-analyzers-smartcn:

check-analyzers-morfologik-javadocs-uptodate:

javadocs-analyzers-morfologik:

check-analyzers-stempel-javadocs-uptodate:

javadocs-analyzers-stempel:

check-analyzers-uima-javadocs-uptodate:

javadocs-analyzers-uima:

check-suggest-javadocs-uptodate:

javadocs-suggest:

check-grouping-javadocs-uptodate:

javadocs-grouping:

check-queries-javadocs-uptodate:

javadocs-queries:

check-queryparser-javadocs-uptodate:

javadocs-queryparser:

check-highlighter-javadocs-uptodate:

javadocs-highlighter:

check-memory-javadocs-uptodate:

javadocs-memory:

check-misc-javadocs-uptodate:

javadocs-misc:

check-spatial-javadocs-uptodate:

javadocs-spatial:

check-test-framework-javadocs-uptodate:

javadocs-test-framework:

lucene-javadocs:

check-solr-core-javadocs-uptodate:

javadocs-solr-core:

javadocs:
     [echo] Building solr-velocity...

download-java6-javadoc-packagelist:
   [delete] Deleting: <http://sierranevada.servebeer.com/job/Lucene-Solr-40-ReleaseSmoke/ws/solr/build/docs/solr-velocity/stylesheet.css>
  [javadoc] Generating Javadoc
  [javadoc] Javadoc execution
  [javadoc] Loading source files for package org.apache.solr.response...
  [javadoc] Constructing Javadoc information...
  [javadoc] Standard Doclet version 1.7.0_01
  [javadoc] Building tree for all the packages and classes...
  [javadoc] Building index for all the packages and classes...
  [javadoc] Building index for all classes...
  [javadoc] Generating <http://sierranevada.servebeer.com/job/Lucene-Solr-40-ReleaseSmoke/ws/solr/build/docs/solr-velocity/help-doc.html...>
  [javadoc] Note: Custom tags that were not seen:  @lucene.internal, @lucene.experimental
      [jar] Building jar: <http://sierranevada.servebeer.com/job/Lucene-Solr-40-ReleaseSmoke/ws/solr/build/contrib/solr-velocity/apache-solr-velocity-4.0.0-javadoc.jar>

dist-maven-common:
[artifact:install-provider] Installing provider: org.apache.maven.wagon:wagon-ssh:jar:1.0-beta-7:runtime
[artifact:deploy] Deploying to <http://sierranevada.servebeer.com/job/Lucene-Solr-40-ReleaseSmoke/ws/solr/package/maven/>
[artifact:deploy] Uploading: org/apache/solr/solr-velocity/4.0.0/solr-velocity-4.0.0.jar to repository local at <http://sierranevada.servebeer.com/job/Lucene-Solr-40-ReleaseSmoke/ws/solr/package/maven/>
[artifact:deploy] Transferring 22K from local
[artifact:deploy] Uploaded 22K
[artifact:deploy] [INFO] Retrieving previous metadata from local
[artifact:deploy] [INFO] repository metadata for: 'artifact org.apache.solr:solr-velocity' could not be found on repository: local, so will be created
[artifact:deploy] [INFO] Uploading repository metadata for: 'artifact org.apache.solr:solr-velocity'
[artifact:deploy] [INFO] Uploading project information for solr-velocity 4.0.0
[artifact:deploy] Uploading: org/apache/solr/solr-velocity/4.0.0/solr-velocity-4.0.0-sources.jar to repository local at <http://sierranevada.servebeer.com/job/Lucene-Solr-40-ReleaseSmoke/ws/solr/package/maven/>
[artifact:deploy] Transferring 20K from local
[artifact:deploy] Uploaded 20K
[artifact:deploy] Uploading: org/apache/solr/solr-velocity/4.0.0/solr-velocity-4.0.0-javadoc.jar to repository local at <http://sierranevada.servebeer.com/job/Lucene-Solr-40-ReleaseSmoke/ws/solr/package/maven/>
[artifact:deploy] Transferring 68K from local
[artifact:deploy] Uploaded 68K

dist-maven:

prepare-release-no-sign:
    [mkdir] Created dir: <http://sierranevada.servebeer.com/job/Lucene-Solr-40-ReleaseSmoke/ws/lucene/build/fakeRelease>
     [copy] Copying 381 files to <http://sierranevada.servebeer.com/job/Lucene-Solr-40-ReleaseSmoke/ws/lucene/build/fakeRelease/lucene>
     [copy] Copying 4 files to <http://sierranevada.servebeer.com/job/Lucene-Solr-40-ReleaseSmoke/ws/lucene/build/fakeRelease/lucene/changes>
      [get] Getting: http://people.apache.org/keys/group/lucene.asc
      [get] To: <http://sierranevada.servebeer.com/job/Lucene-Solr-40-ReleaseSmoke/ws/lucene/build/fakeRelease/lucene/KEYS>
     [copy] Copying 189 files to <http://sierranevada.servebeer.com/job/Lucene-Solr-40-ReleaseSmoke/ws/lucene/build/fakeRelease/solr>
     [copy] Copying 1 file to <http://sierranevada.servebeer.com/job/Lucene-Solr-40-ReleaseSmoke/ws/lucene/build/fakeRelease/solr>
     [copy] Copying 4 files to <http://sierranevada.servebeer.com/job/Lucene-Solr-40-ReleaseSmoke/ws/lucene/build/fakeRelease/solr/changes>
     [exec]
     [exec] Load release URL "<http://sierranevada.servebeer.com/job/Lucene-Solr-40-ReleaseSmoke/ws/lucene/build/fakeRelease/"...>
     [exec]
     [exec] Test Lucene...
     [exec]   test basics...
     [exec]   get KEYS
     [exec]     0.1 MB
     [exec]   check changes HTML...
     [exec]   download lucene-4.0.0-src.tgz...
     [exec]     26.4 MB
     [exec]     verify md5/sha1 digests
     [exec]   download lucene-4.0.0.tgz...
     [exec]     47.6 MB
     [exec]     verify md5/sha1 digests
     [exec]   download lucene-4.0.0.zip...
     [exec]     56.6 MB
     [exec]     verify md5/sha1 digests
     [exec]   unpack lucene-4.0.0.tgz...
     [exec]     make sure Lucene JARs don't have javax.* or java.* classes...
     [exec]     test demo...
     [exec]       got 5250 hits for query "lucene"
     [exec]     check Lucene's javadoc JAR
     [exec]
     [exec] Crawl/parse...
     [exec]
     [exec] Verify...
     [exec]   unpack lucene-4.0.0.zip...
     [exec]     make sure Lucene JARs don't have javax.* or java.* classes...
     [exec]     test demo...
     [exec]       got 5250 hits for query "lucene"
     [exec]     check Lucene's javadoc JAR
     [exec]
     [exec] Crawl/parse...
     [exec]
     [exec] Verify...
     [exec]   unpack lucene-4.0.0-src.tgz...
     [exec]     make sure no JARs/WARs in src dist...
     [exec]     run "ant validate"
     [exec]     run tests w/ Java 6...
     [exec] Traceback (most recent call last):
     [exec]   File "dev-tools/scripts/smokeTestRelease.py", line 1178, in <module>
     [exec]   File "dev-tools/scripts/smokeTestRelease.py", line 1126, in main
     [exec]   File "dev-tools/scripts/smokeTestRelease.py", line 1162, in smokeTest
     [exec]   File "dev-tools/scripts/smokeTestRelease.py", line 455, in unpack
     [exec]   File "dev-tools/scripts/smokeTestRelease.py", line 524, in verifyUnpacked
     [exec]   File "dev-tools/scripts/smokeTestRelease.py", line 377, in run
     [exec] RuntimeError: command "export JAVA_HOME="/usr/local/jdk1.6.0_27" PATH="/usr/local/jdk1.6.0_27/bin:$PATH"; ant test" failed; see log file <http://sierranevada.servebeer.com/job/Lucene-Solr-40-ReleaseSmoke/ws/lucene/build/fakeReleaseTmp/unpack/lucene-4.0.0/test.log>

BUILD FAILED
<http://sierranevada.servebeer.com/job/Lucene-Solr-40-ReleaseSmoke/ws/build.xml>:282: exec returned: 1

Total time: 11 minutes 13 seconds
Build step 'Invoke Ant' marked build as failure

---------------------------------------------------------------------
To unsubscribe, e-mail: [hidden email]
For additional commands, e-mail: [hidden email]

Reply | Threaded
Open this post in threaded view
|

Jenkins build is back to normal : Lucene-Solr-40-ReleaseSmoke #194

Charlie Cron
See <http://sierranevada.servebeer.com/job/Lucene-Solr-40-ReleaseSmoke/194/>


---------------------------------------------------------------------
To unsubscribe, e-mail: [hidden email]
For additional commands, e-mail: [hidden email]

Reply | Threaded
Open this post in threaded view
|

Re: Build failed in Jenkins: Lucene-Solr-40-ReleaseSmoke #193

Robert Muir
In reply to this post by Charlie Cron
Can we improve the way the smoketester works here?

I've been running lucene's tests in loops for a really long time now
trying to provoke any test fail, but now i finally provoked one and we
never will know what it is.

Instead of 'see /path/to/log' when something fails, can we just cat
/path/to/log to stdout when something fails?

On Wed, Sep 26, 2012 at 4:31 AM,  <[hidden email]> wrote:

> See <http://sierranevada.servebeer.com/job/Lucene-Solr-40-ReleaseSmoke/193/>
>
> ------------------------------------------
> [...truncated 41716 lines...]
> prep-lucene-jars:
>
> resolve-example:
>      [echo] Building solr-example...
>
> ivy-availability-check:
>
> ivy-fail:
>
> ivy-configure:
> [ivy:configure] :: loading settings :: file = <http://sierranevada.servebeer.com/job/Lucene-Solr-40-ReleaseSmoke/ws/lucene/ivy-settings.xml>
>
> resolve:
>      [echo] Building solr-example-DIH...
>
> ivy-availability-check:
>
> ivy-fail:
>
> ivy-configure:
> [ivy:configure] :: loading settings :: file = <http://sierranevada.servebeer.com/job/Lucene-Solr-40-ReleaseSmoke/ws/lucene/ivy-settings.xml>
>
> resolve:
>
> resolve:
>
> common.init:
>
> compile-lucene-core:
>
> ivy-availability-check:
>
> ivy-fail:
>
> ivy-configure:
> [ivy:configure] :: loading settings :: file = <http://sierranevada.servebeer.com/job/Lucene-Solr-40-ReleaseSmoke/ws/lucene/ivy-settings.xml>
>
> resolve:
>
> init:
>
> -clover.disable:
>
> -clover.setup:
>
> clover:
>
> compile-core:
>
> init:
>
> -clover.disable:
>
> -clover.setup:
>
> clover:
>
> common.compile-core:
>
> common-solr.compile-core:
>
> compile-core:
>
> jar-core:
>       [jar] Building jar: <http://sierranevada.servebeer.com/job/Lucene-Solr-40-ReleaseSmoke/ws/solr/build/contrib/solr-velocity/apache-solr-velocity-4.0.0.jar>
>
> jar-src:
>       [jar] Building jar: <http://sierranevada.servebeer.com/job/Lucene-Solr-40-ReleaseSmoke/ws/solr/build/contrib/solr-velocity/apache-solr-velocity-4.0.0-src.jar>
>
> resolve-groovy:
>
> define-lucene-javadoc-url:
>
> check-lucene-core-javadocs-uptodate:
>
> javadocs-lucene-core:
>
> check-analyzers-common-javadocs-uptodate:
>
> javadocs-analyzers-common:
>
> check-analyzers-icu-javadocs-uptodate:
>
> javadocs-analyzers-icu:
>
> check-analyzers-kuromoji-javadocs-uptodate:
>
> javadocs-analyzers-kuromoji:
>
> check-analyzers-phonetic-javadocs-uptodate:
>
> javadocs-analyzers-phonetic:
>
> check-analyzers-smartcn-javadocs-uptodate:
>
> javadocs-analyzers-smartcn:
>
> check-analyzers-morfologik-javadocs-uptodate:
>
> javadocs-analyzers-morfologik:
>
> check-analyzers-stempel-javadocs-uptodate:
>
> javadocs-analyzers-stempel:
>
> check-analyzers-uima-javadocs-uptodate:
>
> javadocs-analyzers-uima:
>
> check-suggest-javadocs-uptodate:
>
> javadocs-suggest:
>
> check-grouping-javadocs-uptodate:
>
> javadocs-grouping:
>
> check-queries-javadocs-uptodate:
>
> javadocs-queries:
>
> check-queryparser-javadocs-uptodate:
>
> javadocs-queryparser:
>
> check-highlighter-javadocs-uptodate:
>
> javadocs-highlighter:
>
> check-memory-javadocs-uptodate:
>
> javadocs-memory:
>
> check-misc-javadocs-uptodate:
>
> javadocs-misc:
>
> check-spatial-javadocs-uptodate:
>
> javadocs-spatial:
>
> check-test-framework-javadocs-uptodate:
>
> javadocs-test-framework:
>
> lucene-javadocs:
>
> check-solr-core-javadocs-uptodate:
>
> javadocs-solr-core:
>
> javadocs:
>      [echo] Building solr-velocity...
>
> download-java6-javadoc-packagelist:
>    [delete] Deleting: <http://sierranevada.servebeer.com/job/Lucene-Solr-40-ReleaseSmoke/ws/solr/build/docs/solr-velocity/stylesheet.css>
>   [javadoc] Generating Javadoc
>   [javadoc] Javadoc execution
>   [javadoc] Loading source files for package org.apache.solr.response...
>   [javadoc] Constructing Javadoc information...
>   [javadoc] Standard Doclet version 1.7.0_01
>   [javadoc] Building tree for all the packages and classes...
>   [javadoc] Building index for all the packages and classes...
>   [javadoc] Building index for all classes...
>   [javadoc] Generating <http://sierranevada.servebeer.com/job/Lucene-Solr-40-ReleaseSmoke/ws/solr/build/docs/solr-velocity/help-doc.html...>
>   [javadoc] Note: Custom tags that were not seen:  @lucene.internal, @lucene.experimental
>       [jar] Building jar: <http://sierranevada.servebeer.com/job/Lucene-Solr-40-ReleaseSmoke/ws/solr/build/contrib/solr-velocity/apache-solr-velocity-4.0.0-javadoc.jar>
>
> dist-maven-common:
> [artifact:install-provider] Installing provider: org.apache.maven.wagon:wagon-ssh:jar:1.0-beta-7:runtime
> [artifact:deploy] Deploying to <http://sierranevada.servebeer.com/job/Lucene-Solr-40-ReleaseSmoke/ws/solr/package/maven/>
> [artifact:deploy] Uploading: org/apache/solr/solr-velocity/4.0.0/solr-velocity-4.0.0.jar to repository local at <http://sierranevada.servebeer.com/job/Lucene-Solr-40-ReleaseSmoke/ws/solr/package/maven/>
> [artifact:deploy] Transferring 22K from local
> [artifact:deploy] Uploaded 22K
> [artifact:deploy] [INFO] Retrieving previous metadata from local
> [artifact:deploy] [INFO] repository metadata for: 'artifact org.apache.solr:solr-velocity' could not be found on repository: local, so will be created
> [artifact:deploy] [INFO] Uploading repository metadata for: 'artifact org.apache.solr:solr-velocity'
> [artifact:deploy] [INFO] Uploading project information for solr-velocity 4.0.0
> [artifact:deploy] Uploading: org/apache/solr/solr-velocity/4.0.0/solr-velocity-4.0.0-sources.jar to repository local at <http://sierranevada.servebeer.com/job/Lucene-Solr-40-ReleaseSmoke/ws/solr/package/maven/>
> [artifact:deploy] Transferring 20K from local
> [artifact:deploy] Uploaded 20K
> [artifact:deploy] Uploading: org/apache/solr/solr-velocity/4.0.0/solr-velocity-4.0.0-javadoc.jar to repository local at <http://sierranevada.servebeer.com/job/Lucene-Solr-40-ReleaseSmoke/ws/solr/package/maven/>
> [artifact:deploy] Transferring 68K from local
> [artifact:deploy] Uploaded 68K
>
> dist-maven:
>
> prepare-release-no-sign:
>     [mkdir] Created dir: <http://sierranevada.servebeer.com/job/Lucene-Solr-40-ReleaseSmoke/ws/lucene/build/fakeRelease>
>      [copy] Copying 381 files to <http://sierranevada.servebeer.com/job/Lucene-Solr-40-ReleaseSmoke/ws/lucene/build/fakeRelease/lucene>
>      [copy] Copying 4 files to <http://sierranevada.servebeer.com/job/Lucene-Solr-40-ReleaseSmoke/ws/lucene/build/fakeRelease/lucene/changes>
>       [get] Getting: http://people.apache.org/keys/group/lucene.asc
>       [get] To: <http://sierranevada.servebeer.com/job/Lucene-Solr-40-ReleaseSmoke/ws/lucene/build/fakeRelease/lucene/KEYS>
>      [copy] Copying 189 files to <http://sierranevada.servebeer.com/job/Lucene-Solr-40-ReleaseSmoke/ws/lucene/build/fakeRelease/solr>
>      [copy] Copying 1 file to <http://sierranevada.servebeer.com/job/Lucene-Solr-40-ReleaseSmoke/ws/lucene/build/fakeRelease/solr>
>      [copy] Copying 4 files to <http://sierranevada.servebeer.com/job/Lucene-Solr-40-ReleaseSmoke/ws/lucene/build/fakeRelease/solr/changes>
>      [exec]
>      [exec] Load release URL "<http://sierranevada.servebeer.com/job/Lucene-Solr-40-ReleaseSmoke/ws/lucene/build/fakeRelease/"...>
>      [exec]
>      [exec] Test Lucene...
>      [exec]   test basics...
>      [exec]   get KEYS
>      [exec]     0.1 MB
>      [exec]   check changes HTML...
>      [exec]   download lucene-4.0.0-src.tgz...
>      [exec]     26.4 MB
>      [exec]     verify md5/sha1 digests
>      [exec]   download lucene-4.0.0.tgz...
>      [exec]     47.6 MB
>      [exec]     verify md5/sha1 digests
>      [exec]   download lucene-4.0.0.zip...
>      [exec]     56.6 MB
>      [exec]     verify md5/sha1 digests
>      [exec]   unpack lucene-4.0.0.tgz...
>      [exec]     make sure Lucene JARs don't have javax.* or java.* classes...
>      [exec]     test demo...
>      [exec]       got 5250 hits for query "lucene"
>      [exec]     check Lucene's javadoc JAR
>      [exec]
>      [exec] Crawl/parse...
>      [exec]
>      [exec] Verify...
>      [exec]   unpack lucene-4.0.0.zip...
>      [exec]     make sure Lucene JARs don't have javax.* or java.* classes...
>      [exec]     test demo...
>      [exec]       got 5250 hits for query "lucene"
>      [exec]     check Lucene's javadoc JAR
>      [exec]
>      [exec] Crawl/parse...
>      [exec]
>      [exec] Verify...
>      [exec]   unpack lucene-4.0.0-src.tgz...
>      [exec]     make sure no JARs/WARs in src dist...
>      [exec]     run "ant validate"
>      [exec]     run tests w/ Java 6...
>      [exec] Traceback (most recent call last):
>      [exec]   File "dev-tools/scripts/smokeTestRelease.py", line 1178, in <module>
>      [exec]   File "dev-tools/scripts/smokeTestRelease.py", line 1126, in main
>      [exec]   File "dev-tools/scripts/smokeTestRelease.py", line 1162, in smokeTest
>      [exec]   File "dev-tools/scripts/smokeTestRelease.py", line 455, in unpack
>      [exec]   File "dev-tools/scripts/smokeTestRelease.py", line 524, in verifyUnpacked
>      [exec]   File "dev-tools/scripts/smokeTestRelease.py", line 377, in run
>      [exec] RuntimeError: command "export JAVA_HOME="/usr/local/jdk1.6.0_27" PATH="/usr/local/jdk1.6.0_27/bin:$PATH"; ant test" failed; see log file <http://sierranevada.servebeer.com/job/Lucene-Solr-40-ReleaseSmoke/ws/lucene/build/fakeReleaseTmp/unpack/lucene-4.0.0/test.log>
>
> BUILD FAILED
> <http://sierranevada.servebeer.com/job/Lucene-Solr-40-ReleaseSmoke/ws/build.xml>:282: exec returned: 1
>
> Total time: 11 minutes 13 seconds
> Build step 'Invoke Ant' marked build as failure
>
> ---------------------------------------------------------------------
> To unsubscribe, e-mail: [hidden email]
> For additional commands, e-mail: [hidden email]
>

---------------------------------------------------------------------
To unsubscribe, e-mail: [hidden email]
For additional commands, e-mail: [hidden email]

Reply | Threaded
Open this post in threaded view
|

RE: Build failed in Jenkins: Lucene-Solr-40-ReleaseSmoke #193

steve_rowe
+1

-----Original Message-----
From: Robert Muir [mailto:[hidden email]]
Sent: Wednesday, September 26, 2012 6:22 AM
To: [hidden email]
Subject: Re: Build failed in Jenkins: Lucene-Solr-40-ReleaseSmoke #193

Can we improve the way the smoketester works here?

I've been running lucene's tests in loops for a really long time now
trying to provoke any test fail, but now i finally provoked one and we
never will know what it is.

Instead of 'see /path/to/log' when something fails, can we just cat
/path/to/log to stdout when something fails?

On Wed, Sep 26, 2012 at 4:31 AM,  <[hidden email]> wrote:

> See <http://sierranevada.servebeer.com/job/Lucene-Solr-40-ReleaseSmoke/193/>
>
> ------------------------------------------
> [...truncated 41716 lines...]
> prep-lucene-jars:
>
> resolve-example:
>      [echo] Building solr-example...
>
> ivy-availability-check:
>
> ivy-fail:
>
> ivy-configure:
> [ivy:configure] :: loading settings :: file = <http://sierranevada.servebeer.com/job/Lucene-Solr-40-ReleaseSmoke/ws/lucene/ivy-settings.xml>
>
> resolve:
>      [echo] Building solr-example-DIH...
>
> ivy-availability-check:
>
> ivy-fail:
>
> ivy-configure:
> [ivy:configure] :: loading settings :: file = <http://sierranevada.servebeer.com/job/Lucene-Solr-40-ReleaseSmoke/ws/lucene/ivy-settings.xml>
>
> resolve:
>
> resolve:
>
> common.init:
>
> compile-lucene-core:
>
> ivy-availability-check:
>
> ivy-fail:
>
> ivy-configure:
> [ivy:configure] :: loading settings :: file = <http://sierranevada.servebeer.com/job/Lucene-Solr-40-ReleaseSmoke/ws/lucene/ivy-settings.xml>
>
> resolve:
>
> init:
>
> -clover.disable:
>
> -clover.setup:
>
> clover:
>
> compile-core:
>
> init:
>
> -clover.disable:
>
> -clover.setup:
>
> clover:
>
> common.compile-core:
>
> common-solr.compile-core:
>
> compile-core:
>
> jar-core:
>       [jar] Building jar: <http://sierranevada.servebeer.com/job/Lucene-Solr-40-ReleaseSmoke/ws/solr/build/contrib/solr-velocity/apache-solr-velocity-4.0.0.jar>
>
> jar-src:
>       [jar] Building jar: <http://sierranevada.servebeer.com/job/Lucene-Solr-40-ReleaseSmoke/ws/solr/build/contrib/solr-velocity/apache-solr-velocity-4.0.0-src.jar>
>
> resolve-groovy:
>
> define-lucene-javadoc-url:
>
> check-lucene-core-javadocs-uptodate:
>
> javadocs-lucene-core:
>
> check-analyzers-common-javadocs-uptodate:
>
> javadocs-analyzers-common:
>
> check-analyzers-icu-javadocs-uptodate:
>
> javadocs-analyzers-icu:
>
> check-analyzers-kuromoji-javadocs-uptodate:
>
> javadocs-analyzers-kuromoji:
>
> check-analyzers-phonetic-javadocs-uptodate:
>
> javadocs-analyzers-phonetic:
>
> check-analyzers-smartcn-javadocs-uptodate:
>
> javadocs-analyzers-smartcn:
>
> check-analyzers-morfologik-javadocs-uptodate:
>
> javadocs-analyzers-morfologik:
>
> check-analyzers-stempel-javadocs-uptodate:
>
> javadocs-analyzers-stempel:
>
> check-analyzers-uima-javadocs-uptodate:
>
> javadocs-analyzers-uima:
>
> check-suggest-javadocs-uptodate:
>
> javadocs-suggest:
>
> check-grouping-javadocs-uptodate:
>
> javadocs-grouping:
>
> check-queries-javadocs-uptodate:
>
> javadocs-queries:
>
> check-queryparser-javadocs-uptodate:
>
> javadocs-queryparser:
>
> check-highlighter-javadocs-uptodate:
>
> javadocs-highlighter:
>
> check-memory-javadocs-uptodate:
>
> javadocs-memory:
>
> check-misc-javadocs-uptodate:
>
> javadocs-misc:
>
> check-spatial-javadocs-uptodate:
>
> javadocs-spatial:
>
> check-test-framework-javadocs-uptodate:
>
> javadocs-test-framework:
>
> lucene-javadocs:
>
> check-solr-core-javadocs-uptodate:
>
> javadocs-solr-core:
>
> javadocs:
>      [echo] Building solr-velocity...
>
> download-java6-javadoc-packagelist:
>    [delete] Deleting: <http://sierranevada.servebeer.com/job/Lucene-Solr-40-ReleaseSmoke/ws/solr/build/docs/solr-velocity/stylesheet.css>
>   [javadoc] Generating Javadoc
>   [javadoc] Javadoc execution
>   [javadoc] Loading source files for package org.apache.solr.response...
>   [javadoc] Constructing Javadoc information...
>   [javadoc] Standard Doclet version 1.7.0_01
>   [javadoc] Building tree for all the packages and classes...
>   [javadoc] Building index for all the packages and classes...
>   [javadoc] Building index for all classes...
>   [javadoc] Generating <http://sierranevada.servebeer.com/job/Lucene-Solr-40-ReleaseSmoke/ws/solr/build/docs/solr-velocity/help-doc.html...>
>   [javadoc] Note: Custom tags that were not seen:  @lucene.internal, @lucene.experimental
>       [jar] Building jar: <http://sierranevada.servebeer.com/job/Lucene-Solr-40-ReleaseSmoke/ws/solr/build/contrib/solr-velocity/apache-solr-velocity-4.0.0-javadoc.jar>
>
> dist-maven-common:
> [artifact:install-provider] Installing provider: org.apache.maven.wagon:wagon-ssh:jar:1.0-beta-7:runtime
> [artifact:deploy] Deploying to <http://sierranevada.servebeer.com/job/Lucene-Solr-40-ReleaseSmoke/ws/solr/package/maven/>
> [artifact:deploy] Uploading: org/apache/solr/solr-velocity/4.0.0/solr-velocity-4.0.0.jar to repository local at <http://sierranevada.servebeer.com/job/Lucene-Solr-40-ReleaseSmoke/ws/solr/package/maven/>
> [artifact:deploy] Transferring 22K from local
> [artifact:deploy] Uploaded 22K
> [artifact:deploy] [INFO] Retrieving previous metadata from local
> [artifact:deploy] [INFO] repository metadata for: 'artifact org.apache.solr:solr-velocity' could not be found on repository: local, so will be created
> [artifact:deploy] [INFO] Uploading repository metadata for: 'artifact org.apache.solr:solr-velocity'
> [artifact:deploy] [INFO] Uploading project information for solr-velocity 4.0.0
> [artifact:deploy] Uploading: org/apache/solr/solr-velocity/4.0.0/solr-velocity-4.0.0-sources.jar to repository local at <http://sierranevada.servebeer.com/job/Lucene-Solr-40-ReleaseSmoke/ws/solr/package/maven/>
> [artifact:deploy] Transferring 20K from local
> [artifact:deploy] Uploaded 20K
> [artifact:deploy] Uploading: org/apache/solr/solr-velocity/4.0.0/solr-velocity-4.0.0-javadoc.jar to repository local at <http://sierranevada.servebeer.com/job/Lucene-Solr-40-ReleaseSmoke/ws/solr/package/maven/>
> [artifact:deploy] Transferring 68K from local
> [artifact:deploy] Uploaded 68K
>
> dist-maven:
>
> prepare-release-no-sign:
>     [mkdir] Created dir: <http://sierranevada.servebeer.com/job/Lucene-Solr-40-ReleaseSmoke/ws/lucene/build/fakeRelease>
>      [copy] Copying 381 files to <http://sierranevada.servebeer.com/job/Lucene-Solr-40-ReleaseSmoke/ws/lucene/build/fakeRelease/lucene>
>      [copy] Copying 4 files to <http://sierranevada.servebeer.com/job/Lucene-Solr-40-ReleaseSmoke/ws/lucene/build/fakeRelease/lucene/changes>
>       [get] Getting: http://people.apache.org/keys/group/lucene.asc
>       [get] To: <http://sierranevada.servebeer.com/job/Lucene-Solr-40-ReleaseSmoke/ws/lucene/build/fakeRelease/lucene/KEYS>
>      [copy] Copying 189 files to <http://sierranevada.servebeer.com/job/Lucene-Solr-40-ReleaseSmoke/ws/lucene/build/fakeRelease/solr>
>      [copy] Copying 1 file to <http://sierranevada.servebeer.com/job/Lucene-Solr-40-ReleaseSmoke/ws/lucene/build/fakeRelease/solr>
>      [copy] Copying 4 files to <http://sierranevada.servebeer.com/job/Lucene-Solr-40-ReleaseSmoke/ws/lucene/build/fakeRelease/solr/changes>
>      [exec]
>      [exec] Load release URL "<http://sierranevada.servebeer.com/job/Lucene-Solr-40-ReleaseSmoke/ws/lucene/build/fakeRelease/"...>
>      [exec]
>      [exec] Test Lucene...
>      [exec]   test basics...
>      [exec]   get KEYS
>      [exec]     0.1 MB
>      [exec]   check changes HTML...
>      [exec]   download lucene-4.0.0-src.tgz...
>      [exec]     26.4 MB
>      [exec]     verify md5/sha1 digests
>      [exec]   download lucene-4.0.0.tgz...
>      [exec]     47.6 MB
>      [exec]     verify md5/sha1 digests
>      [exec]   download lucene-4.0.0.zip...
>      [exec]     56.6 MB
>      [exec]     verify md5/sha1 digests
>      [exec]   unpack lucene-4.0.0.tgz...
>      [exec]     make sure Lucene JARs don't have javax.* or java.* classes...
>      [exec]     test demo...
>      [exec]       got 5250 hits for query "lucene"
>      [exec]     check Lucene's javadoc JAR
>      [exec]
>      [exec] Crawl/parse...
>      [exec]
>      [exec] Verify...
>      [exec]   unpack lucene-4.0.0.zip...
>      [exec]     make sure Lucene JARs don't have javax.* or java.* classes...
>      [exec]     test demo...
>      [exec]       got 5250 hits for query "lucene"
>      [exec]     check Lucene's javadoc JAR
>      [exec]
>      [exec] Crawl/parse...
>      [exec]
>      [exec] Verify...
>      [exec]   unpack lucene-4.0.0-src.tgz...
>      [exec]     make sure no JARs/WARs in src dist...
>      [exec]     run "ant validate"
>      [exec]     run tests w/ Java 6...
>      [exec] Traceback (most recent call last):
>      [exec]   File "dev-tools/scripts/smokeTestRelease.py", line 1178, in <module>
>      [exec]   File "dev-tools/scripts/smokeTestRelease.py", line 1126, in main
>      [exec]   File "dev-tools/scripts/smokeTestRelease.py", line 1162, in smokeTest
>      [exec]   File "dev-tools/scripts/smokeTestRelease.py", line 455, in unpack
>      [exec]   File "dev-tools/scripts/smokeTestRelease.py", line 524, in verifyUnpacked
>      [exec]   File "dev-tools/scripts/smokeTestRelease.py", line 377, in run
>      [exec] RuntimeError: command "export JAVA_HOME="/usr/local/jdk1.6.0_27" PATH="/usr/local/jdk1.6.0_27/bin:$PATH"; ant test" failed; see log file <http://sierranevada.servebeer.com/job/Lucene-Solr-40-ReleaseSmoke/ws/lucene/build/fakeReleaseTmp/unpack/lucene-4.0.0/test.log>
>
> BUILD FAILED
> <http://sierranevada.servebeer.com/job/Lucene-Solr-40-ReleaseSmoke/ws/build.xml>:282: exec returned: 1
>
> Total time: 11 minutes 13 seconds
> Build step 'Invoke Ant' marked build as failure
>
> ---------------------------------------------------------------------
> To unsubscribe, e-mail: [hidden email]
> For additional commands, e-mail: [hidden email]
>

---------------------------------------------------------------------
To unsubscribe, e-mail: [hidden email]
For additional commands, e-mail: [hidden email]


---------------------------------------------------------------------
To unsubscribe, e-mail: [hidden email]
For additional commands, e-mail: [hidden email]

Reply | Threaded
Open this post in threaded view
|

Re: Build failed in Jenkins: Lucene-Solr-40-ReleaseSmoke #193

Michael McCandless-2
Ugh!

I'll fix to cat to stdout on failure.

Mike McCandless

http://blog.mikemccandless.com

On Wed, Sep 26, 2012 at 7:25 AM, Steven A Rowe <[hidden email]> wrote:

> +1
>
> -----Original Message-----
> From: Robert Muir [mailto:[hidden email]]
> Sent: Wednesday, September 26, 2012 6:22 AM
> To: [hidden email]
> Subject: Re: Build failed in Jenkins: Lucene-Solr-40-ReleaseSmoke #193
>
> Can we improve the way the smoketester works here?
>
> I've been running lucene's tests in loops for a really long time now
> trying to provoke any test fail, but now i finally provoked one and we
> never will know what it is.
>
> Instead of 'see /path/to/log' when something fails, can we just cat
> /path/to/log to stdout when something fails?
>
> On Wed, Sep 26, 2012 at 4:31 AM,  <[hidden email]> wrote:
>> See <http://sierranevada.servebeer.com/job/Lucene-Solr-40-ReleaseSmoke/193/>
>>
>> ------------------------------------------
>> [...truncated 41716 lines...]
>> prep-lucene-jars:
>>
>> resolve-example:
>>      [echo] Building solr-example...
>>
>> ivy-availability-check:
>>
>> ivy-fail:
>>
>> ivy-configure:
>> [ivy:configure] :: loading settings :: file = <http://sierranevada.servebeer.com/job/Lucene-Solr-40-ReleaseSmoke/ws/lucene/ivy-settings.xml>
>>
>> resolve:
>>      [echo] Building solr-example-DIH...
>>
>> ivy-availability-check:
>>
>> ivy-fail:
>>
>> ivy-configure:
>> [ivy:configure] :: loading settings :: file = <http://sierranevada.servebeer.com/job/Lucene-Solr-40-ReleaseSmoke/ws/lucene/ivy-settings.xml>
>>
>> resolve:
>>
>> resolve:
>>
>> common.init:
>>
>> compile-lucene-core:
>>
>> ivy-availability-check:
>>
>> ivy-fail:
>>
>> ivy-configure:
>> [ivy:configure] :: loading settings :: file = <http://sierranevada.servebeer.com/job/Lucene-Solr-40-ReleaseSmoke/ws/lucene/ivy-settings.xml>
>>
>> resolve:
>>
>> init:
>>
>> -clover.disable:
>>
>> -clover.setup:
>>
>> clover:
>>
>> compile-core:
>>
>> init:
>>
>> -clover.disable:
>>
>> -clover.setup:
>>
>> clover:
>>
>> common.compile-core:
>>
>> common-solr.compile-core:
>>
>> compile-core:
>>
>> jar-core:
>>       [jar] Building jar: <http://sierranevada.servebeer.com/job/Lucene-Solr-40-ReleaseSmoke/ws/solr/build/contrib/solr-velocity/apache-solr-velocity-4.0.0.jar>
>>
>> jar-src:
>>       [jar] Building jar: <http://sierranevada.servebeer.com/job/Lucene-Solr-40-ReleaseSmoke/ws/solr/build/contrib/solr-velocity/apache-solr-velocity-4.0.0-src.jar>
>>
>> resolve-groovy:
>>
>> define-lucene-javadoc-url:
>>
>> check-lucene-core-javadocs-uptodate:
>>
>> javadocs-lucene-core:
>>
>> check-analyzers-common-javadocs-uptodate:
>>
>> javadocs-analyzers-common:
>>
>> check-analyzers-icu-javadocs-uptodate:
>>
>> javadocs-analyzers-icu:
>>
>> check-analyzers-kuromoji-javadocs-uptodate:
>>
>> javadocs-analyzers-kuromoji:
>>
>> check-analyzers-phonetic-javadocs-uptodate:
>>
>> javadocs-analyzers-phonetic:
>>
>> check-analyzers-smartcn-javadocs-uptodate:
>>
>> javadocs-analyzers-smartcn:
>>
>> check-analyzers-morfologik-javadocs-uptodate:
>>
>> javadocs-analyzers-morfologik:
>>
>> check-analyzers-stempel-javadocs-uptodate:
>>
>> javadocs-analyzers-stempel:
>>
>> check-analyzers-uima-javadocs-uptodate:
>>
>> javadocs-analyzers-uima:
>>
>> check-suggest-javadocs-uptodate:
>>
>> javadocs-suggest:
>>
>> check-grouping-javadocs-uptodate:
>>
>> javadocs-grouping:
>>
>> check-queries-javadocs-uptodate:
>>
>> javadocs-queries:
>>
>> check-queryparser-javadocs-uptodate:
>>
>> javadocs-queryparser:
>>
>> check-highlighter-javadocs-uptodate:
>>
>> javadocs-highlighter:
>>
>> check-memory-javadocs-uptodate:
>>
>> javadocs-memory:
>>
>> check-misc-javadocs-uptodate:
>>
>> javadocs-misc:
>>
>> check-spatial-javadocs-uptodate:
>>
>> javadocs-spatial:
>>
>> check-test-framework-javadocs-uptodate:
>>
>> javadocs-test-framework:
>>
>> lucene-javadocs:
>>
>> check-solr-core-javadocs-uptodate:
>>
>> javadocs-solr-core:
>>
>> javadocs:
>>      [echo] Building solr-velocity...
>>
>> download-java6-javadoc-packagelist:
>>    [delete] Deleting: <http://sierranevada.servebeer.com/job/Lucene-Solr-40-ReleaseSmoke/ws/solr/build/docs/solr-velocity/stylesheet.css>
>>   [javadoc] Generating Javadoc
>>   [javadoc] Javadoc execution
>>   [javadoc] Loading source files for package org.apache.solr.response...
>>   [javadoc] Constructing Javadoc information...
>>   [javadoc] Standard Doclet version 1.7.0_01
>>   [javadoc] Building tree for all the packages and classes...
>>   [javadoc] Building index for all the packages and classes...
>>   [javadoc] Building index for all classes...
>>   [javadoc] Generating <http://sierranevada.servebeer.com/job/Lucene-Solr-40-ReleaseSmoke/ws/solr/build/docs/solr-velocity/help-doc.html...>
>>   [javadoc] Note: Custom tags that were not seen:  @lucene.internal, @lucene.experimental
>>       [jar] Building jar: <http://sierranevada.servebeer.com/job/Lucene-Solr-40-ReleaseSmoke/ws/solr/build/contrib/solr-velocity/apache-solr-velocity-4.0.0-javadoc.jar>
>>
>> dist-maven-common:
>> [artifact:install-provider] Installing provider: org.apache.maven.wagon:wagon-ssh:jar:1.0-beta-7:runtime
>> [artifact:deploy] Deploying to <http://sierranevada.servebeer.com/job/Lucene-Solr-40-ReleaseSmoke/ws/solr/package/maven/>
>> [artifact:deploy] Uploading: org/apache/solr/solr-velocity/4.0.0/solr-velocity-4.0.0.jar to repository local at <http://sierranevada.servebeer.com/job/Lucene-Solr-40-ReleaseSmoke/ws/solr/package/maven/>
>> [artifact:deploy] Transferring 22K from local
>> [artifact:deploy] Uploaded 22K
>> [artifact:deploy] [INFO] Retrieving previous metadata from local
>> [artifact:deploy] [INFO] repository metadata for: 'artifact org.apache.solr:solr-velocity' could not be found on repository: local, so will be created
>> [artifact:deploy] [INFO] Uploading repository metadata for: 'artifact org.apache.solr:solr-velocity'
>> [artifact:deploy] [INFO] Uploading project information for solr-velocity 4.0.0
>> [artifact:deploy] Uploading: org/apache/solr/solr-velocity/4.0.0/solr-velocity-4.0.0-sources.jar to repository local at <http://sierranevada.servebeer.com/job/Lucene-Solr-40-ReleaseSmoke/ws/solr/package/maven/>
>> [artifact:deploy] Transferring 20K from local
>> [artifact:deploy] Uploaded 20K
>> [artifact:deploy] Uploading: org/apache/solr/solr-velocity/4.0.0/solr-velocity-4.0.0-javadoc.jar to repository local at <http://sierranevada.servebeer.com/job/Lucene-Solr-40-ReleaseSmoke/ws/solr/package/maven/>
>> [artifact:deploy] Transferring 68K from local
>> [artifact:deploy] Uploaded 68K
>>
>> dist-maven:
>>
>> prepare-release-no-sign:
>>     [mkdir] Created dir: <http://sierranevada.servebeer.com/job/Lucene-Solr-40-ReleaseSmoke/ws/lucene/build/fakeRelease>
>>      [copy] Copying 381 files to <http://sierranevada.servebeer.com/job/Lucene-Solr-40-ReleaseSmoke/ws/lucene/build/fakeRelease/lucene>
>>      [copy] Copying 4 files to <http://sierranevada.servebeer.com/job/Lucene-Solr-40-ReleaseSmoke/ws/lucene/build/fakeRelease/lucene/changes>
>>       [get] Getting: http://people.apache.org/keys/group/lucene.asc
>>       [get] To: <http://sierranevada.servebeer.com/job/Lucene-Solr-40-ReleaseSmoke/ws/lucene/build/fakeRelease/lucene/KEYS>
>>      [copy] Copying 189 files to <http://sierranevada.servebeer.com/job/Lucene-Solr-40-ReleaseSmoke/ws/lucene/build/fakeRelease/solr>
>>      [copy] Copying 1 file to <http://sierranevada.servebeer.com/job/Lucene-Solr-40-ReleaseSmoke/ws/lucene/build/fakeRelease/solr>
>>      [copy] Copying 4 files to <http://sierranevada.servebeer.com/job/Lucene-Solr-40-ReleaseSmoke/ws/lucene/build/fakeRelease/solr/changes>
>>      [exec]
>>      [exec] Load release URL "<http://sierranevada.servebeer.com/job/Lucene-Solr-40-ReleaseSmoke/ws/lucene/build/fakeRelease/"...>
>>      [exec]
>>      [exec] Test Lucene...
>>      [exec]   test basics...
>>      [exec]   get KEYS
>>      [exec]     0.1 MB
>>      [exec]   check changes HTML...
>>      [exec]   download lucene-4.0.0-src.tgz...
>>      [exec]     26.4 MB
>>      [exec]     verify md5/sha1 digests
>>      [exec]   download lucene-4.0.0.tgz...
>>      [exec]     47.6 MB
>>      [exec]     verify md5/sha1 digests
>>      [exec]   download lucene-4.0.0.zip...
>>      [exec]     56.6 MB
>>      [exec]     verify md5/sha1 digests
>>      [exec]   unpack lucene-4.0.0.tgz...
>>      [exec]     make sure Lucene JARs don't have javax.* or java.* classes...
>>      [exec]     test demo...
>>      [exec]       got 5250 hits for query "lucene"
>>      [exec]     check Lucene's javadoc JAR
>>      [exec]
>>      [exec] Crawl/parse...
>>      [exec]
>>      [exec] Verify...
>>      [exec]   unpack lucene-4.0.0.zip...
>>      [exec]     make sure Lucene JARs don't have javax.* or java.* classes...
>>      [exec]     test demo...
>>      [exec]       got 5250 hits for query "lucene"
>>      [exec]     check Lucene's javadoc JAR
>>      [exec]
>>      [exec] Crawl/parse...
>>      [exec]
>>      [exec] Verify...
>>      [exec]   unpack lucene-4.0.0-src.tgz...
>>      [exec]     make sure no JARs/WARs in src dist...
>>      [exec]     run "ant validate"
>>      [exec]     run tests w/ Java 6...
>>      [exec] Traceback (most recent call last):
>>      [exec]   File "dev-tools/scripts/smokeTestRelease.py", line 1178, in <module>
>>      [exec]   File "dev-tools/scripts/smokeTestRelease.py", line 1126, in main
>>      [exec]   File "dev-tools/scripts/smokeTestRelease.py", line 1162, in smokeTest
>>      [exec]   File "dev-tools/scripts/smokeTestRelease.py", line 455, in unpack
>>      [exec]   File "dev-tools/scripts/smokeTestRelease.py", line 524, in verifyUnpacked
>>      [exec]   File "dev-tools/scripts/smokeTestRelease.py", line 377, in run
>>      [exec] RuntimeError: command "export JAVA_HOME="/usr/local/jdk1.6.0_27" PATH="/usr/local/jdk1.6.0_27/bin:$PATH"; ant test" failed; see log file <http://sierranevada.servebeer.com/job/Lucene-Solr-40-ReleaseSmoke/ws/lucene/build/fakeReleaseTmp/unpack/lucene-4.0.0/test.log>
>>
>> BUILD FAILED
>> <http://sierranevada.servebeer.com/job/Lucene-Solr-40-ReleaseSmoke/ws/build.xml>:282: exec returned: 1
>>
>> Total time: 11 minutes 13 seconds
>> Build step 'Invoke Ant' marked build as failure
>>
>> ---------------------------------------------------------------------
>> To unsubscribe, e-mail: [hidden email]
>> For additional commands, e-mail: [hidden email]
>>
>
> ---------------------------------------------------------------------
> To unsubscribe, e-mail: [hidden email]
> For additional commands, e-mail: [hidden email]
>
>
> ---------------------------------------------------------------------
> To unsubscribe, e-mail: [hidden email]
> For additional commands, e-mail: [hidden email]
>

---------------------------------------------------------------------
To unsubscribe, e-mail: [hidden email]
For additional commands, e-mail: [hidden email]

Reply | Threaded
Open this post in threaded view
|

Re: Build failed in Jenkins: Lucene-Solr-40-ReleaseSmoke #193

Robert Muir
Build time is pretty stable here (more or less):
http://sierranevada.servebeer.com/job/Lucene-Solr-40-ReleaseSmoke/buildTimeTrend

at exactly 11 minutes in the current build i peeked at the file, it
was in the analyzers/common tests... If i had to put money on it, I'd
guess TestRandomChains :)

On Wed, Sep 26, 2012 at 7:43 AM, Michael McCandless
<[hidden email]> wrote:

> Ugh!
>
> I'll fix to cat to stdout on failure.
>
> Mike McCandless
>
> http://blog.mikemccandless.com
>
> On Wed, Sep 26, 2012 at 7:25 AM, Steven A Rowe <[hidden email]> wrote:
>> +1
>>
>> -----Original Message-----
>> From: Robert Muir [mailto:[hidden email]]
>> Sent: Wednesday, September 26, 2012 6:22 AM
>> To: [hidden email]
>> Subject: Re: Build failed in Jenkins: Lucene-Solr-40-ReleaseSmoke #193
>>
>> Can we improve the way the smoketester works here?
>>
>> I've been running lucene's tests in loops for a really long time now
>> trying to provoke any test fail, but now i finally provoked one and we
>> never will know what it is.
>>
>> Instead of 'see /path/to/log' when something fails, can we just cat
>> /path/to/log to stdout when something fails?
>>
>> On Wed, Sep 26, 2012 at 4:31 AM,  <[hidden email]> wrote:
>>> See <http://sierranevada.servebeer.com/job/Lucene-Solr-40-ReleaseSmoke/193/>
>>>
>>> ------------------------------------------
>>> [...truncated 41716 lines...]
>>> prep-lucene-jars:
>>>
>>> resolve-example:
>>>      [echo] Building solr-example...
>>>
>>> ivy-availability-check:
>>>
>>> ivy-fail:
>>>
>>> ivy-configure:
>>> [ivy:configure] :: loading settings :: file = <http://sierranevada.servebeer.com/job/Lucene-Solr-40-ReleaseSmoke/ws/lucene/ivy-settings.xml>
>>>
>>> resolve:
>>>      [echo] Building solr-example-DIH...
>>>
>>> ivy-availability-check:
>>>
>>> ivy-fail:
>>>
>>> ivy-configure:
>>> [ivy:configure] :: loading settings :: file = <http://sierranevada.servebeer.com/job/Lucene-Solr-40-ReleaseSmoke/ws/lucene/ivy-settings.xml>
>>>
>>> resolve:
>>>
>>> resolve:
>>>
>>> common.init:
>>>
>>> compile-lucene-core:
>>>
>>> ivy-availability-check:
>>>
>>> ivy-fail:
>>>
>>> ivy-configure:
>>> [ivy:configure] :: loading settings :: file = <http://sierranevada.servebeer.com/job/Lucene-Solr-40-ReleaseSmoke/ws/lucene/ivy-settings.xml>
>>>
>>> resolve:
>>>
>>> init:
>>>
>>> -clover.disable:
>>>
>>> -clover.setup:
>>>
>>> clover:
>>>
>>> compile-core:
>>>
>>> init:
>>>
>>> -clover.disable:
>>>
>>> -clover.setup:
>>>
>>> clover:
>>>
>>> common.compile-core:
>>>
>>> common-solr.compile-core:
>>>
>>> compile-core:
>>>
>>> jar-core:
>>>       [jar] Building jar: <http://sierranevada.servebeer.com/job/Lucene-Solr-40-ReleaseSmoke/ws/solr/build/contrib/solr-velocity/apache-solr-velocity-4.0.0.jar>
>>>
>>> jar-src:
>>>       [jar] Building jar: <http://sierranevada.servebeer.com/job/Lucene-Solr-40-ReleaseSmoke/ws/solr/build/contrib/solr-velocity/apache-solr-velocity-4.0.0-src.jar>
>>>
>>> resolve-groovy:
>>>
>>> define-lucene-javadoc-url:
>>>
>>> check-lucene-core-javadocs-uptodate:
>>>
>>> javadocs-lucene-core:
>>>
>>> check-analyzers-common-javadocs-uptodate:
>>>
>>> javadocs-analyzers-common:
>>>
>>> check-analyzers-icu-javadocs-uptodate:
>>>
>>> javadocs-analyzers-icu:
>>>
>>> check-analyzers-kuromoji-javadocs-uptodate:
>>>
>>> javadocs-analyzers-kuromoji:
>>>
>>> check-analyzers-phonetic-javadocs-uptodate:
>>>
>>> javadocs-analyzers-phonetic:
>>>
>>> check-analyzers-smartcn-javadocs-uptodate:
>>>
>>> javadocs-analyzers-smartcn:
>>>
>>> check-analyzers-morfologik-javadocs-uptodate:
>>>
>>> javadocs-analyzers-morfologik:
>>>
>>> check-analyzers-stempel-javadocs-uptodate:
>>>
>>> javadocs-analyzers-stempel:
>>>
>>> check-analyzers-uima-javadocs-uptodate:
>>>
>>> javadocs-analyzers-uima:
>>>
>>> check-suggest-javadocs-uptodate:
>>>
>>> javadocs-suggest:
>>>
>>> check-grouping-javadocs-uptodate:
>>>
>>> javadocs-grouping:
>>>
>>> check-queries-javadocs-uptodate:
>>>
>>> javadocs-queries:
>>>
>>> check-queryparser-javadocs-uptodate:
>>>
>>> javadocs-queryparser:
>>>
>>> check-highlighter-javadocs-uptodate:
>>>
>>> javadocs-highlighter:
>>>
>>> check-memory-javadocs-uptodate:
>>>
>>> javadocs-memory:
>>>
>>> check-misc-javadocs-uptodate:
>>>
>>> javadocs-misc:
>>>
>>> check-spatial-javadocs-uptodate:
>>>
>>> javadocs-spatial:
>>>
>>> check-test-framework-javadocs-uptodate:
>>>
>>> javadocs-test-framework:
>>>
>>> lucene-javadocs:
>>>
>>> check-solr-core-javadocs-uptodate:
>>>
>>> javadocs-solr-core:
>>>
>>> javadocs:
>>>      [echo] Building solr-velocity...
>>>
>>> download-java6-javadoc-packagelist:
>>>    [delete] Deleting: <http://sierranevada.servebeer.com/job/Lucene-Solr-40-ReleaseSmoke/ws/solr/build/docs/solr-velocity/stylesheet.css>
>>>   [javadoc] Generating Javadoc
>>>   [javadoc] Javadoc execution
>>>   [javadoc] Loading source files for package org.apache.solr.response...
>>>   [javadoc] Constructing Javadoc information...
>>>   [javadoc] Standard Doclet version 1.7.0_01
>>>   [javadoc] Building tree for all the packages and classes...
>>>   [javadoc] Building index for all the packages and classes...
>>>   [javadoc] Building index for all classes...
>>>   [javadoc] Generating <http://sierranevada.servebeer.com/job/Lucene-Solr-40-ReleaseSmoke/ws/solr/build/docs/solr-velocity/help-doc.html...>
>>>   [javadoc] Note: Custom tags that were not seen:  @lucene.internal, @lucene.experimental
>>>       [jar] Building jar: <http://sierranevada.servebeer.com/job/Lucene-Solr-40-ReleaseSmoke/ws/solr/build/contrib/solr-velocity/apache-solr-velocity-4.0.0-javadoc.jar>
>>>
>>> dist-maven-common:
>>> [artifact:install-provider] Installing provider: org.apache.maven.wagon:wagon-ssh:jar:1.0-beta-7:runtime
>>> [artifact:deploy] Deploying to <http://sierranevada.servebeer.com/job/Lucene-Solr-40-ReleaseSmoke/ws/solr/package/maven/>
>>> [artifact:deploy] Uploading: org/apache/solr/solr-velocity/4.0.0/solr-velocity-4.0.0.jar to repository local at <http://sierranevada.servebeer.com/job/Lucene-Solr-40-ReleaseSmoke/ws/solr/package/maven/>
>>> [artifact:deploy] Transferring 22K from local
>>> [artifact:deploy] Uploaded 22K
>>> [artifact:deploy] [INFO] Retrieving previous metadata from local
>>> [artifact:deploy] [INFO] repository metadata for: 'artifact org.apache.solr:solr-velocity' could not be found on repository: local, so will be created
>>> [artifact:deploy] [INFO] Uploading repository metadata for: 'artifact org.apache.solr:solr-velocity'
>>> [artifact:deploy] [INFO] Uploading project information for solr-velocity 4.0.0
>>> [artifact:deploy] Uploading: org/apache/solr/solr-velocity/4.0.0/solr-velocity-4.0.0-sources.jar to repository local at <http://sierranevada.servebeer.com/job/Lucene-Solr-40-ReleaseSmoke/ws/solr/package/maven/>
>>> [artifact:deploy] Transferring 20K from local
>>> [artifact:deploy] Uploaded 20K
>>> [artifact:deploy] Uploading: org/apache/solr/solr-velocity/4.0.0/solr-velocity-4.0.0-javadoc.jar to repository local at <http://sierranevada.servebeer.com/job/Lucene-Solr-40-ReleaseSmoke/ws/solr/package/maven/>
>>> [artifact:deploy] Transferring 68K from local
>>> [artifact:deploy] Uploaded 68K
>>>
>>> dist-maven:
>>>
>>> prepare-release-no-sign:
>>>     [mkdir] Created dir: <http://sierranevada.servebeer.com/job/Lucene-Solr-40-ReleaseSmoke/ws/lucene/build/fakeRelease>
>>>      [copy] Copying 381 files to <http://sierranevada.servebeer.com/job/Lucene-Solr-40-ReleaseSmoke/ws/lucene/build/fakeRelease/lucene>
>>>      [copy] Copying 4 files to <http://sierranevada.servebeer.com/job/Lucene-Solr-40-ReleaseSmoke/ws/lucene/build/fakeRelease/lucene/changes>
>>>       [get] Getting: http://people.apache.org/keys/group/lucene.asc
>>>       [get] To: <http://sierranevada.servebeer.com/job/Lucene-Solr-40-ReleaseSmoke/ws/lucene/build/fakeRelease/lucene/KEYS>
>>>      [copy] Copying 189 files to <http://sierranevada.servebeer.com/job/Lucene-Solr-40-ReleaseSmoke/ws/lucene/build/fakeRelease/solr>
>>>      [copy] Copying 1 file to <http://sierranevada.servebeer.com/job/Lucene-Solr-40-ReleaseSmoke/ws/lucene/build/fakeRelease/solr>
>>>      [copy] Copying 4 files to <http://sierranevada.servebeer.com/job/Lucene-Solr-40-ReleaseSmoke/ws/lucene/build/fakeRelease/solr/changes>
>>>      [exec]
>>>      [exec] Load release URL "<http://sierranevada.servebeer.com/job/Lucene-Solr-40-ReleaseSmoke/ws/lucene/build/fakeRelease/"...>
>>>      [exec]
>>>      [exec] Test Lucene...
>>>      [exec]   test basics...
>>>      [exec]   get KEYS
>>>      [exec]     0.1 MB
>>>      [exec]   check changes HTML...
>>>      [exec]   download lucene-4.0.0-src.tgz...
>>>      [exec]     26.4 MB
>>>      [exec]     verify md5/sha1 digests
>>>      [exec]   download lucene-4.0.0.tgz...
>>>      [exec]     47.6 MB
>>>      [exec]     verify md5/sha1 digests
>>>      [exec]   download lucene-4.0.0.zip...
>>>      [exec]     56.6 MB
>>>      [exec]     verify md5/sha1 digests
>>>      [exec]   unpack lucene-4.0.0.tgz...
>>>      [exec]     make sure Lucene JARs don't have javax.* or java.* classes...
>>>      [exec]     test demo...
>>>      [exec]       got 5250 hits for query "lucene"
>>>      [exec]     check Lucene's javadoc JAR
>>>      [exec]
>>>      [exec] Crawl/parse...
>>>      [exec]
>>>      [exec] Verify...
>>>      [exec]   unpack lucene-4.0.0.zip...
>>>      [exec]     make sure Lucene JARs don't have javax.* or java.* classes...
>>>      [exec]     test demo...
>>>      [exec]       got 5250 hits for query "lucene"
>>>      [exec]     check Lucene's javadoc JAR
>>>      [exec]
>>>      [exec] Crawl/parse...
>>>      [exec]
>>>      [exec] Verify...
>>>      [exec]   unpack lucene-4.0.0-src.tgz...
>>>      [exec]     make sure no JARs/WARs in src dist...
>>>      [exec]     run "ant validate"
>>>      [exec]     run tests w/ Java 6...
>>>      [exec] Traceback (most recent call last):
>>>      [exec]   File "dev-tools/scripts/smokeTestRelease.py", line 1178, in <module>
>>>      [exec]   File "dev-tools/scripts/smokeTestRelease.py", line 1126, in main
>>>      [exec]   File "dev-tools/scripts/smokeTestRelease.py", line 1162, in smokeTest
>>>      [exec]   File "dev-tools/scripts/smokeTestRelease.py", line 455, in unpack
>>>      [exec]   File "dev-tools/scripts/smokeTestRelease.py", line 524, in verifyUnpacked
>>>      [exec]   File "dev-tools/scripts/smokeTestRelease.py", line 377, in run
>>>      [exec] RuntimeError: command "export JAVA_HOME="/usr/local/jdk1.6.0_27" PATH="/usr/local/jdk1.6.0_27/bin:$PATH"; ant test" failed; see log file <http://sierranevada.servebeer.com/job/Lucene-Solr-40-ReleaseSmoke/ws/lucene/build/fakeReleaseTmp/unpack/lucene-4.0.0/test.log>
>>>
>>> BUILD FAILED
>>> <http://sierranevada.servebeer.com/job/Lucene-Solr-40-ReleaseSmoke/ws/build.xml>:282: exec returned: 1
>>>
>>> Total time: 11 minutes 13 seconds
>>> Build step 'Invoke Ant' marked build as failure
>>>
>>> ---------------------------------------------------------------------
>>> To unsubscribe, e-mail: [hidden email]
>>> For additional commands, e-mail: [hidden email]
>>>
>>
>> ---------------------------------------------------------------------
>> To unsubscribe, e-mail: [hidden email]
>> For additional commands, e-mail: [hidden email]
>>
>>
>> ---------------------------------------------------------------------
>> To unsubscribe, e-mail: [hidden email]
>> For additional commands, e-mail: [hidden email]
>>
>
> ---------------------------------------------------------------------
> To unsubscribe, e-mail: [hidden email]
> For additional commands, e-mail: [hidden email]
>

---------------------------------------------------------------------
To unsubscribe, e-mail: [hidden email]
For additional commands, e-mail: [hidden email]