Build failed in Jenkins: Lucene-Solr-4x-ReleaseSmoke #1

Previous Topic Next Topic
 
classic Classic list List threaded Threaded
19 messages Options
Reply | Threaded
Open this post in threaded view
|

Build failed in Jenkins: Lucene-Solr-4x-ReleaseSmoke #1

Charlie Cron
See <http://sierranevada.servebeer.com/job/Lucene-Solr-4x-ReleaseSmoke/1/>

------------------------------------------
[...truncated 15330 lines...]
  [javadoc] Javadoc execution
  [javadoc] Loading source files for package org.apache.lucene.sandbox.queries...
  [javadoc] Loading source files for package org.apache.lucene.sandbox.queries.regex...
  [javadoc] Constructing Javadoc information...
  [javadoc] Standard Doclet version 1.7.0_01
  [javadoc] Building tree for all the packages and classes...
  [javadoc] Building index for all the packages and classes...
  [javadoc] Building index for all classes...
  [javadoc] Generating <http://sierranevada.servebeer.com/job/Lucene-Solr-4x-ReleaseSmoke/ws/lucene/build/docs/sandbox/help-doc.html...>
  [javadoc] Note: Custom tags that were not seen:  @lucene.internal, @lucene.experimental
     [exec] Result: 1
      [jar] Building jar: <http://sierranevada.servebeer.com/job/Lucene-Solr-4x-ReleaseSmoke/ws/lucene/build/sandbox/lucene-sandbox-4.0-javadoc.jar>
     [echo] Building spatial...

check-queries-javadocs-uptodate:

javadocs-queries:

check-queries-uptodate:

jar-queries:

ivy-availability-check:

ivy-fail:

ivy-configure:
[ivy:configure] :: loading settings :: file = <http://sierranevada.servebeer.com/job/Lucene-Solr-4x-ReleaseSmoke/ws/lucene/ivy-settings.xml>

resolve:

common.init:

compile-lucene-core:

init:

-clover.disable:

-clover.setup:

clover:

common.compile-core:

compile-core:

javadocs:
    [mkdir] Created dir: <http://sierranevada.servebeer.com/job/Lucene-Solr-4x-ReleaseSmoke/ws/lucene/build/docs/spatial>
     [echo] Building spatial...

download-java6-javadoc-packagelist:
     [copy] Copying 1 file to <http://sierranevada.servebeer.com/job/Lucene-Solr-4x-ReleaseSmoke/ws/lucene/build/docs/spatial>
  [javadoc] Generating Javadoc
  [javadoc] Javadoc execution
  [javadoc] Loading source files for package org.apache.lucene.spatial...
  [javadoc] Loading source files for package org.apache.lucene.spatial.prefix...
  [javadoc] Loading source files for package org.apache.lucene.spatial.prefix.tree...
  [javadoc] Loading source files for package org.apache.lucene.spatial.query...
  [javadoc] Loading source files for package org.apache.lucene.spatial.util...
  [javadoc] Loading source files for package org.apache.lucene.spatial.vector...
  [javadoc] Constructing Javadoc information...
  [javadoc] Standard Doclet version 1.7.0_01
  [javadoc] Building tree for all the packages and classes...
  [javadoc] Building index for all the packages and classes...
  [javadoc] Building index for all classes...
     [exec] Result: 1
      [jar] Building jar: <http://sierranevada.servebeer.com/job/Lucene-Solr-4x-ReleaseSmoke/ws/lucene/build/spatial/lucene-spatial-4.0-javadoc.jar>
     [echo] Building suggest...

ivy-availability-check:

ivy-fail:

ivy-configure:
[ivy:configure] :: loading settings :: file = <http://sierranevada.servebeer.com/job/Lucene-Solr-4x-ReleaseSmoke/ws/lucene/ivy-settings.xml>

resolve:

common.init:

compile-lucene-core:

init:

-clover.disable:

-clover.setup:

clover:

compile-core:

check-lucene-core-javadocs-uptodate:

javadocs-lucene-core:

javadocs:
    [mkdir] Created dir: <http://sierranevada.servebeer.com/job/Lucene-Solr-4x-ReleaseSmoke/ws/lucene/build/docs/suggest>
     [echo] Building suggest...

download-java6-javadoc-packagelist:
     [copy] Copying 1 file to <http://sierranevada.servebeer.com/job/Lucene-Solr-4x-ReleaseSmoke/ws/lucene/build/docs/suggest>
  [javadoc] Generating Javadoc
  [javadoc] Javadoc execution
  [javadoc] Loading source files for package org.apache.lucene.search.spell...
  [javadoc] Loading source files for package org.apache.lucene.search.suggest...
  [javadoc] Loading source files for package org.apache.lucene.search.suggest.fst...
  [javadoc] Loading source files for package org.apache.lucene.search.suggest.jaspell...
  [javadoc] Loading source files for package org.apache.lucene.search.suggest.tst...
  [javadoc] Constructing Javadoc information...
  [javadoc] Standard Doclet version 1.7.0_01
  [javadoc] Building tree for all the packages and classes...
  [javadoc] Building index for all the packages and classes...
  [javadoc] Building index for all classes...
     [exec] Result: 1
      [jar] Building jar: <http://sierranevada.servebeer.com/job/Lucene-Solr-4x-ReleaseSmoke/ws/lucene/build/suggest/lucene-suggest-4.0-javadoc.jar>

check-lucene-test-framework-javadocs-uptodate:

javadocs-test-framework:

ivy-availability-check:

ivy-fail:

ivy-configure:
[ivy:configure] :: loading settings :: file = <http://sierranevada.servebeer.com/job/Lucene-Solr-4x-ReleaseSmoke/ws/lucene/ivy-settings.xml>

resolve:

init:

check-lucene-core-javadocs-uptodate:

javadocs-lucene-core:

check-lucene-codecs-javadocs-uptodate:

javadocs-lucene-codecs:

javadocs:
    [mkdir] Created dir: <http://sierranevada.servebeer.com/job/Lucene-Solr-4x-ReleaseSmoke/ws/lucene/build/docs/test-framework>

download-java6-javadoc-packagelist:
     [copy] Copying 1 file to <http://sierranevada.servebeer.com/job/Lucene-Solr-4x-ReleaseSmoke/ws/lucene/build/docs/test-framework>
  [javadoc] Generating Javadoc
  [javadoc] Javadoc execution
  [javadoc] Loading source files for package org.apache.lucene.analysis...
  [javadoc] Loading source files for package org.apache.lucene.codecs.asserting...
  [javadoc] Loading source files for package org.apache.lucene.codecs.bloom...
  [javadoc] Loading source files for package org.apache.lucene.codecs.lucene3x...
  [javadoc] Loading source files for package org.apache.lucene.codecs.lucene40ords...
  [javadoc] Loading source files for package org.apache.lucene.codecs.mockintblock...
  [javadoc] Loading source files for package org.apache.lucene.codecs.mockrandom...
  [javadoc] Loading source files for package org.apache.lucene.codecs.mocksep...
  [javadoc] Loading source files for package org.apache.lucene.codecs.nestedpulsing...
  [javadoc] Loading source files for package org.apache.lucene.codecs.ramonly...
  [javadoc] Loading source files for package org.apache.lucene.index...
  [javadoc] Loading source files for package org.apache.lucene.search...
  [javadoc] Loading source files for package org.apache.lucene.store...
  [javadoc] Loading source files for package org.apache.lucene.util...
  [javadoc] Loading source files for package org.apache.lucene.util.automaton...
  [javadoc] Constructing Javadoc information...
  [javadoc] Standard Doclet version 1.7.0_01
  [javadoc] Building tree for all the packages and classes...
  [javadoc] Building index for all the packages and classes...
  [javadoc] Building index for all classes...
     [exec] Result: 1
      [jar] Building jar: <http://sierranevada.servebeer.com/job/Lucene-Solr-4x-ReleaseSmoke/ws/lucene/build/test-framework/lucene-test-framework-4.0-javadoc.jar>

javadocs:

changes-to-html:
    [mkdir] Created dir: <http://sierranevada.servebeer.com/job/Lucene-Solr-4x-ReleaseSmoke/ws/lucene/build/docs/changes>
     [exec] Retrieving https://issues.apache.org/jira/rest/api/2/project/LUCENE ...
     [exec] --2012-09-20 16:20:23--  https://issues.apache.org/jira/rest/api/2/project/LUCENE
     [exec] Resolving issues.apache.org (issues.apache.org)... 140.211.11.121
     [exec] Connecting to issues.apache.org (issues.apache.org)|140.211.11.121|:443... connected.
     [exec] HTTP request sent, awaiting response... 200 OK
     [exec] Length: unspecified [application/json]
     [exec] Saving to: `STDOUT'
     [exec]
     [exec]      0K .......... ........                                    48.7M=0s
     [exec]
     [exec] 2012-09-20 16:20:23 (48.7 MB/s) - written to stdout [18789]
     [exec]
     [copy] Copying 3 files to <http://sierranevada.servebeer.com/job/Lucene-Solr-4x-ReleaseSmoke/ws/lucene/build/docs/changes>

ivy-availability-check:

ivy-fail:

ivy-configure:
[ivy:configure] :: loading settings :: file = <http://sierranevada.servebeer.com/job/Lucene-Solr-4x-ReleaseSmoke/ws/lucene/ivy-settings.xml>

resolve-pegdown:
[ivy:cachepath] :: resolving dependencies :: org.pegdown#pegdown-caller;working
[ivy:cachepath] confs: [default]
[ivy:cachepath] found org.pegdown#pegdown;1.1.0 in public
[ivy:cachepath] found org.parboiled#parboiled-core;1.0.2 in public
[ivy:cachepath] found org.parboiled#parboiled-java;1.0.2 in public
[ivy:cachepath] found asm#asm;3.3.1 in public
[ivy:cachepath] found asm#asm-util;3.3.1 in public
[ivy:cachepath] found asm#asm-tree;3.3.1 in public
[ivy:cachepath] found asm#asm-analysis;3.3.1 in public
[ivy:cachepath] :: resolution report :: resolve 27ms :: artifacts dl 2ms
        ---------------------------------------------------------------------
        |                  |            modules            ||   artifacts   |
        |       conf       | number| search|dwnlded|evicted|| number|dwnlded|
        ---------------------------------------------------------------------
        |      default     |   7   |   0   |   0   |   0   ||   7   |   0   |
        ---------------------------------------------------------------------

process-webpages:
     [xslt] Processing <http://sierranevada.servebeer.com/job/Lucene-Solr-4x-ReleaseSmoke/ws/lucene/build.xml> to <http://sierranevada.servebeer.com/job/Lucene-Solr-4x-ReleaseSmoke/ws/lucene/build/docs/index.html>
     [xslt] Loading stylesheet <http://sierranevada.servebeer.com/job/Lucene-Solr-4x-ReleaseSmoke/ws/lucene/site/xsl/index.xsl>
  [pegdown] Copying 2 files to <http://sierranevada.servebeer.com/job/Lucene-Solr-4x-ReleaseSmoke/ws/lucene/build/docs>
  [pegdown] Copying <http://sierranevada.servebeer.com/job/Lucene-Solr-4x-ReleaseSmoke/ws/lucene/JRE_VERSION_MIGRATION.txt> to <http://sierranevada.servebeer.com/job/Lucene-Solr-4x-ReleaseSmoke/ws/lucene/build/docs/JRE_VERSION_MIGRATION.html>
  [pegdown] Copying <http://sierranevada.servebeer.com/job/Lucene-Solr-4x-ReleaseSmoke/ws/lucene/MIGRATE.txt> to <http://sierranevada.servebeer.com/job/Lucene-Solr-4x-ReleaseSmoke/ws/lucene/build/docs/MIGRATE.html>
     [copy] Copying 1 file to <http://sierranevada.servebeer.com/job/Lucene-Solr-4x-ReleaseSmoke/ws/lucene/build/docs>

documentation:

package:

package-zip:
      [zip] Building zip: <http://sierranevada.servebeer.com/job/Lucene-Solr-4x-ReleaseSmoke/ws/lucene/dist/lucene-4.0.zip>
     [echo] Building checksums for '<http://sierranevada.servebeer.com/job/Lucene-Solr-4x-ReleaseSmoke/ws/lucene/dist/lucene-4.0.zip'>

package-tgz:
      [tar] Building tar: <http://sierranevada.servebeer.com/job/Lucene-Solr-4x-ReleaseSmoke/ws/lucene/dist/lucene-4.0.tgz>
     [echo] Building checksums for '<http://sierranevada.servebeer.com/job/Lucene-Solr-4x-ReleaseSmoke/ws/lucene/dist/lucene-4.0.tgz'>

package-all-binary:

dist:

package-tgz-src:
     [exec] Result: 1

BUILD FAILED
<http://sierranevada.servebeer.com/job/Lucene-Solr-4x-ReleaseSmoke/ws/build.xml>:258: The following error occurred while executing this line:
<http://sierranevada.servebeer.com/job/Lucene-Solr-4x-ReleaseSmoke/ws/lucene/build.xml>:400: The following error occurred while executing this line:
<http://sierranevada.servebeer.com/job/Lucene-Solr-4x-ReleaseSmoke/ws/lucene/common-build.xml>:1601: The following error occurred while executing this line:
<http://sierranevada.servebeer.com/job/Lucene-Solr-4x-ReleaseSmoke/ws/lucene/common-build.xml>:1624: exec returned: 1

Total time: 2 minutes 11 seconds
Build step 'Invoke Ant' marked build as failure

---------------------------------------------------------------------
To unsubscribe, e-mail: [hidden email]
For additional commands, e-mail: [hidden email]

Reply | Threaded
Open this post in threaded view
|

Re: Build failed in Jenkins: Lucene-Solr-4x-ReleaseSmoke #1

Robert Muir
This has something to do with jenkins' crazy broken internal svn i
think. I'll disable this job until I can figure out how to make it
work

On Thu, Sep 20, 2012 at 4:20 PM,  <[hidden email]> wrote:

> See <http://sierranevada.servebeer.com/job/Lucene-Solr-4x-ReleaseSmoke/1/>
>
> ------------------------------------------
> [...truncated 15330 lines...]
>   [javadoc] Javadoc execution
>   [javadoc] Loading source files for package org.apache.lucene.sandbox.queries...
>   [javadoc] Loading source files for package org.apache.lucene.sandbox.queries.regex...
>   [javadoc] Constructing Javadoc information...
>   [javadoc] Standard Doclet version 1.7.0_01
>   [javadoc] Building tree for all the packages and classes...
>   [javadoc] Building index for all the packages and classes...
>   [javadoc] Building index for all classes...
>   [javadoc] Generating <http://sierranevada.servebeer.com/job/Lucene-Solr-4x-ReleaseSmoke/ws/lucene/build/docs/sandbox/help-doc.html...>
>   [javadoc] Note: Custom tags that were not seen:  @lucene.internal, @lucene.experimental
>      [exec] Result: 1
>       [jar] Building jar: <http://sierranevada.servebeer.com/job/Lucene-Solr-4x-ReleaseSmoke/ws/lucene/build/sandbox/lucene-sandbox-4.0-javadoc.jar>
>      [echo] Building spatial...
>
> check-queries-javadocs-uptodate:
>
> javadocs-queries:
>
> check-queries-uptodate:
>
> jar-queries:
>
> ivy-availability-check:
>
> ivy-fail:
>
> ivy-configure:
> [ivy:configure] :: loading settings :: file = <http://sierranevada.servebeer.com/job/Lucene-Solr-4x-ReleaseSmoke/ws/lucene/ivy-settings.xml>
>
> resolve:
>
> common.init:
>
> compile-lucene-core:
>
> init:
>
> -clover.disable:
>
> -clover.setup:
>
> clover:
>
> common.compile-core:
>
> compile-core:
>
> javadocs:
>     [mkdir] Created dir: <http://sierranevada.servebeer.com/job/Lucene-Solr-4x-ReleaseSmoke/ws/lucene/build/docs/spatial>
>      [echo] Building spatial...
>
> download-java6-javadoc-packagelist:
>      [copy] Copying 1 file to <http://sierranevada.servebeer.com/job/Lucene-Solr-4x-ReleaseSmoke/ws/lucene/build/docs/spatial>
>   [javadoc] Generating Javadoc
>   [javadoc] Javadoc execution
>   [javadoc] Loading source files for package org.apache.lucene.spatial...
>   [javadoc] Loading source files for package org.apache.lucene.spatial.prefix...
>   [javadoc] Loading source files for package org.apache.lucene.spatial.prefix.tree...
>   [javadoc] Loading source files for package org.apache.lucene.spatial.query...
>   [javadoc] Loading source files for package org.apache.lucene.spatial.util...
>   [javadoc] Loading source files for package org.apache.lucene.spatial.vector...
>   [javadoc] Constructing Javadoc information...
>   [javadoc] Standard Doclet version 1.7.0_01
>   [javadoc] Building tree for all the packages and classes...
>   [javadoc] Building index for all the packages and classes...
>   [javadoc] Building index for all classes...
>      [exec] Result: 1
>       [jar] Building jar: <http://sierranevada.servebeer.com/job/Lucene-Solr-4x-ReleaseSmoke/ws/lucene/build/spatial/lucene-spatial-4.0-javadoc.jar>
>      [echo] Building suggest...
>
> ivy-availability-check:
>
> ivy-fail:
>
> ivy-configure:
> [ivy:configure] :: loading settings :: file = <http://sierranevada.servebeer.com/job/Lucene-Solr-4x-ReleaseSmoke/ws/lucene/ivy-settings.xml>
>
> resolve:
>
> common.init:
>
> compile-lucene-core:
>
> init:
>
> -clover.disable:
>
> -clover.setup:
>
> clover:
>
> compile-core:
>
> check-lucene-core-javadocs-uptodate:
>
> javadocs-lucene-core:
>
> javadocs:
>     [mkdir] Created dir: <http://sierranevada.servebeer.com/job/Lucene-Solr-4x-ReleaseSmoke/ws/lucene/build/docs/suggest>
>      [echo] Building suggest...
>
> download-java6-javadoc-packagelist:
>      [copy] Copying 1 file to <http://sierranevada.servebeer.com/job/Lucene-Solr-4x-ReleaseSmoke/ws/lucene/build/docs/suggest>
>   [javadoc] Generating Javadoc
>   [javadoc] Javadoc execution
>   [javadoc] Loading source files for package org.apache.lucene.search.spell...
>   [javadoc] Loading source files for package org.apache.lucene.search.suggest...
>   [javadoc] Loading source files for package org.apache.lucene.search.suggest.fst...
>   [javadoc] Loading source files for package org.apache.lucene.search.suggest.jaspell...
>   [javadoc] Loading source files for package org.apache.lucene.search.suggest.tst...
>   [javadoc] Constructing Javadoc information...
>   [javadoc] Standard Doclet version 1.7.0_01
>   [javadoc] Building tree for all the packages and classes...
>   [javadoc] Building index for all the packages and classes...
>   [javadoc] Building index for all classes...
>      [exec] Result: 1
>       [jar] Building jar: <http://sierranevada.servebeer.com/job/Lucene-Solr-4x-ReleaseSmoke/ws/lucene/build/suggest/lucene-suggest-4.0-javadoc.jar>
>
> check-lucene-test-framework-javadocs-uptodate:
>
> javadocs-test-framework:
>
> ivy-availability-check:
>
> ivy-fail:
>
> ivy-configure:
> [ivy:configure] :: loading settings :: file = <http://sierranevada.servebeer.com/job/Lucene-Solr-4x-ReleaseSmoke/ws/lucene/ivy-settings.xml>
>
> resolve:
>
> init:
>
> check-lucene-core-javadocs-uptodate:
>
> javadocs-lucene-core:
>
> check-lucene-codecs-javadocs-uptodate:
>
> javadocs-lucene-codecs:
>
> javadocs:
>     [mkdir] Created dir: <http://sierranevada.servebeer.com/job/Lucene-Solr-4x-ReleaseSmoke/ws/lucene/build/docs/test-framework>
>
> download-java6-javadoc-packagelist:
>      [copy] Copying 1 file to <http://sierranevada.servebeer.com/job/Lucene-Solr-4x-ReleaseSmoke/ws/lucene/build/docs/test-framework>
>   [javadoc] Generating Javadoc
>   [javadoc] Javadoc execution
>   [javadoc] Loading source files for package org.apache.lucene.analysis...
>   [javadoc] Loading source files for package org.apache.lucene.codecs.asserting...
>   [javadoc] Loading source files for package org.apache.lucene.codecs.bloom...
>   [javadoc] Loading source files for package org.apache.lucene.codecs.lucene3x...
>   [javadoc] Loading source files for package org.apache.lucene.codecs.lucene40ords...
>   [javadoc] Loading source files for package org.apache.lucene.codecs.mockintblock...
>   [javadoc] Loading source files for package org.apache.lucene.codecs.mockrandom...
>   [javadoc] Loading source files for package org.apache.lucene.codecs.mocksep...
>   [javadoc] Loading source files for package org.apache.lucene.codecs.nestedpulsing...
>   [javadoc] Loading source files for package org.apache.lucene.codecs.ramonly...
>   [javadoc] Loading source files for package org.apache.lucene.index...
>   [javadoc] Loading source files for package org.apache.lucene.search...
>   [javadoc] Loading source files for package org.apache.lucene.store...
>   [javadoc] Loading source files for package org.apache.lucene.util...
>   [javadoc] Loading source files for package org.apache.lucene.util.automaton...
>   [javadoc] Constructing Javadoc information...
>   [javadoc] Standard Doclet version 1.7.0_01
>   [javadoc] Building tree for all the packages and classes...
>   [javadoc] Building index for all the packages and classes...
>   [javadoc] Building index for all classes...
>      [exec] Result: 1
>       [jar] Building jar: <http://sierranevada.servebeer.com/job/Lucene-Solr-4x-ReleaseSmoke/ws/lucene/build/test-framework/lucene-test-framework-4.0-javadoc.jar>
>
> javadocs:
>
> changes-to-html:
>     [mkdir] Created dir: <http://sierranevada.servebeer.com/job/Lucene-Solr-4x-ReleaseSmoke/ws/lucene/build/docs/changes>
>      [exec] Retrieving https://issues.apache.org/jira/rest/api/2/project/LUCENE ...
>      [exec] --2012-09-20 16:20:23--  https://issues.apache.org/jira/rest/api/2/project/LUCENE
>      [exec] Resolving issues.apache.org (issues.apache.org)... 140.211.11.121
>      [exec] Connecting to issues.apache.org (issues.apache.org)|140.211.11.121|:443... connected.
>      [exec] HTTP request sent, awaiting response... 200 OK
>      [exec] Length: unspecified [application/json]
>      [exec] Saving to: `STDOUT'
>      [exec]
>      [exec]      0K .......... ........                                    48.7M=0s
>      [exec]
>      [exec] 2012-09-20 16:20:23 (48.7 MB/s) - written to stdout [18789]
>      [exec]
>      [copy] Copying 3 files to <http://sierranevada.servebeer.com/job/Lucene-Solr-4x-ReleaseSmoke/ws/lucene/build/docs/changes>
>
> ivy-availability-check:
>
> ivy-fail:
>
> ivy-configure:
> [ivy:configure] :: loading settings :: file = <http://sierranevada.servebeer.com/job/Lucene-Solr-4x-ReleaseSmoke/ws/lucene/ivy-settings.xml>
>
> resolve-pegdown:
> [ivy:cachepath] :: resolving dependencies :: org.pegdown#pegdown-caller;working
> [ivy:cachepath]         confs: [default]
> [ivy:cachepath]         found org.pegdown#pegdown;1.1.0 in public
> [ivy:cachepath]         found org.parboiled#parboiled-core;1.0.2 in public
> [ivy:cachepath]         found org.parboiled#parboiled-java;1.0.2 in public
> [ivy:cachepath]         found asm#asm;3.3.1 in public
> [ivy:cachepath]         found asm#asm-util;3.3.1 in public
> [ivy:cachepath]         found asm#asm-tree;3.3.1 in public
> [ivy:cachepath]         found asm#asm-analysis;3.3.1 in public
> [ivy:cachepath] :: resolution report :: resolve 27ms :: artifacts dl 2ms
>         ---------------------------------------------------------------------
>         |                  |            modules            ||   artifacts   |
>         |       conf       | number| search|dwnlded|evicted|| number|dwnlded|
>         ---------------------------------------------------------------------
>         |      default     |   7   |   0   |   0   |   0   ||   7   |   0   |
>         ---------------------------------------------------------------------
>
> process-webpages:
>      [xslt] Processing <http://sierranevada.servebeer.com/job/Lucene-Solr-4x-ReleaseSmoke/ws/lucene/build.xml> to <http://sierranevada.servebeer.com/job/Lucene-Solr-4x-ReleaseSmoke/ws/lucene/build/docs/index.html>
>      [xslt] Loading stylesheet <http://sierranevada.servebeer.com/job/Lucene-Solr-4x-ReleaseSmoke/ws/lucene/site/xsl/index.xsl>
>   [pegdown] Copying 2 files to <http://sierranevada.servebeer.com/job/Lucene-Solr-4x-ReleaseSmoke/ws/lucene/build/docs>
>   [pegdown] Copying <http://sierranevada.servebeer.com/job/Lucene-Solr-4x-ReleaseSmoke/ws/lucene/JRE_VERSION_MIGRATION.txt> to <http://sierranevada.servebeer.com/job/Lucene-Solr-4x-ReleaseSmoke/ws/lucene/build/docs/JRE_VERSION_MIGRATION.html>
>   [pegdown] Copying <http://sierranevada.servebeer.com/job/Lucene-Solr-4x-ReleaseSmoke/ws/lucene/MIGRATE.txt> to <http://sierranevada.servebeer.com/job/Lucene-Solr-4x-ReleaseSmoke/ws/lucene/build/docs/MIGRATE.html>
>      [copy] Copying 1 file to <http://sierranevada.servebeer.com/job/Lucene-Solr-4x-ReleaseSmoke/ws/lucene/build/docs>
>
> documentation:
>
> package:
>
> package-zip:
>       [zip] Building zip: <http://sierranevada.servebeer.com/job/Lucene-Solr-4x-ReleaseSmoke/ws/lucene/dist/lucene-4.0.zip>
>      [echo] Building checksums for '<http://sierranevada.servebeer.com/job/Lucene-Solr-4x-ReleaseSmoke/ws/lucene/dist/lucene-4.0.zip'>
>
> package-tgz:
>       [tar] Building tar: <http://sierranevada.servebeer.com/job/Lucene-Solr-4x-ReleaseSmoke/ws/lucene/dist/lucene-4.0.tgz>
>      [echo] Building checksums for '<http://sierranevada.servebeer.com/job/Lucene-Solr-4x-ReleaseSmoke/ws/lucene/dist/lucene-4.0.tgz'>
>
> package-all-binary:
>
> dist:
>
> package-tgz-src:
>      [exec] Result: 1
>
> BUILD FAILED
> <http://sierranevada.servebeer.com/job/Lucene-Solr-4x-ReleaseSmoke/ws/build.xml>:258: The following error occurred while executing this line:
> <http://sierranevada.servebeer.com/job/Lucene-Solr-4x-ReleaseSmoke/ws/lucene/build.xml>:400: The following error occurred while executing this line:
> <http://sierranevada.servebeer.com/job/Lucene-Solr-4x-ReleaseSmoke/ws/lucene/common-build.xml>:1601: The following error occurred while executing this line:
> <http://sierranevada.servebeer.com/job/Lucene-Solr-4x-ReleaseSmoke/ws/lucene/common-build.xml>:1624: exec returned: 1
>
> Total time: 2 minutes 11 seconds
> Build step 'Invoke Ant' marked build as failure
>
> ---------------------------------------------------------------------
> To unsubscribe, e-mail: [hidden email]
> For additional commands, e-mail: [hidden email]
>



--
lucidworks.com

---------------------------------------------------------------------
To unsubscribe, e-mail: [hidden email]
For additional commands, e-mail: [hidden email]

Reply | Threaded
Open this post in threaded view
|

Build failed in Jenkins: Lucene-Solr-40-ReleaseSmoke #2

Charlie Cron
In reply to this post by Charlie Cron
See <http://sierranevada.servebeer.com/job/Lucene-Solr-40-ReleaseSmoke/2/>

------------------------------------------
[...truncated 50337 lines...]
     [exec]
     [exec] <http://sierranevada.servebeer.com/job/Lucene-Solr-40-ReleaseSmoke/ws/lucene/build/fakeReleaseTmp/unpack/apache-solr-4.0/solr/build/docs/solr-solrj/org/apache/solr/common/cloud/package-summary.html>
     [exec]   no package description (missing package.html in src?)
     [exec]   missing: ClosableThread
     [exec]   missing: OnReconnect
     [exec]   missing: ZkClientConnectionStrategy.ConnectedListener
     [exec]   missing: ZkClientConnectionStrategy.DisconnectedListener
     [exec]   missing: HashPartitioner.Range
     [exec]   missing: Replica
     [exec]   missing: SolrZooKeeper
     [exec]   missing: ZkClientConnectionStrategy
     [exec]   missing: ZkClientConnectionStrategy.ZkUpdate
     [exec]   missing: ZkCmdExecutor
     [exec]   missing: ZkCoreNodeProps
     [exec]   missing: ZkStateReader
     [exec]   missing: ZooKeeperException
     [exec]
     [exec] <http://sierranevada.servebeer.com/job/Lucene-Solr-40-ReleaseSmoke/ws/lucene/build/fakeReleaseTmp/unpack/apache-solr-4.0/solr/build/docs/solr-solrj/org/apache/solr/client/solrj/package-summary.html>
     [exec]   no package description (missing package.html in src?)
     [exec]   missing: ResponseParser
     [exec]   missing: SolrRequest
     [exec]   missing: SolrResponse
     [exec]   missing: SolrServer
     [exec]   missing: SolrQuery.ORDER
     [exec]   missing: SolrRequest.METHOD
     [exec]
     [exec] <http://sierranevada.servebeer.com/job/Lucene-Solr-40-ReleaseSmoke/ws/lucene/build/fakeReleaseTmp/unpack/apache-solr-4.0/solr/build/docs/solr-solrj/org/apache/solr/client/solrj/request/package-summary.html>
     [exec]   no package description (missing package.html in src?)
     [exec]   missing: JavaBinUpdateRequestCodec.StreamingUpdateHandler
     [exec]   missing: AbstractUpdateRequest
     [exec]   missing: CoreAdminRequest.Create
     [exec]   missing: CoreAdminRequest.MergeIndexes
     [exec]   missing: CoreAdminRequest.Persist
     [exec]   missing: CoreAdminRequest.RequestRecovery
     [exec]   missing: CoreAdminRequest.RequestSyncShard
     [exec]   missing: CoreAdminRequest.Unload
     [exec]   missing: CoreAdminRequest.WaitForState
     [exec]   missing: LukeRequest
     [exec]   missing: QueryRequest
     [exec]   missing: SolrPing
     [exec]   missing: UpdateRequest
     [exec]   missing: UpdateRequestExt
     [exec]   missing: AbstractUpdateRequest.ACTION
     [exec]
     [exec] <http://sierranevada.servebeer.com/job/Lucene-Solr-40-ReleaseSmoke/ws/lucene/build/fakeReleaseTmp/unpack/apache-solr-4.0/solr/build/docs/solr-solrj/org/apache/solr/client/solrj/util/package-summary.html>
     [exec]   no package description (missing package.html in src?)
     [exec]   missing: ClientUtils
     [exec]
     [exec] <http://sierranevada.servebeer.com/job/Lucene-Solr-40-ReleaseSmoke/ws/lucene/build/fakeReleaseTmp/unpack/apache-solr-4.0/solr/build/docs/solr-solrj/org/apache/solr/client/solrj/beans/package-summary.html>
     [exec]   no package description (missing package.html in src?)
     [exec]   missing: BindingException
     [exec]   missing: Field
     [exec]
     [exec] <http://sierranevada.servebeer.com/job/Lucene-Solr-40-ReleaseSmoke/ws/lucene/build/fakeReleaseTmp/unpack/apache-solr-4.0/solr/build/docs/solr-solrj/org/apache/solr/client/solrj/response/package-summary.html>
     [exec]   no package description (missing package.html in src?)
     [exec]   missing: CoreAdminResponse
     [exec]   missing: FacetField.Count
     [exec]   missing: LukeResponse.FieldInfo
     [exec]   missing: LukeResponse.FieldTypeInfo
     [exec]   missing: PivotField
     [exec]   missing: QueryResponse
     [exec]   missing: RangeFacet.Count
     [exec]   missing: RangeFacet.Date
     [exec]   missing: RangeFacet.Numeric
     [exec]   missing: SolrPingResponse
     [exec]   missing: SolrResponseBase
     [exec]   missing: SpellCheckResponse.Suggestion
     [exec]   missing: TermsResponse.Term
     [exec]
     [exec] <http://sierranevada.servebeer.com/job/Lucene-Solr-40-ReleaseSmoke/ws/lucene/build/fakeReleaseTmp/unpack/apache-solr-4.0/solr/build/docs/solr-solrj/org/apache/solr/client/solrj/impl/package-summary.html>
     [exec]   no package description (missing package.html in src?)
     [exec]   missing: BinaryResponseParser
     [exec]   missing: HttpSolrServer
     [exec]   missing: LBHttpSolrServer.Req
     [exec]   missing: LBHttpSolrServer.Rsp
     [exec]   missing: XMLResponseParser
     [exec]   missing: XMLResponseParser.KnownType
     [exec]
     [exec] <http://sierranevada.servebeer.com/job/Lucene-Solr-40-ReleaseSmoke/ws/lucene/build/fakeReleaseTmp/unpack/apache-solr-4.0/solr/build/docs/solr-solrj/org/apache/noggit/package-summary.html>
     [exec]   no package description (missing package.html in src?)
     [exec]   missing: CharArr
     [exec]   missing: CharUtil
     [exec]   missing: JSONParser
     [exec]   missing: JSONUtil
     [exec]   missing: JSONWriter
     [exec]   missing: ObjectBuilder
     [exec]   missing: JSONParser.ParseException
     [exec]
     [exec] <http://sierranevada.servebeer.com/job/Lucene-Solr-40-ReleaseSmoke/ws/lucene/build/fakeReleaseTmp/unpack/apache-solr-4.0/solr/build/docs/solr-uima/overview-summary.html>
     [exec]   missing: org.apache.solr.uima.processor
     [exec]   missing: org.apache.solr.uima.processor.exception
     [exec]
     [exec] <http://sierranevada.servebeer.com/job/Lucene-Solr-40-ReleaseSmoke/ws/lucene/build/fakeReleaseTmp/unpack/apache-solr-4.0/solr/build/docs/solr-uima/org/apache/solr/uima/processor/package-summary.html>
     [exec]   no package description (missing package.html in src?)
     [exec]
     [exec] <http://sierranevada.servebeer.com/job/Lucene-Solr-40-ReleaseSmoke/ws/lucene/build/fakeReleaseTmp/unpack/apache-solr-4.0/solr/build/docs/solr-uima/org/apache/solr/uima/processor/exception/package-summary.html>
     [exec]   no package description (missing package.html in src?)
     [exec]
     [exec] <http://sierranevada.servebeer.com/job/Lucene-Solr-40-ReleaseSmoke/ws/lucene/build/fakeReleaseTmp/unpack/apache-solr-4.0/solr/build/docs/solr-dataimporthandler/overview-summary.html>
     [exec]   missing: org.apache.solr.handler.dataimport
     [exec]   missing: org.apache.solr.handler.dataimport.config
     [exec]
     [exec] <http://sierranevada.servebeer.com/job/Lucene-Solr-40-ReleaseSmoke/ws/lucene/build/fakeReleaseTmp/unpack/apache-solr-4.0/solr/build/docs/solr-dataimporthandler/org/apache/solr/handler/dataimport/package-summary.html>
     [exec]   no package description (missing package.html in src?)
     [exec]   missing: DIHPropertiesWriter
     [exec]   missing: DIHWriter
     [exec]   missing: CachePropertyUtil
     [exec]   missing: ConfigParseUtil
     [exec]   missing: DebugInfo
     [exec]   missing: DIHCacheSupport
     [exec]   missing: DIHWriterBase
     [exec]   missing: DocBuilder.Statistics
     [exec]   missing: EvaluatorBag.VariableWrapper
     [exec]   missing: RequestInfo
     [exec]   missing: SimplePropertiesWriter
     [exec]   missing: SortedMapBackedCache
     [exec]   missing: ZKPropertiesWriter
     [exec]   missing: DataImporter.Status
     [exec]   missing: DIHLogLevels
     [exec]
     [exec] <http://sierranevada.servebeer.com/job/Lucene-Solr-40-ReleaseSmoke/ws/lucene/build/fakeReleaseTmp/unpack/apache-solr-4.0/solr/build/docs/solr-dataimporthandler/org/apache/solr/handler/dataimport/config/package-summary.html>
     [exec]   no package description (missing package.html in src?)
     [exec]   missing: ConfigNameConstants
     [exec]   missing: ConfigParseUtil
     [exec]   missing: Entity
     [exec]   missing: EntityField
     [exec]   missing: EntityField.Builder
     [exec]   missing: Field
     [exec]   missing: Field.Builder
     [exec]   missing: Script
     [exec]
     [exec] <http://sierranevada.servebeer.com/job/Lucene-Solr-40-ReleaseSmoke/ws/lucene/build/fakeReleaseTmp/unpack/apache-solr-4.0/solr/build/docs/solr-cell/overview-summary.html>
     [exec]   missing: org.apache.solr.handler.extraction
     [exec]
     [exec] <http://sierranevada.servebeer.com/job/Lucene-Solr-40-ReleaseSmoke/ws/lucene/build/fakeReleaseTmp/unpack/apache-solr-4.0/solr/build/docs/solr-cell/org/apache/solr/handler/extraction/package-summary.html>
     [exec]   no package description (missing package.html in src?)
     [exec]   missing: SolrContentHandlerFactory
     [exec]
     [exec] <http://sierranevada.servebeer.com/job/Lucene-Solr-40-ReleaseSmoke/ws/lucene/build/fakeReleaseTmp/unpack/apache-solr-4.0/solr/build/docs/solr-test-framework/overview-summary.html>
     [exec]   missing: org.apache.solr
     [exec]   missing: org.apache.solr.analysis
     [exec]   missing: org.apache.solr.cloud
     [exec]   missing: org.apache.solr.core
     [exec]   missing: org.apache.solr.update.processor
     [exec]   missing: org.apache.solr.util
     [exec]
     [exec] <http://sierranevada.servebeer.com/job/Lucene-Solr-40-ReleaseSmoke/ws/lucene/build/fakeReleaseTmp/unpack/apache-solr-4.0/solr/build/docs/solr-test-framework/org/apache/solr/package-summary.html>
     [exec]   no package description (missing package.html in src?)
     [exec]   missing: BaseDistributedSearchTestCase.RandDate
     [exec]   missing: BaseDistributedSearchTestCase.RandVal
     [exec]   missing: JSONTestUtil
     [exec]   missing: SolrJettyTestBase
     [exec]   missing: SolrTestCaseJ4.Doc
     [exec]   missing: SolrTestCaseJ4.Fld
     [exec]   missing: SolrTestCaseJ4.FVal
     [exec]   missing: SolrTestCaseJ4.IRange
     [exec]   missing: SolrTestCaseJ4.IVals
     [exec]   missing: SolrTestCaseJ4.SVal
     [exec]   missing: SolrTestCaseJ4.Vals
     [exec]
     [exec] <http://sierranevada.servebeer.com/job/Lucene-Solr-40-ReleaseSmoke/ws/lucene/build/fakeReleaseTmp/unpack/apache-solr-4.0/solr/build/docs/solr-test-framework/org/apache/solr/util/package-summary.html>
     [exec]   no package description (missing package.html in src?)
     [exec]   missing: DOMUtilTestBase
     [exec]   missing: RevertDefaultThreadHandlerRule
     [exec]
     [exec] <http://sierranevada.servebeer.com/job/Lucene-Solr-40-ReleaseSmoke/ws/lucene/build/fakeReleaseTmp/unpack/apache-solr-4.0/solr/build/docs/solr-test-framework/org/apache/solr/core/package-summary.html>
     [exec]   no package description (missing package.html in src?)
     [exec]
     [exec] <http://sierranevada.servebeer.com/job/Lucene-Solr-40-ReleaseSmoke/ws/lucene/build/fakeReleaseTmp/unpack/apache-solr-4.0/solr/build/docs/solr-test-framework/org/apache/solr/update/processor/package-summary.html>
     [exec]   no package description (missing package.html in src?)
     [exec]   missing: BufferingRequestProcessor
     [exec]
     [exec] <http://sierranevada.servebeer.com/job/Lucene-Solr-40-ReleaseSmoke/ws/lucene/build/fakeReleaseTmp/unpack/apache-solr-4.0/solr/build/docs/solr-test-framework/org/apache/solr/cloud/package-summary.html>
     [exec]   no package description (missing package.html in src?)
     [exec]   missing: AbstractDistribZkTestBase
     [exec]   missing: AbstractFullDistribZkTestBase.CloudJettyRunner
     [exec]   missing: ZkTestServer
     [exec]   missing: ZkTestServer.HostPort
     [exec]
     [exec] <http://sierranevada.servebeer.com/job/Lucene-Solr-40-ReleaseSmoke/ws/lucene/build/fakeReleaseTmp/unpack/apache-solr-4.0/solr/build/docs/solr-test-framework/org/apache/solr/analysis/package-summary.html>
     [exec]   no package description (missing package.html in src?)
     [exec]
     [exec] <http://sierranevada.servebeer.com/job/Lucene-Solr-40-ReleaseSmoke/ws/lucene/build/fakeReleaseTmp/unpack/apache-solr-4.0/solr/build/docs/solr-dataimporthandler-extras/overview-summary.html>
     [exec]   missing: org.apache.solr.handler.dataimport
     [exec]
     [exec] <http://sierranevada.servebeer.com/job/Lucene-Solr-40-ReleaseSmoke/ws/lucene/build/fakeReleaseTmp/unpack/apache-solr-4.0/solr/build/docs/solr-dataimporthandler-extras/org/apache/solr/handler/dataimport/package-summary.html>
     [exec]   no package description (missing package.html in src?)
     [exec]   missing: MailEntityProcessor.CustomFilter
     [exec]
     [exec] ***WARNING***: javadocs want to fail!
     [exec]
     [exec]
     [exec] Crawl/parse...
     [exec]
     [exec] Verify...
     [exec]     test solr example w/ Java 6...
     [exec]       start Solr instance (log=<http://sierranevada.servebeer.com/job/Lucene-Solr-40-ReleaseSmoke/ws/lucene/build/fakeReleaseTmp/unpack/apache-solr-4.0/solr-example.log)...>
     [exec]       startup done
     [exec]       test utf8...
     [exec]       index example docs...
     [exec]       run query...
     [exec]       stop server (SIGINT)...
     [exec]     test solr example w/ Java 7...
     [exec]       start Solr instance (log=<http://sierranevada.servebeer.com/job/Lucene-Solr-40-ReleaseSmoke/ws/lucene/build/fakeReleaseTmp/unpack/apache-solr-4.0/solr-example.log)...>
     [exec]       startup done
     [exec]       test utf8...
     [exec]       index example docs...
     [exec]       run query...
     [exec]       stop server (SIGINT)...
     [exec]     check NOTICE
     [exec] Test Maven artifacts for Lucene and Solr...
     [exec]     get POM templates ...................................................
     [exec]     download artifacts ........................................................................................................................................................................................................................................................................................................................................................................................................................................................................................................................................................................
     [exec]     verify that each binary artifact has a deployed POM...
     [exec]     verify that there is an artifact for each POM template...
     [exec] Traceback (most recent call last):
     [exec]   File "/usr/lib/python3.2/xml/etree/ElementTree.py", line 1668, in feed
     [exec]     self._parser.Parse(data, 0)
     [exec] xml.parsers.expat.ExpatError: not well-formed (invalid token): line 1, column 8
     [exec]
     [exec] During handling of the above exception, another exception occurred:
     [exec]
     [exec] Traceback (most recent call last):
     [exec]   File "dev-tools/scripts/smokeTestRelease.py", line 1107, in <module>
     [exec]     main()
     [exec]   File "dev-tools/scripts/smokeTestRelease.py", line 1057, in main
     [exec]     smokeTest(baseURL, version, tmpDir, isSigned)
     [exec]   File "dev-tools/scripts/smokeTestRelease.py", line 1103, in smokeTest
     [exec]     checkMaven(baseURL, tmpDir, version, isSigned)
     [exec]   File "dev-tools/scripts/smokeTestRelease.py", line 688, in checkMaven
     [exec]     verifyArtifactPerPOMtemplate(POMtemplates, artifacts, tmpDir, version)
     [exec]   File "dev-tools/scripts/smokeTestRelease.py", line 985, in verifyArtifactPerPOMtemplate
     [exec]     treeRoot = ET.parse(POMtemplate).getroot()
     [exec]   File "/usr/lib/python3.2/xml/etree/ElementTree.py", line 1223, in parse
     [exec]     tree.parse(source, parser)
     [exec]   File "/usr/lib/python3.2/xml/etree/ElementTree.py", line 678, in parse
     [exec]     parser.feed(data)
     [exec]   File "/usr/lib/python3.2/xml/etree/ElementTree.py", line 1670, in feed
     [exec]     self._raiseerror(v)
     [exec]   File "/usr/lib/python3.2/xml/etree/ElementTree.py", line 1543, in _raiseerror
     [exec]     raise err
     [exec]   File "<string>", line None
     [exec] xml.etree.ElementTree.ParseError: not well-formed (invalid token): line 1, column 8

BUILD FAILED
<http://sierranevada.servebeer.com/job/Lucene-Solr-40-ReleaseSmoke/ws/build.xml>:279: exec returned: 1

Total time: 21 minutes 57 seconds
Build step 'Invoke Ant' marked build as failure

---------------------------------------------------------------------
To unsubscribe, e-mail: [hidden email]
For additional commands, e-mail: [hidden email]

Reply | Threaded
Open this post in threaded view
|

Build failed in Jenkins: Lucene-Solr-40-ReleaseSmoke #3

Charlie Cron
See <http://sierranevada.servebeer.com/job/Lucene-Solr-40-ReleaseSmoke/3/>

------------------------------------------
[...truncated 43034 lines...]
     [exec]
     [exec] <http://sierranevada.servebeer.com/job/Lucene-Solr-40-ReleaseSmoke/ws/lucene/build/fakeReleaseTmp/unpack/apache-solr-4.0/solr/build/docs/solr-solrj/org/apache/solr/common/cloud/package-summary.html>
     [exec]   no package description (missing package.html in src?)
     [exec]   missing: ClosableThread
     [exec]   missing: OnReconnect
     [exec]   missing: ZkClientConnectionStrategy.ConnectedListener
     [exec]   missing: ZkClientConnectionStrategy.DisconnectedListener
     [exec]   missing: HashPartitioner.Range
     [exec]   missing: Replica
     [exec]   missing: SolrZooKeeper
     [exec]   missing: ZkClientConnectionStrategy
     [exec]   missing: ZkClientConnectionStrategy.ZkUpdate
     [exec]   missing: ZkCmdExecutor
     [exec]   missing: ZkCoreNodeProps
     [exec]   missing: ZkStateReader
     [exec]   missing: ZooKeeperException
     [exec]
     [exec] <http://sierranevada.servebeer.com/job/Lucene-Solr-40-ReleaseSmoke/ws/lucene/build/fakeReleaseTmp/unpack/apache-solr-4.0/solr/build/docs/solr-solrj/org/apache/solr/client/solrj/package-summary.html>
     [exec]   no package description (missing package.html in src?)
     [exec]   missing: ResponseParser
     [exec]   missing: SolrRequest
     [exec]   missing: SolrResponse
     [exec]   missing: SolrServer
     [exec]   missing: SolrQuery.ORDER
     [exec]   missing: SolrRequest.METHOD
     [exec]
     [exec] <http://sierranevada.servebeer.com/job/Lucene-Solr-40-ReleaseSmoke/ws/lucene/build/fakeReleaseTmp/unpack/apache-solr-4.0/solr/build/docs/solr-solrj/org/apache/solr/client/solrj/request/package-summary.html>
     [exec]   no package description (missing package.html in src?)
     [exec]   missing: JavaBinUpdateRequestCodec.StreamingUpdateHandler
     [exec]   missing: AbstractUpdateRequest
     [exec]   missing: CoreAdminRequest.Create
     [exec]   missing: CoreAdminRequest.MergeIndexes
     [exec]   missing: CoreAdminRequest.Persist
     [exec]   missing: CoreAdminRequest.RequestRecovery
     [exec]   missing: CoreAdminRequest.RequestSyncShard
     [exec]   missing: CoreAdminRequest.Unload
     [exec]   missing: CoreAdminRequest.WaitForState
     [exec]   missing: LukeRequest
     [exec]   missing: QueryRequest
     [exec]   missing: SolrPing
     [exec]   missing: UpdateRequest
     [exec]   missing: UpdateRequestExt
     [exec]   missing: AbstractUpdateRequest.ACTION
     [exec]
     [exec] <http://sierranevada.servebeer.com/job/Lucene-Solr-40-ReleaseSmoke/ws/lucene/build/fakeReleaseTmp/unpack/apache-solr-4.0/solr/build/docs/solr-solrj/org/apache/solr/client/solrj/util/package-summary.html>
     [exec]   no package description (missing package.html in src?)
     [exec]   missing: ClientUtils
     [exec]
     [exec] <http://sierranevada.servebeer.com/job/Lucene-Solr-40-ReleaseSmoke/ws/lucene/build/fakeReleaseTmp/unpack/apache-solr-4.0/solr/build/docs/solr-solrj/org/apache/solr/client/solrj/beans/package-summary.html>
     [exec]   no package description (missing package.html in src?)
     [exec]   missing: BindingException
     [exec]   missing: Field
     [exec]
     [exec] <http://sierranevada.servebeer.com/job/Lucene-Solr-40-ReleaseSmoke/ws/lucene/build/fakeReleaseTmp/unpack/apache-solr-4.0/solr/build/docs/solr-solrj/org/apache/solr/client/solrj/response/package-summary.html>
     [exec]   no package description (missing package.html in src?)
     [exec]   missing: CoreAdminResponse
     [exec]   missing: FacetField.Count
     [exec]   missing: LukeResponse.FieldInfo
     [exec]   missing: LukeResponse.FieldTypeInfo
     [exec]   missing: PivotField
     [exec]   missing: QueryResponse
     [exec]   missing: RangeFacet.Count
     [exec]   missing: RangeFacet.Date
     [exec]   missing: RangeFacet.Numeric
     [exec]   missing: SolrPingResponse
     [exec]   missing: SolrResponseBase
     [exec]   missing: SpellCheckResponse.Suggestion
     [exec]   missing: TermsResponse.Term
     [exec]
     [exec] <http://sierranevada.servebeer.com/job/Lucene-Solr-40-ReleaseSmoke/ws/lucene/build/fakeReleaseTmp/unpack/apache-solr-4.0/solr/build/docs/solr-solrj/org/apache/solr/client/solrj/impl/package-summary.html>
     [exec]   no package description (missing package.html in src?)
     [exec]   missing: BinaryResponseParser
     [exec]   missing: HttpSolrServer
     [exec]   missing: LBHttpSolrServer.Req
     [exec]   missing: LBHttpSolrServer.Rsp
     [exec]   missing: XMLResponseParser
     [exec]   missing: XMLResponseParser.KnownType
     [exec]
     [exec] <http://sierranevada.servebeer.com/job/Lucene-Solr-40-ReleaseSmoke/ws/lucene/build/fakeReleaseTmp/unpack/apache-solr-4.0/solr/build/docs/solr-solrj/org/apache/noggit/package-summary.html>
     [exec]   no package description (missing package.html in src?)
     [exec]   missing: CharArr
     [exec]   missing: CharUtil
     [exec]   missing: JSONParser
     [exec]   missing: JSONUtil
     [exec]   missing: JSONWriter
     [exec]   missing: ObjectBuilder
     [exec]   missing: JSONParser.ParseException
     [exec]
     [exec] <http://sierranevada.servebeer.com/job/Lucene-Solr-40-ReleaseSmoke/ws/lucene/build/fakeReleaseTmp/unpack/apache-solr-4.0/solr/build/docs/solr-uima/overview-summary.html>
     [exec]   missing: org.apache.solr.uima.processor
     [exec]   missing: org.apache.solr.uima.processor.exception
     [exec]
     [exec] <http://sierranevada.servebeer.com/job/Lucene-Solr-40-ReleaseSmoke/ws/lucene/build/fakeReleaseTmp/unpack/apache-solr-4.0/solr/build/docs/solr-uima/org/apache/solr/uima/processor/package-summary.html>
     [exec]   no package description (missing package.html in src?)
     [exec]
     [exec] <http://sierranevada.servebeer.com/job/Lucene-Solr-40-ReleaseSmoke/ws/lucene/build/fakeReleaseTmp/unpack/apache-solr-4.0/solr/build/docs/solr-uima/org/apache/solr/uima/processor/exception/package-summary.html>
     [exec]   no package description (missing package.html in src?)
     [exec]
     [exec] <http://sierranevada.servebeer.com/job/Lucene-Solr-40-ReleaseSmoke/ws/lucene/build/fakeReleaseTmp/unpack/apache-solr-4.0/solr/build/docs/solr-dataimporthandler/overview-summary.html>
     [exec]   missing: org.apache.solr.handler.dataimport
     [exec]   missing: org.apache.solr.handler.dataimport.config
     [exec]
     [exec] <http://sierranevada.servebeer.com/job/Lucene-Solr-40-ReleaseSmoke/ws/lucene/build/fakeReleaseTmp/unpack/apache-solr-4.0/solr/build/docs/solr-dataimporthandler/org/apache/solr/handler/dataimport/package-summary.html>
     [exec]   no package description (missing package.html in src?)
     [exec]   missing: DIHPropertiesWriter
     [exec]   missing: DIHWriter
     [exec]   missing: CachePropertyUtil
     [exec]   missing: ConfigParseUtil
     [exec]   missing: DebugInfo
     [exec]   missing: DIHCacheSupport
     [exec]   missing: DIHWriterBase
     [exec]   missing: DocBuilder.Statistics
     [exec]   missing: EvaluatorBag.VariableWrapper
     [exec]   missing: RequestInfo
     [exec]   missing: SimplePropertiesWriter
     [exec]   missing: SortedMapBackedCache
     [exec]   missing: ZKPropertiesWriter
     [exec]   missing: DataImporter.Status
     [exec]   missing: DIHLogLevels
     [exec]
     [exec] <http://sierranevada.servebeer.com/job/Lucene-Solr-40-ReleaseSmoke/ws/lucene/build/fakeReleaseTmp/unpack/apache-solr-4.0/solr/build/docs/solr-dataimporthandler/org/apache/solr/handler/dataimport/config/package-summary.html>
     [exec]   no package description (missing package.html in src?)
     [exec]   missing: ConfigNameConstants
     [exec]   missing: ConfigParseUtil
     [exec]   missing: Entity
     [exec]   missing: EntityField
     [exec]   missing: EntityField.Builder
     [exec]   missing: Field
     [exec]   missing: Field.Builder
     [exec]   missing: Script
     [exec]
     [exec] <http://sierranevada.servebeer.com/job/Lucene-Solr-40-ReleaseSmoke/ws/lucene/build/fakeReleaseTmp/unpack/apache-solr-4.0/solr/build/docs/solr-cell/overview-summary.html>
     [exec]   missing: org.apache.solr.handler.extraction
     [exec]
     [exec] <http://sierranevada.servebeer.com/job/Lucene-Solr-40-ReleaseSmoke/ws/lucene/build/fakeReleaseTmp/unpack/apache-solr-4.0/solr/build/docs/solr-cell/org/apache/solr/handler/extraction/package-summary.html>
     [exec]   no package description (missing package.html in src?)
     [exec]   missing: SolrContentHandlerFactory
     [exec]
     [exec] <http://sierranevada.servebeer.com/job/Lucene-Solr-40-ReleaseSmoke/ws/lucene/build/fakeReleaseTmp/unpack/apache-solr-4.0/solr/build/docs/solr-test-framework/overview-summary.html>
     [exec]   missing: org.apache.solr
     [exec]   missing: org.apache.solr.analysis
     [exec]   missing: org.apache.solr.cloud
     [exec]   missing: org.apache.solr.core
     [exec]   missing: org.apache.solr.update.processor
     [exec]   missing: org.apache.solr.util
     [exec]
     [exec] <http://sierranevada.servebeer.com/job/Lucene-Solr-40-ReleaseSmoke/ws/lucene/build/fakeReleaseTmp/unpack/apache-solr-4.0/solr/build/docs/solr-test-framework/org/apache/solr/package-summary.html>
     [exec]   no package description (missing package.html in src?)
     [exec]   missing: BaseDistributedSearchTestCase.RandDate
     [exec]   missing: BaseDistributedSearchTestCase.RandVal
     [exec]   missing: JSONTestUtil
     [exec]   missing: SolrJettyTestBase
     [exec]   missing: SolrTestCaseJ4.Doc
     [exec]   missing: SolrTestCaseJ4.Fld
     [exec]   missing: SolrTestCaseJ4.FVal
     [exec]   missing: SolrTestCaseJ4.IRange
     [exec]   missing: SolrTestCaseJ4.IVals
     [exec]   missing: SolrTestCaseJ4.SVal
     [exec]   missing: SolrTestCaseJ4.Vals
     [exec]
     [exec] <http://sierranevada.servebeer.com/job/Lucene-Solr-40-ReleaseSmoke/ws/lucene/build/fakeReleaseTmp/unpack/apache-solr-4.0/solr/build/docs/solr-test-framework/org/apache/solr/util/package-summary.html>
     [exec]   no package description (missing package.html in src?)
     [exec]   missing: DOMUtilTestBase
     [exec]   missing: RevertDefaultThreadHandlerRule
     [exec]
     [exec] <http://sierranevada.servebeer.com/job/Lucene-Solr-40-ReleaseSmoke/ws/lucene/build/fakeReleaseTmp/unpack/apache-solr-4.0/solr/build/docs/solr-test-framework/org/apache/solr/core/package-summary.html>
     [exec]   no package description (missing package.html in src?)
     [exec]
     [exec] <http://sierranevada.servebeer.com/job/Lucene-Solr-40-ReleaseSmoke/ws/lucene/build/fakeReleaseTmp/unpack/apache-solr-4.0/solr/build/docs/solr-test-framework/org/apache/solr/update/processor/package-summary.html>
     [exec]   no package description (missing package.html in src?)
     [exec]   missing: BufferingRequestProcessor
     [exec]
     [exec] <http://sierranevada.servebeer.com/job/Lucene-Solr-40-ReleaseSmoke/ws/lucene/build/fakeReleaseTmp/unpack/apache-solr-4.0/solr/build/docs/solr-test-framework/org/apache/solr/cloud/package-summary.html>
     [exec]   no package description (missing package.html in src?)
     [exec]   missing: AbstractDistribZkTestBase
     [exec]   missing: AbstractFullDistribZkTestBase.CloudJettyRunner
     [exec]   missing: ZkTestServer
     [exec]   missing: ZkTestServer.HostPort
     [exec]
     [exec] <http://sierranevada.servebeer.com/job/Lucene-Solr-40-ReleaseSmoke/ws/lucene/build/fakeReleaseTmp/unpack/apache-solr-4.0/solr/build/docs/solr-test-framework/org/apache/solr/analysis/package-summary.html>
     [exec]   no package description (missing package.html in src?)
     [exec]
     [exec] <http://sierranevada.servebeer.com/job/Lucene-Solr-40-ReleaseSmoke/ws/lucene/build/fakeReleaseTmp/unpack/apache-solr-4.0/solr/build/docs/solr-dataimporthandler-extras/overview-summary.html>
     [exec]   missing: org.apache.solr.handler.dataimport
     [exec]
     [exec] <http://sierranevada.servebeer.com/job/Lucene-Solr-40-ReleaseSmoke/ws/lucene/build/fakeReleaseTmp/unpack/apache-solr-4.0/solr/build/docs/solr-dataimporthandler-extras/org/apache/solr/handler/dataimport/package-summary.html>
     [exec]   no package description (missing package.html in src?)
     [exec]   missing: MailEntityProcessor.CustomFilter
     [exec]
     [exec] ***WARNING***: javadocs want to fail!
     [exec]
     [exec]
     [exec] Crawl/parse...
     [exec]
     [exec] Verify...
     [exec]     test solr example w/ Java 6...
     [exec]       start Solr instance (log=<http://sierranevada.servebeer.com/job/Lucene-Solr-40-ReleaseSmoke/ws/lucene/build/fakeReleaseTmp/unpack/apache-solr-4.0/solr-example.log)...>
     [exec]       startup done
     [exec]       test utf8...
     [exec]       index example docs...
     [exec]       run query...
     [exec]       stop server (SIGINT)...
     [exec]     test solr example w/ Java 7...
     [exec]       start Solr instance (log=<http://sierranevada.servebeer.com/job/Lucene-Solr-40-ReleaseSmoke/ws/lucene/build/fakeReleaseTmp/unpack/apache-solr-4.0/solr-example.log)...>
     [exec]       startup done
     [exec]       test utf8...
     [exec]       index example docs...
     [exec]       run query...
     [exec]       stop server (SIGINT)...
     [exec]     check NOTICE
     [exec] Test Maven artifacts for Lucene and Solr...
     [exec]     get POM templates ...................................................
     [exec]     download artifacts ........................................................................................................................................................................................................................................................................................................................................................................................................................................................................................................................................................................
     [exec]     verify that each binary artifact has a deployed POM...
     [exec]     verify that there is an artifact for each POM template...
     [exec] Traceback (most recent call last):
     [exec]   File "/usr/lib/python3.2/xml/etree/ElementTree.py", line 1668, in feed
     [exec]     self._parser.Parse(data, 0)
     [exec] xml.parsers.expat.ExpatError: not well-formed (invalid token): line 1, column 8
     [exec]
     [exec] During handling of the above exception, another exception occurred:
     [exec]
     [exec] Traceback (most recent call last):
     [exec]   File "dev-tools/scripts/smokeTestRelease.py", line 1107, in <module>
     [exec]     main()
     [exec]   File "dev-tools/scripts/smokeTestRelease.py", line 1057, in main
     [exec]     smokeTest(baseURL, version, tmpDir, isSigned)
     [exec]   File "dev-tools/scripts/smokeTestRelease.py", line 1103, in smokeTest
     [exec]     checkMaven(baseURL, tmpDir, version, isSigned)
     [exec]   File "dev-tools/scripts/smokeTestRelease.py", line 688, in checkMaven
     [exec]     verifyArtifactPerPOMtemplate(POMtemplates, artifacts, tmpDir, version)
     [exec]   File "dev-tools/scripts/smokeTestRelease.py", line 985, in verifyArtifactPerPOMtemplate
     [exec]     treeRoot = ET.parse(POMtemplate).getroot()
     [exec]   File "/usr/lib/python3.2/xml/etree/ElementTree.py", line 1223, in parse
     [exec]     tree.parse(source, parser)
     [exec]   File "/usr/lib/python3.2/xml/etree/ElementTree.py", line 678, in parse
     [exec]     parser.feed(data)
     [exec]   File "/usr/lib/python3.2/xml/etree/ElementTree.py", line 1670, in feed
     [exec]     self._raiseerror(v)
     [exec]   File "/usr/lib/python3.2/xml/etree/ElementTree.py", line 1543, in _raiseerror
     [exec]     raise err
     [exec]   File "<string>", line None
     [exec] xml.etree.ElementTree.ParseError: not well-formed (invalid token): line 1, column 8

BUILD FAILED
<http://sierranevada.servebeer.com/job/Lucene-Solr-40-ReleaseSmoke/ws/build.xml>:279: exec returned: 1

Total time: 22 minutes 2 seconds
Build step 'Invoke Ant' marked build as failure

---------------------------------------------------------------------
To unsubscribe, e-mail: [hidden email]
For additional commands, e-mail: [hidden email]

Reply | Threaded
Open this post in threaded view
|

Build failed in Jenkins: Lucene-Solr-40-ReleaseSmoke #4

Charlie Cron
See <http://sierranevada.servebeer.com/job/Lucene-Solr-40-ReleaseSmoke/4/>

------------------------------------------
[...truncated 43034 lines...]
     [exec]
     [exec] <http://sierranevada.servebeer.com/job/Lucene-Solr-40-ReleaseSmoke/ws/lucene/build/fakeReleaseTmp/unpack/apache-solr-4.0/solr/build/docs/solr-solrj/org/apache/solr/common/cloud/package-summary.html>
     [exec]   no package description (missing package.html in src?)
     [exec]   missing: ClosableThread
     [exec]   missing: OnReconnect
     [exec]   missing: ZkClientConnectionStrategy.ConnectedListener
     [exec]   missing: ZkClientConnectionStrategy.DisconnectedListener
     [exec]   missing: HashPartitioner.Range
     [exec]   missing: Replica
     [exec]   missing: SolrZooKeeper
     [exec]   missing: ZkClientConnectionStrategy
     [exec]   missing: ZkClientConnectionStrategy.ZkUpdate
     [exec]   missing: ZkCmdExecutor
     [exec]   missing: ZkCoreNodeProps
     [exec]   missing: ZkStateReader
     [exec]   missing: ZooKeeperException
     [exec]
     [exec] <http://sierranevada.servebeer.com/job/Lucene-Solr-40-ReleaseSmoke/ws/lucene/build/fakeReleaseTmp/unpack/apache-solr-4.0/solr/build/docs/solr-solrj/org/apache/solr/client/solrj/package-summary.html>
     [exec]   no package description (missing package.html in src?)
     [exec]   missing: ResponseParser
     [exec]   missing: SolrRequest
     [exec]   missing: SolrResponse
     [exec]   missing: SolrServer
     [exec]   missing: SolrQuery.ORDER
     [exec]   missing: SolrRequest.METHOD
     [exec]
     [exec] <http://sierranevada.servebeer.com/job/Lucene-Solr-40-ReleaseSmoke/ws/lucene/build/fakeReleaseTmp/unpack/apache-solr-4.0/solr/build/docs/solr-solrj/org/apache/solr/client/solrj/request/package-summary.html>
     [exec]   no package description (missing package.html in src?)
     [exec]   missing: JavaBinUpdateRequestCodec.StreamingUpdateHandler
     [exec]   missing: AbstractUpdateRequest
     [exec]   missing: CoreAdminRequest.Create
     [exec]   missing: CoreAdminRequest.MergeIndexes
     [exec]   missing: CoreAdminRequest.Persist
     [exec]   missing: CoreAdminRequest.RequestRecovery
     [exec]   missing: CoreAdminRequest.RequestSyncShard
     [exec]   missing: CoreAdminRequest.Unload
     [exec]   missing: CoreAdminRequest.WaitForState
     [exec]   missing: LukeRequest
     [exec]   missing: QueryRequest
     [exec]   missing: SolrPing
     [exec]   missing: UpdateRequest
     [exec]   missing: UpdateRequestExt
     [exec]   missing: AbstractUpdateRequest.ACTION
     [exec]
     [exec] <http://sierranevada.servebeer.com/job/Lucene-Solr-40-ReleaseSmoke/ws/lucene/build/fakeReleaseTmp/unpack/apache-solr-4.0/solr/build/docs/solr-solrj/org/apache/solr/client/solrj/util/package-summary.html>
     [exec]   no package description (missing package.html in src?)
     [exec]   missing: ClientUtils
     [exec]
     [exec] <http://sierranevada.servebeer.com/job/Lucene-Solr-40-ReleaseSmoke/ws/lucene/build/fakeReleaseTmp/unpack/apache-solr-4.0/solr/build/docs/solr-solrj/org/apache/solr/client/solrj/beans/package-summary.html>
     [exec]   no package description (missing package.html in src?)
     [exec]   missing: BindingException
     [exec]   missing: Field
     [exec]
     [exec] <http://sierranevada.servebeer.com/job/Lucene-Solr-40-ReleaseSmoke/ws/lucene/build/fakeReleaseTmp/unpack/apache-solr-4.0/solr/build/docs/solr-solrj/org/apache/solr/client/solrj/response/package-summary.html>
     [exec]   no package description (missing package.html in src?)
     [exec]   missing: CoreAdminResponse
     [exec]   missing: FacetField.Count
     [exec]   missing: LukeResponse.FieldInfo
     [exec]   missing: LukeResponse.FieldTypeInfo
     [exec]   missing: PivotField
     [exec]   missing: QueryResponse
     [exec]   missing: RangeFacet.Count
     [exec]   missing: RangeFacet.Date
     [exec]   missing: RangeFacet.Numeric
     [exec]   missing: SolrPingResponse
     [exec]   missing: SolrResponseBase
     [exec]   missing: SpellCheckResponse.Suggestion
     [exec]   missing: TermsResponse.Term
     [exec]
     [exec] <http://sierranevada.servebeer.com/job/Lucene-Solr-40-ReleaseSmoke/ws/lucene/build/fakeReleaseTmp/unpack/apache-solr-4.0/solr/build/docs/solr-solrj/org/apache/solr/client/solrj/impl/package-summary.html>
     [exec]   no package description (missing package.html in src?)
     [exec]   missing: BinaryResponseParser
     [exec]   missing: HttpSolrServer
     [exec]   missing: LBHttpSolrServer.Req
     [exec]   missing: LBHttpSolrServer.Rsp
     [exec]   missing: XMLResponseParser
     [exec]   missing: XMLResponseParser.KnownType
     [exec]
     [exec] <http://sierranevada.servebeer.com/job/Lucene-Solr-40-ReleaseSmoke/ws/lucene/build/fakeReleaseTmp/unpack/apache-solr-4.0/solr/build/docs/solr-solrj/org/apache/noggit/package-summary.html>
     [exec]   no package description (missing package.html in src?)
     [exec]   missing: CharArr
     [exec]   missing: CharUtil
     [exec]   missing: JSONParser
     [exec]   missing: JSONUtil
     [exec]   missing: JSONWriter
     [exec]   missing: ObjectBuilder
     [exec]   missing: JSONParser.ParseException
     [exec]
     [exec] <http://sierranevada.servebeer.com/job/Lucene-Solr-40-ReleaseSmoke/ws/lucene/build/fakeReleaseTmp/unpack/apache-solr-4.0/solr/build/docs/solr-uima/overview-summary.html>
     [exec]   missing: org.apache.solr.uima.processor
     [exec]   missing: org.apache.solr.uima.processor.exception
     [exec]
     [exec] <http://sierranevada.servebeer.com/job/Lucene-Solr-40-ReleaseSmoke/ws/lucene/build/fakeReleaseTmp/unpack/apache-solr-4.0/solr/build/docs/solr-uima/org/apache/solr/uima/processor/package-summary.html>
     [exec]   no package description (missing package.html in src?)
     [exec]
     [exec] <http://sierranevada.servebeer.com/job/Lucene-Solr-40-ReleaseSmoke/ws/lucene/build/fakeReleaseTmp/unpack/apache-solr-4.0/solr/build/docs/solr-uima/org/apache/solr/uima/processor/exception/package-summary.html>
     [exec]   no package description (missing package.html in src?)
     [exec]
     [exec] <http://sierranevada.servebeer.com/job/Lucene-Solr-40-ReleaseSmoke/ws/lucene/build/fakeReleaseTmp/unpack/apache-solr-4.0/solr/build/docs/solr-dataimporthandler/overview-summary.html>
     [exec]   missing: org.apache.solr.handler.dataimport
     [exec]   missing: org.apache.solr.handler.dataimport.config
     [exec]
     [exec] <http://sierranevada.servebeer.com/job/Lucene-Solr-40-ReleaseSmoke/ws/lucene/build/fakeReleaseTmp/unpack/apache-solr-4.0/solr/build/docs/solr-dataimporthandler/org/apache/solr/handler/dataimport/package-summary.html>
     [exec]   no package description (missing package.html in src?)
     [exec]   missing: DIHPropertiesWriter
     [exec]   missing: DIHWriter
     [exec]   missing: CachePropertyUtil
     [exec]   missing: ConfigParseUtil
     [exec]   missing: DebugInfo
     [exec]   missing: DIHCacheSupport
     [exec]   missing: DIHWriterBase
     [exec]   missing: DocBuilder.Statistics
     [exec]   missing: EvaluatorBag.VariableWrapper
     [exec]   missing: RequestInfo
     [exec]   missing: SimplePropertiesWriter
     [exec]   missing: SortedMapBackedCache
     [exec]   missing: ZKPropertiesWriter
     [exec]   missing: DataImporter.Status
     [exec]   missing: DIHLogLevels
     [exec]
     [exec] <http://sierranevada.servebeer.com/job/Lucene-Solr-40-ReleaseSmoke/ws/lucene/build/fakeReleaseTmp/unpack/apache-solr-4.0/solr/build/docs/solr-dataimporthandler/org/apache/solr/handler/dataimport/config/package-summary.html>
     [exec]   no package description (missing package.html in src?)
     [exec]   missing: ConfigNameConstants
     [exec]   missing: ConfigParseUtil
     [exec]   missing: Entity
     [exec]   missing: EntityField
     [exec]   missing: EntityField.Builder
     [exec]   missing: Field
     [exec]   missing: Field.Builder
     [exec]   missing: Script
     [exec]
     [exec] <http://sierranevada.servebeer.com/job/Lucene-Solr-40-ReleaseSmoke/ws/lucene/build/fakeReleaseTmp/unpack/apache-solr-4.0/solr/build/docs/solr-cell/overview-summary.html>
     [exec]   missing: org.apache.solr.handler.extraction
     [exec]
     [exec] <http://sierranevada.servebeer.com/job/Lucene-Solr-40-ReleaseSmoke/ws/lucene/build/fakeReleaseTmp/unpack/apache-solr-4.0/solr/build/docs/solr-cell/org/apache/solr/handler/extraction/package-summary.html>
     [exec]   no package description (missing package.html in src?)
     [exec]   missing: SolrContentHandlerFactory
     [exec]
     [exec] <http://sierranevada.servebeer.com/job/Lucene-Solr-40-ReleaseSmoke/ws/lucene/build/fakeReleaseTmp/unpack/apache-solr-4.0/solr/build/docs/solr-test-framework/overview-summary.html>
     [exec]   missing: org.apache.solr
     [exec]   missing: org.apache.solr.analysis
     [exec]   missing: org.apache.solr.cloud
     [exec]   missing: org.apache.solr.core
     [exec]   missing: org.apache.solr.update.processor
     [exec]   missing: org.apache.solr.util
     [exec]
     [exec] <http://sierranevada.servebeer.com/job/Lucene-Solr-40-ReleaseSmoke/ws/lucene/build/fakeReleaseTmp/unpack/apache-solr-4.0/solr/build/docs/solr-test-framework/org/apache/solr/package-summary.html>
     [exec]   no package description (missing package.html in src?)
     [exec]   missing: BaseDistributedSearchTestCase.RandDate
     [exec]   missing: BaseDistributedSearchTestCase.RandVal
     [exec]   missing: JSONTestUtil
     [exec]   missing: SolrJettyTestBase
     [exec]   missing: SolrTestCaseJ4.Doc
     [exec]   missing: SolrTestCaseJ4.Fld
     [exec]   missing: SolrTestCaseJ4.FVal
     [exec]   missing: SolrTestCaseJ4.IRange
     [exec]   missing: SolrTestCaseJ4.IVals
     [exec]   missing: SolrTestCaseJ4.SVal
     [exec]   missing: SolrTestCaseJ4.Vals
     [exec]
     [exec] <http://sierranevada.servebeer.com/job/Lucene-Solr-40-ReleaseSmoke/ws/lucene/build/fakeReleaseTmp/unpack/apache-solr-4.0/solr/build/docs/solr-test-framework/org/apache/solr/util/package-summary.html>
     [exec]   no package description (missing package.html in src?)
     [exec]   missing: DOMUtilTestBase
     [exec]   missing: RevertDefaultThreadHandlerRule
     [exec]
     [exec] <http://sierranevada.servebeer.com/job/Lucene-Solr-40-ReleaseSmoke/ws/lucene/build/fakeReleaseTmp/unpack/apache-solr-4.0/solr/build/docs/solr-test-framework/org/apache/solr/core/package-summary.html>
     [exec]   no package description (missing package.html in src?)
     [exec]
     [exec] <http://sierranevada.servebeer.com/job/Lucene-Solr-40-ReleaseSmoke/ws/lucene/build/fakeReleaseTmp/unpack/apache-solr-4.0/solr/build/docs/solr-test-framework/org/apache/solr/update/processor/package-summary.html>
     [exec]   no package description (missing package.html in src?)
     [exec]   missing: BufferingRequestProcessor
     [exec]
     [exec] <http://sierranevada.servebeer.com/job/Lucene-Solr-40-ReleaseSmoke/ws/lucene/build/fakeReleaseTmp/unpack/apache-solr-4.0/solr/build/docs/solr-test-framework/org/apache/solr/cloud/package-summary.html>
     [exec]   no package description (missing package.html in src?)
     [exec]   missing: AbstractDistribZkTestBase
     [exec]   missing: AbstractFullDistribZkTestBase.CloudJettyRunner
     [exec]   missing: ZkTestServer
     [exec]   missing: ZkTestServer.HostPort
     [exec]
     [exec] <http://sierranevada.servebeer.com/job/Lucene-Solr-40-ReleaseSmoke/ws/lucene/build/fakeReleaseTmp/unpack/apache-solr-4.0/solr/build/docs/solr-test-framework/org/apache/solr/analysis/package-summary.html>
     [exec]   no package description (missing package.html in src?)
     [exec]
     [exec] <http://sierranevada.servebeer.com/job/Lucene-Solr-40-ReleaseSmoke/ws/lucene/build/fakeReleaseTmp/unpack/apache-solr-4.0/solr/build/docs/solr-dataimporthandler-extras/overview-summary.html>
     [exec]   missing: org.apache.solr.handler.dataimport
     [exec]
     [exec] <http://sierranevada.servebeer.com/job/Lucene-Solr-40-ReleaseSmoke/ws/lucene/build/fakeReleaseTmp/unpack/apache-solr-4.0/solr/build/docs/solr-dataimporthandler-extras/org/apache/solr/handler/dataimport/package-summary.html>
     [exec]   no package description (missing package.html in src?)
     [exec]   missing: MailEntityProcessor.CustomFilter
     [exec]
     [exec] ***WARNING***: javadocs want to fail!
     [exec]
     [exec]
     [exec] Crawl/parse...
     [exec]
     [exec] Verify...
     [exec]     test solr example w/ Java 6...
     [exec]       start Solr instance (log=<http://sierranevada.servebeer.com/job/Lucene-Solr-40-ReleaseSmoke/ws/lucene/build/fakeReleaseTmp/unpack/apache-solr-4.0/solr-example.log)...>
     [exec]       startup done
     [exec]       test utf8...
     [exec]       index example docs...
     [exec]       run query...
     [exec]       stop server (SIGINT)...
     [exec]     test solr example w/ Java 7...
     [exec]       start Solr instance (log=<http://sierranevada.servebeer.com/job/Lucene-Solr-40-ReleaseSmoke/ws/lucene/build/fakeReleaseTmp/unpack/apache-solr-4.0/solr-example.log)...>
     [exec]       startup done
     [exec]       test utf8...
     [exec]       index example docs...
     [exec]       run query...
     [exec]       stop server (SIGINT)...
     [exec]     check NOTICE
     [exec] Test Maven artifacts for Lucene and Solr...
     [exec]     get POM templates ...................................................
     [exec] Traceback (most recent call last):
     [exec]   File "/usr/lib/python3.2/xml/etree/ElementTree.py", line 1668, in feed
     [exec]     self._parser.Parse(data, 0)
     [exec] xml.parsers.expat.ExpatError: not well-formed (invalid token): line 1, column 8
     [exec]
     [exec] During handling of the above exception, another exception occurred:
     [exec]
     [exec] Traceback (most recent call last):
     [exec]   File "dev-tools/scripts/smokeTestRelease.py", line 1107, in <module>
     [exec]     main()
     [exec]   File "dev-tools/scripts/smokeTestRelease.py", line 1057, in main
     [exec]     smokeTest(baseURL, version, tmpDir, isSigned)
     [exec]   File "dev-tools/scripts/smokeTestRelease.py", line 1103, in smokeTest
     [exec]     checkMaven(baseURL, tmpDir, version, isSigned)
     [exec]   File "dev-tools/scripts/smokeTestRelease.py", line 688, in checkMaven
     [exec]     verifyArtifactPerPOMtemplate(POMtemplates, artifacts, tmpDir, version)
     [exec]   File "dev-tools/scripts/smokeTestRelease.py", line 985, in verifyArtifactPerPOMtemplate
     [exec]     treeRoot = ET.parse(POMtemplate).getroot()
     [exec]   File "/usr/lib/python3.2/xml/etree/ElementTree.py", line 1223, in parse
     [exec]     tree.parse(source, parser)
     [exec]   File "/usr/lib/python3.2/xml/etree/ElementTree.py", line 678, in parse
     [exec]     parser.feed(data)
     [exec]   File "/usr/lib/python3.2/xml/etree/ElementTree.py", line 1670, in feed
     [exec]     self._raiseerror(v)
     [exec]   File "/usr/lib/python3.2/xml/etree/ElementTree.py", line 1543, in _raiseerror
     [exec]     raise err
     [exec]   File "<string>", line None
     [exec] xml.etree.ElementTree.ParseError: not well-formed (invalid token): line 1, column 8
     [exec]     download artifacts ........................................................................................................................................................................................................................................................................................................................................................................................................................................................................................................................................................................
     [exec]     verify that each binary artifact has a deployed POM...
     [exec]     verify that there is an artifact for each POM template...

BUILD FAILED
<http://sierranevada.servebeer.com/job/Lucene-Solr-40-ReleaseSmoke/ws/build.xml>:279: exec returned: 1

Total time: 21 minutes 35 seconds
Build step 'Invoke Ant' marked build as failure

---------------------------------------------------------------------
To unsubscribe, e-mail: [hidden email]
For additional commands, e-mail: [hidden email]

Reply | Threaded
Open this post in threaded view
|

Re: Build failed in Jenkins: Lucene-Solr-40-ReleaseSmoke #3

Robert Muir
In reply to this post by Charlie Cron
I have no idea about what this is, or what is going on here.

On Sat, Sep 22, 2012 at 10:41 AM,  <[hidden email]> wrote:

>      [exec] Test Maven artifacts for Lucene and Solr...
>      [exec]     get POM templates ...................................................
>      [exec]     download artifacts ........................................................................................................................................................................................................................................................................................................................................................................................................................................................................................................................................................................
>      [exec]     verify that each binary artifact has a deployed POM...
>      [exec]     verify that there is an artifact for each POM template...
>      [exec] Traceback (most recent call last):
>      [exec]   File "/usr/lib/python3.2/xml/etree/ElementTree.py", line 1668, in feed
>      [exec]     self._parser.Parse(data, 0)
>      [exec] xml.parsers.expat.ExpatError: not well-formed (invalid token): line 1, column 8
>      [exec]
>      [exec] During handling of the above exception, another exception occurred:
>      [exec]
>      [exec] Traceback (most recent call last):
>      [exec]   File "dev-tools/scripts/smokeTestRelease.py", line 1107, in <module>
>      [exec]     main()
>      [exec]   File "dev-tools/scripts/smokeTestRelease.py", line 1057, in main
>      [exec]     smokeTest(baseURL, version, tmpDir, isSigned)
>      [exec]   File "dev-tools/scripts/smokeTestRelease.py", line 1103, in smokeTest
>      [exec]     checkMaven(baseURL, tmpDir, version, isSigned)
>      [exec]   File "dev-tools/scripts/smokeTestRelease.py", line 688, in checkMaven
>      [exec]     verifyArtifactPerPOMtemplate(POMtemplates, artifacts, tmpDir, version)
>      [exec]   File "dev-tools/scripts/smokeTestRelease.py", line 985, in verifyArtifactPerPOMtemplate
>      [exec]     treeRoot = ET.parse(POMtemplate).getroot()
>      [exec]   File "/usr/lib/python3.2/xml/etree/ElementTree.py", line 1223, in parse
>      [exec]     tree.parse(source, parser)
>      [exec]   File "/usr/lib/python3.2/xml/etree/ElementTree.py", line 678, in parse
>      [exec]     parser.feed(data)
>      [exec]   File "/usr/lib/python3.2/xml/etree/ElementTree.py", line 1670, in feed
>      [exec]     self._raiseerror(v)
>      [exec]   File "/usr/lib/python3.2/xml/etree/ElementTree.py", line 1543, in _raiseerror
>      [exec]     raise err
>      [exec]   File "<string>", line None
>      [exec] xml.etree.ElementTree.ParseError: not well-formed (invalid token): line 1, column 8
>
> BUILD FAILED
> <http://sierranevada.servebeer.com/job/Lucene-Solr-40-ReleaseSmoke/ws/build.xml>:279: exec returned: 1
>
> Total time: 22 minutes 2 seconds
> Build step 'Invoke Ant' marked build as failure
>
> ---------------------------------------------------------------------
> To unsubscribe, e-mail: [hidden email]
> For additional commands, e-mail: [hidden email]
>



--
lucidworks.com

---------------------------------------------------------------------
To unsubscribe, e-mail: [hidden email]
For additional commands, e-mail: [hidden email]

Reply | Threaded
Open this post in threaded view
|

Build failed in Jenkins: Lucene-Solr-40-ReleaseSmoke #5

Charlie Cron
In reply to this post by Charlie Cron
See <http://sierranevada.servebeer.com/job/Lucene-Solr-40-ReleaseSmoke/5/>

------------------------------------------
[...truncated 43034 lines...]
     [exec]
     [exec] <http://sierranevada.servebeer.com/job/Lucene-Solr-40-ReleaseSmoke/ws/lucene/build/fakeReleaseTmp/unpack/apache-solr-4.0/solr/build/docs/solr-solrj/org/apache/solr/common/cloud/package-summary.html>
     [exec]   no package description (missing package.html in src?)
     [exec]   missing: ClosableThread
     [exec]   missing: OnReconnect
     [exec]   missing: ZkClientConnectionStrategy.ConnectedListener
     [exec]   missing: ZkClientConnectionStrategy.DisconnectedListener
     [exec]   missing: HashPartitioner.Range
     [exec]   missing: Replica
     [exec]   missing: SolrZooKeeper
     [exec]   missing: ZkClientConnectionStrategy
     [exec]   missing: ZkClientConnectionStrategy.ZkUpdate
     [exec]   missing: ZkCmdExecutor
     [exec]   missing: ZkCoreNodeProps
     [exec]   missing: ZkStateReader
     [exec]   missing: ZooKeeperException
     [exec]
     [exec] <http://sierranevada.servebeer.com/job/Lucene-Solr-40-ReleaseSmoke/ws/lucene/build/fakeReleaseTmp/unpack/apache-solr-4.0/solr/build/docs/solr-solrj/org/apache/solr/client/solrj/package-summary.html>
     [exec]   no package description (missing package.html in src?)
     [exec]   missing: ResponseParser
     [exec]   missing: SolrRequest
     [exec]   missing: SolrResponse
     [exec]   missing: SolrServer
     [exec]   missing: SolrQuery.ORDER
     [exec]   missing: SolrRequest.METHOD
     [exec]
     [exec] <http://sierranevada.servebeer.com/job/Lucene-Solr-40-ReleaseSmoke/ws/lucene/build/fakeReleaseTmp/unpack/apache-solr-4.0/solr/build/docs/solr-solrj/org/apache/solr/client/solrj/request/package-summary.html>
     [exec]   no package description (missing package.html in src?)
     [exec]   missing: JavaBinUpdateRequestCodec.StreamingUpdateHandler
     [exec]   missing: AbstractUpdateRequest
     [exec]   missing: CoreAdminRequest.Create
     [exec]   missing: CoreAdminRequest.MergeIndexes
     [exec]   missing: CoreAdminRequest.Persist
     [exec]   missing: CoreAdminRequest.RequestRecovery
     [exec]   missing: CoreAdminRequest.RequestSyncShard
     [exec]   missing: CoreAdminRequest.Unload
     [exec]   missing: CoreAdminRequest.WaitForState
     [exec]   missing: LukeRequest
     [exec]   missing: QueryRequest
     [exec]   missing: SolrPing
     [exec]   missing: UpdateRequest
     [exec]   missing: UpdateRequestExt
     [exec]   missing: AbstractUpdateRequest.ACTION
     [exec]
     [exec] <http://sierranevada.servebeer.com/job/Lucene-Solr-40-ReleaseSmoke/ws/lucene/build/fakeReleaseTmp/unpack/apache-solr-4.0/solr/build/docs/solr-solrj/org/apache/solr/client/solrj/util/package-summary.html>
     [exec]   no package description (missing package.html in src?)
     [exec]   missing: ClientUtils
     [exec]
     [exec] <http://sierranevada.servebeer.com/job/Lucene-Solr-40-ReleaseSmoke/ws/lucene/build/fakeReleaseTmp/unpack/apache-solr-4.0/solr/build/docs/solr-solrj/org/apache/solr/client/solrj/beans/package-summary.html>
     [exec]   no package description (missing package.html in src?)
     [exec]   missing: BindingException
     [exec]   missing: Field
     [exec]
     [exec] <http://sierranevada.servebeer.com/job/Lucene-Solr-40-ReleaseSmoke/ws/lucene/build/fakeReleaseTmp/unpack/apache-solr-4.0/solr/build/docs/solr-solrj/org/apache/solr/client/solrj/response/package-summary.html>
     [exec]   no package description (missing package.html in src?)
     [exec]   missing: CoreAdminResponse
     [exec]   missing: FacetField.Count
     [exec]   missing: LukeResponse.FieldInfo
     [exec]   missing: LukeResponse.FieldTypeInfo
     [exec]   missing: PivotField
     [exec]   missing: QueryResponse
     [exec]   missing: RangeFacet.Count
     [exec]   missing: RangeFacet.Date
     [exec]   missing: RangeFacet.Numeric
     [exec]   missing: SolrPingResponse
     [exec]   missing: SolrResponseBase
     [exec]   missing: SpellCheckResponse.Suggestion
     [exec]   missing: TermsResponse.Term
     [exec]
     [exec] <http://sierranevada.servebeer.com/job/Lucene-Solr-40-ReleaseSmoke/ws/lucene/build/fakeReleaseTmp/unpack/apache-solr-4.0/solr/build/docs/solr-solrj/org/apache/solr/client/solrj/impl/package-summary.html>
     [exec]   no package description (missing package.html in src?)
     [exec]   missing: BinaryResponseParser
     [exec]   missing: HttpSolrServer
     [exec]   missing: LBHttpSolrServer.Req
     [exec]   missing: LBHttpSolrServer.Rsp
     [exec]   missing: XMLResponseParser
     [exec]   missing: XMLResponseParser.KnownType
     [exec]
     [exec] <http://sierranevada.servebeer.com/job/Lucene-Solr-40-ReleaseSmoke/ws/lucene/build/fakeReleaseTmp/unpack/apache-solr-4.0/solr/build/docs/solr-solrj/org/apache/noggit/package-summary.html>
     [exec]   no package description (missing package.html in src?)
     [exec]   missing: CharArr
     [exec]   missing: CharUtil
     [exec]   missing: JSONParser
     [exec]   missing: JSONUtil
     [exec]   missing: JSONWriter
     [exec]   missing: ObjectBuilder
     [exec]   missing: JSONParser.ParseException
     [exec]
     [exec] <http://sierranevada.servebeer.com/job/Lucene-Solr-40-ReleaseSmoke/ws/lucene/build/fakeReleaseTmp/unpack/apache-solr-4.0/solr/build/docs/solr-uima/overview-summary.html>
     [exec]   missing: org.apache.solr.uima.processor
     [exec]   missing: org.apache.solr.uima.processor.exception
     [exec]
     [exec] <http://sierranevada.servebeer.com/job/Lucene-Solr-40-ReleaseSmoke/ws/lucene/build/fakeReleaseTmp/unpack/apache-solr-4.0/solr/build/docs/solr-uima/org/apache/solr/uima/processor/package-summary.html>
     [exec]   no package description (missing package.html in src?)
     [exec]
     [exec] <http://sierranevada.servebeer.com/job/Lucene-Solr-40-ReleaseSmoke/ws/lucene/build/fakeReleaseTmp/unpack/apache-solr-4.0/solr/build/docs/solr-uima/org/apache/solr/uima/processor/exception/package-summary.html>
     [exec]   no package description (missing package.html in src?)
     [exec]
     [exec] <http://sierranevada.servebeer.com/job/Lucene-Solr-40-ReleaseSmoke/ws/lucene/build/fakeReleaseTmp/unpack/apache-solr-4.0/solr/build/docs/solr-dataimporthandler/overview-summary.html>
     [exec]   missing: org.apache.solr.handler.dataimport
     [exec]   missing: org.apache.solr.handler.dataimport.config
     [exec]
     [exec] <http://sierranevada.servebeer.com/job/Lucene-Solr-40-ReleaseSmoke/ws/lucene/build/fakeReleaseTmp/unpack/apache-solr-4.0/solr/build/docs/solr-dataimporthandler/org/apache/solr/handler/dataimport/package-summary.html>
     [exec]   no package description (missing package.html in src?)
     [exec]   missing: DIHPropertiesWriter
     [exec]   missing: DIHWriter
     [exec]   missing: CachePropertyUtil
     [exec]   missing: ConfigParseUtil
     [exec]   missing: DebugInfo
     [exec]   missing: DIHCacheSupport
     [exec]   missing: DIHWriterBase
     [exec]   missing: DocBuilder.Statistics
     [exec]   missing: EvaluatorBag.VariableWrapper
     [exec]   missing: RequestInfo
     [exec]   missing: SimplePropertiesWriter
     [exec]   missing: SortedMapBackedCache
     [exec]   missing: ZKPropertiesWriter
     [exec]   missing: DataImporter.Status
     [exec]   missing: DIHLogLevels
     [exec]
     [exec] <http://sierranevada.servebeer.com/job/Lucene-Solr-40-ReleaseSmoke/ws/lucene/build/fakeReleaseTmp/unpack/apache-solr-4.0/solr/build/docs/solr-dataimporthandler/org/apache/solr/handler/dataimport/config/package-summary.html>
     [exec]   no package description (missing package.html in src?)
     [exec]   missing: ConfigNameConstants
     [exec]   missing: ConfigParseUtil
     [exec]   missing: Entity
     [exec]   missing: EntityField
     [exec]   missing: EntityField.Builder
     [exec]   missing: Field
     [exec]   missing: Field.Builder
     [exec]   missing: Script
     [exec]
     [exec] <http://sierranevada.servebeer.com/job/Lucene-Solr-40-ReleaseSmoke/ws/lucene/build/fakeReleaseTmp/unpack/apache-solr-4.0/solr/build/docs/solr-cell/overview-summary.html>
     [exec]   missing: org.apache.solr.handler.extraction
     [exec]
     [exec] <http://sierranevada.servebeer.com/job/Lucene-Solr-40-ReleaseSmoke/ws/lucene/build/fakeReleaseTmp/unpack/apache-solr-4.0/solr/build/docs/solr-cell/org/apache/solr/handler/extraction/package-summary.html>
     [exec]   no package description (missing package.html in src?)
     [exec]   missing: SolrContentHandlerFactory
     [exec]
     [exec] <http://sierranevada.servebeer.com/job/Lucene-Solr-40-ReleaseSmoke/ws/lucene/build/fakeReleaseTmp/unpack/apache-solr-4.0/solr/build/docs/solr-test-framework/overview-summary.html>
     [exec]   missing: org.apache.solr
     [exec]   missing: org.apache.solr.analysis
     [exec]   missing: org.apache.solr.cloud
     [exec]   missing: org.apache.solr.core
     [exec]   missing: org.apache.solr.update.processor
     [exec]   missing: org.apache.solr.util
     [exec]
     [exec] <http://sierranevada.servebeer.com/job/Lucene-Solr-40-ReleaseSmoke/ws/lucene/build/fakeReleaseTmp/unpack/apache-solr-4.0/solr/build/docs/solr-test-framework/org/apache/solr/package-summary.html>
     [exec]   no package description (missing package.html in src?)
     [exec]   missing: BaseDistributedSearchTestCase.RandDate
     [exec]   missing: BaseDistributedSearchTestCase.RandVal
     [exec]   missing: JSONTestUtil
     [exec]   missing: SolrJettyTestBase
     [exec]   missing: SolrTestCaseJ4.Doc
     [exec]   missing: SolrTestCaseJ4.Fld
     [exec]   missing: SolrTestCaseJ4.FVal
     [exec]   missing: SolrTestCaseJ4.IRange
     [exec]   missing: SolrTestCaseJ4.IVals
     [exec]   missing: SolrTestCaseJ4.SVal
     [exec]   missing: SolrTestCaseJ4.Vals
     [exec]
     [exec] <http://sierranevada.servebeer.com/job/Lucene-Solr-40-ReleaseSmoke/ws/lucene/build/fakeReleaseTmp/unpack/apache-solr-4.0/solr/build/docs/solr-test-framework/org/apache/solr/util/package-summary.html>
     [exec]   no package description (missing package.html in src?)
     [exec]   missing: DOMUtilTestBase
     [exec]   missing: RevertDefaultThreadHandlerRule
     [exec]
     [exec] <http://sierranevada.servebeer.com/job/Lucene-Solr-40-ReleaseSmoke/ws/lucene/build/fakeReleaseTmp/unpack/apache-solr-4.0/solr/build/docs/solr-test-framework/org/apache/solr/core/package-summary.html>
     [exec]   no package description (missing package.html in src?)
     [exec]
     [exec] <http://sierranevada.servebeer.com/job/Lucene-Solr-40-ReleaseSmoke/ws/lucene/build/fakeReleaseTmp/unpack/apache-solr-4.0/solr/build/docs/solr-test-framework/org/apache/solr/update/processor/package-summary.html>
     [exec]   no package description (missing package.html in src?)
     [exec]   missing: BufferingRequestProcessor
     [exec]
     [exec] <http://sierranevada.servebeer.com/job/Lucene-Solr-40-ReleaseSmoke/ws/lucene/build/fakeReleaseTmp/unpack/apache-solr-4.0/solr/build/docs/solr-test-framework/org/apache/solr/cloud/package-summary.html>
     [exec]   no package description (missing package.html in src?)
     [exec]   missing: AbstractDistribZkTestBase
     [exec]   missing: AbstractFullDistribZkTestBase.CloudJettyRunner
     [exec]   missing: ZkTestServer
     [exec]   missing: ZkTestServer.HostPort
     [exec]
     [exec] <http://sierranevada.servebeer.com/job/Lucene-Solr-40-ReleaseSmoke/ws/lucene/build/fakeReleaseTmp/unpack/apache-solr-4.0/solr/build/docs/solr-test-framework/org/apache/solr/analysis/package-summary.html>
     [exec]   no package description (missing package.html in src?)
     [exec]
     [exec] <http://sierranevada.servebeer.com/job/Lucene-Solr-40-ReleaseSmoke/ws/lucene/build/fakeReleaseTmp/unpack/apache-solr-4.0/solr/build/docs/solr-dataimporthandler-extras/overview-summary.html>
     [exec]   missing: org.apache.solr.handler.dataimport
     [exec]
     [exec] <http://sierranevada.servebeer.com/job/Lucene-Solr-40-ReleaseSmoke/ws/lucene/build/fakeReleaseTmp/unpack/apache-solr-4.0/solr/build/docs/solr-dataimporthandler-extras/org/apache/solr/handler/dataimport/package-summary.html>
     [exec]   no package description (missing package.html in src?)
     [exec]   missing: MailEntityProcessor.CustomFilter
     [exec]
     [exec] ***WARNING***: javadocs want to fail!
     [exec]
     [exec]
     [exec] Crawl/parse...
     [exec]
     [exec] Verify...
     [exec]     test solr example w/ Java 6...
     [exec]       start Solr instance (log=<http://sierranevada.servebeer.com/job/Lucene-Solr-40-ReleaseSmoke/ws/lucene/build/fakeReleaseTmp/unpack/apache-solr-4.0/solr-example.log)...>
     [exec]       startup done
     [exec]       test utf8...
     [exec]       index example docs...
     [exec]       run query...
     [exec]       stop server (SIGINT)...
     [exec]     test solr example w/ Java 7...
     [exec]       start Solr instance (log=<http://sierranevada.servebeer.com/job/Lucene-Solr-40-ReleaseSmoke/ws/lucene/build/fakeReleaseTmp/unpack/apache-solr-4.0/solr-example.log)...>
     [exec]       startup done
     [exec]       test utf8...
     [exec]       index example docs...
     [exec]       run query...
     [exec]       stop server (SIGINT)...
     [exec]     check NOTICE
     [exec] Test Maven artifacts for Lucene and Solr...
     [exec]     get POM templates ...................................................
     [exec] Traceback (most recent call last):
     [exec]   File "/usr/lib/python3.2/xml/etree/ElementTree.py", line 1668, in feed
     [exec]     self._parser.Parse(data, 0)
     [exec] xml.parsers.expat.ExpatError: not well-formed (invalid token): line 1, column 8
     [exec]
     [exec] During handling of the above exception, another exception occurred:
     [exec]
     [exec] Traceback (most recent call last):
     [exec]   File "dev-tools/scripts/smokeTestRelease.py", line 1107, in <module>
     [exec]     main()
     [exec]   File "dev-tools/scripts/smokeTestRelease.py", line 1057, in main
     [exec]     smokeTest(baseURL, version, tmpDir, isSigned)
     [exec]   File "dev-tools/scripts/smokeTestRelease.py", line 1103, in smokeTest
     [exec]     checkMaven(baseURL, tmpDir, version, isSigned)
     [exec]   File "dev-tools/scripts/smokeTestRelease.py", line 688, in checkMaven
     [exec]     verifyArtifactPerPOMtemplate(POMtemplates, artifacts, tmpDir, version)
     [exec]   File "dev-tools/scripts/smokeTestRelease.py", line 985, in verifyArtifactPerPOMtemplate
     [exec]     treeRoot = ET.parse(POMtemplate).getroot()
     [exec]   File "/usr/lib/python3.2/xml/etree/ElementTree.py", line 1223, in parse
     [exec]     tree.parse(source, parser)
     [exec]   File "/usr/lib/python3.2/xml/etree/ElementTree.py", line 678, in parse
     [exec]     parser.feed(data)
     [exec]   File "/usr/lib/python3.2/xml/etree/ElementTree.py", line 1670, in feed
     [exec]     self._raiseerror(v)
     [exec]   File "/usr/lib/python3.2/xml/etree/ElementTree.py", line 1543, in _raiseerror
     [exec]     raise err
     [exec]   File "<string>", line None
     [exec] xml.etree.ElementTree.ParseError: not well-formed (invalid token): line 1, column 8
     [exec]     download artifacts ........................................................................................................................................................................................................................................................................................................................................................................................................................................................................................................................................................................
     [exec]     verify that each binary artifact has a deployed POM...
     [exec]     verify that there is an artifact for each POM template...

BUILD FAILED
<http://sierranevada.servebeer.com/job/Lucene-Solr-40-ReleaseSmoke/ws/build.xml>:279: exec returned: 1

Total time: 22 minutes 5 seconds
Build step 'Invoke Ant' marked build as failure

---------------------------------------------------------------------
To unsubscribe, e-mail: [hidden email]
For additional commands, e-mail: [hidden email]

Reply | Threaded
Open this post in threaded view
|

RE: Build failed in Jenkins: Lucene-Solr-40-ReleaseSmoke #3

steve_rowe
In reply to this post by Robert Muir
The maven checks use python XML parsing, which appears to be complaining about well-formedness of a POM file.

How is smoketester being run?  Against a file:// url built locally?

Steve
 
-----Original Message-----
From: Robert Muir [mailto:[hidden email]]
Sent: Saturday, September 22, 2012 11:07 AM
To: [hidden email]
Subject: Re: Build failed in Jenkins: Lucene-Solr-40-ReleaseSmoke #3

I have no idea about what this is, or what is going on here.

On Sat, Sep 22, 2012 at 10:41 AM,  <[hidden email]> wrote:

>      [exec] Test Maven artifacts for Lucene and Solr...
>      [exec]     get POM templates ...................................................
>      [exec]     download artifacts ........................................................................................................................................................................................................................................................................................................................................................................................................................................................................................................................................................................
>      [exec]     verify that each binary artifact has a deployed POM...
>      [exec]     verify that there is an artifact for each POM template...
>      [exec] Traceback (most recent call last):
>      [exec]   File "/usr/lib/python3.2/xml/etree/ElementTree.py", line 1668, in feed
>      [exec]     self._parser.Parse(data, 0)
>      [exec] xml.parsers.expat.ExpatError: not well-formed (invalid token): line 1, column 8
>      [exec]
>      [exec] During handling of the above exception, another exception occurred:
>      [exec]
>      [exec] Traceback (most recent call last):
>      [exec]   File "dev-tools/scripts/smokeTestRelease.py", line 1107, in <module>
>      [exec]     main()
>      [exec]   File "dev-tools/scripts/smokeTestRelease.py", line 1057, in main
>      [exec]     smokeTest(baseURL, version, tmpDir, isSigned)
>      [exec]   File "dev-tools/scripts/smokeTestRelease.py", line 1103, in smokeTest
>      [exec]     checkMaven(baseURL, tmpDir, version, isSigned)
>      [exec]   File "dev-tools/scripts/smokeTestRelease.py", line 688, in checkMaven
>      [exec]     verifyArtifactPerPOMtemplate(POMtemplates, artifacts, tmpDir, version)
>      [exec]   File "dev-tools/scripts/smokeTestRelease.py", line 985, in verifyArtifactPerPOMtemplate
>      [exec]     treeRoot = ET.parse(POMtemplate).getroot()
>      [exec]   File "/usr/lib/python3.2/xml/etree/ElementTree.py", line 1223, in parse
>      [exec]     tree.parse(source, parser)
>      [exec]   File "/usr/lib/python3.2/xml/etree/ElementTree.py", line 678, in parse
>      [exec]     parser.feed(data)
>      [exec]   File "/usr/lib/python3.2/xml/etree/ElementTree.py", line 1670, in feed
>      [exec]     self._raiseerror(v)
>      [exec]   File "/usr/lib/python3.2/xml/etree/ElementTree.py", line 1543, in _raiseerror
>      [exec]     raise err
>      [exec]   File "<string>", line None
>      [exec] xml.etree.ElementTree.ParseError: not well-formed (invalid token): line 1, column 8
>
> BUILD FAILED
> <http://sierranevada.servebeer.com/job/Lucene-Solr-40-ReleaseSmoke/ws/build.xml>:279: exec returned: 1
>
> Total time: 22 minutes 2 seconds
> Build step 'Invoke Ant' marked build as failure
>
> ---------------------------------------------------------------------
> To unsubscribe, e-mail: [hidden email]
> For additional commands, e-mail: [hidden email]
>



--
lucidworks.com

---------------------------------------------------------------------
To unsubscribe, e-mail: [hidden email]
For additional commands, e-mail: [hidden email]


---------------------------------------------------------------------
To unsubscribe, e-mail: [hidden email]
For additional commands, e-mail: [hidden email]

Reply | Threaded
Open this post in threaded view
|

Re: Build failed in Jenkins: Lucene-Solr-40-ReleaseSmoke #3

Robert Muir
the jenkins job checks out the lucene_solr_4_0 release branch and runs
'ant nightly-smoke -DJAVA6_HOME=xxxx -DJAVA7_HOME=yyyy'

On Sat, Sep 22, 2012 at 11:29 AM, Steven A Rowe <[hidden email]> wrote:

> The maven checks use python XML parsing, which appears to be complaining about well-formedness of a POM file.
>
> How is smoketester being run?  Against a file:// url built locally?
>
> Steve
>
> -----Original Message-----
> From: Robert Muir [mailto:[hidden email]]
> Sent: Saturday, September 22, 2012 11:07 AM
> To: [hidden email]
> Subject: Re: Build failed in Jenkins: Lucene-Solr-40-ReleaseSmoke #3
>
> I have no idea about what this is, or what is going on here.
>
> On Sat, Sep 22, 2012 at 10:41 AM,  <[hidden email]> wrote:
>>      [exec] Test Maven artifacts for Lucene and Solr...
>>      [exec]     get POM templates ...................................................
>>      [exec]     download artifacts ........................................................................................................................................................................................................................................................................................................................................................................................................................................................................................................................................................................
>>      [exec]     verify that each binary artifact has a deployed POM...
>>      [exec]     verify that there is an artifact for each POM template...
>>      [exec] Traceback (most recent call last):
>>      [exec]   File "/usr/lib/python3.2/xml/etree/ElementTree.py", line 1668, in feed
>>      [exec]     self._parser.Parse(data, 0)
>>      [exec] xml.parsers.expat.ExpatError: not well-formed (invalid token): line 1, column 8
>>      [exec]
>>      [exec] During handling of the above exception, another exception occurred:
>>      [exec]
>>      [exec] Traceback (most recent call last):
>>      [exec]   File "dev-tools/scripts/smokeTestRelease.py", line 1107, in <module>
>>      [exec]     main()
>>      [exec]   File "dev-tools/scripts/smokeTestRelease.py", line 1057, in main
>>      [exec]     smokeTest(baseURL, version, tmpDir, isSigned)
>>      [exec]   File "dev-tools/scripts/smokeTestRelease.py", line 1103, in smokeTest
>>      [exec]     checkMaven(baseURL, tmpDir, version, isSigned)
>>      [exec]   File "dev-tools/scripts/smokeTestRelease.py", line 688, in checkMaven
>>      [exec]     verifyArtifactPerPOMtemplate(POMtemplates, artifacts, tmpDir, version)
>>      [exec]   File "dev-tools/scripts/smokeTestRelease.py", line 985, in verifyArtifactPerPOMtemplate
>>      [exec]     treeRoot = ET.parse(POMtemplate).getroot()
>>      [exec]   File "/usr/lib/python3.2/xml/etree/ElementTree.py", line 1223, in parse
>>      [exec]     tree.parse(source, parser)
>>      [exec]   File "/usr/lib/python3.2/xml/etree/ElementTree.py", line 678, in parse
>>      [exec]     parser.feed(data)
>>      [exec]   File "/usr/lib/python3.2/xml/etree/ElementTree.py", line 1670, in feed
>>      [exec]     self._raiseerror(v)
>>      [exec]   File "/usr/lib/python3.2/xml/etree/ElementTree.py", line 1543, in _raiseerror
>>      [exec]     raise err
>>      [exec]   File "<string>", line None
>>      [exec] xml.etree.ElementTree.ParseError: not well-formed (invalid token): line 1, column 8
>>
>> BUILD FAILED
>> <http://sierranevada.servebeer.com/job/Lucene-Solr-40-ReleaseSmoke/ws/build.xml>:279: exec returned: 1
>>
>> Total time: 22 minutes 2 seconds
>> Build step 'Invoke Ant' marked build as failure
>>
>> ---------------------------------------------------------------------
>> To unsubscribe, e-mail: [hidden email]
>> For additional commands, e-mail: [hidden email]
>>
>
>
>
> --
> lucidworks.com
>
> ---------------------------------------------------------------------
> To unsubscribe, e-mail: [hidden email]
> For additional commands, e-mail: [hidden email]
>
>
> ---------------------------------------------------------------------
> To unsubscribe, e-mail: [hidden email]
> For additional commands, e-mail: [hidden email]
>



--
lucidworks.com

---------------------------------------------------------------------
To unsubscribe, e-mail: [hidden email]
For additional commands, e-mail: [hidden email]

Reply | Threaded
Open this post in threaded view
|

Re: Build failed in Jenkins: Lucene-Solr-40-ReleaseSmoke #3

Robert Muir
the check is slow, maybe we could just add some prints to the checker
in this loop to see what file its complaining about?

my jenkins runs this task about every 22 minutes (i have my desktop
running it in a loop)

On Sat, Sep 22, 2012 at 11:35 AM, Robert Muir <[hidden email]> wrote:

> the jenkins job checks out the lucene_solr_4_0 release branch and runs
> 'ant nightly-smoke -DJAVA6_HOME=xxxx -DJAVA7_HOME=yyyy'
>
> On Sat, Sep 22, 2012 at 11:29 AM, Steven A Rowe <[hidden email]> wrote:
>> The maven checks use python XML parsing, which appears to be complaining about well-formedness of a POM file.
>>
>> How is smoketester being run?  Against a file:// url built locally?
>>
>> Steve
>>
>> -----Original Message-----
>> From: Robert Muir [mailto:[hidden email]]
>> Sent: Saturday, September 22, 2012 11:07 AM
>> To: [hidden email]
>> Subject: Re: Build failed in Jenkins: Lucene-Solr-40-ReleaseSmoke #3
>>
>> I have no idea about what this is, or what is going on here.
>>
>> On Sat, Sep 22, 2012 at 10:41 AM,  <[hidden email]> wrote:
>>>      [exec] Test Maven artifacts for Lucene and Solr...
>>>      [exec]     get POM templates ...................................................
>>>      [exec]     download artifacts ........................................................................................................................................................................................................................................................................................................................................................................................................................................................................................................................................................................
>>>      [exec]     verify that each binary artifact has a deployed POM...
>>>      [exec]     verify that there is an artifact for each POM template...
>>>      [exec] Traceback (most recent call last):
>>>      [exec]   File "/usr/lib/python3.2/xml/etree/ElementTree.py", line 1668, in feed
>>>      [exec]     self._parser.Parse(data, 0)
>>>      [exec] xml.parsers.expat.ExpatError: not well-formed (invalid token): line 1, column 8
>>>      [exec]
>>>      [exec] During handling of the above exception, another exception occurred:
>>>      [exec]
>>>      [exec] Traceback (most recent call last):
>>>      [exec]   File "dev-tools/scripts/smokeTestRelease.py", line 1107, in <module>
>>>      [exec]     main()
>>>      [exec]   File "dev-tools/scripts/smokeTestRelease.py", line 1057, in main
>>>      [exec]     smokeTest(baseURL, version, tmpDir, isSigned)
>>>      [exec]   File "dev-tools/scripts/smokeTestRelease.py", line 1103, in smokeTest
>>>      [exec]     checkMaven(baseURL, tmpDir, version, isSigned)
>>>      [exec]   File "dev-tools/scripts/smokeTestRelease.py", line 688, in checkMaven
>>>      [exec]     verifyArtifactPerPOMtemplate(POMtemplates, artifacts, tmpDir, version)
>>>      [exec]   File "dev-tools/scripts/smokeTestRelease.py", line 985, in verifyArtifactPerPOMtemplate
>>>      [exec]     treeRoot = ET.parse(POMtemplate).getroot()
>>>      [exec]   File "/usr/lib/python3.2/xml/etree/ElementTree.py", line 1223, in parse
>>>      [exec]     tree.parse(source, parser)
>>>      [exec]   File "/usr/lib/python3.2/xml/etree/ElementTree.py", line 678, in parse
>>>      [exec]     parser.feed(data)
>>>      [exec]   File "/usr/lib/python3.2/xml/etree/ElementTree.py", line 1670, in feed
>>>      [exec]     self._raiseerror(v)
>>>      [exec]   File "/usr/lib/python3.2/xml/etree/ElementTree.py", line 1543, in _raiseerror
>>>      [exec]     raise err
>>>      [exec]   File "<string>", line None
>>>      [exec] xml.etree.ElementTree.ParseError: not well-formed (invalid token): line 1, column 8
>>>
>>> BUILD FAILED
>>> <http://sierranevada.servebeer.com/job/Lucene-Solr-40-ReleaseSmoke/ws/build.xml>:279: exec returned: 1
>>>
>>> Total time: 22 minutes 2 seconds
>>> Build step 'Invoke Ant' marked build as failure
>>>
>>> ---------------------------------------------------------------------
>>> To unsubscribe, e-mail: [hidden email]
>>> For additional commands, e-mail: [hidden email]
>>>
>>
>>
>>
>> --
>> lucidworks.com
>>
>> ---------------------------------------------------------------------
>> To unsubscribe, e-mail: [hidden email]
>> For additional commands, e-mail: [hidden email]
>>
>>
>> ---------------------------------------------------------------------
>> To unsubscribe, e-mail: [hidden email]
>> For additional commands, e-mail: [hidden email]
>>
>
>
>
> --
> lucidworks.com



--
lucidworks.com

---------------------------------------------------------------------
To unsubscribe, e-mail: [hidden email]
For additional commands, e-mail: [hidden email]

Reply | Threaded
Open this post in threaded view
|

Build failed in Jenkins: Lucene-Solr-40-ReleaseSmoke #6

Charlie Cron
In reply to this post by Charlie Cron
See <http://sierranevada.servebeer.com/job/Lucene-Solr-40-ReleaseSmoke/6/>

------------------------------------------
[...truncated 43034 lines...]
     [exec]
     [exec] <http://sierranevada.servebeer.com/job/Lucene-Solr-40-ReleaseSmoke/ws/lucene/build/fakeReleaseTmp/unpack/apache-solr-4.0/solr/build/docs/solr-solrj/org/apache/solr/common/cloud/package-summary.html>
     [exec]   no package description (missing package.html in src?)
     [exec]   missing: ClosableThread
     [exec]   missing: OnReconnect
     [exec]   missing: ZkClientConnectionStrategy.ConnectedListener
     [exec]   missing: ZkClientConnectionStrategy.DisconnectedListener
     [exec]   missing: HashPartitioner.Range
     [exec]   missing: Replica
     [exec]   missing: SolrZooKeeper
     [exec]   missing: ZkClientConnectionStrategy
     [exec]   missing: ZkClientConnectionStrategy.ZkUpdate
     [exec]   missing: ZkCmdExecutor
     [exec]   missing: ZkCoreNodeProps
     [exec]   missing: ZkStateReader
     [exec]   missing: ZooKeeperException
     [exec]
     [exec] <http://sierranevada.servebeer.com/job/Lucene-Solr-40-ReleaseSmoke/ws/lucene/build/fakeReleaseTmp/unpack/apache-solr-4.0/solr/build/docs/solr-solrj/org/apache/solr/client/solrj/package-summary.html>
     [exec]   no package description (missing package.html in src?)
     [exec]   missing: ResponseParser
     [exec]   missing: SolrRequest
     [exec]   missing: SolrResponse
     [exec]   missing: SolrServer
     [exec]   missing: SolrQuery.ORDER
     [exec]   missing: SolrRequest.METHOD
     [exec]
     [exec] <http://sierranevada.servebeer.com/job/Lucene-Solr-40-ReleaseSmoke/ws/lucene/build/fakeReleaseTmp/unpack/apache-solr-4.0/solr/build/docs/solr-solrj/org/apache/solr/client/solrj/request/package-summary.html>
     [exec]   no package description (missing package.html in src?)
     [exec]   missing: JavaBinUpdateRequestCodec.StreamingUpdateHandler
     [exec]   missing: AbstractUpdateRequest
     [exec]   missing: CoreAdminRequest.Create
     [exec]   missing: CoreAdminRequest.MergeIndexes
     [exec]   missing: CoreAdminRequest.Persist
     [exec]   missing: CoreAdminRequest.RequestRecovery
     [exec]   missing: CoreAdminRequest.RequestSyncShard
     [exec]   missing: CoreAdminRequest.Unload
     [exec]   missing: CoreAdminRequest.WaitForState
     [exec]   missing: LukeRequest
     [exec]   missing: QueryRequest
     [exec]   missing: SolrPing
     [exec]   missing: UpdateRequest
     [exec]   missing: UpdateRequestExt
     [exec]   missing: AbstractUpdateRequest.ACTION
     [exec]
     [exec] <http://sierranevada.servebeer.com/job/Lucene-Solr-40-ReleaseSmoke/ws/lucene/build/fakeReleaseTmp/unpack/apache-solr-4.0/solr/build/docs/solr-solrj/org/apache/solr/client/solrj/util/package-summary.html>
     [exec]   no package description (missing package.html in src?)
     [exec]   missing: ClientUtils
     [exec]
     [exec] <http://sierranevada.servebeer.com/job/Lucene-Solr-40-ReleaseSmoke/ws/lucene/build/fakeReleaseTmp/unpack/apache-solr-4.0/solr/build/docs/solr-solrj/org/apache/solr/client/solrj/beans/package-summary.html>
     [exec]   no package description (missing package.html in src?)
     [exec]   missing: BindingException
     [exec]   missing: Field
     [exec]
     [exec] <http://sierranevada.servebeer.com/job/Lucene-Solr-40-ReleaseSmoke/ws/lucene/build/fakeReleaseTmp/unpack/apache-solr-4.0/solr/build/docs/solr-solrj/org/apache/solr/client/solrj/response/package-summary.html>
     [exec]   no package description (missing package.html in src?)
     [exec]   missing: CoreAdminResponse
     [exec]   missing: FacetField.Count
     [exec]   missing: LukeResponse.FieldInfo
     [exec]   missing: LukeResponse.FieldTypeInfo
     [exec]   missing: PivotField
     [exec]   missing: QueryResponse
     [exec]   missing: RangeFacet.Count
     [exec]   missing: RangeFacet.Date
     [exec]   missing: RangeFacet.Numeric
     [exec]   missing: SolrPingResponse
     [exec]   missing: SolrResponseBase
     [exec]   missing: SpellCheckResponse.Suggestion
     [exec]   missing: TermsResponse.Term
     [exec]
     [exec] <http://sierranevada.servebeer.com/job/Lucene-Solr-40-ReleaseSmoke/ws/lucene/build/fakeReleaseTmp/unpack/apache-solr-4.0/solr/build/docs/solr-solrj/org/apache/solr/client/solrj/impl/package-summary.html>
     [exec]   no package description (missing package.html in src?)
     [exec]   missing: BinaryResponseParser
     [exec]   missing: HttpSolrServer
     [exec]   missing: LBHttpSolrServer.Req
     [exec]   missing: LBHttpSolrServer.Rsp
     [exec]   missing: XMLResponseParser
     [exec]   missing: XMLResponseParser.KnownType
     [exec]
     [exec] <http://sierranevada.servebeer.com/job/Lucene-Solr-40-ReleaseSmoke/ws/lucene/build/fakeReleaseTmp/unpack/apache-solr-4.0/solr/build/docs/solr-solrj/org/apache/noggit/package-summary.html>
     [exec]   no package description (missing package.html in src?)
     [exec]   missing: CharArr
     [exec]   missing: CharUtil
     [exec]   missing: JSONParser
     [exec]   missing: JSONUtil
     [exec]   missing: JSONWriter
     [exec]   missing: ObjectBuilder
     [exec]   missing: JSONParser.ParseException
     [exec]
     [exec] <http://sierranevada.servebeer.com/job/Lucene-Solr-40-ReleaseSmoke/ws/lucene/build/fakeReleaseTmp/unpack/apache-solr-4.0/solr/build/docs/solr-uima/overview-summary.html>
     [exec]   missing: org.apache.solr.uima.processor
     [exec]   missing: org.apache.solr.uima.processor.exception
     [exec]
     [exec] <http://sierranevada.servebeer.com/job/Lucene-Solr-40-ReleaseSmoke/ws/lucene/build/fakeReleaseTmp/unpack/apache-solr-4.0/solr/build/docs/solr-uima/org/apache/solr/uima/processor/package-summary.html>
     [exec]   no package description (missing package.html in src?)
     [exec]
     [exec] <http://sierranevada.servebeer.com/job/Lucene-Solr-40-ReleaseSmoke/ws/lucene/build/fakeReleaseTmp/unpack/apache-solr-4.0/solr/build/docs/solr-uima/org/apache/solr/uima/processor/exception/package-summary.html>
     [exec]   no package description (missing package.html in src?)
     [exec]
     [exec] <http://sierranevada.servebeer.com/job/Lucene-Solr-40-ReleaseSmoke/ws/lucene/build/fakeReleaseTmp/unpack/apache-solr-4.0/solr/build/docs/solr-dataimporthandler/overview-summary.html>
     [exec]   missing: org.apache.solr.handler.dataimport
     [exec]   missing: org.apache.solr.handler.dataimport.config
     [exec]
     [exec] <http://sierranevada.servebeer.com/job/Lucene-Solr-40-ReleaseSmoke/ws/lucene/build/fakeReleaseTmp/unpack/apache-solr-4.0/solr/build/docs/solr-dataimporthandler/org/apache/solr/handler/dataimport/package-summary.html>
     [exec]   no package description (missing package.html in src?)
     [exec]   missing: DIHPropertiesWriter
     [exec]   missing: DIHWriter
     [exec]   missing: CachePropertyUtil
     [exec]   missing: ConfigParseUtil
     [exec]   missing: DebugInfo
     [exec]   missing: DIHCacheSupport
     [exec]   missing: DIHWriterBase
     [exec]   missing: DocBuilder.Statistics
     [exec]   missing: EvaluatorBag.VariableWrapper
     [exec]   missing: RequestInfo
     [exec]   missing: SimplePropertiesWriter
     [exec]   missing: SortedMapBackedCache
     [exec]   missing: ZKPropertiesWriter
     [exec]   missing: DataImporter.Status
     [exec]   missing: DIHLogLevels
     [exec]
     [exec] <http://sierranevada.servebeer.com/job/Lucene-Solr-40-ReleaseSmoke/ws/lucene/build/fakeReleaseTmp/unpack/apache-solr-4.0/solr/build/docs/solr-dataimporthandler/org/apache/solr/handler/dataimport/config/package-summary.html>
     [exec]   no package description (missing package.html in src?)
     [exec]   missing: ConfigNameConstants
     [exec]   missing: ConfigParseUtil
     [exec]   missing: Entity
     [exec]   missing: EntityField
     [exec]   missing: EntityField.Builder
     [exec]   missing: Field
     [exec]   missing: Field.Builder
     [exec]   missing: Script
     [exec]
     [exec] <http://sierranevada.servebeer.com/job/Lucene-Solr-40-ReleaseSmoke/ws/lucene/build/fakeReleaseTmp/unpack/apache-solr-4.0/solr/build/docs/solr-cell/overview-summary.html>
     [exec]   missing: org.apache.solr.handler.extraction
     [exec]
     [exec] <http://sierranevada.servebeer.com/job/Lucene-Solr-40-ReleaseSmoke/ws/lucene/build/fakeReleaseTmp/unpack/apache-solr-4.0/solr/build/docs/solr-cell/org/apache/solr/handler/extraction/package-summary.html>
     [exec]   no package description (missing package.html in src?)
     [exec]   missing: SolrContentHandlerFactory
     [exec]
     [exec] <http://sierranevada.servebeer.com/job/Lucene-Solr-40-ReleaseSmoke/ws/lucene/build/fakeReleaseTmp/unpack/apache-solr-4.0/solr/build/docs/solr-test-framework/overview-summary.html>
     [exec]   missing: org.apache.solr
     [exec]   missing: org.apache.solr.analysis
     [exec]   missing: org.apache.solr.cloud
     [exec]   missing: org.apache.solr.core
     [exec]   missing: org.apache.solr.update.processor
     [exec]   missing: org.apache.solr.util
     [exec]
     [exec] <http://sierranevada.servebeer.com/job/Lucene-Solr-40-ReleaseSmoke/ws/lucene/build/fakeReleaseTmp/unpack/apache-solr-4.0/solr/build/docs/solr-test-framework/org/apache/solr/package-summary.html>
     [exec]   no package description (missing package.html in src?)
     [exec]   missing: BaseDistributedSearchTestCase.RandDate
     [exec]   missing: BaseDistributedSearchTestCase.RandVal
     [exec]   missing: JSONTestUtil
     [exec]   missing: SolrJettyTestBase
     [exec]   missing: SolrTestCaseJ4.Doc
     [exec]   missing: SolrTestCaseJ4.Fld
     [exec]   missing: SolrTestCaseJ4.FVal
     [exec]   missing: SolrTestCaseJ4.IRange
     [exec]   missing: SolrTestCaseJ4.IVals
     [exec]   missing: SolrTestCaseJ4.SVal
     [exec]   missing: SolrTestCaseJ4.Vals
     [exec]
     [exec] <http://sierranevada.servebeer.com/job/Lucene-Solr-40-ReleaseSmoke/ws/lucene/build/fakeReleaseTmp/unpack/apache-solr-4.0/solr/build/docs/solr-test-framework/org/apache/solr/util/package-summary.html>
     [exec]   no package description (missing package.html in src?)
     [exec]   missing: DOMUtilTestBase
     [exec]   missing: RevertDefaultThreadHandlerRule
     [exec]
     [exec] <http://sierranevada.servebeer.com/job/Lucene-Solr-40-ReleaseSmoke/ws/lucene/build/fakeReleaseTmp/unpack/apache-solr-4.0/solr/build/docs/solr-test-framework/org/apache/solr/core/package-summary.html>
     [exec]   no package description (missing package.html in src?)
     [exec]
     [exec] <http://sierranevada.servebeer.com/job/Lucene-Solr-40-ReleaseSmoke/ws/lucene/build/fakeReleaseTmp/unpack/apache-solr-4.0/solr/build/docs/solr-test-framework/org/apache/solr/update/processor/package-summary.html>
     [exec]   no package description (missing package.html in src?)
     [exec]   missing: BufferingRequestProcessor
     [exec]
     [exec] <http://sierranevada.servebeer.com/job/Lucene-Solr-40-ReleaseSmoke/ws/lucene/build/fakeReleaseTmp/unpack/apache-solr-4.0/solr/build/docs/solr-test-framework/org/apache/solr/cloud/package-summary.html>
     [exec]   no package description (missing package.html in src?)
     [exec]   missing: AbstractDistribZkTestBase
     [exec]   missing: AbstractFullDistribZkTestBase.CloudJettyRunner
     [exec]   missing: ZkTestServer
     [exec]   missing: ZkTestServer.HostPort
     [exec]
     [exec] <http://sierranevada.servebeer.com/job/Lucene-Solr-40-ReleaseSmoke/ws/lucene/build/fakeReleaseTmp/unpack/apache-solr-4.0/solr/build/docs/solr-test-framework/org/apache/solr/analysis/package-summary.html>
     [exec]   no package description (missing package.html in src?)
     [exec]
     [exec] <http://sierranevada.servebeer.com/job/Lucene-Solr-40-ReleaseSmoke/ws/lucene/build/fakeReleaseTmp/unpack/apache-solr-4.0/solr/build/docs/solr-dataimporthandler-extras/overview-summary.html>
     [exec]   missing: org.apache.solr.handler.dataimport
     [exec]
     [exec] <http://sierranevada.servebeer.com/job/Lucene-Solr-40-ReleaseSmoke/ws/lucene/build/fakeReleaseTmp/unpack/apache-solr-4.0/solr/build/docs/solr-dataimporthandler-extras/org/apache/solr/handler/dataimport/package-summary.html>
     [exec]   no package description (missing package.html in src?)
     [exec]   missing: MailEntityProcessor.CustomFilter
     [exec]
     [exec] ***WARNING***: javadocs want to fail!
     [exec]
     [exec]
     [exec] Crawl/parse...
     [exec]
     [exec] Verify...
     [exec]     test solr example w/ Java 6...
     [exec]       start Solr instance (log=<http://sierranevada.servebeer.com/job/Lucene-Solr-40-ReleaseSmoke/ws/lucene/build/fakeReleaseTmp/unpack/apache-solr-4.0/solr-example.log)...>
     [exec]       startup done
     [exec]       test utf8...
     [exec]       index example docs...
     [exec]       run query...
     [exec]       stop server (SIGINT)...
     [exec]     test solr example w/ Java 7...
     [exec]       start Solr instance (log=<http://sierranevada.servebeer.com/job/Lucene-Solr-40-ReleaseSmoke/ws/lucene/build/fakeReleaseTmp/unpack/apache-solr-4.0/solr-example.log)...>
     [exec]       startup done
     [exec]       test utf8...
     [exec]       index example docs...
     [exec]       run query...
     [exec]       stop server (SIGINT)...
     [exec]     check NOTICE
     [exec] Test Maven artifacts for Lucene and Solr...
     [exec]     get POM templates ...................................................
     [exec] Traceback (most recent call last):
     [exec]   File "/usr/lib/python3.2/xml/etree/ElementTree.py", line 1668, in feed
     [exec]     self._parser.Par    download artifacts .........................................................................................................se(data, 0)
     [exec] xml.parsers.expat.ExpatError: not well-formed (invalid token): line 1, column 8
     [exec]
     [exec] During handling of the above exception, another exception occurred:
     [exec]
     [exec] Traceback (most recent call last):
     [exec]   File "dev-tools/scripts/smokeTestRelease.py", line 1107, in <module>
     [exec]     main()
     [exec]   File "dev-tools/scripts/smokeTestRelease.py", line 1057, in main
     [exec]     smokeTest(baseURL, version, tmpDir, isSigned)
     [exec]   File "dev-tools/scripts/smokeTestRelease.py", line 1103, in smokeTest
     [exec]     checkMaven(baseURL, tmpDir, version, isSigned)
     [exec]   File "dev-tools/scripts/smokeTestRelease.py", line 688, in checkMaven
     [exec]     verifyArtifactPerPOMtemplate(POMtemplates, artifacts, tmpDir, version)
     [exec]   File "dev-tools/scripts/smokeTestRelease.py", line 985, in verifyArtifactPerPOMtemplate
     [exec]     treeRoot = ET.parse(POMtemplate).getroot()
     [exec]   File "/usr/lib/python3.2/xml/etree/ElementTree.py", line 1223, in parse
     [exec]     tree.parse(source, parser)
     [exec]   File "/usr/lib/python3.2/xml/etree/ElementTree.py", line 678, in parse
     [exec]     parser.feed(data)
     [exec]   File "/usr/lib/python3.2/xml/etree/ElementTree.py", line 1670, in feed
     [exec]     self._raiseerror(v)
     [exec]   File "/usr/lib/python3.2/xml/etree/ElementTree.py", line 1543, in _raiseerror
     [exec]     raise err
     [exec]   File "<string>", line None
     [exec] xml.etree.ElementTree.ParseError: not well-formed (invalid token): line 1, column 8
     [exec] ...............................................................................................................................................................................................................................................................................................................................................................................................................................................................
     [exec]     verify that each binary artifact has a deployed POM...
     [exec]     verify that there is an artifact for each POM template...

BUILD FAILED
<http://sierranevada.servebeer.com/job/Lucene-Solr-40-ReleaseSmoke/ws/build.xml>:279: exec returned: 1

Total time: 21 minutes 31 seconds
Build step 'Invoke Ant' marked build as failure

---------------------------------------------------------------------
To unsubscribe, e-mail: [hidden email]
For additional commands, e-mail: [hidden email]

Reply | Threaded
Open this post in threaded view
|

RE: Build failed in Jenkins: Lucene-Solr-40-ReleaseSmoke #3

steve_rowe
In reply to this post by Robert Muir
Okay, I'll do that.

-----Original Message-----
From: Robert Muir [mailto:[hidden email]]
Sent: Saturday, September 22, 2012 11:46 AM
To: [hidden email]
Subject: Re: Build failed in Jenkins: Lucene-Solr-40-ReleaseSmoke #3

the check is slow, maybe we could just add some prints to the checker
in this loop to see what file its complaining about?

my jenkins runs this task about every 22 minutes (i have my desktop
running it in a loop)

On Sat, Sep 22, 2012 at 11:35 AM, Robert Muir <[hidden email]> wrote:

> the jenkins job checks out the lucene_solr_4_0 release branch and runs
> 'ant nightly-smoke -DJAVA6_HOME=xxxx -DJAVA7_HOME=yyyy'
>
> On Sat, Sep 22, 2012 at 11:29 AM, Steven A Rowe <[hidden email]> wrote:
>> The maven checks use python XML parsing, which appears to be complaining about well-formedness of a POM file.
>>
>> How is smoketester being run?  Against a file:// url built locally?
>>
>> Steve
>>
>> -----Original Message-----
>> From: Robert Muir [mailto:[hidden email]]
>> Sent: Saturday, September 22, 2012 11:07 AM
>> To: [hidden email]
>> Subject: Re: Build failed in Jenkins: Lucene-Solr-40-ReleaseSmoke #3
>>
>> I have no idea about what this is, or what is going on here.
>>
>> On Sat, Sep 22, 2012 at 10:41 AM,  <[hidden email]> wrote:
>>>      [exec] Test Maven artifacts for Lucene and Solr...
>>>      [exec]     get POM templates ...................................................
>>>      [exec]     download artifacts ........................................................................................................................................................................................................................................................................................................................................................................................................................................................................................................................................................................
>>>      [exec]     verify that each binary artifact has a deployed POM...
>>>      [exec]     verify that there is an artifact for each POM template...
>>>      [exec] Traceback (most recent call last):
>>>      [exec]   File "/usr/lib/python3.2/xml/etree/ElementTree.py", line 1668, in feed
>>>      [exec]     self._parser.Parse(data, 0)
>>>      [exec] xml.parsers.expat.ExpatError: not well-formed (invalid token): line 1, column 8
>>>      [exec]
>>>      [exec] During handling of the above exception, another exception occurred:
>>>      [exec]
>>>      [exec] Traceback (most recent call last):
>>>      [exec]   File "dev-tools/scripts/smokeTestRelease.py", line 1107, in <module>
>>>      [exec]     main()
>>>      [exec]   File "dev-tools/scripts/smokeTestRelease.py", line 1057, in main
>>>      [exec]     smokeTest(baseURL, version, tmpDir, isSigned)
>>>      [exec]   File "dev-tools/scripts/smokeTestRelease.py", line 1103, in smokeTest
>>>      [exec]     checkMaven(baseURL, tmpDir, version, isSigned)
>>>      [exec]   File "dev-tools/scripts/smokeTestRelease.py", line 688, in checkMaven
>>>      [exec]     verifyArtifactPerPOMtemplate(POMtemplates, artifacts, tmpDir, version)
>>>      [exec]   File "dev-tools/scripts/smokeTestRelease.py", line 985, in verifyArtifactPerPOMtemplate
>>>      [exec]     treeRoot = ET.parse(POMtemplate).getroot()
>>>      [exec]   File "/usr/lib/python3.2/xml/etree/ElementTree.py", line 1223, in parse
>>>      [exec]     tree.parse(source, parser)
>>>      [exec]   File "/usr/lib/python3.2/xml/etree/ElementTree.py", line 678, in parse
>>>      [exec]     parser.feed(data)
>>>      [exec]   File "/usr/lib/python3.2/xml/etree/ElementTree.py", line 1670, in feed
>>>      [exec]     self._raiseerror(v)
>>>      [exec]   File "/usr/lib/python3.2/xml/etree/ElementTree.py", line 1543, in _raiseerror
>>>      [exec]     raise err
>>>      [exec]   File "<string>", line None
>>>      [exec] xml.etree.ElementTree.ParseError: not well-formed (invalid token): line 1, column 8
>>>
>>> BUILD FAILED
>>> <http://sierranevada.servebeer.com/job/Lucene-Solr-40-ReleaseSmoke/ws/build.xml>:279: exec returned: 1
>>>
>>> Total time: 22 minutes 2 seconds
>>> Build step 'Invoke Ant' marked build as failure
>>>
>>> ---------------------------------------------------------------------
>>> To unsubscribe, e-mail: [hidden email]
>>> For additional commands, e-mail: [hidden email]
>>>
>>
>>
>>
>> --
>> lucidworks.com
>>
>> ---------------------------------------------------------------------
>> To unsubscribe, e-mail: [hidden email]
>> For additional commands, e-mail: [hidden email]
>>
>>
>> ---------------------------------------------------------------------
>> To unsubscribe, e-mail: [hidden email]
>> For additional commands, e-mail: [hidden email]
>>
>
>
>
> --
> lucidworks.com



--
lucidworks.com

---------------------------------------------------------------------
To unsubscribe, e-mail: [hidden email]
For additional commands, e-mail: [hidden email]


---------------------------------------------------------------------
To unsubscribe, e-mail: [hidden email]
For additional commands, e-mail: [hidden email]

Reply | Threaded
Open this post in threaded view
|

Re: Build failed in Jenkins: Lucene-Solr-40-ReleaseSmoke #3

Robert Muir
Thanks, I would have heavy-committed it myself but my python skills
are about a zero on a scale of 1 to 10

On Sat, Sep 22, 2012 at 11:48 AM, Steven A Rowe <[hidden email]> wrote:

> Okay, I'll do that.
>
> -----Original Message-----
> From: Robert Muir [mailto:[hidden email]]
> Sent: Saturday, September 22, 2012 11:46 AM
> To: [hidden email]
> Subject: Re: Build failed in Jenkins: Lucene-Solr-40-ReleaseSmoke #3
>
> the check is slow, maybe we could just add some prints to the checker
> in this loop to see what file its complaining about?
>
> my jenkins runs this task about every 22 minutes (i have my desktop
> running it in a loop)
>
> On Sat, Sep 22, 2012 at 11:35 AM, Robert Muir <[hidden email]> wrote:
>> the jenkins job checks out the lucene_solr_4_0 release branch and runs
>> 'ant nightly-smoke -DJAVA6_HOME=xxxx -DJAVA7_HOME=yyyy'
>>
>> On Sat, Sep 22, 2012 at 11:29 AM, Steven A Rowe <[hidden email]> wrote:
>>> The maven checks use python XML parsing, which appears to be complaining about well-formedness of a POM file.
>>>
>>> How is smoketester being run?  Against a file:// url built locally?
>>>
>>> Steve
>>>
>>> -----Original Message-----
>>> From: Robert Muir [mailto:[hidden email]]
>>> Sent: Saturday, September 22, 2012 11:07 AM
>>> To: [hidden email]
>>> Subject: Re: Build failed in Jenkins: Lucene-Solr-40-ReleaseSmoke #3
>>>
>>> I have no idea about what this is, or what is going on here.
>>>
>>> On Sat, Sep 22, 2012 at 10:41 AM,  <[hidden email]> wrote:
>>>>      [exec] Test Maven artifacts for Lucene and Solr...
>>>>      [exec]     get POM templates ...................................................
>>>>      [exec]     download artifacts ........................................................................................................................................................................................................................................................................................................................................................................................................................................................................................................................................................................
>>>>      [exec]     verify that each binary artifact has a deployed POM...
>>>>      [exec]     verify that there is an artifact for each POM template...
>>>>      [exec] Traceback (most recent call last):
>>>>      [exec]   File "/usr/lib/python3.2/xml/etree/ElementTree.py", line 1668, in feed
>>>>      [exec]     self._parser.Parse(data, 0)
>>>>      [exec] xml.parsers.expat.ExpatError: not well-formed (invalid token): line 1, column 8
>>>>      [exec]
>>>>      [exec] During handling of the above exception, another exception occurred:
>>>>      [exec]
>>>>      [exec] Traceback (most recent call last):
>>>>      [exec]   File "dev-tools/scripts/smokeTestRelease.py", line 1107, in <module>
>>>>      [exec]     main()
>>>>      [exec]   File "dev-tools/scripts/smokeTestRelease.py", line 1057, in main
>>>>      [exec]     smokeTest(baseURL, version, tmpDir, isSigned)
>>>>      [exec]   File "dev-tools/scripts/smokeTestRelease.py", line 1103, in smokeTest
>>>>      [exec]     checkMaven(baseURL, tmpDir, version, isSigned)
>>>>      [exec]   File "dev-tools/scripts/smokeTestRelease.py", line 688, in checkMaven
>>>>      [exec]     verifyArtifactPerPOMtemplate(POMtemplates, artifacts, tmpDir, version)
>>>>      [exec]   File "dev-tools/scripts/smokeTestRelease.py", line 985, in verifyArtifactPerPOMtemplate
>>>>      [exec]     treeRoot = ET.parse(POMtemplate).getroot()
>>>>      [exec]   File "/usr/lib/python3.2/xml/etree/ElementTree.py", line 1223, in parse
>>>>      [exec]     tree.parse(source, parser)
>>>>      [exec]   File "/usr/lib/python3.2/xml/etree/ElementTree.py", line 678, in parse
>>>>      [exec]     parser.feed(data)
>>>>      [exec]   File "/usr/lib/python3.2/xml/etree/ElementTree.py", line 1670, in feed
>>>>      [exec]     self._raiseerror(v)
>>>>      [exec]   File "/usr/lib/python3.2/xml/etree/ElementTree.py", line 1543, in _raiseerror
>>>>      [exec]     raise err
>>>>      [exec]   File "<string>", line None
>>>>      [exec] xml.etree.ElementTree.ParseError: not well-formed (invalid token): line 1, column 8
>>>>
>>>> BUILD FAILED
>>>> <http://sierranevada.servebeer.com/job/Lucene-Solr-40-ReleaseSmoke/ws/build.xml>:279: exec returned: 1
>>>>
>>>> Total time: 22 minutes 2 seconds
>>>> Build step 'Invoke Ant' marked build as failure
>>>>
>>>> ---------------------------------------------------------------------
>>>> To unsubscribe, e-mail: [hidden email]
>>>> For additional commands, e-mail: [hidden email]
>>>>
>>>
>>>
>>>
>>> --
>>> lucidworks.com
>>>
>>> ---------------------------------------------------------------------
>>> To unsubscribe, e-mail: [hidden email]
>>> For additional commands, e-mail: [hidden email]
>>>
>>>
>>> ---------------------------------------------------------------------
>>> To unsubscribe, e-mail: [hidden email]
>>> For additional commands, e-mail: [hidden email]
>>>
>>
>>
>>
>> --
>> lucidworks.com
>
>
>
> --
> lucidworks.com
>
> ---------------------------------------------------------------------
> To unsubscribe, e-mail: [hidden email]
> For additional commands, e-mail: [hidden email]
>
>
> ---------------------------------------------------------------------
> To unsubscribe, e-mail: [hidden email]
> For additional commands, e-mail: [hidden email]
>



--
lucidworks.com

---------------------------------------------------------------------
To unsubscribe, e-mail: [hidden email]
For additional commands, e-mail: [hidden email]

Reply | Threaded
Open this post in threaded view
|

Build failed in Jenkins: Lucene-Solr-40-ReleaseSmoke #7

Charlie Cron
In reply to this post by Charlie Cron
See <http://sierranevada.servebeer.com/job/Lucene-Solr-40-ReleaseSmoke/7/>

------------------------------------------
[...truncated 43035 lines...]
     [exec]
     [exec] <http://sierranevada.servebeer.com/job/Lucene-Solr-40-ReleaseSmoke/ws/lucene/build/fakeReleaseTmp/unpack/apache-solr-4.0/solr/build/docs/solr-solrj/org/apache/solr/common/cloud/package-summary.html>
     [exec]   no package description (missing package.html in src?)
     [exec]   missing: ClosableThread
     [exec]   missing: OnReconnect
     [exec]   missing: ZkClientConnectionStrategy.ConnectedListener
     [exec]   missing: ZkClientConnectionStrategy.DisconnectedListener
     [exec]   missing: HashPartitioner.Range
     [exec]   missing: Replica
     [exec]   missing: SolrZooKeeper
     [exec]   missing: ZkClientConnectionStrategy
     [exec]   missing: ZkClientConnectionStrategy.ZkUpdate
     [exec]   missing: ZkCmdExecutor
     [exec]   missing: ZkCoreNodeProps
     [exec]   missing: ZkStateReader
     [exec]   missing: ZooKeeperException
     [exec]
     [exec] <http://sierranevada.servebeer.com/job/Lucene-Solr-40-ReleaseSmoke/ws/lucene/build/fakeReleaseTmp/unpack/apache-solr-4.0/solr/build/docs/solr-solrj/org/apache/solr/client/solrj/package-summary.html>
     [exec]   no package description (missing package.html in src?)
     [exec]   missing: ResponseParser
     [exec]   missing: SolrRequest
     [exec]   missing: SolrResponse
     [exec]   missing: SolrServer
     [exec]   missing: SolrQuery.ORDER
     [exec]   missing: SolrRequest.METHOD
     [exec]
     [exec] <http://sierranevada.servebeer.com/job/Lucene-Solr-40-ReleaseSmoke/ws/lucene/build/fakeReleaseTmp/unpack/apache-solr-4.0/solr/build/docs/solr-solrj/org/apache/solr/client/solrj/request/package-summary.html>
     [exec]   no package description (missing package.html in src?)
     [exec]   missing: JavaBinUpdateRequestCodec.StreamingUpdateHandler
     [exec]   missing: AbstractUpdateRequest
     [exec]   missing: CoreAdminRequest.Create
     [exec]   missing: CoreAdminRequest.MergeIndexes
     [exec]   missing: CoreAdminRequest.Persist
     [exec]   missing: CoreAdminRequest.RequestRecovery
     [exec]   missing: CoreAdminRequest.RequestSyncShard
     [exec]   missing: CoreAdminRequest.Unload
     [exec]   missing: CoreAdminRequest.WaitForState
     [exec]   missing: LukeRequest
     [exec]   missing: QueryRequest
     [exec]   missing: SolrPing
     [exec]   missing: UpdateRequest
     [exec]   missing: UpdateRequestExt
     [exec]   missing: AbstractUpdateRequest.ACTION
     [exec]
     [exec] <http://sierranevada.servebeer.com/job/Lucene-Solr-40-ReleaseSmoke/ws/lucene/build/fakeReleaseTmp/unpack/apache-solr-4.0/solr/build/docs/solr-solrj/org/apache/solr/client/solrj/util/package-summary.html>
     [exec]   no package description (missing package.html in src?)
     [exec]   missing: ClientUtils
     [exec]
     [exec] <http://sierranevada.servebeer.com/job/Lucene-Solr-40-ReleaseSmoke/ws/lucene/build/fakeReleaseTmp/unpack/apache-solr-4.0/solr/build/docs/solr-solrj/org/apache/solr/client/solrj/beans/package-summary.html>
     [exec]   no package description (missing package.html in src?)
     [exec]   missing: BindingException
     [exec]   missing: Field
     [exec]
     [exec] <http://sierranevada.servebeer.com/job/Lucene-Solr-40-ReleaseSmoke/ws/lucene/build/fakeReleaseTmp/unpack/apache-solr-4.0/solr/build/docs/solr-solrj/org/apache/solr/client/solrj/response/package-summary.html>
     [exec]   no package description (missing package.html in src?)
     [exec]   missing: CoreAdminResponse
     [exec]   missing: FacetField.Count
     [exec]   missing: LukeResponse.FieldInfo
     [exec]   missing: LukeResponse.FieldTypeInfo
     [exec]   missing: PivotField
     [exec]   missing: QueryResponse
     [exec]   missing: RangeFacet.Count
     [exec]   missing: RangeFacet.Date
     [exec]   missing: RangeFacet.Numeric
     [exec]   missing: SolrPingResponse
     [exec]   missing: SolrResponseBase
     [exec]   missing: SpellCheckResponse.Suggestion
     [exec]   missing: TermsResponse.Term
     [exec]
     [exec] <http://sierranevada.servebeer.com/job/Lucene-Solr-40-ReleaseSmoke/ws/lucene/build/fakeReleaseTmp/unpack/apache-solr-4.0/solr/build/docs/solr-solrj/org/apache/solr/client/solrj/impl/package-summary.html>
     [exec]   no package description (missing package.html in src?)
     [exec]   missing: BinaryResponseParser
     [exec]   missing: HttpSolrServer
     [exec]   missing: LBHttpSolrServer.Req
     [exec]   missing: LBHttpSolrServer.Rsp
     [exec]   missing: XMLResponseParser
     [exec]   missing: XMLResponseParser.KnownType
     [exec]
     [exec] <http://sierranevada.servebeer.com/job/Lucene-Solr-40-ReleaseSmoke/ws/lucene/build/fakeReleaseTmp/unpack/apache-solr-4.0/solr/build/docs/solr-solrj/org/apache/noggit/package-summary.html>
     [exec]   no package description (missing package.html in src?)
     [exec]   missing: CharArr
     [exec]   missing: CharUtil
     [exec]   missing: JSONParser
     [exec]   missing: JSONUtil
     [exec]   missing: JSONWriter
     [exec]   missing: ObjectBuilder
     [exec]   missing: JSONParser.ParseException
     [exec]
     [exec] <http://sierranevada.servebeer.com/job/Lucene-Solr-40-ReleaseSmoke/ws/lucene/build/fakeReleaseTmp/unpack/apache-solr-4.0/solr/build/docs/solr-uima/overview-summary.html>
     [exec]   missing: org.apache.solr.uima.processor
     [exec]   missing: org.apache.solr.uima.processor.exception
     [exec]
     [exec] <http://sierranevada.servebeer.com/job/Lucene-Solr-40-ReleaseSmoke/ws/lucene/build/fakeReleaseTmp/unpack/apache-solr-4.0/solr/build/docs/solr-uima/org/apache/solr/uima/processor/package-summary.html>
     [exec]   no package description (missing package.html in src?)
     [exec]
     [exec] <http://sierranevada.servebeer.com/job/Lucene-Solr-40-ReleaseSmoke/ws/lucene/build/fakeReleaseTmp/unpack/apache-solr-4.0/solr/build/docs/solr-uima/org/apache/solr/uima/processor/exception/package-summary.html>
     [exec]   no package description (missing package.html in src?)
     [exec]
     [exec] <http://sierranevada.servebeer.com/job/Lucene-Solr-40-ReleaseSmoke/ws/lucene/build/fakeReleaseTmp/unpack/apache-solr-4.0/solr/build/docs/solr-dataimporthandler/overview-summary.html>
     [exec]   missing: org.apache.solr.handler.dataimport
     [exec]   missing: org.apache.solr.handler.dataimport.config
     [exec]
     [exec] <http://sierranevada.servebeer.com/job/Lucene-Solr-40-ReleaseSmoke/ws/lucene/build/fakeReleaseTmp/unpack/apache-solr-4.0/solr/build/docs/solr-dataimporthandler/org/apache/solr/handler/dataimport/package-summary.html>
     [exec]   no package description (missing package.html in src?)
     [exec]   missing: DIHPropertiesWriter
     [exec]   missing: DIHWriter
     [exec]   missing: CachePropertyUtil
     [exec]   missing: ConfigParseUtil
     [exec]   missing: DebugInfo
     [exec]   missing: DIHCacheSupport
     [exec]   missing: DIHWriterBase
     [exec]   missing: DocBuilder.Statistics
     [exec]   missing: EvaluatorBag.VariableWrapper
     [exec]   missing: RequestInfo
     [exec]   missing: SimplePropertiesWriter
     [exec]   missing: SortedMapBackedCache
     [exec]   missing: ZKPropertiesWriter
     [exec]   missing: DataImporter.Status
     [exec]   missing: DIHLogLevels
     [exec]
     [exec] <http://sierranevada.servebeer.com/job/Lucene-Solr-40-ReleaseSmoke/ws/lucene/build/fakeReleaseTmp/unpack/apache-solr-4.0/solr/build/docs/solr-dataimporthandler/org/apache/solr/handler/dataimport/config/package-summary.html>
     [exec]   no package description (missing package.html in src?)
     [exec]   missing: ConfigNameConstants
     [exec]   missing: ConfigParseUtil
     [exec]   missing: Entity
     [exec]   missing: EntityField
     [exec]   missing: EntityField.Builder
     [exec]   missing: Field
     [exec]   missing: Field.Builder
     [exec]   missing: Script
     [exec]
     [exec] <http://sierranevada.servebeer.com/job/Lucene-Solr-40-ReleaseSmoke/ws/lucene/build/fakeReleaseTmp/unpack/apache-solr-4.0/solr/build/docs/solr-cell/overview-summary.html>
     [exec]   missing: org.apache.solr.handler.extraction
     [exec]
     [exec] <http://sierranevada.servebeer.com/job/Lucene-Solr-40-ReleaseSmoke/ws/lucene/build/fakeReleaseTmp/unpack/apache-solr-4.0/solr/build/docs/solr-cell/org/apache/solr/handler/extraction/package-summary.html>
     [exec]   no package description (missing package.html in src?)
     [exec]   missing: SolrContentHandlerFactory
     [exec]
     [exec] <http://sierranevada.servebeer.com/job/Lucene-Solr-40-ReleaseSmoke/ws/lucene/build/fakeReleaseTmp/unpack/apache-solr-4.0/solr/build/docs/solr-test-framework/overview-summary.html>
     [exec]   missing: org.apache.solr
     [exec]   missing: org.apache.solr.analysis
     [exec]   missing: org.apache.solr.cloud
     [exec]   missing: org.apache.solr.core
     [exec]   missing: org.apache.solr.update.processor
     [exec]   missing: org.apache.solr.util
     [exec]
     [exec] <http://sierranevada.servebeer.com/job/Lucene-Solr-40-ReleaseSmoke/ws/lucene/build/fakeReleaseTmp/unpack/apache-solr-4.0/solr/build/docs/solr-test-framework/org/apache/solr/package-summary.html>
     [exec]   no package description (missing package.html in src?)
     [exec]   missing: BaseDistributedSearchTestCase.RandDate
     [exec]   missing: BaseDistributedSearchTestCase.RandVal
     [exec]   missing: JSONTestUtil
     [exec]   missing: SolrJettyTestBase
     [exec]   missing: SolrTestCaseJ4.Doc
     [exec]   missing: SolrTestCaseJ4.Fld
     [exec]   missing: SolrTestCaseJ4.FVal
     [exec]   missing: SolrTestCaseJ4.IRange
     [exec]   missing: SolrTestCaseJ4.IVals
     [exec]   missing: SolrTestCaseJ4.SVal
     [exec]   missing: SolrTestCaseJ4.Vals
     [exec]
     [exec] <http://sierranevada.servebeer.com/job/Lucene-Solr-40-ReleaseSmoke/ws/lucene/build/fakeReleaseTmp/unpack/apache-solr-4.0/solr/build/docs/solr-test-framework/org/apache/solr/util/package-summary.html>
     [exec]   no package description (missing package.html in src?)
     [exec]   missing: DOMUtilTestBase
     [exec]   missing: RevertDefaultThreadHandlerRule
     [exec]
     [exec] <http://sierranevada.servebeer.com/job/Lucene-Solr-40-ReleaseSmoke/ws/lucene/build/fakeReleaseTmp/unpack/apache-solr-4.0/solr/build/docs/solr-test-framework/org/apache/solr/core/package-summary.html>
     [exec]   no package description (missing package.html in src?)
     [exec]
     [exec] <http://sierranevada.servebeer.com/job/Lucene-Solr-40-ReleaseSmoke/ws/lucene/build/fakeReleaseTmp/unpack/apache-solr-4.0/solr/build/docs/solr-test-framework/org/apache/solr/update/processor/package-summary.html>
     [exec]   no package description (missing package.html in src?)
     [exec]   missing: BufferingRequestProcessor
     [exec]
     [exec] <http://sierranevada.servebeer.com/job/Lucene-Solr-40-ReleaseSmoke/ws/lucene/build/fakeReleaseTmp/unpack/apache-solr-4.0/solr/build/docs/solr-test-framework/org/apache/solr/cloud/package-summary.html>
     [exec]   no package description (missing package.html in src?)
     [exec]   missing: AbstractDistribZkTestBase
     [exec]   missing: AbstractFullDistribZkTestBase.CloudJettyRunner
     [exec]   missing: ZkTestServer
     [exec]   missing: ZkTestServer.HostPort
     [exec]
     [exec] <http://sierranevada.servebeer.com/job/Lucene-Solr-40-ReleaseSmoke/ws/lucene/build/fakeReleaseTmp/unpack/apache-solr-4.0/solr/build/docs/solr-test-framework/org/apache/solr/analysis/package-summary.html>
     [exec]   no package description (missing package.html in src?)
     [exec]
     [exec] <http://sierranevada.servebeer.com/job/Lucene-Solr-40-ReleaseSmoke/ws/lucene/build/fakeReleaseTmp/unpack/apache-solr-4.0/solr/build/docs/solr-dataimporthandler-extras/overview-summary.html>
     [exec]   missing: org.apache.solr.handler.dataimport
     [exec]
     [exec] <http://sierranevada.servebeer.com/job/Lucene-Solr-40-ReleaseSmoke/ws/lucene/build/fakeReleaseTmp/unpack/apache-solr-4.0/solr/build/docs/solr-dataimporthandler-extras/org/apache/solr/handler/dataimport/package-summary.html>
     [exec]   no package description (missing package.html in src?)
     [exec]   missing: MailEntityProcessor.CustomFilter
     [exec]
     [exec] ***WARNING***: javadocs want to fail!
     [exec]
     [exec]
     [exec] Crawl/parse...
     [exec]
     [exec] Verify...
     [exec]     test solr example w/ Java 6...
     [exec]       start Solr instance (log=<http://sierranevada.servebeer.com/job/Lucene-Solr-40-ReleaseSmoke/ws/lucene/build/fakeReleaseTmp/unpack/apache-solr-4.0/solr-example.log)...>
     [exec]       startup done
     [exec]       test utf8...
     [exec]       index example docs...
     [exec]       run query...
     [exec]       stop server (SIGINT)...
     [exec]     test solr example w/ Java 7...
     [exec]       start Solr instance (log=<http://sierranevada.servebeer.com/job/Lucene-Solr-40-ReleaseSmoke/ws/lucene/build/fakeReleaseTmp/unpack/apache-solr-4.0/solr-example.log)...>
     [exec]       startup done
     [exec]       test utf8...
     [exec]       index example docs...
     [exec]       run query...
     [exec]       stop server (SIGINT)...
     [exec]     check NOTICE
     [exec] Test Maven artifacts for Lucene and Solr...
     [exec]     get POM templates ...................................................
     [exec] Traceback (most recent call last):
     [exec]   File "/usr/lib/python3.2/xml/etree/ElementTree.py", line 1668, in feed
     [exec]     self._parser.Parse(data, 0)
     [exec] xml.parsers.expat.ExpatError: not well-formed (invalid token): line 1, column 8
     [exec]
     [exec] During handling of the above exception, another exception occurred:
     [exec]
     [exec] Traceback (most recent call last):
     [exec]   File "dev-tools/scripts/smokeTestRelease.py", line 1107, in <module>
     [exec]     main()
     [exec]   File "dev-tools/scripts/smokeTestRelease.py", line 1057, in main
     [exec]     smokeTest(baseURL, version, tmpDir, isSigned)
     [exec]   File "dev-tools/scripts/smokeTestRelease.py", line 1103, in smokeTest
     [exec]     checkMaven(baseURL, tmpDir, version, isSigned)
     [exec]   File "dev-tools/scripts/smokeTestRelease.py", line 688, in checkMaven
     [exec]     verifyArtifactPerPOMtemplate(POMtemplates, artifacts, tmpDir, version)
     [exec]   File "dev-tools/scripts/smokeTestRelease.py", line 985, in verifyArtifactPerPOMtemplate
     [exec]     treeRoot = ET.parse(POMtemplate).getroot()
     [exec]   File "/usr/lib/python3.2/xml/etree/ElementTree.py", line 1223, in parse
     [exec]     tree.parse(source, parser)
     [exec]   File "/usr/lib/python3.2/xml/etree/ElementTree.py", line 678, in parse
     [exec]     parser.feed(data)
     [exec]   File "/usr/lib/python3.2/xml/etree/ElementTree.py", line 1670, in feed
     [exec]     self._raiseerror(v)
     [exec]   File "/usr/lib/python3.2/xml/etree/ElementTree.py", line 1543, in _raiseerror
     [exec]     raise err
     [exec]   File "<string>", line None
     [exec] xml.etree.ElementTree.ParseError: not well-formed (invalid token): line 1, column 8
     [exec]     download artifacts ........................................................................................................................................................................................................................................................................................................................................................................................................................................................................................................................................................................
     [exec]     verify that each binary artifact has a deployed POM...
     [exec]     verify that there is an artifact for each POM template...

BUILD FAILED
<http://sierranevada.servebeer.com/job/Lucene-Solr-40-ReleaseSmoke/ws/build.xml>:279: exec returned: 1

Total time: 21 minutes 18 seconds
Build step 'Invoke Ant' marked build as failure

---------------------------------------------------------------------
To unsubscribe, e-mail: [hidden email]
For additional commands, e-mail: [hidden email]

Reply | Threaded
Open this post in threaded view
|

RE: Build failed in Jenkins: Lucene-Solr-40-ReleaseSmoke #3

Uwe Schindler
In reply to this post by Robert Muir
I have to give up, too.

From my minimal knowledge I see:
- The maven artifact poms are fine and parese
- The maven templates in dev-tools seem also to be parsed with XML parsers. As they are only "templates", I am not sure if we can require them to be valid XML! If this is not the case, I would disable those 2 lines for now:

  print('    verify that there is an artifact for each POM template...')
  verifyArtifactPerPOMtemplate(POMtemplates, artifacts, tmpDir, version)

and:

  print('    verify that all non-Mavenized deps are deployed...')
  nonMavenizedDeps = dict()
  checkNonMavenizedDeps(nonMavenizedDeps, POMtemplates, artifacts, tmpDir,
                        version, releaseBranchSvnURL)

-----
Uwe Schindler
H.-H.-Meier-Allee 63, D-28213 Bremen
http://www.thetaphi.de
eMail: [hidden email]


> -----Original Message-----
> From: Robert Muir [mailto:[hidden email]]
> Sent: Saturday, September 22, 2012 5:50 PM
> To: [hidden email]
> Subject: Re: Build failed in Jenkins: Lucene-Solr-40-ReleaseSmoke #3
>
> Thanks, I would have heavy-committed it myself but my python skills are about
> a zero on a scale of 1 to 10
>
> On Sat, Sep 22, 2012 at 11:48 AM, Steven A Rowe <[hidden email]> wrote:
> > Okay, I'll do that.
> >
> > -----Original Message-----
> > From: Robert Muir [mailto:[hidden email]]
> > Sent: Saturday, September 22, 2012 11:46 AM
> > To: [hidden email]
> > Subject: Re: Build failed in Jenkins: Lucene-Solr-40-ReleaseSmoke #3
> >
> > the check is slow, maybe we could just add some prints to the checker
> > in this loop to see what file its complaining about?
> >
> > my jenkins runs this task about every 22 minutes (i have my desktop
> > running it in a loop)
> >
> > On Sat, Sep 22, 2012 at 11:35 AM, Robert Muir <[hidden email]> wrote:
> >> the jenkins job checks out the lucene_solr_4_0 release branch and
> >> runs 'ant nightly-smoke -DJAVA6_HOME=xxxx -DJAVA7_HOME=yyyy'
> >>
> >> On Sat, Sep 22, 2012 at 11:29 AM, Steven A Rowe <[hidden email]> wrote:
> >>> The maven checks use python XML parsing, which appears to be
> complaining about well-formedness of a POM file.
> >>>
> >>> How is smoketester being run?  Against a file:// url built locally?
> >>>
> >>> Steve
> >>>
> >>> -----Original Message-----
> >>> From: Robert Muir [mailto:[hidden email]]
> >>> Sent: Saturday, September 22, 2012 11:07 AM
> >>> To: [hidden email]
> >>> Subject: Re: Build failed in Jenkins: Lucene-Solr-40-ReleaseSmoke #3
> >>>
> >>> I have no idea about what this is, or what is going on here.
> >>>
> >>> On Sat, Sep 22, 2012 at 10:41 AM,  <[hidden email]> wrote:
> >>>>      [exec] Test Maven artifacts for Lucene and Solr...
> >>>>      [exec]     get POM templates ...................................................
> >>>>      [exec]     download artifacts
> .................................................................................................................................
> .................................................................................................................................
> .................................................................................................................................
> .................................................................................................................................
> ....................................
> >>>>      [exec]     verify that each binary artifact has a deployed POM...
> >>>>      [exec]     verify that there is an artifact for each POM template...
> >>>>      [exec] Traceback (most recent call last):
> >>>>      [exec]   File "/usr/lib/python3.2/xml/etree/ElementTree.py", line 1668,
> in feed
> >>>>      [exec]     self._parser.Parse(data, 0)
> >>>>      [exec] xml.parsers.expat.ExpatError: not well-formed (invalid token):
> line 1, column 8
> >>>>      [exec]
> >>>>      [exec] During handling of the above exception, another exception
> occurred:
> >>>>      [exec]
> >>>>      [exec] Traceback (most recent call last):
> >>>>      [exec]   File "dev-tools/scripts/smokeTestRelease.py", line 1107, in
> <module>
> >>>>      [exec]     main()
> >>>>      [exec]   File "dev-tools/scripts/smokeTestRelease.py", line 1057, in
> main
> >>>>      [exec]     smokeTest(baseURL, version, tmpDir, isSigned)
> >>>>      [exec]   File "dev-tools/scripts/smokeTestRelease.py", line 1103, in
> smokeTest
> >>>>      [exec]     checkMaven(baseURL, tmpDir, version, isSigned)
> >>>>      [exec]   File "dev-tools/scripts/smokeTestRelease.py", line 688, in
> checkMaven
> >>>>      [exec]     verifyArtifactPerPOMtemplate(POMtemplates, artifacts,
> tmpDir, version)
> >>>>      [exec]   File "dev-tools/scripts/smokeTestRelease.py", line 985, in
> verifyArtifactPerPOMtemplate
> >>>>      [exec]     treeRoot = ET.parse(POMtemplate).getroot()
> >>>>      [exec]   File "/usr/lib/python3.2/xml/etree/ElementTree.py", line 1223,
> in parse
> >>>>      [exec]     tree.parse(source, parser)
> >>>>      [exec]   File "/usr/lib/python3.2/xml/etree/ElementTree.py", line 678,
> in parse
> >>>>      [exec]     parser.feed(data)
> >>>>      [exec]   File "/usr/lib/python3.2/xml/etree/ElementTree.py", line 1670,
> in feed
> >>>>      [exec]     self._raiseerror(v)
> >>>>      [exec]   File "/usr/lib/python3.2/xml/etree/ElementTree.py", line 1543,
> in _raiseerror
> >>>>      [exec]     raise err
> >>>>      [exec]   File "<string>", line None
> >>>>      [exec] xml.etree.ElementTree.ParseError: not well-formed
> >>>> (invalid token): line 1, column 8
> >>>>
> >>>> BUILD FAILED
> >>>> <http://sierranevada.servebeer.com/job/Lucene-Solr-40-ReleaseSmoke/
> >>>> ws/build.xml>:279: exec returned: 1
> >>>>
> >>>> Total time: 22 minutes 2 seconds
> >>>> Build step 'Invoke Ant' marked build as failure
> >>>>
> >>>> -------------------------------------------------------------------
> >>>> -- To unsubscribe, e-mail: [hidden email] For
> >>>> additional commands, e-mail: [hidden email]
> >>>>
> >>>
> >>>
> >>>
> >>> --
> >>> lucidworks.com
> >>>
> >>> --------------------------------------------------------------------
> >>> - To unsubscribe, e-mail: [hidden email] For
> >>> additional commands, e-mail: [hidden email]
> >>>
> >>>
> >>> --------------------------------------------------------------------
> >>> - To unsubscribe, e-mail: [hidden email] For
> >>> additional commands, e-mail: [hidden email]
> >>>
> >>
> >>
> >>
> >> --
> >> lucidworks.com
> >
> >
> >
> > --
> > lucidworks.com
> >
> > ---------------------------------------------------------------------
> > To unsubscribe, e-mail: [hidden email] For
> > additional commands, e-mail: [hidden email]
> >
> >
> > ---------------------------------------------------------------------
> > To unsubscribe, e-mail: [hidden email] For
> > additional commands, e-mail: [hidden email]
> >
>
>
>
> --
> lucidworks.com
>
> ---------------------------------------------------------------------
> To unsubscribe, e-mail: [hidden email] For additional
> commands, e-mail: [hidden email]


---------------------------------------------------------------------
To unsubscribe, e-mail: [hidden email]
For additional commands, e-mail: [hidden email]

Reply | Threaded
Open this post in threaded view
|

RE: Build failed in Jenkins: Lucene-Solr-40-ReleaseSmoke #3

steve_rowe
In reply to this post by Robert Muir
committed debug printing to lucene_solr_4_0 branch r1388826

-----Original Message-----
From: Robert Muir [mailto:[hidden email]]
Sent: Saturday, September 22, 2012 11:46 AM
To: [hidden email]
Subject: Re: Build failed in Jenkins: Lucene-Solr-40-ReleaseSmoke #3

the check is slow, maybe we could just add some prints to the checker
in this loop to see what file its complaining about?

my jenkins runs this task about every 22 minutes (i have my desktop
running it in a loop)

On Sat, Sep 22, 2012 at 11:35 AM, Robert Muir <[hidden email]> wrote:

> the jenkins job checks out the lucene_solr_4_0 release branch and runs
> 'ant nightly-smoke -DJAVA6_HOME=xxxx -DJAVA7_HOME=yyyy'
>
> On Sat, Sep 22, 2012 at 11:29 AM, Steven A Rowe <[hidden email]> wrote:
>> The maven checks use python XML parsing, which appears to be complaining about well-formedness of a POM file.
>>
>> How is smoketester being run?  Against a file:// url built locally?
>>
>> Steve
>>
>> -----Original Message-----
>> From: Robert Muir [mailto:[hidden email]]
>> Sent: Saturday, September 22, 2012 11:07 AM
>> To: [hidden email]
>> Subject: Re: Build failed in Jenkins: Lucene-Solr-40-ReleaseSmoke #3
>>
>> I have no idea about what this is, or what is going on here.
>>
>> On Sat, Sep 22, 2012 at 10:41 AM,  <[hidden email]> wrote:
>>>      [exec] Test Maven artifacts for Lucene and Solr...
>>>      [exec]     get POM templates ...................................................
>>>      [exec]     download artifacts ........................................................................................................................................................................................................................................................................................................................................................................................................................................................................................................................................................................
>>>      [exec]     verify that each binary artifact has a deployed POM...
>>>      [exec]     verify that there is an artifact for each POM template...
>>>      [exec] Traceback (most recent call last):
>>>      [exec]   File "/usr/lib/python3.2/xml/etree/ElementTree.py", line 1668, in feed
>>>      [exec]     self._parser.Parse(data, 0)
>>>      [exec] xml.parsers.expat.ExpatError: not well-formed (invalid token): line 1, column 8
>>>      [exec]
>>>      [exec] During handling of the above exception, another exception occurred:
>>>      [exec]
>>>      [exec] Traceback (most recent call last):
>>>      [exec]   File "dev-tools/scripts/smokeTestRelease.py", line 1107, in <module>
>>>      [exec]     main()
>>>      [exec]   File "dev-tools/scripts/smokeTestRelease.py", line 1057, in main
>>>      [exec]     smokeTest(baseURL, version, tmpDir, isSigned)
>>>      [exec]   File "dev-tools/scripts/smokeTestRelease.py", line 1103, in smokeTest
>>>      [exec]     checkMaven(baseURL, tmpDir, version, isSigned)
>>>      [exec]   File "dev-tools/scripts/smokeTestRelease.py", line 688, in checkMaven
>>>      [exec]     verifyArtifactPerPOMtemplate(POMtemplates, artifacts, tmpDir, version)
>>>      [exec]   File "dev-tools/scripts/smokeTestRelease.py", line 985, in verifyArtifactPerPOMtemplate
>>>      [exec]     treeRoot = ET.parse(POMtemplate).getroot()
>>>      [exec]   File "/usr/lib/python3.2/xml/etree/ElementTree.py", line 1223, in parse
>>>      [exec]     tree.parse(source, parser)
>>>      [exec]   File "/usr/lib/python3.2/xml/etree/ElementTree.py", line 678, in parse
>>>      [exec]     parser.feed(data)
>>>      [exec]   File "/usr/lib/python3.2/xml/etree/ElementTree.py", line 1670, in feed
>>>      [exec]     self._raiseerror(v)
>>>      [exec]   File "/usr/lib/python3.2/xml/etree/ElementTree.py", line 1543, in _raiseerror
>>>      [exec]     raise err
>>>      [exec]   File "<string>", line None
>>>      [exec] xml.etree.ElementTree.ParseError: not well-formed (invalid token): line 1, column 8
>>>
>>> BUILD FAILED
>>> <http://sierranevada.servebeer.com/job/Lucene-Solr-40-ReleaseSmoke/ws/build.xml>:279: exec returned: 1
>>>
>>> Total time: 22 minutes 2 seconds
>>> Build step 'Invoke Ant' marked build as failure
>>>
>>> ---------------------------------------------------------------------
>>> To unsubscribe, e-mail: [hidden email]
>>> For additional commands, e-mail: [hidden email]
>>>
>>
>>
>>
>> --
>> lucidworks.com
>>
>> ---------------------------------------------------------------------
>> To unsubscribe, e-mail: [hidden email]
>> For additional commands, e-mail: [hidden email]
>>
>>
>> ---------------------------------------------------------------------
>> To unsubscribe, e-mail: [hidden email]
>> For additional commands, e-mail: [hidden email]
>>
>
>
>
> --
> lucidworks.com



--
lucidworks.com

---------------------------------------------------------------------
To unsubscribe, e-mail: [hidden email]
For additional commands, e-mail: [hidden email]


---------------------------------------------------------------------
To unsubscribe, e-mail: [hidden email]
For additional commands, e-mail: [hidden email]

Reply | Threaded
Open this post in threaded view
|

Re: Build failed in Jenkins: Lucene-Solr-40-ReleaseSmoke #3

Robert Muir
I started a new jenkins run:

http://sierranevada.servebeer.com/job/Lucene-Solr-40-ReleaseSmoke/9/console

On Sat, Sep 22, 2012 at 12:14 PM, Steven A Rowe <[hidden email]> wrote:

> committed debug printing to lucene_solr_4_0 branch r1388826
>
> -----Original Message-----
> From: Robert Muir [mailto:[hidden email]]
> Sent: Saturday, September 22, 2012 11:46 AM
> To: [hidden email]
> Subject: Re: Build failed in Jenkins: Lucene-Solr-40-ReleaseSmoke #3
>
> the check is slow, maybe we could just add some prints to the checker
> in this loop to see what file its complaining about?
>
> my jenkins runs this task about every 22 minutes (i have my desktop
> running it in a loop)
>
> On Sat, Sep 22, 2012 at 11:35 AM, Robert Muir <[hidden email]> wrote:
>> the jenkins job checks out the lucene_solr_4_0 release branch and runs
>> 'ant nightly-smoke -DJAVA6_HOME=xxxx -DJAVA7_HOME=yyyy'
>>
>> On Sat, Sep 22, 2012 at 11:29 AM, Steven A Rowe <[hidden email]> wrote:
>>> The maven checks use python XML parsing, which appears to be complaining about well-formedness of a POM file.
>>>
>>> How is smoketester being run?  Against a file:// url built locally?
>>>
>>> Steve
>>>
>>> -----Original Message-----
>>> From: Robert Muir [mailto:[hidden email]]
>>> Sent: Saturday, September 22, 2012 11:07 AM
>>> To: [hidden email]
>>> Subject: Re: Build failed in Jenkins: Lucene-Solr-40-ReleaseSmoke #3
>>>
>>> I have no idea about what this is, or what is going on here.
>>>
>>> On Sat, Sep 22, 2012 at 10:41 AM,  <[hidden email]> wrote:
>>>>      [exec] Test Maven artifacts for Lucene and Solr...
>>>>      [exec]     get POM templates ...................................................
>>>>      [exec]     download artifacts ........................................................................................................................................................................................................................................................................................................................................................................................................................................................................................................................................................................
>>>>      [exec]     verify that each binary artifact has a deployed POM...
>>>>      [exec]     verify that there is an artifact for each POM template...
>>>>      [exec] Traceback (most recent call last):
>>>>      [exec]   File "/usr/lib/python3.2/xml/etree/ElementTree.py", line 1668, in feed
>>>>      [exec]     self._parser.Parse(data, 0)
>>>>      [exec] xml.parsers.expat.ExpatError: not well-formed (invalid token): line 1, column 8
>>>>      [exec]
>>>>      [exec] During handling of the above exception, another exception occurred:
>>>>      [exec]
>>>>      [exec] Traceback (most recent call last):
>>>>      [exec]   File "dev-tools/scripts/smokeTestRelease.py", line 1107, in <module>
>>>>      [exec]     main()
>>>>      [exec]   File "dev-tools/scripts/smokeTestRelease.py", line 1057, in main
>>>>      [exec]     smokeTest(baseURL, version, tmpDir, isSigned)
>>>>      [exec]   File "dev-tools/scripts/smokeTestRelease.py", line 1103, in smokeTest
>>>>      [exec]     checkMaven(baseURL, tmpDir, version, isSigned)
>>>>      [exec]   File "dev-tools/scripts/smokeTestRelease.py", line 688, in checkMaven
>>>>      [exec]     verifyArtifactPerPOMtemplate(POMtemplates, artifacts, tmpDir, version)
>>>>      [exec]   File "dev-tools/scripts/smokeTestRelease.py", line 985, in verifyArtifactPerPOMtemplate
>>>>      [exec]     treeRoot = ET.parse(POMtemplate).getroot()
>>>>      [exec]   File "/usr/lib/python3.2/xml/etree/ElementTree.py", line 1223, in parse
>>>>      [exec]     tree.parse(source, parser)
>>>>      [exec]   File "/usr/lib/python3.2/xml/etree/ElementTree.py", line 678, in parse
>>>>      [exec]     parser.feed(data)
>>>>      [exec]   File "/usr/lib/python3.2/xml/etree/ElementTree.py", line 1670, in feed
>>>>      [exec]     self._raiseerror(v)
>>>>      [exec]   File "/usr/lib/python3.2/xml/etree/ElementTree.py", line 1543, in _raiseerror
>>>>      [exec]     raise err
>>>>      [exec]   File "<string>", line None
>>>>      [exec] xml.etree.ElementTree.ParseError: not well-formed (invalid token): line 1, column 8
>>>>
>>>> BUILD FAILED
>>>> <http://sierranevada.servebeer.com/job/Lucene-Solr-40-ReleaseSmoke/ws/build.xml>:279: exec returned: 1
>>>>
>>>> Total time: 22 minutes 2 seconds
>>>> Build step 'Invoke Ant' marked build as failure
>>>>
>>>> ---------------------------------------------------------------------
>>>> To unsubscribe, e-mail: [hidden email]
>>>> For additional commands, e-mail: [hidden email]
>>>>
>>>
>>>
>>>
>>> --
>>> lucidworks.com
>>>
>>> ---------------------------------------------------------------------
>>> To unsubscribe, e-mail: [hidden email]
>>> For additional commands, e-mail: [hidden email]
>>>
>>>
>>> ---------------------------------------------------------------------
>>> To unsubscribe, e-mail: [hidden email]
>>> For additional commands, e-mail: [hidden email]
>>>
>>
>>
>>
>> --
>> lucidworks.com
>
>
>
> --
> lucidworks.com
>
> ---------------------------------------------------------------------
> To unsubscribe, e-mail: [hidden email]
> For additional commands, e-mail: [hidden email]
>



--
lucidworks.com

---------------------------------------------------------------------
To unsubscribe, e-mail: [hidden email]
For additional commands, e-mail: [hidden email]

Reply | Threaded
Open this post in threaded view
|

Re: Build failed in Jenkins: Lucene-Solr-40-ReleaseSmoke #3

Robert Muir
AHA

     [exec]       Checking POM template
/home/rmuir/.jenkins/workspace/Lucene-Solr-40-ReleaseSmoke/lucene/build/fakeReleaseTmp/dev-tools/maven/solr/maven.testlogging.properties



On Sat, Sep 22, 2012 at 12:17 PM, Robert Muir <[hidden email]> wrote:

> I started a new jenkins run:
>
> http://sierranevada.servebeer.com/job/Lucene-Solr-40-ReleaseSmoke/9/console
>
> On Sat, Sep 22, 2012 at 12:14 PM, Steven A Rowe <[hidden email]> wrote:
>> committed debug printing to lucene_solr_4_0 branch r1388826
>>
>> -----Original Message-----
>> From: Robert Muir [mailto:[hidden email]]
>> Sent: Saturday, September 22, 2012 11:46 AM
>> To: [hidden email]
>> Subject: Re: Build failed in Jenkins: Lucene-Solr-40-ReleaseSmoke #3
>>
>> the check is slow, maybe we could just add some prints to the checker
>> in this loop to see what file its complaining about?
>>
>> my jenkins runs this task about every 22 minutes (i have my desktop
>> running it in a loop)
>>
>> On Sat, Sep 22, 2012 at 11:35 AM, Robert Muir <[hidden email]> wrote:
>>> the jenkins job checks out the lucene_solr_4_0 release branch and runs
>>> 'ant nightly-smoke -DJAVA6_HOME=xxxx -DJAVA7_HOME=yyyy'
>>>
>>> On Sat, Sep 22, 2012 at 11:29 AM, Steven A Rowe <[hidden email]> wrote:
>>>> The maven checks use python XML parsing, which appears to be complaining about well-formedness of a POM file.
>>>>
>>>> How is smoketester being run?  Against a file:// url built locally?
>>>>
>>>> Steve
>>>>
>>>> -----Original Message-----
>>>> From: Robert Muir [mailto:[hidden email]]
>>>> Sent: Saturday, September 22, 2012 11:07 AM
>>>> To: [hidden email]
>>>> Subject: Re: Build failed in Jenkins: Lucene-Solr-40-ReleaseSmoke #3
>>>>
>>>> I have no idea about what this is, or what is going on here.
>>>>
>>>> On Sat, Sep 22, 2012 at 10:41 AM,  <[hidden email]> wrote:
>>>>>      [exec] Test Maven artifacts for Lucene and Solr...
>>>>>      [exec]     get POM templates ...................................................
>>>>>      [exec]     download artifacts ........................................................................................................................................................................................................................................................................................................................................................................................................................................................................................................................................................................
>>>>>      [exec]     verify that each binary artifact has a deployed POM...
>>>>>      [exec]     verify that there is an artifact for each POM template...
>>>>>      [exec] Traceback (most recent call last):
>>>>>      [exec]   File "/usr/lib/python3.2/xml/etree/ElementTree.py", line 1668, in feed
>>>>>      [exec]     self._parser.Parse(data, 0)
>>>>>      [exec] xml.parsers.expat.ExpatError: not well-formed (invalid token): line 1, column 8
>>>>>      [exec]
>>>>>      [exec] During handling of the above exception, another exception occurred:
>>>>>      [exec]
>>>>>      [exec] Traceback (most recent call last):
>>>>>      [exec]   File "dev-tools/scripts/smokeTestRelease.py", line 1107, in <module>
>>>>>      [exec]     main()
>>>>>      [exec]   File "dev-tools/scripts/smokeTestRelease.py", line 1057, in main
>>>>>      [exec]     smokeTest(baseURL, version, tmpDir, isSigned)
>>>>>      [exec]   File "dev-tools/scripts/smokeTestRelease.py", line 1103, in smokeTest
>>>>>      [exec]     checkMaven(baseURL, tmpDir, version, isSigned)
>>>>>      [exec]   File "dev-tools/scripts/smokeTestRelease.py", line 688, in checkMaven
>>>>>      [exec]     verifyArtifactPerPOMtemplate(POMtemplates, artifacts, tmpDir, version)
>>>>>      [exec]   File "dev-tools/scripts/smokeTestRelease.py", line 985, in verifyArtifactPerPOMtemplate
>>>>>      [exec]     treeRoot = ET.parse(POMtemplate).getroot()
>>>>>      [exec]   File "/usr/lib/python3.2/xml/etree/ElementTree.py", line 1223, in parse
>>>>>      [exec]     tree.parse(source, parser)
>>>>>      [exec]   File "/usr/lib/python3.2/xml/etree/ElementTree.py", line 678, in parse
>>>>>      [exec]     parser.feed(data)
>>>>>      [exec]   File "/usr/lib/python3.2/xml/etree/ElementTree.py", line 1670, in feed
>>>>>      [exec]     self._raiseerror(v)
>>>>>      [exec]   File "/usr/lib/python3.2/xml/etree/ElementTree.py", line 1543, in _raiseerror
>>>>>      [exec]     raise err
>>>>>      [exec]   File "<string>", line None
>>>>>      [exec] xml.etree.ElementTree.ParseError: not well-formed (invalid token): line 1, column 8
>>>>>
>>>>> BUILD FAILED
>>>>> <http://sierranevada.servebeer.com/job/Lucene-Solr-40-ReleaseSmoke/ws/build.xml>:279: exec returned: 1
>>>>>
>>>>> Total time: 22 minutes 2 seconds
>>>>> Build step 'Invoke Ant' marked build as failure
>>>>>
>>>>> ---------------------------------------------------------------------
>>>>> To unsubscribe, e-mail: [hidden email]
>>>>> For additional commands, e-mail: [hidden email]
>>>>>
>>>>
>>>>
>>>>
>>>> --
>>>> lucidworks.com
>>>>
>>>> ---------------------------------------------------------------------
>>>> To unsubscribe, e-mail: [hidden email]
>>>> For additional commands, e-mail: [hidden email]
>>>>
>>>>
>>>> ---------------------------------------------------------------------
>>>> To unsubscribe, e-mail: [hidden email]
>>>> For additional commands, e-mail: [hidden email]
>>>>
>>>
>>>
>>>
>>> --
>>> lucidworks.com
>>
>>
>>
>> --
>> lucidworks.com
>>
>> ---------------------------------------------------------------------
>> To unsubscribe, e-mail: [hidden email]
>> For additional commands, e-mail: [hidden email]
>>
>
>
>
> --
> lucidworks.com



--
lucidworks.com

---------------------------------------------------------------------
To unsubscribe, e-mail: [hidden email]
For additional commands, e-mail: [hidden email]

Reply | Threaded
Open this post in threaded view
|

RE: Build failed in Jenkins: Lucene-Solr-40-ReleaseSmoke #3

Uwe Schindler
So ist a bug in the script.... We should either rename that file or exclude it.

-----
Uwe Schindler
H.-H.-Meier-Allee 63, D-28213 Bremen
http://www.thetaphi.de
eMail: [hidden email]


> -----Original Message-----
> From: Robert Muir [mailto:[hidden email]]
> Sent: Saturday, September 22, 2012 6:39 PM
> To: [hidden email]
> Subject: Re: Build failed in Jenkins: Lucene-Solr-40-ReleaseSmoke #3
>
> AHA
>
>      [exec]       Checking POM template
> /home/rmuir/.jenkins/workspace/Lucene-Solr-40-
> ReleaseSmoke/lucene/build/fakeReleaseTmp/dev-
> tools/maven/solr/maven.testlogging.properties
>
>
>
> On Sat, Sep 22, 2012 at 12:17 PM, Robert Muir <[hidden email]> wrote:
> > I started a new jenkins run:
> >
> > http://sierranevada.servebeer.com/job/Lucene-Solr-40-ReleaseSmoke/9/co
> > nsole
> >
> > On Sat, Sep 22, 2012 at 12:14 PM, Steven A Rowe <[hidden email]> wrote:
> >> committed debug printing to lucene_solr_4_0 branch r1388826
> >>
> >> -----Original Message-----
> >> From: Robert Muir [mailto:[hidden email]]
> >> Sent: Saturday, September 22, 2012 11:46 AM
> >> To: [hidden email]
> >> Subject: Re: Build failed in Jenkins: Lucene-Solr-40-ReleaseSmoke #3
> >>
> >> the check is slow, maybe we could just add some prints to the checker
> >> in this loop to see what file its complaining about?
> >>
> >> my jenkins runs this task about every 22 minutes (i have my desktop
> >> running it in a loop)
> >>
> >> On Sat, Sep 22, 2012 at 11:35 AM, Robert Muir <[hidden email]> wrote:
> >>> the jenkins job checks out the lucene_solr_4_0 release branch and
> >>> runs 'ant nightly-smoke -DJAVA6_HOME=xxxx -DJAVA7_HOME=yyyy'
> >>>
> >>> On Sat, Sep 22, 2012 at 11:29 AM, Steven A Rowe <[hidden email]>
> wrote:
> >>>> The maven checks use python XML parsing, which appears to be
> complaining about well-formedness of a POM file.
> >>>>
> >>>> How is smoketester being run?  Against a file:// url built locally?
> >>>>
> >>>> Steve
> >>>>
> >>>> -----Original Message-----
> >>>> From: Robert Muir [mailto:[hidden email]]
> >>>> Sent: Saturday, September 22, 2012 11:07 AM
> >>>> To: [hidden email]
> >>>> Subject: Re: Build failed in Jenkins: Lucene-Solr-40-ReleaseSmoke
> >>>> #3
> >>>>
> >>>> I have no idea about what this is, or what is going on here.
> >>>>
> >>>> On Sat, Sep 22, 2012 at 10:41 AM,  <[hidden email]> wrote:
> >>>>>      [exec] Test Maven artifacts for Lucene and Solr...
> >>>>>      [exec]     get POM templates ...................................................
> >>>>>      [exec]     download artifacts
> .................................................................................................................................
> .................................................................................................................................
> .................................................................................................................................
> .................................................................................................................................
> ....................................
> >>>>>      [exec]     verify that each binary artifact has a deployed POM...
> >>>>>      [exec]     verify that there is an artifact for each POM template...
> >>>>>      [exec] Traceback (most recent call last):
> >>>>>      [exec]   File "/usr/lib/python3.2/xml/etree/ElementTree.py", line
> 1668, in feed
> >>>>>      [exec]     self._parser.Parse(data, 0)
> >>>>>      [exec] xml.parsers.expat.ExpatError: not well-formed (invalid token):
> line 1, column 8
> >>>>>      [exec]
> >>>>>      [exec] During handling of the above exception, another exception
> occurred:
> >>>>>      [exec]
> >>>>>      [exec] Traceback (most recent call last):
> >>>>>      [exec]   File "dev-tools/scripts/smokeTestRelease.py", line 1107, in
> <module>
> >>>>>      [exec]     main()
> >>>>>      [exec]   File "dev-tools/scripts/smokeTestRelease.py", line 1057, in
> main
> >>>>>      [exec]     smokeTest(baseURL, version, tmpDir, isSigned)
> >>>>>      [exec]   File "dev-tools/scripts/smokeTestRelease.py", line 1103, in
> smokeTest
> >>>>>      [exec]     checkMaven(baseURL, tmpDir, version, isSigned)
> >>>>>      [exec]   File "dev-tools/scripts/smokeTestRelease.py", line 688, in
> checkMaven
> >>>>>      [exec]     verifyArtifactPerPOMtemplate(POMtemplates, artifacts,
> tmpDir, version)
> >>>>>      [exec]   File "dev-tools/scripts/smokeTestRelease.py", line 985, in
> verifyArtifactPerPOMtemplate
> >>>>>      [exec]     treeRoot = ET.parse(POMtemplate).getroot()
> >>>>>      [exec]   File "/usr/lib/python3.2/xml/etree/ElementTree.py", line
> 1223, in parse
> >>>>>      [exec]     tree.parse(source, parser)
> >>>>>      [exec]   File "/usr/lib/python3.2/xml/etree/ElementTree.py", line 678,
> in parse
> >>>>>      [exec]     parser.feed(data)
> >>>>>      [exec]   File "/usr/lib/python3.2/xml/etree/ElementTree.py", line
> 1670, in feed
> >>>>>      [exec]     self._raiseerror(v)
> >>>>>      [exec]   File "/usr/lib/python3.2/xml/etree/ElementTree.py", line
> 1543, in _raiseerror
> >>>>>      [exec]     raise err
> >>>>>      [exec]   File "<string>", line None
> >>>>>      [exec] xml.etree.ElementTree.ParseError: not well-formed
> >>>>> (invalid token): line 1, column 8
> >>>>>
> >>>>> BUILD FAILED
> >>>>> <http://sierranevada.servebeer.com/job/Lucene-Solr-40-ReleaseSmoke
> >>>>> /ws/build.xml>:279: exec returned: 1
> >>>>>
> >>>>> Total time: 22 minutes 2 seconds
> >>>>> Build step 'Invoke Ant' marked build as failure
> >>>>>
> >>>>> ------------------------------------------------------------------
> >>>>> --- To unsubscribe, e-mail: [hidden email] For
> >>>>> additional commands, e-mail: [hidden email]
> >>>>>
> >>>>
> >>>>
> >>>>
> >>>> --
> >>>> lucidworks.com
> >>>>
> >>>> -------------------------------------------------------------------
> >>>> -- To unsubscribe, e-mail: [hidden email] For
> >>>> additional commands, e-mail: [hidden email]
> >>>>
> >>>>
> >>>> -------------------------------------------------------------------
> >>>> -- To unsubscribe, e-mail: [hidden email] For
> >>>> additional commands, e-mail: [hidden email]
> >>>>
> >>>
> >>>
> >>>
> >>> --
> >>> lucidworks.com
> >>
> >>
> >>
> >> --
> >> lucidworks.com
> >>
> >> ---------------------------------------------------------------------
> >> To unsubscribe, e-mail: [hidden email] For
> >> additional commands, e-mail: [hidden email]
> >>
> >
> >
> >
> > --
> > lucidworks.com
>
>
>
> --
> lucidworks.com
>
> ---------------------------------------------------------------------
> To unsubscribe, e-mail: [hidden email] For additional
> commands, e-mail: [hidden email]


---------------------------------------------------------------------
To unsubscribe, e-mail: [hidden email]
For additional commands, e-mail: [hidden email]