Build failed in Jenkins: Lucene-Solr-trunk-Windows-Java6-64 #319

classic Classic list List threaded Threaded
3 messages Options
Reply | Threaded
Open this post in threaded view
|

Build failed in Jenkins: Lucene-Solr-trunk-Windows-Java6-64 #319

Policeman Jenkins Server
See <http://jenkins.sd-datasolutions.de/job/Lucene-Solr-trunk-Windows-Java6-64/319/>

------------------------------------------
[...truncated 1255 lines...]
   [junit4] Suite: org.apache.lucene.index.TestTermsEnum2
   [junit4] Completed in 0.23s, 4 tests
   [junit4]  
   [junit4] Suite: org.apache.lucene.search.spans.TestSpanMultiTermQueryWrapper
   [junit4] Completed in 0.04s, 4 tests
   [junit4]  
   [junit4] Suite: org.apache.lucene.search.TestNumericRangeQuery64
   [junit4] Completed in 3.25s, 34 tests
   [junit4]  
   [junit4] Suite: org.apache.lucene.analysis.TestLookaheadTokenFilter
   [junit4] Completed in 2.89s, 2 tests
   [junit4]  
   [junit4] Suite: org.apache.lucene.index.TestAddIndexes
   [junit4] Completed in 1.99s, 20 tests
   [junit4]  
   [junit4] Suite: org.apache.lucene.index.TestDuelingCodecs
   [junit4] Completed in 2.23s, 1 test
   [junit4]  
   [junit4] Suite: org.apache.lucene.index.TestNorms
   [junit4] Completed in 3.23s, 3 tests
   [junit4]  
   [junit4] Suite: org.apache.lucene.search.TestTopDocsMerge
   [junit4] Completed in 1.97s, 1 test
   [junit4]  
   [junit4] Suite: org.apache.lucene.search.TestTimeLimitingCollector
   [junit4] Completed in 1.36s, 6 tests
   [junit4]  
   [junit4] Suite: org.apache.lucene.index.TestDocValuesIndexing
   [junit4] Completed in 0.97s, 14 tests
   [junit4]  
   [junit4] Suite: org.apache.lucene.util.packed.TestPackedInts
   [junit4] Completed in 4.49s, 8 tests
   [junit4]  
   [junit4] Suite: org.apache.lucene.index.TestIndexWriterMergePolicy
   [junit4] Completed in 1.78s, 6 tests
   [junit4]  
   [junit4] Suite: org.apache.lucene.index.TestByteSlices
   [junit4] Completed in 3.47s, 1 test
   [junit4]  
   [junit4] Suite: org.apache.lucene.index.TestNRTReaderWithThreads
   [junit4] Completed in 2.15s, 1 test
   [junit4]  
   [junit4] Suite: org.apache.lucene.util.TestArrayUtil
   [junit4] Completed in 1.33s, 11 tests
   [junit4]  
   [junit4] Suite: org.apache.lucene.search.TestSearchWithThreads
   [junit4] Completed in 1.96s, 1 test
   [junit4]  
   [junit4] Suite: org.apache.lucene.index.TestStressAdvance
   [junit4] Completed in 0.41s, 1 test
   [junit4]  
   [junit4] Suite: org.apache.lucene.index.TestNeverDelete
   [junit4] Completed in 1.49s, 1 test
   [junit4]  
   [junit4] Suite: org.apache.lucene.search.similarities.TestSimilarityBase
   [junit4] Completed in 0.40s, 29 tests
   [junit4]  
   [junit4] Suite: org.apache.lucene.util.automaton.TestUTF32ToUTF8
   [junit4] Completed in 0.51s, 5 tests
   [junit4]  
   [junit4] Suite: org.apache.lucene.search.TestMultiThreadTermVectors
   [junit4] Completed in 0.22s, 1 test
   [junit4]  
   [junit4] Suite: org.apache.lucene.util.TestNumericUtils
   [junit4] Completed in 1.30s, 12 tests
   [junit4]  
   [junit4] Suite: org.apache.lucene.search.TestFieldCacheRewriteMethod
   [junit4] Completed in 0.52s, 1 test
   [junit4]  
   [junit4] Suite: org.apache.lucene.index.TestSegmentReader
   [junit4] Completed in 0.75s, 6 tests
   [junit4]  
   [junit4] Suite: org.apache.lucene.store.TestLockFactory
   [junit4] IGNOR/A 0.00s | TestLockFactory.testStressLocks
   [junit4]    > Assumption #1: 'nightly' test group is disabled (@Nightly)
   [junit4] IGNOR/A 0.00s | TestLockFactory.testStressLocksNativeFSLockFactory
   [junit4]    > Assumption #1: 'nightly' test group is disabled (@Nightly)
   [junit4] Completed in 1.23s, 11 tests, 2 skipped
   [junit4]  
   [junit4] Suite: org.apache.lucene.search.TestCustomSearcherSort
   [junit4] Completed in 0.75s, 2 tests
   [junit4]  
   [junit4] Suite: org.apache.lucene.search.TestPrefixRandom
   [junit4] Completed in 0.13s, 1 test
   [junit4]  
   [junit4] Suite: org.apache.lucene.codecs.lucene40.TestBitVector
   [junit4] Completed in 0.70s, 9 tests
   [junit4]  
   [junit4] Suite: org.apache.lucene.index.TestFieldsReader
   [junit4] Completed in 0.41s, 4 tests
   [junit4]  
   [junit4] Suite: org.apache.lucene.util.automaton.TestLevenshteinAutomata
   [junit4] Completed in 0.66s, 4 tests
   [junit4]  
   [junit4] Suite: org.apache.lucene.index.TestTransactions
   [junit4] Completed in 0.69s, 1 test
   [junit4]  
   [junit4] Suite: org.apache.lucene.search.spans.TestPayloadSpans
   [junit4] Completed in 4.21s, 10 tests
   [junit4]  
   [junit4] Suite: org.apache.lucene.index.TestCustomNorms
   [junit4] Completed in 0.32s, 2 tests
   [junit4]  
   [junit4] Suite: org.apache.lucene.store.TestCopyBytes
   [junit4] Completed in 0.56s, 2 tests
   [junit4]  
   [junit4] Suite: org.apache.lucene.index.TestDoc
   [junit4] Completed in 0.27s, 1 test
   [junit4]  
   [junit4] Suite: org.apache.lucene.index.TestDocumentsWriterDeleteQueue
   [junit4] Completed in 0.17s, 5 tests
   [junit4]  
   [junit4] Suite: org.apache.lucene.search.TestTermVectors
   [junit4] Completed in 0.15s, 11 tests
   [junit4]  
   [junit4] Suite: org.apache.lucene.util.TestPagedBytes
   [junit4] Completed in 1.77s, 3 tests
   [junit4]  
   [junit4] Suite: org.apache.lucene.index.TestCodecs
   [junit4] Completed in 0.31s, 3 tests
   [junit4]  
   [junit4] Suite: org.apache.lucene.search.TestAutomatonQuery
   [junit4] Completed in 0.06s, 6 tests
   [junit4]  
   [junit4] Suite: org.apache.lucene.search.TestFilteredQuery
   [junit4] Completed in 0.15s, 9 tests
   [junit4]  
   [junit4] Suite: org.apache.lucene.index.TestMultiFields
   [junit4] Completed in 0.12s, 2 tests
   [junit4]  
   [junit4] Suite: org.apache.lucene.search.TestSimpleSearchEquivalence
   [junit4] Completed in 0.72s, 12 tests
   [junit4]  
   [junit4] Suite: org.apache.lucene.index.TestSumDocFreq
   [junit4] Completed in 0.19s, 1 test
   [junit4]  
   [junit4] Suite: org.apache.lucene.index.TestParallelAtomicReader
   [junit4] Completed in 0.09s, 6 tests
   [junit4]  
   [junit4] Suite: org.apache.lucene.util.TestIdentityHashSet
   [junit4] Completed in 0.12s, 1 test
   [junit4]  
   [junit4] Suite: org.apache.lucene.search.similarities.TestSimilarity2
   [junit4] Completed in 0.07s, 7 tests
   [junit4]  
   [junit4] Suite: org.apache.lucene.index.TestCheckIndex
   [junit4] Completed in 0.02s, 2 tests
   [junit4]  
   [junit4] Suite: org.apache.lucene.util.TestRollingBuffer
   [junit4] Completed in 0.14s, 1 test
   [junit4]  
   [junit4] Suite: org.apache.lucene.util.automaton.TestSpecialOperations
   [junit4] Completed in 0.06s, 1 test
   [junit4]  
   [junit4] Suite: org.apache.lucene.search.TestWildcardRandom
   [junit4] Completed in 0.05s, 1 test
   [junit4]  
   [junit4] Suite: org.apache.lucene.search.TestTopDocsCollector
   [junit4] Completed in 0.05s, 8 tests
   [junit4]  
   [junit4] Suite: org.apache.lucene.search.TestTermRangeQuery
   [junit4] Completed in 0.07s, 7 tests
   [junit4]  
   [junit4] Suite: org.apache.lucene.search.TestComplexExplanationsOfNonMatches
   [junit4] Completed in 0.09s, 22 tests
   [junit4]  
   [junit4] Suite: org.apache.lucene.index.TestNoDeletionPolicy
   [junit4] Completed in 0.05s, 4 tests
   [junit4]  
   [junit4] Suite: org.apache.lucene.search.spans.TestSpanExplanationsOfNonMatches
   [junit4] Completed in 0.09s, 31 tests
   [junit4]  
   [junit4] Suite: org.apache.lucene.index.TestDocCount
   [junit4] Completed in 0.04s, 1 test
   [junit4]  
   [junit4] Suite: org.apache.lucene.TestSearch
   [junit4] Completed in 0.02s, 1 test
   [junit4]  
   [junit4] Suite: org.apache.lucene.store.TestFileSwitchDirectory
   [junit4] Completed in 0.05s, 4 tests
   [junit4]  
   [junit4] Suite: org.apache.lucene.index.TestParallelTermEnum
   [junit4] Completed in 0.02s, 1 test
   [junit4]  
   [junit4] Suite: org.apache.lucene.search.TestFieldValueFilter
   [junit4] Completed in 0.03s, 2 tests
   [junit4]  
   [junit4] Suite: org.apache.lucene.search.TestDateFilter
   [junit4] Completed in 0.02s, 2 tests
   [junit4]  
   [junit4] Suite: org.apache.lucene.search.TestMatchAllDocsQuery
   [junit4] Completed in 0.02s, 2 tests
   [junit4]  
   [junit4] Suite: org.apache.lucene.util.TestSortedVIntList
   [junit4] Completed in 0.06s, 19 tests
   [junit4]  
   [junit4] Suite: org.apache.lucene.document.TestDateTools
   [junit4] Completed in 0.02s, 5 tests
   [junit4]  
   [junit4] Suite: org.apache.lucene.codecs.pulsing.TestPulsingReuse
   [junit4] Completed in 0.02s, 2 tests
   [junit4]  
   [junit4] Suite: org.apache.lucene.search.TestNot
   [junit4] Completed in 0.01s, 1 test
   [junit4]  
   [junit4] Suite: org.apache.lucene.search.TestPrefixFilter
   [junit4] Completed in 0.01s, 1 test
   [junit4]  
   [junit4] Suite: org.apache.lucene.util.TestAttributeSource
   [junit4] Completed in 0.02s, 5 tests
   [junit4]  
   [junit4] Suite: org.apache.lucene.index.TestIndexWriterConfig
   [junit4] Completed in 0.04s, 9 tests
   [junit4]  
   [junit4] Suite: org.apache.lucene.util.TestTwoPhaseCommitTool
   [junit4] Completed in 0.02s, 4 tests
   [junit4]  
   [junit4] Suite: org.apache.lucene.search.TestTopScoreDocCollector
   [junit4] Completed in 0.04s, 1 test
   [junit4]  
   [junit4] Suite: org.apache.lucene.index.TestFieldInfos
   [junit4] Completed in 0.01s, 2 tests
   [junit4]  
   [junit4] Suite: org.apache.lucene.analysis.tokenattributes.TestSimpleAttributeImpl
   [junit4] Completed in 0.01s, 1 test
   [junit4]  
   [junit4] Suite: org.apache.lucene.index.TestIndexWriterOnJRECrash
   [junit4] IGNOR/A 0.00s | TestIndexWriterOnJRECrash.testNRTThreads
   [junit4]    > Assumption #1: 'nightly' test group is disabled (@Nightly)
   [junit4] Completed in 0.01s, 1 test, 1 skipped
   [junit4]  
   [junit4] Suite: org.apache.lucene.index.Test2BPostings
   [junit4] IGNOR/A 0.00s | Test2BPostings.test
   [junit4]    > Assumption #1: 'nightly' test group is disabled (@Nightly)
   [junit4] Completed in 0.01s, 1 test, 1 skipped
   [junit4]  
   [junit4] JVM J0:     1.05 ..   289.48 =   288.43s
   [junit4] Execution time total: 4 minutes 49 seconds
   [junit4] Tests summary: 296 suites, 1684 tests, 1 failure, 10 ignored (9 assumptions)

BUILD FAILED
<http://jenkins.sd-datasolutions.de/job/Lucene-Solr-trunk-Windows-Java6-64/ws/build.xml>:29: The following error occurred while executing this line:
<http://jenkins.sd-datasolutions.de/job/Lucene-Solr-trunk-Windows-Java6-64/ws/lucene\build.xml>:50: The following error occurred while executing this line:
<http://jenkins.sd-datasolutions.de/job/Lucene-Solr-trunk-Windows-Java6-64/ws/lucene\common-build.xml>:1019: The following error occurred while executing this line:
<http://jenkins.sd-datasolutions.de/job/Lucene-Solr-trunk-Windows-Java6-64/ws/lucene\common-build.xml>:745: There were test failures: 296 suites, 1684 tests, 1 failure, 10 ignored (9 assumptions)

Total time: 5 minutes 34 seconds
Build step 'Invoke Ant' marked build as failure
Recording test results

---------------------------------------------------------------------
To unsubscribe, e-mail: [hidden email]
For additional commands, e-mail: [hidden email]

Reply | Threaded
Open this post in threaded view
|

Build failed in Jenkins: Lucene-Solr-trunk-Windows-Java6-64 #320

Policeman Jenkins Server
See <http://jenkins.sd-datasolutions.de/job/Lucene-Solr-trunk-Windows-Java6-64/320/>

------------------------------------------
[...truncated 13237 lines...]
   [junit4]   2> 46564 T2761 C172 REQ [collection1] webapp=/solr path=/select params={wt=javabin&q=*:*&version=2} hits=497 status=0 QTime=0
   [junit4]   2> 46668 T2761 C172 REQ [collection1] webapp=/solr path=/select params={wt=javabin&q=*:*&version=2} hits=497 status=0 QTime=0
   [junit4]   2> 46768 T2761 C172 REQ [collection1] webapp=/solr path=/select params={wt=javabin&q=*:*&version=2} hits=497 status=0 QTime=0
   [junit4]   2> 46869 T2761 C172 REQ [collection1] webapp=/solr path=/select params={wt=javabin&q=*:*&version=2} hits=497 status=0 QTime=0
   [junit4]   2> 46970 T2761 C172 REQ [collection1] webapp=/solr path=/select params={wt=javabin&q=*:*&version=2} hits=497 status=0 QTime=0
   [junit4]   2> 47071 T2761 C172 REQ [collection1] webapp=/solr path=/select params={wt=javabin&q=*:*&version=2} hits=497 status=0 QTime=0
   [junit4]   2> 47172 T2761 C172 REQ [collection1] webapp=/solr path=/select params={wt=javabin&q=*:*&version=2} hits=497 status=0 QTime=0
   [junit4]   2> 47274 T2761 C172 REQ [collection1] webapp=/solr path=/select params={wt=javabin&q=*:*&version=2} hits=497 status=0 QTime=0
   [junit4]   2> 47374 T2761 C172 REQ [collection1] webapp=/solr path=/select params={wt=javabin&q=*:*&version=2} hits=497 status=0 QTime=0
   [junit4]   2> 47475 T2761 C172 REQ [collection1] webapp=/solr path=/select params={wt=javabin&q=*:*&version=2} hits=497 status=0 QTime=0
   [junit4]   2> 47573 T2666 oas.SolrTestCaseJ4.tearDown ###Ending test
   [junit4]   2> NOTE: reproduce with: ant test -Dtestcase=TestReplicationHandler -Dtests.method=test -Dtests.seed=97575C4897CF25F5 -Dtests.locale=bg -Dtests.timezone=America/St_Vincent -Dargs="-Dfile.encoding=Cp1252"
   [junit4]   2>
   [junit4]    > (@AfterClass output)
   [junit4]   2> 47588 T2666 oasc.CoreContainer.shutdown Shutting down CoreContainer instance=1041527622
   [junit4]   2> 47589 T2666 oasc.SolrCore.close [collection1]  CLOSING SolrCore org.apache.solr.core.SolrCore@7bf22d96
   [junit4]   2> 47590 T2666 oasc.SolrCore.closeSearcher [collection1] Closing main searcher on request.
   [junit4]   2> 47590 T2666 oasu.DirectUpdateHandler2.close closing DirectUpdateHandler2{commits=4,autocommits=0,soft autocommits=0,optimizes=0,rollbacks=0,expungeDeletes=0,docsPending=0,adds=0,deletesById=0,deletesByQuery=0,errors=0,cumulative_adds=499,cumulative_deletesById=0,cumulative_deletesByQuery=1,cumulative_errors=0}
   [junit4]   2> 47593 T2666 oejsh.ContextHandler.doStop stopped o.e.j.s.ServletContextHandler{/solr,null}
   [junit4]   2> 47645 T2666 oasc.CoreContainer.shutdown Shutting down CoreContainer instance=1005823421
   [junit4]   2> 47645 T2666 oasc.SolrCore.close [collection1]  CLOSING SolrCore org.apache.solr.core.SolrCore@315bede2
   [junit4]   2> 47646 T2666 oasc.SolrCore.closeSearcher [collection1] Closing main searcher on request.
   [junit4]   2> 47646 T2666 oasu.DirectUpdateHandler2.close closing DirectUpdateHandler2{commits=2,autocommits=0,soft autocommits=0,optimizes=0,rollbacks=0,expungeDeletes=0,docsPending=0,adds=0,deletesById=0,deletesByQuery=0,errors=0,cumulative_adds=0,cumulative_deletesById=0,cumulative_deletesByQuery=0,cumulative_errors=0}
   [junit4]   2> 47649 T2666 oejsh.ContextHandler.doStop stopped o.e.j.s.ServletContextHandler{/solr,null}
   [junit4]   2> 47740 T2666 oas.SolrTestCaseJ4.deleteCore ###deleteCore
   [junit4]   2> NOTE: test params are: codec=Lucene40, sim=DefaultSimilarity, locale=bg, timezone=America/St_Vincent
   [junit4]   2> NOTE: Windows 7 6.1 amd64/Sun Microsystems Inc. 1.6.0_32 (64-bit)/cpus=2,threads=1,free=62590440,total=254148608
   [junit4]   2> NOTE: All tests run in this JVM: [TestSurroundQueryParser, TestStandardFactories, TestMultiWordSynonyms, TestGroupingSearch, TestArbitraryIndexDir, TestNGramFilters, TestItalianLightStemFilterFactory, TestPropInject, TestSolrDeletionPolicy1, TestGalicianMinimalStemFilterFactory, FileBasedSpellCheckerTest, MinimalSchemaTest, MBeansHandlerTest, NodeStateWatcherTest, DateFieldTest, PolyFieldTest, LegacyHTMLStripCharFilterTest, TestUtils, MoreLikeThisHandlerTest, NoCacheHeaderTest, TestLMJelinekMercerSimilarityFactory, TestRussianLightStemFilterFactory, QueryElevationComponentTest, UniqFieldsUpdateProcessorFactoryTest, TestSynonymMap, NotRequiredUniqueKeyTest, TestFiltering, TestJmxMonitoredMap, SolrCmdDistributorTest, TermVectorComponentTest, TestSuggestSpellingConverter, TestSolrXMLSerializer, TestRangeQuery, TestBrazilianStemFilterFactory, TestChineseTokenizerFactory, TestDelimitedPayloadTokenFilterFactory, EchoParamsTest, TestPortugueseMinimalStemFilterFactory, TestCoreContainer, BasicDistributedZkTest, TestReversedWildcardFilterFactory, FullSolrCloudTest, QueryParsingTest, TestPropInjectDefaults, TestShingleFilterFactory, CommonGramsQueryFilterFactoryTest, TestGalicianStemFilterFactory, SortByFunctionTest, SpellCheckCollatorTest, TestLFUCache, TestStopFilterFactory, TestMappingCharFilterFactory, TestExtendedDismaxParser, RequiredFieldsTest, DebugComponentTest, PeerSyncTest, TestCJKTokenizerFactory, TestWikipediaTokenizerFactory, TestNumberUtils, TestLuceneMatchVersion, TestSpanishLightStemFilterFactory, PrimitiveFieldTypeTest, SimpleFacetsTest, IndexReaderFactoryTest, TestJapaneseTokenizerFactory, TestJmxIntegration, TestIndexingPerformance, XmlUpdateRequestHandlerTest, SpellingQueryConverterTest, TestSolrCoreProperties, BadIndexSchemaTest, TestUpdate, UUIDFieldTest, TestHindiFilters, DOMUtilTest, StatsComponentTest, BadComponentTest, TestFunctionQuery, RAMDirectoryFactoryTest, TestBeiderMorseFilterFactory, SolrInfoMBeanTest, SuggesterTest, CommonGramsFilterFactoryTest, TestWriterPerf, TestSystemIdResolver, TestQuerySenderNoQuery, TestRemoveDuplicatesTokenFilterFactory, CurrencyFieldTest, DocumentAnalysisRequestHandlerTest, IndexSchemaTest, URLClassifyProcessorTest, TestIndexSearcher, DocumentBuilderTest, TestMergePolicyConfig, TestEnglishMinimalStemFilterFactory, TestPorterStemFilterFactory, TestKStemFilterFactory, CloudStateTest, PrimUtilsTest, TestGermanNormalizationFilterFactory, NumericFieldsTest, FieldAnalysisRequestHandlerTest, TestCapitalizationFilterFactory, OverseerTest, TestHTMLStripCharFilterFactory, TestLRUCache, ConvertedLegacyTest, TestDFRSimilarityFactory, SpellPossibilityIteratorTest, ShowFileRequestHandlerTest, TestKeywordMarkerFilterFactory, TestCollationKeyFilterFactory, TestMultiCoreConfBootstrap, TestSearchPerf, TestThaiWordFilterFactory, MultiTermTest, IndexBasedSpellCheckerTest, CacheHeaderTest, TestPHPSerializedResponseWriter, LeaderElectionTest, SOLR749Test, SoftAutoCommitTest, DirectSolrConnectionTest, TestDistributedGrouping, SuggesterFSTTest, TestPatternReplaceFilterFactory, TestIrishLowerCaseFilterFactory, TestSlowSynonymFilter, TestValueSourceCache, ZkNodePropsTest, TestTurkishLowerCaseFilterFactory, TestSort, DirectUpdateHandlerOptimizeTest, DisMaxRequestHandlerTest, TestRussianFilters, TestFrenchMinimalStemFilterFactory, TestDistributedSearch, FieldMutatingUpdateProcessorTest, TestJoin, TestBulgarianStemFilterFactory, TestXIncludeConfig, TestCzechStemFilterFactory, TestReverseStringFilterFactory, CoreAdminHandlerTest, XsltUpdateRequestHandlerTest, FileUtilsTest, TestKeepFilterFactory, LukeRequestHandlerTest, CSVRequestHandlerTest, SearchHandlerTest, TestBadConfig, RequestHandlersTest, TestTypeTokenFilterFactory, TermsComponentTest, TestGreekLowerCaseFilterFactory, LeaderElectionIntegrationTest, TestPatternTokenizerFactory, DoubleMetaphoneFilterFactoryTest, SolrIndexConfigTest, TestHungarianLightStemFilterFactory, UpdateRequestProcessorFactoryTest, DateMathParserTest, DirectUpdateHandlerTest, TestPhraseSuggestions, TestCJKWidthFilterFactory, SuggesterTSTTest, SnowballPorterFilterFactoryTest, BasicFunctionalityTest, TestCSVResponseWriter, SpatialFilterTest, CopyFieldTest, TestOmitPositions, TestHunspellStemFilterFactory, ReturnFieldsTest, StandardRequestHandlerTest, PluginInfoTest, TestWordDelimiterFilterFactory, TestPluginEnable, TestPersianNormalizationFilterFactory, TestPortugueseLightStemFilterFactory, TestUAX29URLEmailTokenizerFactory, TestIndonesianStemFilterFactory, TestArabicFilters, AutoCommitTest, SolrRequestParserTest, TestJapanesePartOfSpeechStopFilterFactory, TestFastLRUCache, FullSolrCloudDistribCmdsTest, TestDictionaryCompoundWordTokenFilterFactory, DistributedSpellCheckComponentTest, TestRandomFaceting, ResourceLoaderTest, TestSolrDeletionPolicy2, TestBinaryResponseWriter, TestSolrQueryParser, TestNorwegianLightStemFilterFactory, TestFrenchLightStemFilterFactory, DirectSolrSpellCheckerTest, CloudStateUpdateTest, TestCodecSupport, TestQueryUtils, TestHyphenationCompoundWordTokenFilterFactory, JsonLoaderTest, TestRealTimeGet, RecoveryZkTest, TestReplicationHandler]
   [junit4]   2>
   [junit4] Completed in 47.75s, 1 test, 1 failure <<< FAILURES!
   [junit4]  
   [junit4] Suite: org.apache.solr.cloud.ZkSolrClientTest
   [junit4] Completed in 17.97s, 4 tests
   [junit4]  
   [junit4] Suite: org.apache.solr.analysis.TestPhoneticFilterFactory
   [junit4] Completed in 11.19s, 5 tests
   [junit4]  
   [junit4] Suite: org.apache.solr.search.TestRecovery
   [junit4] Completed in 12.62s, 9 tests
   [junit4]  
   [junit4] Suite: org.apache.solr.handler.component.DistributedTermsComponentTest
   [junit4] Completed in 1133.80s, 1 test
   [junit4]  
   [junit4] Suite: org.apache.solr.cloud.BasicZkTest
   [junit4] Completed in 9.31s, 1 test
   [junit4]  
   [junit4] Suite: org.apache.solr.request.TestFaceting
   [junit4] Completed in 16.42s, 3 tests
   [junit4]  
   [junit4] Suite: org.apache.solr.cloud.ZkControllerTest
   [junit4] Completed in 16.86s, 3 tests
   [junit4]  
   [junit4] Suite: org.apache.solr.cloud.TestHashPartitioner
   [junit4] Completed in 5.33s, 1 test
   [junit4]  
   [junit4] Suite: org.apache.solr.handler.component.SpellCheckComponentTest
   [junit4] Completed in 4.53s, 9 tests
   [junit4]  
   [junit4] Suite: org.apache.solr.handler.component.DistributedQueryElevationComponentTest
   [junit4] Completed in 3.22s, 1 test
   [junit4]  
   [junit4] Suite: org.apache.solr.TestTrie
   [junit4] Completed in 1.47s, 8 tests
   [junit4]  
   [junit4] Suite: org.apache.solr.core.SolrCoreTest
   [junit4] Completed in 5.34s, 5 tests
   [junit4]  
   [junit4] Suite: org.apache.solr.update.processor.SignatureUpdateProcessorFactoryTest
   [junit4] Completed in 1.13s, 6 tests
   [junit4]  
   [junit4] Suite: org.apache.solr.search.TestPseudoReturnFields
   [junit4] Completed in 1.23s, 13 tests
   [junit4]  
   [junit4] Suite: org.apache.solr.search.similarities.TestLMDirichletSimilarityFactory
   [junit4] Completed in 0.14s, 2 tests
   [junit4]  
   [junit4] Suite: org.apache.solr.highlight.HighlighterTest
   [junit4] Completed in 1.89s, 27 tests
   [junit4]  
   [junit4] Suite: org.apache.solr.search.function.distance.DistanceFunctionTest
   [junit4] Completed in 1.01s, 3 tests
   [junit4]  
   [junit4] Suite: org.apache.solr.request.TestRemoteStreaming
   [junit4] Completed in 0.98s, 4 tests
   [junit4]  
   [junit4] Suite: org.apache.solr.core.SolrCoreCheckLockOnStartupTest
   [junit4] Completed in 1.58s, 2 tests
   [junit4]  
   [junit4] Suite: org.apache.solr.spelling.suggest.SuggesterWFSTTest
   [junit4] Completed in 1.29s, 4 tests
   [junit4]  
   [junit4] Suite: org.apache.solr.search.TestFoldingMultitermQuery
   [junit4] Completed in 1.15s, 18 tests
   [junit4]  
   [junit4] Suite: org.apache.solr.internal.csv.CSVPrinterTest
   [junit4] Completed in 0.42s, 6 tests
   [junit4]  
   [junit4] Suite: org.apache.solr.highlight.FastVectorHighlighterTest
   [junit4] Completed in 0.95s, 2 tests
   [junit4]  
   [junit4] Suite: org.apache.solr.search.TestDocSet
   [junit4] Completed in 0.53s, 2 tests
   [junit4]  
   [junit4] Suite: org.apache.solr.search.TestQueryTypes
   [junit4] Completed in 0.84s, 1 test
   [junit4]  
   [junit4] Suite: org.apache.solr.handler.TestCSVLoader
   [junit4] Completed in 1.20s, 5 tests
   [junit4]  
   [junit4] Suite: org.apache.solr.util.SolrPluginUtilsTest
   [junit4] Completed in 1.00s, 7 tests
   [junit4]  
   [junit4] Suite: org.apache.solr.highlight.HighlighterConfigTest
   [junit4] Completed in 0.93s, 1 test
   [junit4]  
   [junit4] Suite: org.apache.solr.request.JSONWriterTest
   [junit4] Completed in 0.98s, 3 tests
   [junit4]  
   [junit4] Suite: org.apache.solr.handler.BinaryUpdateRequestHandlerTest
   [junit4] Completed in 0.97s, 1 test
   [junit4]  
   [junit4] Suite: org.apache.solr.schema.TestCollationField
   [junit4] Completed in 0.39s, 8 tests
   [junit4]  
   [junit4] Suite: org.apache.solr.schema.IndexSchemaRuntimeFieldTest
   [junit4] Completed in 1.01s, 1 test
   [junit4]  
   [junit4] Suite: org.apache.solr.core.AlternateDirectoryTest
   [junit4] Completed in 0.89s, 1 test
   [junit4]  
   [junit4] Suite: org.apache.solr.update.UpdateParamsTest
   [junit4] Completed in 0.96s, 1 test
   [junit4]  
   [junit4] Suite: org.apache.solr.core.TestQuerySenderListener
   [junit4] Completed in 0.89s, 3 tests
   [junit4]  
   [junit4] Suite: org.apache.solr.schema.TestBinaryField
   [junit4] Completed in 0.38s, 1 test
   [junit4]  
   [junit4] Suite: org.apache.solr.analysis.TestJapaneseBaseFormFilterFactory
   [junit4] Completed in 0.01s, 1 test
   [junit4]  
   [junit4] Suite: org.apache.solr.SampleTest
   [junit4] Completed in 0.34s, 2 tests
   [junit4]  
   [junit4] Suite: org.apache.solr.OutputWriterTest
   [junit4] Completed in 0.25s, 5 tests
   [junit4]  
   [junit4] Suite: org.apache.solr.search.similarities.TestDefaultSimilarityFactory
   [junit4] Completed in 0.17s, 1 test
   [junit4]  
   [junit4] Suite: org.apache.solr.analysis.TestCollationKeyRangeQueries
   [junit4] Completed in 0.33s, 3 tests
   [junit4]  
   [junit4] Suite: org.apache.solr.search.similarities.TestIBSimilarityFactory
   [junit4] Completed in 0.19s, 2 tests
   [junit4]  
   [junit4] Suite: org.apache.solr.core.TestConfig
   [junit4] Completed in 0.50s, 8 tests
   [junit4]  
   [junit4] Suite: org.apache.solr.search.similarities.TestBM25SimilarityFactory
   [junit4] Completed in 0.19s, 2 tests
   [junit4]  
   [junit4] Suite: org.apache.solr.search.similarities.TestPerFieldSimilarity
   [junit4] Completed in 0.21s, 7 tests
   [junit4]  
   [junit4] Suite: org.apache.solr.schema.OpenExchangeRatesOrgProviderTest
   [junit4] Completed in 0.03s, 5 tests
   [junit4]  
   [junit4] Suite: org.apache.solr.analysis.TestPatternReplaceCharFilterFactory
   [junit4] Completed in 0.01s, 3 tests
   [junit4]  
   [junit4] Suite: org.apache.solr.analysis.TestPortugueseStemFilterFactory
   [junit4] Completed in 0.01s, 1 test
   [junit4]  
   [junit4] Suite: org.apache.solr.analysis.TestSynonymFilterFactory
   [junit4] Completed in 0.02s, 4 tests
   [junit4]  
   [junit4] Suite: org.apache.solr.analysis.TestLatvianStemFilterFactory
   [junit4] Completed in 0.01s, 1 test
   [junit4]  
   [junit4] Suite: org.apache.solr.analysis.TestElisionFilterFactory
   [junit4] Completed in 0.02s, 3 tests
   [junit4]  
   [junit4] Suite: org.apache.solr.analysis.TestSwedishLightStemFilterFactory
   [junit4] Completed in 0.01s, 1 test
   [junit4]  
   [junit4] Suite: org.apache.solr.analysis.TestNorwegianMinimalStemFilterFactory
   [junit4] Completed in 0.01s, 1 test
   [junit4]  
   [junit4] Suite: org.apache.solr.analysis.LengthFilterTest
   [junit4] Completed in 0.01s, 1 test
   [junit4]  
   [junit4] Suite: org.apache.solr.analysis.TestFinnishLightStemFilterFactory
   [junit4] Completed in 0.01s, 1 test
   [junit4]  
   [junit4] Suite: org.apache.solr.analysis.TestGreekStemFilterFactory
   [junit4] Completed in 0.01s, 1 test
   [junit4]  
   [junit4] Suite: org.apache.solr.analysis.TestGermanLightStemFilterFactory
   [junit4] Completed in 0.01s, 1 test
   [junit4]  
   [junit4] Suite: org.apache.solr.analysis.TestStemmerOverrideFilterFactory
   [junit4] Completed in 0.01s, 2 tests
   [junit4]  
   [junit4] Suite: org.apache.solr.analysis.TestTrimFilterFactory
   [junit4] Completed in 0.01s, 1 test
   [junit4]  
   [junit4] Suite: org.apache.solr.analysis.TestCJKBigramFilterFactory
   [junit4] Completed in 0.01s, 2 tests
   [junit4]  
   [junit4] Suite: org.apache.solr.analysis.TestGermanMinimalStemFilterFactory
   [junit4] Completed in 0.01s, 1 test
   [junit4]  
   [junit4] Suite: org.apache.solr.analysis.TestGermanStemFilterFactory
   [junit4] Completed in 0.01s, 1 test
   [junit4]  
   [junit4] Suite: org.apache.solr.analysis.TestChineseFilterFactory
   [junit4] Completed in 0.01s, 1 test
   [junit4]  
   [junit4] Suite: org.apache.solr.internal.csv.writer.CSVFieldTest
   [junit4] Completed in 0.01s, 2 tests
   [junit4]  
   [junit4] Suite: org.apache.solr.handler.admin.SystemInfoHandlerTest
   [junit4] Completed in 0.01s, 1 test
   [junit4]  
   [junit4] Suite: org.apache.solr.handler.PingRequestHandlerTest
   [junit4] Completed in 1.07s, 5 tests
   [junit4]  
   [junit4] Suite: org.apache.solr.handler.admin.LoggingHandlerTest
   [junit4] Completed in 1.09s, 1 test
   [junit4]  
   [junit4] Suite: org.apache.solr.util.TimeZoneUtilsTest
   [junit4] Completed in 0.18s, 5 tests
   [junit4]  
   [junit4] JVM J0:     1.01 ..  2044.05 =  2043.04s
   [junit4] Execution time total: 34 minutes 4 seconds
   [junit4] Tests summary: 286 suites, 972 tests, 1 failure, 10 ignored (5 assumptions)

BUILD FAILED
<http://jenkins.sd-datasolutions.de/job/Lucene-Solr-trunk-Windows-Java6-64/ws/build.xml>:29: The following error occurred while executing this line:
<http://jenkins.sd-datasolutions.de/job/Lucene-Solr-trunk-Windows-Java6-64/ws/solr\build.xml>:144: The following error occurred while executing this line:
<http://jenkins.sd-datasolutions.de/job/Lucene-Solr-trunk-Windows-Java6-64/ws/lucene\module-build.xml>:62: The following error occurred while executing this line:
<http://jenkins.sd-datasolutions.de/job/Lucene-Solr-trunk-Windows-Java6-64/ws/lucene\common-build.xml>:1019: The following error occurred while executing this line:
<http://jenkins.sd-datasolutions.de/job/Lucene-Solr-trunk-Windows-Java6-64/ws/lucene\common-build.xml>:745: There were test failures: 286 suites, 972 tests, 1 failure, 10 ignored (5 assumptions)

Total time: 48 minutes 49 seconds
Build step 'Invoke Ant' marked build as failure
Recording test results

---------------------------------------------------------------------
To unsubscribe, e-mail: [hidden email]
For additional commands, e-mail: [hidden email]

Reply | Threaded
Open this post in threaded view
|

Jenkins build is back to normal : Lucene-Solr-trunk-Windows-Java6-64 #321

Policeman Jenkins Server
See <http://jenkins.sd-datasolutions.de/job/Lucene-Solr-trunk-Windows-Java6-64/321/changes>


---------------------------------------------------------------------
To unsubscribe, e-mail: [hidden email]
For additional commands, e-mail: [hidden email]