[HUDSON] Lucene-Solr-tests-only-trunk - Build # 5732 - Failure

classic Classic list List threaded Threaded
8 messages Options
Reply | Threaded
Open this post in threaded view
|

[HUDSON] Lucene-Solr-tests-only-trunk - Build # 5732 - Failure

Apache Jenkins Server
Build: https://hudson.apache.org/hudson/job/Lucene-Solr-tests-only-trunk/5732/

2 tests failed.
FAILED:  org.apache.solr.update.DirectUpdateHandlerOptimizeTest.testWatchChildren

Error Message:
Forked Java VM exited abnormally. Please note the time in the report does not reflect the time until the VM exit.

Stack Trace:
junit.framework.AssertionFailedError: Forked Java VM exited abnormally. Please note the time in the report does not reflect the time until the VM exit.
        at java.lang.Thread.run(Thread.java:636)


FAILED:  TEST-org.apache.solr.cloud.ZkSolrClientTest.xml.<init>

Error Message:


Stack Trace:
Test report file /home/hudson/hudson-slave/workspace/Lucene-Solr-tests-only-trunk/checkout/solr/build/test-results/TEST-org.apache.solr.cloud.ZkSolrClientTest.xml was length 0



Build Log (for compile errors):
[...truncated 8481 lines...]



---------------------------------------------------------------------
To unsubscribe, e-mail: [hidden email]
For additional commands, e-mail: [hidden email]

Reply | Threaded
Open this post in threaded view
|

[HUDSON] Lucene-Solr-tests-only-trunk - Build # 5733 - Still Failing

Apache Jenkins Server
Build: https://hudson.apache.org/hudson/job/Lucene-Solr-tests-only-trunk/5733/

2 tests failed.
FAILED:  org.apache.solr.update.DirectUpdateHandlerOptimizeTest.testWatchChildren

Error Message:
Forked Java VM exited abnormally. Please note the time in the report does not reflect the time until the VM exit.

Stack Trace:
junit.framework.AssertionFailedError: Forked Java VM exited abnormally. Please note the time in the report does not reflect the time until the VM exit.
        at java.lang.Thread.run(Thread.java:636)


FAILED:  TEST-org.apache.solr.cloud.ZkSolrClientTest.xml.<init>

Error Message:


Stack Trace:
Test report file /home/hudson/hudson-slave/workspace/Lucene-Solr-tests-only-trunk/checkout/solr/build/test-results/TEST-org.apache.solr.cloud.ZkSolrClientTest.xml was length 0



Build Log (for compile errors):
[...truncated 8494 lines...]



---------------------------------------------------------------------
To unsubscribe, e-mail: [hidden email]
For additional commands, e-mail: [hidden email]

Reply | Threaded
Open this post in threaded view
|

[HUDSON] Lucene-Solr-tests-only-trunk - Build # 5734 - Still Failing

Apache Jenkins Server
Build: https://hudson.apache.org/hudson/job/Lucene-Solr-tests-only-trunk/5734/

2 tests failed.
FAILED:  org.apache.solr.update.DirectUpdateHandlerOptimizeTest.testWatchChildren

Error Message:
Forked Java VM exited abnormally. Please note the time in the report does not reflect the time until the VM exit.

Stack Trace:
junit.framework.AssertionFailedError: Forked Java VM exited abnormally. Please note the time in the report does not reflect the time until the VM exit.
        at java.lang.Thread.run(Thread.java:636)


FAILED:  TEST-org.apache.solr.cloud.ZkSolrClientTest.xml.<init>

Error Message:


Stack Trace:
Test report file /home/hudson/hudson-slave/workspace/Lucene-Solr-tests-only-trunk/checkout/solr/build/test-results/TEST-org.apache.solr.cloud.ZkSolrClientTest.xml was length 0



Build Log (for compile errors):
[...truncated 8483 lines...]



---------------------------------------------------------------------
To unsubscribe, e-mail: [hidden email]
For additional commands, e-mail: [hidden email]

Reply | Threaded
Open this post in threaded view
|

[HUDSON] Lucene-Solr-tests-only-trunk - Build # 5735 - Still Failing

Apache Jenkins Server
Build: https://hudson.apache.org/hudson/job/Lucene-Solr-tests-only-trunk/5735/

2 tests failed.
FAILED:  org.apache.solr.update.DirectUpdateHandlerOptimizeTest.testWatchChildren

Error Message:
Forked Java VM exited abnormally. Please note the time in the report does not reflect the time until the VM exit.

Stack Trace:
junit.framework.AssertionFailedError: Forked Java VM exited abnormally. Please note the time in the report does not reflect the time until the VM exit.
        at java.lang.Thread.run(Thread.java:636)


FAILED:  TEST-org.apache.solr.cloud.ZkSolrClientTest.xml.<init>

Error Message:


Stack Trace:
Test report file /home/hudson/hudson-slave/workspace/Lucene-Solr-tests-only-trunk/checkout/solr/build/test-results/TEST-org.apache.solr.cloud.ZkSolrClientTest.xml was length 0



Build Log (for compile errors):
[...truncated 8471 lines...]



---------------------------------------------------------------------
To unsubscribe, e-mail: [hidden email]
For additional commands, e-mail: [hidden email]

Reply | Threaded
Open this post in threaded view
|

[HUDSON] Lucene-Solr-tests-only-trunk - Build # 5736 - Still Failing

Apache Jenkins Server
Build: https://hudson.apache.org/hudson/job/Lucene-Solr-tests-only-trunk/5736/

2 tests failed.
FAILED:  org.apache.solr.update.DirectUpdateHandlerOptimizeTest.testWatchChildren

Error Message:
Forked Java VM exited abnormally. Please note the time in the report does not reflect the time until the VM exit.

Stack Trace:
junit.framework.AssertionFailedError: Forked Java VM exited abnormally. Please note the time in the report does not reflect the time until the VM exit.
        at java.lang.Thread.run(Thread.java:636)


FAILED:  TEST-org.apache.solr.cloud.ZkSolrClientTest.xml.<init>

Error Message:


Stack Trace:
Test report file /home/hudson/hudson-slave/workspace/Lucene-Solr-tests-only-trunk/checkout/solr/build/test-results/TEST-org.apache.solr.cloud.ZkSolrClientTest.xml was length 0



Build Log (for compile errors):
[...truncated 8466 lines...]



---------------------------------------------------------------------
To unsubscribe, e-mail: [hidden email]
For additional commands, e-mail: [hidden email]

Reply | Threaded
Open this post in threaded view
|

[HUDSON] Lucene-Solr-tests-only-trunk - Build # 5737 - Still Failing

Apache Jenkins Server
Build: https://hudson.apache.org/hudson/job/Lucene-Solr-tests-only-trunk/5737/

2 tests failed.
FAILED:  org.apache.solr.update.DirectUpdateHandlerOptimizeTest.testWatchChildren

Error Message:
Forked Java VM exited abnormally. Please note the time in the report does not reflect the time until the VM exit.

Stack Trace:
junit.framework.AssertionFailedError: Forked Java VM exited abnormally. Please note the time in the report does not reflect the time until the VM exit.
        at java.lang.Thread.run(Thread.java:636)


FAILED:  TEST-org.apache.solr.cloud.ZkSolrClientTest.xml.<init>

Error Message:


Stack Trace:
Test report file /home/hudson/hudson-slave/workspace/Lucene-Solr-tests-only-trunk/checkout/solr/build/test-results/TEST-org.apache.solr.cloud.ZkSolrClientTest.xml was length 0



Build Log (for compile errors):
[...truncated 8476 lines...]



---------------------------------------------------------------------
To unsubscribe, e-mail: [hidden email]
For additional commands, e-mail: [hidden email]

Reply | Threaded
Open this post in threaded view
|

[HUDSON] Lucene-Solr-tests-only-trunk - Build # 5738 - Still Failing

Apache Jenkins Server
Build: https://hudson.apache.org/hudson/job/Lucene-Solr-tests-only-trunk/5738/

2 tests failed.
FAILED:  org.apache.solr.update.DirectUpdateHandlerOptimizeTest.testWatchChildren

Error Message:
Forked Java VM exited abnormally. Please note the time in the report does not reflect the time until the VM exit.

Stack Trace:
junit.framework.AssertionFailedError: Forked Java VM exited abnormally. Please note the time in the report does not reflect the time until the VM exit.
        at java.lang.Thread.run(Thread.java:636)


FAILED:  TEST-org.apache.solr.cloud.ZkSolrClientTest.xml.<init>

Error Message:


Stack Trace:
Test report file /home/hudson/hudson-slave/workspace/Lucene-Solr-tests-only-trunk/checkout/solr/build/test-results/TEST-org.apache.solr.cloud.ZkSolrClientTest.xml was length 0



Build Log (for compile errors):
[...truncated 8466 lines...]



---------------------------------------------------------------------
To unsubscribe, e-mail: [hidden email]
For additional commands, e-mail: [hidden email]

Reply | Threaded
Open this post in threaded view
|

Re: [HUDSON] Lucene-Solr-tests-only-trunk - Build # 5738 - Still Failing

Robert Muir
By the way, I've been seeing this for a while in my local (this test
often causes my jre to crash).

So its nothing wrong with hudson, I just thought it might have been my
computer since nobody else complained.

On Wed, Mar 9, 2011 at 12:13 PM, Apache Hudson Server
<[hidden email]> wrote:

> Build: https://hudson.apache.org/hudson/job/Lucene-Solr-tests-only-trunk/5738/
>
> 2 tests failed.
> FAILED:  org.apache.solr.update.DirectUpdateHandlerOptimizeTest.testWatchChildren
>
> Error Message:
> Forked Java VM exited abnormally. Please note the time in the report does not reflect the time until the VM exit.
>
> Stack Trace:
> junit.framework.AssertionFailedError: Forked Java VM exited abnormally. Please note the time in the report does not reflect the time until the VM exit.
>        at java.lang.Thread.run(Thread.java:636)
>
>
> FAILED:  TEST-org.apache.solr.cloud.ZkSolrClientTest.xml.<init>
>
> Error Message:
>
>
> Stack Trace:
> Test report file /home/hudson/hudson-slave/workspace/Lucene-Solr-tests-only-trunk/checkout/solr/build/test-results/TEST-org.apache.solr.cloud.ZkSolrClientTest.xml was length 0
>
>
>
> Build Log (for compile errors):
> [...truncated 8466 lines...]
>
>
>
> ---------------------------------------------------------------------
> To unsubscribe, e-mail: [hidden email]
> For additional commands, e-mail: [hidden email]
>
>

---------------------------------------------------------------------
To unsubscribe, e-mail: [hidden email]
For additional commands, e-mail: [hidden email]