[HUDSON] Lucene-Solr-tests-only-trunk - Build # 5740 - Failure

classic Classic list List threaded Threaded
4 messages Options
Reply | Threaded
Open this post in threaded view
|

[HUDSON] Lucene-Solr-tests-only-trunk - Build # 5740 - Failure

Apache Jenkins Server
Build: https://hudson.apache.org/hudson/job/Lucene-Solr-tests-only-trunk/5740/

2 tests failed.
FAILED:  org.apache.solr.update.DirectUpdateHandlerOptimizeTest.testWatchChildren

Error Message:
Forked Java VM exited abnormally. Please note the time in the report does not reflect the time until the VM exit.

Stack Trace:
junit.framework.AssertionFailedError: Forked Java VM exited abnormally. Please note the time in the report does not reflect the time until the VM exit.
        at java.lang.Thread.run(Thread.java:636)


FAILED:  TEST-org.apache.solr.cloud.ZkSolrClientTest.xml.<init>

Error Message:


Stack Trace:
Test report file /home/hudson/hudson-slave/workspace/Lucene-Solr-tests-only-trunk/checkout/solr/build/test-results/TEST-org.apache.solr.cloud.ZkSolrClientTest.xml was length 0



Build Log (for compile errors):
[...truncated 8499 lines...]



---------------------------------------------------------------------
To unsubscribe, e-mail: [hidden email]
For additional commands, e-mail: [hidden email]

Reply | Threaded
Open this post in threaded view
|

[HUDSON] Lucene-Solr-tests-only-trunk - Build # 5741 - Still Failing

Apache Jenkins Server
Build: https://hudson.apache.org/hudson/job/Lucene-Solr-tests-only-trunk/5741/

2 tests failed.
FAILED:  org.apache.solr.update.DirectUpdateHandlerOptimizeTest.testWatchChildren

Error Message:
Forked Java VM exited abnormally. Please note the time in the report does not reflect the time until the VM exit.

Stack Trace:
junit.framework.AssertionFailedError: Forked Java VM exited abnormally. Please note the time in the report does not reflect the time until the VM exit.
        at java.lang.Thread.run(Thread.java:636)


FAILED:  TEST-org.apache.solr.cloud.ZkSolrClientTest.xml.<init>

Error Message:


Stack Trace:
Test report file /home/hudson/hudson-slave/workspace/Lucene-Solr-tests-only-trunk/checkout/solr/build/test-results/TEST-org.apache.solr.cloud.ZkSolrClientTest.xml was length 0



Build Log (for compile errors):
[...truncated 8474 lines...]



---------------------------------------------------------------------
To unsubscribe, e-mail: [hidden email]
For additional commands, e-mail: [hidden email]

Reply | Threaded
Open this post in threaded view
|

[HUDSON] Lucene-Solr-tests-only-trunk - Build # 5742 - Still Failing

Apache Jenkins Server
Build: https://hudson.apache.org/hudson/job/Lucene-Solr-tests-only-trunk/5742/

2 tests failed.
FAILED:  org.apache.solr.update.DirectUpdateHandlerOptimizeTest.testWatchChildren

Error Message:
Forked Java VM exited abnormally. Please note the time in the report does not reflect the time until the VM exit.

Stack Trace:
junit.framework.AssertionFailedError: Forked Java VM exited abnormally. Please note the time in the report does not reflect the time until the VM exit.
        at java.lang.Thread.run(Thread.java:636)


FAILED:  TEST-org.apache.solr.cloud.ZkSolrClientTest.xml.<init>

Error Message:


Stack Trace:
Test report file /home/hudson/hudson-slave/workspace/Lucene-Solr-tests-only-trunk/checkout/solr/build/test-results/TEST-org.apache.solr.cloud.ZkSolrClientTest.xml was length 0



Build Log (for compile errors):
[...truncated 8457 lines...]



---------------------------------------------------------------------
To unsubscribe, e-mail: [hidden email]
For additional commands, e-mail: [hidden email]

Reply | Threaded
Open this post in threaded view
|

[HUDSON] Lucene-Solr-tests-only-trunk - Build # 5743 - Still Failing

Apache Jenkins Server
Build: https://hudson.apache.org/hudson/job/Lucene-Solr-tests-only-trunk/5743/

2 tests failed.
FAILED:  org.apache.solr.update.DirectUpdateHandlerOptimizeTest.testWatchChildren

Error Message:
Forked Java VM exited abnormally. Please note the time in the report does not reflect the time until the VM exit.

Stack Trace:
junit.framework.AssertionFailedError: Forked Java VM exited abnormally. Please note the time in the report does not reflect the time until the VM exit.
        at java.lang.Thread.run(Thread.java:636)


FAILED:  TEST-org.apache.solr.cloud.ZkSolrClientTest.xml.<init>

Error Message:


Stack Trace:
Test report file /home/hudson/hudson-slave/workspace/Lucene-Solr-tests-only-trunk/checkout/solr/build/test-results/TEST-org.apache.solr.cloud.ZkSolrClientTest.xml was length 0



Build Log (for compile errors):
[...truncated 8461 lines...]



---------------------------------------------------------------------
To unsubscribe, e-mail: [hidden email]
For additional commands, e-mail: [hidden email]