[JENKINS-EA] Lucene-Solr-6.x-Linux (32bit/jdk-9-ea+155) - Build # 2873 - Unstable!

Previous Topic Next Topic
 
classic Classic list List threaded Threaded
6 messages Options
Reply | Threaded
Open this post in threaded view
|

[JENKINS-EA] Lucene-Solr-6.x-Linux (32bit/jdk-9-ea+155) - Build # 2873 - Unstable!

Policeman Jenkins Server-2
Build: https://jenkins.thetaphi.de/job/Lucene-Solr-6.x-Linux/2873/
Java: 32bit/jdk-9-ea+155 -server -XX:+UseParallelGC

1 tests failed.
FAILED:  org.apache.solr.handler.admin.TestApiFramework.testFramework

Error Message:


Stack Trace:
java.lang.ExceptionInInitializerError
        at __randomizedtesting.SeedInfo.seed([B7BB67CC3268542B:A0CDADEB34BCB816]:0)
        at net.sf.cglib.core.KeyFactory$Generator.generateClass(KeyFactory.java:166)
        at net.sf.cglib.core.DefaultGeneratorStrategy.generate(DefaultGeneratorStrategy.java:25)
        at net.sf.cglib.core.AbstractClassGenerator.create(AbstractClassGenerator.java:216)
        at net.sf.cglib.core.KeyFactory$Generator.create(KeyFactory.java:144)
        at net.sf.cglib.core.KeyFactory.create(KeyFactory.java:116)
        at net.sf.cglib.core.KeyFactory.create(KeyFactory.java:108)
        at net.sf.cglib.core.KeyFactory.create(KeyFactory.java:104)
        at net.sf.cglib.proxy.Enhancer.<clinit>(Enhancer.java:69)
        at org.easymock.internal.ClassProxyFactory.createEnhancer(ClassProxyFactory.java:259)
        at org.easymock.internal.ClassProxyFactory.createProxy(ClassProxyFactory.java:174)
        at org.easymock.internal.MocksControl.createMock(MocksControl.java:60)
        at org.easymock.EasyMock.createMock(EasyMock.java:104)
        at org.apache.solr.handler.admin.TestCoreAdminApis.getCoreContainerMock(TestCoreAdminApis.java:83)
        at org.apache.solr.handler.admin.TestApiFramework.testFramework(TestApiFramework.java:59)
        at java.base/jdk.internal.reflect.NativeMethodAccessorImpl.invoke0(Native Method)
        at java.base/jdk.internal.reflect.NativeMethodAccessorImpl.invoke(NativeMethodAccessorImpl.java:62)
        at java.base/jdk.internal.reflect.DelegatingMethodAccessorImpl.invoke(DelegatingMethodAccessorImpl.java:43)
        at java.base/java.lang.reflect.Method.invoke(Method.java:543)
        at com.carrotsearch.randomizedtesting.RandomizedRunner.invoke(RandomizedRunner.java:1713)
        at com.carrotsearch.randomizedtesting.RandomizedRunner$8.evaluate(RandomizedRunner.java:907)
        at com.carrotsearch.randomizedtesting.RandomizedRunner$9.evaluate(RandomizedRunner.java:943)
        at com.carrotsearch.randomizedtesting.RandomizedRunner$10.evaluate(RandomizedRunner.java:957)
        at com.carrotsearch.randomizedtesting.rules.SystemPropertiesRestoreRule$1.evaluate(SystemPropertiesRestoreRule.java:57)
        at org.apache.lucene.util.TestRuleSetupTeardownChained$1.evaluate(TestRuleSetupTeardownChained.java:49)
        at org.apache.lucene.util.AbstractBeforeAfterRule$1.evaluate(AbstractBeforeAfterRule.java:45)
        at org.apache.lucene.util.TestRuleThreadAndTestName$1.evaluate(TestRuleThreadAndTestName.java:48)
        at org.apache.lucene.util.TestRuleIgnoreAfterMaxFailures$1.evaluate(TestRuleIgnoreAfterMaxFailures.java:64)
        at org.apache.lucene.util.TestRuleMarkFailure$1.evaluate(TestRuleMarkFailure.java:47)
        at com.carrotsearch.randomizedtesting.rules.StatementAdapter.evaluate(StatementAdapter.java:36)
        at com.carrotsearch.randomizedtesting.ThreadLeakControl$StatementRunner.run(ThreadLeakControl.java:368)
        at com.carrotsearch.randomizedtesting.ThreadLeakControl.forkTimeoutingTask(ThreadLeakControl.java:817)
        at com.carrotsearch.randomizedtesting.ThreadLeakControl$3.evaluate(ThreadLeakControl.java:468)
        at com.carrotsearch.randomizedtesting.RandomizedRunner.runSingleTest(RandomizedRunner.java:916)
        at com.carrotsearch.randomizedtesting.RandomizedRunner$5.evaluate(RandomizedRunner.java:802)
        at com.carrotsearch.randomizedtesting.RandomizedRunner$6.evaluate(RandomizedRunner.java:852)
        at com.carrotsearch.randomizedtesting.RandomizedRunner$7.evaluate(RandomizedRunner.java:863)
        at com.carrotsearch.randomizedtesting.rules.StatementAdapter.evaluate(StatementAdapter.java:36)
        at com.carrotsearch.randomizedtesting.rules.SystemPropertiesRestoreRule$1.evaluate(SystemPropertiesRestoreRule.java:57)
        at org.apache.lucene.util.AbstractBeforeAfterRule$1.evaluate(AbstractBeforeAfterRule.java:45)
        at com.carrotsearch.randomizedtesting.rules.StatementAdapter.evaluate(StatementAdapter.java:36)
        at org.apache.lucene.util.TestRuleStoreClassName$1.evaluate(TestRuleStoreClassName.java:41)
        at com.carrotsearch.randomizedtesting.rules.NoShadowingOrOverridesOnMethodsRule$1.evaluate(NoShadowingOrOverridesOnMethodsRule.java:40)
        at com.carrotsearch.randomizedtesting.rules.NoShadowingOrOverridesOnMethodsRule$1.evaluate(NoShadowingOrOverridesOnMethodsRule.java:40)
        at com.carrotsearch.randomizedtesting.rules.StatementAdapter.evaluate(StatementAdapter.java:36)
        at com.carrotsearch.randomizedtesting.rules.StatementAdapter.evaluate(StatementAdapter.java:36)
        at org.apache.lucene.util.TestRuleAssertionsRequired$1.evaluate(TestRuleAssertionsRequired.java:53)
        at org.apache.lucene.util.TestRuleMarkFailure$1.evaluate(TestRuleMarkFailure.java:47)
        at org.apache.lucene.util.TestRuleIgnoreAfterMaxFailures$1.evaluate(TestRuleIgnoreAfterMaxFailures.java:64)
        at org.apache.lucene.util.TestRuleIgnoreTestSuites$1.evaluate(TestRuleIgnoreTestSuites.java:54)
        at com.carrotsearch.randomizedtesting.rules.StatementAdapter.evaluate(StatementAdapter.java:36)
        at com.carrotsearch.randomizedtesting.ThreadLeakControl$StatementRunner.run(ThreadLeakControl.java:368)
        at java.base/java.lang.Thread.run(Thread.java:844)
Caused by: java.lang.reflect.InaccessibleObjectException: Unable to make protected final java.lang.Class java.lang.ClassLoader.defineClass(java.lang.String,byte[],int,int,java.security.ProtectionDomain) throws java.lang.ClassFormatError accessible: module java.base does not "opens java.lang" to unnamed module @520e4e
        at java.base/java.lang.reflect.AccessibleObject.checkCanSetAccessible(AccessibleObject.java:207)
        at java.base/java.lang.reflect.Method.checkCanSetAccessible(Method.java:192)
        at java.base/java.lang.reflect.Method.setAccessible(Method.java:186)
        at net.sf.cglib.core.ReflectUtils$2.run(ReflectUtils.java:56)
        at java.base/java.security.AccessController.doPrivileged(Native Method)
        at net.sf.cglib.core.ReflectUtils.<clinit>(ReflectUtils.java:46)
        ... 52 more




Build Log:
[...truncated 12752 lines...]
   [junit4] Suite: org.apache.solr.handler.admin.TestApiFramework
   [junit4]   2> Creating dataDir: /home/jenkins/workspace/Lucene-Solr-6.x-Linux/solr/build/solr-core/test/J1/temp/solr.handler.admin.TestApiFramework_B7BB67CC3268542B-001/init-core-data-001
   [junit4]   2> 2177923 INFO  (SUITE-TestApiFramework-seed#[B7BB67CC3268542B]-worker) [    ] o.a.s.SolrTestCaseJ4 Using TrieFields
   [junit4]   2> 2177925 INFO  (SUITE-TestApiFramework-seed#[B7BB67CC3268542B]-worker) [    ] o.a.s.SolrTestCaseJ4 Randomized ssl (true) and clientAuth (false) via: @org.apache.solr.util.RandomizeSSL(reason="", ssl=0.0/0.0, value=0.0/0.0, clientAuth=0.0/0.0)
   [junit4]   2> 2177928 INFO  (TEST-TestApiFramework.testTrailingTemplatePaths-seed#[B7BB67CC3268542B]) [    ] o.a.s.SolrTestCaseJ4 ###Starting testTrailingTemplatePaths
   [junit4]   2> 2177929 INFO  (TEST-TestApiFramework.testTrailingTemplatePaths-seed#[B7BB67CC3268542B]) [    ] o.a.s.SolrTestCaseJ4 ###Ending testTrailingTemplatePaths
   [junit4]   2> 2177930 INFO  (TEST-TestApiFramework.testFramework-seed#[B7BB67CC3268542B]) [    ] o.a.s.SolrTestCaseJ4 ###Starting testFramework
   [junit4]   2> 2177975 INFO  (TEST-TestApiFramework.testFramework-seed#[B7BB67CC3268542B]) [    ] o.a.s.SolrTestCaseJ4 ###Ending testFramework
   [junit4]   2> NOTE: reproduce with: ant test  -Dtestcase=TestApiFramework -Dtests.method=testFramework -Dtests.seed=B7BB67CC3268542B -Dtests.multiplier=3 -Dtests.slow=true -Dtests.locale=kea -Dtests.timezone=Asia/Tomsk -Dtests.asserts=true -Dtests.file.encoding=US-ASCII
   [junit4] ERROR   0.05s J1 | TestApiFramework.testFramework <<<
   [junit4]    > Throwable #1: java.lang.ExceptionInInitializerError
   [junit4]    > at __randomizedtesting.SeedInfo.seed([B7BB67CC3268542B:A0CDADEB34BCB816]:0)
   [junit4]    > at net.sf.cglib.core.KeyFactory$Generator.generateClass(KeyFactory.java:166)
   [junit4]    > at net.sf.cglib.core.DefaultGeneratorStrategy.generate(DefaultGeneratorStrategy.java:25)
   [junit4]    > at net.sf.cglib.core.AbstractClassGenerator.create(AbstractClassGenerator.java:216)
   [junit4]    > at net.sf.cglib.core.KeyFactory$Generator.create(KeyFactory.java:144)
   [junit4]    > at net.sf.cglib.core.KeyFactory.create(KeyFactory.java:116)
   [junit4]    > at net.sf.cglib.core.KeyFactory.create(KeyFactory.java:108)
   [junit4]    > at net.sf.cglib.core.KeyFactory.create(KeyFactory.java:104)
   [junit4]    > at net.sf.cglib.proxy.Enhancer.<clinit>(Enhancer.java:69)
   [junit4]    > at org.easymock.internal.ClassProxyFactory.createEnhancer(ClassProxyFactory.java:259)
   [junit4]    > at org.easymock.internal.ClassProxyFactory.createProxy(ClassProxyFactory.java:174)
   [junit4]    > at org.easymock.internal.MocksControl.createMock(MocksControl.java:60)
   [junit4]    > at org.easymock.EasyMock.createMock(EasyMock.java:104)
   [junit4]    > at org.apache.solr.handler.admin.TestCoreAdminApis.getCoreContainerMock(TestCoreAdminApis.java:83)
   [junit4]    > at org.apache.solr.handler.admin.TestApiFramework.testFramework(TestApiFramework.java:59)
   [junit4]    > at java.base/jdk.internal.reflect.NativeMethodAccessorImpl.invoke0(Native Method)
   [junit4]    > at java.base/jdk.internal.reflect.NativeMethodAccessorImpl.invoke(NativeMethodAccessorImpl.java:62)
   [junit4]    > at java.base/jdk.internal.reflect.DelegatingMethodAccessorImpl.invoke(DelegatingMethodAccessorImpl.java:43)
   [junit4]    > at java.base/java.lang.reflect.Method.invoke(Method.java:543)
   [junit4]    > at java.base/java.lang.Thread.run(Thread.java:844)
   [junit4]    > Caused by: java.lang.reflect.InaccessibleObjectException: Unable to make protected final java.lang.Class java.lang.ClassLoader.defineClass(java.lang.String,byte[],int,int,java.security.ProtectionDomain) throws java.lang.ClassFormatError accessible: module java.base does not "opens java.lang" to unnamed module @520e4e
   [junit4]    > at java.base/java.lang.reflect.AccessibleObject.checkCanSetAccessible(AccessibleObject.java:207)
   [junit4]    > at java.base/java.lang.reflect.Method.checkCanSetAccessible(Method.java:192)
   [junit4]    > at java.base/java.lang.reflect.Method.setAccessible(Method.java:186)
   [junit4]    > at net.sf.cglib.core.ReflectUtils$2.run(ReflectUtils.java:56)
   [junit4]    > at java.base/java.security.AccessController.doPrivileged(Native Method)
   [junit4]    > at net.sf.cglib.core.ReflectUtils.<clinit>(ReflectUtils.java:46)
   [junit4]    > ... 52 more
   [junit4]   2> 2177977 INFO  (SUITE-TestApiFramework-seed#[B7BB67CC3268542B]-worker) [    ] o.a.s.SolrTestCaseJ4 ###deleteCore
   [junit4]   2> NOTE: leaving temporary files on disk at: /home/jenkins/workspace/Lucene-Solr-6.x-Linux/solr/build/solr-core/test/J1/temp/solr.handler.admin.TestApiFramework_B7BB67CC3268542B-001
   [junit4]   2> NOTE: test params are: codec=Asserting(Lucene62): {}, docValues:{}, maxPointsInLeafNode=1926, maxMBSortInHeap=7.474650484146695, sim=RandomSimilarity(queryNorm=true,coord=crazy): {}, locale=kea, timezone=Asia/Tomsk
   [junit4]   2> NOTE: Linux 4.4.0-53-generic i386/Oracle Corporation 9-ea (32-bit)/cpus=12,threads=1,free=151287920,total=470024192
   [junit4]   2> NOTE: All tests run in this JVM: [JvmMetricsTest, CoreSorterTest, TestSmileRequest, TestPartialUpdateDeduplication, TermsComponentTest, TlogReplayBufferedWhileIndexingTest, CdcrVersionReplicationTest, BlockJoinFacetDistribTest, AddBlockUpdateTest, OverseerTaskQueueTest, LoggingHandlerTest, SortSpecParsingTest, TestLMDirichletSimilarityFactory, TestSerializedLuceneMatchVersion, CSVRequestHandlerTest, ZkCLITest, TestDistribDocBasedVersion, DistributedFacetExistsSmallTest, DateMathParserTest, TestInitParams, TestDynamicLoading, SpellingQueryConverterTest, TestQuerySenderListener, TestConfigSetsAPIZkFailure, TestBlendedInfixSuggestions, TestJsonFacetRefinement, TestDocTermOrds, TestFastOutputStream, TestManagedSchemaAPI, TestSurroundQueryParser, TestSubQueryTransformerDistrib, BasicFunctionalityTest, TestRawResponseWriter, TestDynamicFieldResource, FacetPivotSmallTest, TestDistributedGrouping, UpdateRequestProcessorFactoryTest, TestCharFilters, ChaosMonkeySafeLeaderTest, TestConfigOverlay, DistribDocExpirationUpdateProcessorTest, TestDocBasedVersionConstraints, TestFieldCacheSanityChecker, TestCustomDocTransformer, TestImpersonationWithHadoopAuth, CollectionsAPIDistributedZkTest, V2ApiIntegrationTest, SolrGraphiteReporterTest, TestSolrFieldCacheMBean, TestCoreContainer, GraphQueryTest, HighlighterMaxOffsetTest, MoreLikeThisHandlerTest, TestDefaultStatsCache, IndexBasedSpellCheckerTest, TestTestInjection, FullHLLTest, TestCloudPseudoReturnFields, TestFieldTypeCollectionResource, TestLRUCache, HdfsSyncSliceTest, TestCloudSchemaless, TestConfigSets, TestFuzzyAnalyzedSuggestions, DistributedVersionInfoTest, ShardRoutingCustomTest, TestSchemaManager, WrapperMergePolicyFactoryTest, IndexSchemaTest, DocumentBuilderTest, DeleteLastCustomShardedReplicaTest, SystemInfoHandlerTest, TestSolrConfigHandlerCloud, TestShortCircuitedRequests, TestHdfsBackupRestoreCore, SpellCheckComponentTest, CreateCollectionCleanupTest, MigrateRouteKeyTest, DateRangeFieldTest, SaslZkACLProviderTest, TestTrieFacet, RemoteQueryErrorTest, OutOfBoxZkACLAndCredentialsProvidersTest, VersionInfoTest, SmileWriterTest, ResponseHeaderTest, TestIntervalFaceting, TestSweetSpotSimilarityFactory, TestSuggestSpellingConverter, BadCopyFieldTest, SecurityConfHandlerTest, TestShardHandlerFactory, SliceStateTest, SuggesterFSTTest, DistanceFunctionTest, TestUseDocValuesAsStored2, DistributedMLTComponentTest, TestStressVersions, UUIDUpdateProcessorFallbackTest, TestRuleBasedAuthorizationPlugin, CursorMarkTest, RAMDirectoryFactoryTest, JSONWriterTest, TestHashPartitioner, TestCloudDeleteByQuery, TestMiniSolrCloudCluster, TestJsonRequest, ConcurrentDeleteAndCreateCollectionTest, TestCustomSort, LeaderFailureAfterFreshStartTest, TestTrie, DirectSolrSpellCheckerTest, SampleTest, TestSimpleTrackingShardHandler, SolrMetricReporterTest, BasicDistributedZkTest, OpenCloseCoreStressTest, OverseerTest, ShardRoutingTest, ClusterStateUpdateTest, TestRandomFaceting, ZkSolrClientTest, DistributedSpellCheckComponentTest, TermVectorComponentDistributedTest, HardAutoCommitTest, DistributedTermsComponentTest, StatsComponentTest, QueryElevationComponentTest, BadIndexSchemaTest, ConvertedLegacyTest, TestSort, DirectUpdateHandlerTest, TestBadConfig, TestIndexSearcher, HighlighterTest, SoftAutoCommitTest, SolrIndexSplitterTest, SpellCheckCollatorTest, SolrRequestParserTest, DocValuesTest, SchemaVersionSpecificBehaviorTest, TestAtomicUpdateErrorCases, SortByFunctionTest, XsltUpdateRequestHandlerTest, CacheHeaderTest, DisMaxRequestHandlerTest, TestQueryUtils, StandardRequestHandlerTest, DocumentAnalysisRequestHandlerTest, TestOmitPositions, XmlUpdateRequestHandlerTest, TestValueSourceCache, TermVectorComponentTest, IndexSchemaRuntimeFieldTest, SolrPluginUtilsTest, ReturnFieldsTest, JSONWriterTest, MBeansHandlerTest, JsonLoaderTest, TestComponentsName, SearchHandlerTest, HighlighterConfigTest, SOLR749Test, UpdateParamsTest, AlternateDirectoryTest, TestSolrIndexConfig, CopyFieldTest, SolrIndexConfigTest, BadComponentTest, TestMergePolicyConfig, MinimalSchemaTest, TestConfig, DirectSolrConnectionTest, TestPhraseSuggestions, TestPerFieldSimilarity, TestFastWriter, TestJmxMonitoredMap, URLClassifyProcessorTest, PreAnalyzedFieldTest, DateFieldTest, TestUtils, CircularListTest, DistributedIntervalFacetingTest, CollectionsAPIAsyncDistributedZkTest, DeleteReplicaTest, LeaderInitiatedRecoveryOnCommitTest, MissingSegmentRecoveryTest, OverriddenZkACLAndCredentialsProvidersTest, OverseerModifyCollectionTest, RecoveryAfterSoftCommitTest, ReplaceNodeTest, TestCollectionAPI, TestLocalFSCloudBackupRestore, TestRebalanceLeaders, TestSSLRandomization, TestStressLiveNodes, HdfsBasicDistributedZk2Test, HdfsChaosMonkeySafeLeaderTest, HdfsNNFailoverTest, HdfsRecoverLeaseTest, HdfsRecoveryZkTest, HdfsTlogReplayBufferedWhileIndexingTest, HdfsUnloadDistributedZkTest, StressHdfsTest, TestClusterStateMutator, ZkStateReaderTest, ZkStateWriterTest, HdfsDirectoryFactoryTest, TestBackupRepositoryFactory, TestConfigSetImmutable, TestSolrConfigHandler, TestRestoreCore, TestSolrConfigHandlerConcurrent, TestApiFramework]
   [junit4] Completed [573/692 (1!)] on J1 in 0.07s, 2 tests, 1 error <<< FAILURES!

[...truncated 52043 lines...]



---------------------------------------------------------------------
To unsubscribe, e-mail: [hidden email]
For additional commands, e-mail: [hidden email]
Reply | Threaded
Open this post in threaded view
|

[JENKINS-EA] Lucene-Solr-6.x-Linux (64bit/jdk-9-ea+155) - Build # 2874 - Still Unstable!

Policeman Jenkins Server-2
Build: https://jenkins.thetaphi.de/job/Lucene-Solr-6.x-Linux/2874/
Java: 64bit/jdk-9-ea+155 -XX:+UseCompressedOops -XX:+UseParallelGC

1 tests failed.
FAILED:  org.apache.solr.handler.admin.TestApiFramework.testFramework

Error Message:


Stack Trace:
java.lang.ExceptionInInitializerError
        at __randomizedtesting.SeedInfo.seed([98F85471534EEC5:1EF94F6013E002F8]:0)
        at net.sf.cglib.core.KeyFactory$Generator.generateClass(KeyFactory.java:166)
        at net.sf.cglib.core.DefaultGeneratorStrategy.generate(DefaultGeneratorStrategy.java:25)
        at net.sf.cglib.core.AbstractClassGenerator.create(AbstractClassGenerator.java:216)
        at net.sf.cglib.core.KeyFactory$Generator.create(KeyFactory.java:144)
        at net.sf.cglib.core.KeyFactory.create(KeyFactory.java:116)
        at net.sf.cglib.core.KeyFactory.create(KeyFactory.java:108)
        at net.sf.cglib.core.KeyFactory.create(KeyFactory.java:104)
        at net.sf.cglib.proxy.Enhancer.<clinit>(Enhancer.java:69)
        at org.easymock.internal.ClassProxyFactory.createEnhancer(ClassProxyFactory.java:259)
        at org.easymock.internal.ClassProxyFactory.createProxy(ClassProxyFactory.java:174)
        at org.easymock.internal.MocksControl.createMock(MocksControl.java:60)
        at org.easymock.EasyMock.createMock(EasyMock.java:104)
        at org.apache.solr.handler.admin.TestCoreAdminApis.getCoreContainerMock(TestCoreAdminApis.java:83)
        at org.apache.solr.handler.admin.TestApiFramework.testFramework(TestApiFramework.java:59)
        at java.base/jdk.internal.reflect.NativeMethodAccessorImpl.invoke0(Native Method)
        at java.base/jdk.internal.reflect.NativeMethodAccessorImpl.invoke(NativeMethodAccessorImpl.java:62)
        at java.base/jdk.internal.reflect.DelegatingMethodAccessorImpl.invoke(DelegatingMethodAccessorImpl.java:43)
        at java.base/java.lang.reflect.Method.invoke(Method.java:543)
        at com.carrotsearch.randomizedtesting.RandomizedRunner.invoke(RandomizedRunner.java:1713)
        at com.carrotsearch.randomizedtesting.RandomizedRunner$8.evaluate(RandomizedRunner.java:907)
        at com.carrotsearch.randomizedtesting.RandomizedRunner$9.evaluate(RandomizedRunner.java:943)
        at com.carrotsearch.randomizedtesting.RandomizedRunner$10.evaluate(RandomizedRunner.java:957)
        at com.carrotsearch.randomizedtesting.rules.SystemPropertiesRestoreRule$1.evaluate(SystemPropertiesRestoreRule.java:57)
        at org.apache.lucene.util.TestRuleSetupTeardownChained$1.evaluate(TestRuleSetupTeardownChained.java:49)
        at org.apache.lucene.util.AbstractBeforeAfterRule$1.evaluate(AbstractBeforeAfterRule.java:45)
        at org.apache.lucene.util.TestRuleThreadAndTestName$1.evaluate(TestRuleThreadAndTestName.java:48)
        at org.apache.lucene.util.TestRuleIgnoreAfterMaxFailures$1.evaluate(TestRuleIgnoreAfterMaxFailures.java:64)
        at org.apache.lucene.util.TestRuleMarkFailure$1.evaluate(TestRuleMarkFailure.java:47)
        at com.carrotsearch.randomizedtesting.rules.StatementAdapter.evaluate(StatementAdapter.java:36)
        at com.carrotsearch.randomizedtesting.ThreadLeakControl$StatementRunner.run(ThreadLeakControl.java:368)
        at com.carrotsearch.randomizedtesting.ThreadLeakControl.forkTimeoutingTask(ThreadLeakControl.java:817)
        at com.carrotsearch.randomizedtesting.ThreadLeakControl$3.evaluate(ThreadLeakControl.java:468)
        at com.carrotsearch.randomizedtesting.RandomizedRunner.runSingleTest(RandomizedRunner.java:916)
        at com.carrotsearch.randomizedtesting.RandomizedRunner$5.evaluate(RandomizedRunner.java:802)
        at com.carrotsearch.randomizedtesting.RandomizedRunner$6.evaluate(RandomizedRunner.java:852)
        at com.carrotsearch.randomizedtesting.RandomizedRunner$7.evaluate(RandomizedRunner.java:863)
        at com.carrotsearch.randomizedtesting.rules.StatementAdapter.evaluate(StatementAdapter.java:36)
        at com.carrotsearch.randomizedtesting.rules.SystemPropertiesRestoreRule$1.evaluate(SystemPropertiesRestoreRule.java:57)
        at org.apache.lucene.util.AbstractBeforeAfterRule$1.evaluate(AbstractBeforeAfterRule.java:45)
        at com.carrotsearch.randomizedtesting.rules.StatementAdapter.evaluate(StatementAdapter.java:36)
        at org.apache.lucene.util.TestRuleStoreClassName$1.evaluate(TestRuleStoreClassName.java:41)
        at com.carrotsearch.randomizedtesting.rules.NoShadowingOrOverridesOnMethodsRule$1.evaluate(NoShadowingOrOverridesOnMethodsRule.java:40)
        at com.carrotsearch.randomizedtesting.rules.NoShadowingOrOverridesOnMethodsRule$1.evaluate(NoShadowingOrOverridesOnMethodsRule.java:40)
        at com.carrotsearch.randomizedtesting.rules.StatementAdapter.evaluate(StatementAdapter.java:36)
        at com.carrotsearch.randomizedtesting.rules.StatementAdapter.evaluate(StatementAdapter.java:36)
        at org.apache.lucene.util.TestRuleAssertionsRequired$1.evaluate(TestRuleAssertionsRequired.java:53)
        at org.apache.lucene.util.TestRuleMarkFailure$1.evaluate(TestRuleMarkFailure.java:47)
        at org.apache.lucene.util.TestRuleIgnoreAfterMaxFailures$1.evaluate(TestRuleIgnoreAfterMaxFailures.java:64)
        at org.apache.lucene.util.TestRuleIgnoreTestSuites$1.evaluate(TestRuleIgnoreTestSuites.java:54)
        at com.carrotsearch.randomizedtesting.rules.StatementAdapter.evaluate(StatementAdapter.java:36)
        at com.carrotsearch.randomizedtesting.ThreadLeakControl$StatementRunner.run(ThreadLeakControl.java:368)
        at java.base/java.lang.Thread.run(Thread.java:844)
Caused by: java.lang.reflect.InaccessibleObjectException: Unable to make protected final java.lang.Class java.lang.ClassLoader.defineClass(java.lang.String,byte[],int,int,java.security.ProtectionDomain) throws java.lang.ClassFormatError accessible: module java.base does not "opens java.lang" to unnamed module @494ee399
        at java.base/java.lang.reflect.AccessibleObject.checkCanSetAccessible(AccessibleObject.java:207)
        at java.base/java.lang.reflect.Method.checkCanSetAccessible(Method.java:192)
        at java.base/java.lang.reflect.Method.setAccessible(Method.java:186)
        at net.sf.cglib.core.ReflectUtils$2.run(ReflectUtils.java:56)
        at java.base/java.security.AccessController.doPrivileged(Native Method)
        at net.sf.cglib.core.ReflectUtils.<clinit>(ReflectUtils.java:46)
        ... 52 more




Build Log:
[...truncated 12708 lines...]
   [junit4] Suite: org.apache.solr.handler.admin.TestApiFramework
   [junit4]   2> Creating dataDir: /home/jenkins/workspace/Lucene-Solr-6.x-Linux/solr/build/solr-core/test/J1/temp/solr.handler.admin.TestApiFramework_98F85471534EEC5-001/init-core-data-001
   [junit4]   2> 1949492 INFO  (SUITE-TestApiFramework-seed#[98F85471534EEC5]-worker) [    ] o.a.s.SolrTestCaseJ4 Using PointFields
   [junit4]   2> 1949494 INFO  (SUITE-TestApiFramework-seed#[98F85471534EEC5]-worker) [    ] o.a.s.SolrTestCaseJ4 Randomized ssl (true) and clientAuth (true) via: @org.apache.solr.util.RandomizeSSL(reason="", ssl=0.0/0.0, value=0.0/0.0, clientAuth=0.0/0.0)
   [junit4]   2> 1949496 INFO  (TEST-TestApiFramework.testTrailingTemplatePaths-seed#[98F85471534EEC5]) [    ] o.a.s.SolrTestCaseJ4 ###Starting testTrailingTemplatePaths
   [junit4]   2> 1949496 INFO  (TEST-TestApiFramework.testTrailingTemplatePaths-seed#[98F85471534EEC5]) [    ] o.a.s.SolrTestCaseJ4 ###Ending testTrailingTemplatePaths
   [junit4]   2> 1949497 INFO  (TEST-TestApiFramework.testFramework-seed#[98F85471534EEC5]) [    ] o.a.s.SolrTestCaseJ4 ###Starting testFramework
   [junit4]   2> 1949535 INFO  (TEST-TestApiFramework.testFramework-seed#[98F85471534EEC5]) [    ] o.a.s.SolrTestCaseJ4 ###Ending testFramework
   [junit4]   2> NOTE: reproduce with: ant test  -Dtestcase=TestApiFramework -Dtests.method=testFramework -Dtests.seed=98F85471534EEC5 -Dtests.multiplier=3 -Dtests.slow=true -Dtests.locale=kde-TZ -Dtests.timezone=Europe/Jersey -Dtests.asserts=true -Dtests.file.encoding=UTF-8
   [junit4] ERROR   0.04s J1 | TestApiFramework.testFramework <<<
   [junit4]    > Throwable #1: java.lang.ExceptionInInitializerError
   [junit4]    > at __randomizedtesting.SeedInfo.seed([98F85471534EEC5:1EF94F6013E002F8]:0)
   [junit4]    > at net.sf.cglib.core.KeyFactory$Generator.generateClass(KeyFactory.java:166)
   [junit4]    > at net.sf.cglib.core.DefaultGeneratorStrategy.generate(DefaultGeneratorStrategy.java:25)
   [junit4]    > at net.sf.cglib.core.AbstractClassGenerator.create(AbstractClassGenerator.java:216)
   [junit4]    > at net.sf.cglib.core.KeyFactory$Generator.create(KeyFactory.java:144)
   [junit4]    > at net.sf.cglib.core.KeyFactory.create(KeyFactory.java:116)
   [junit4]    > at net.sf.cglib.core.KeyFactory.create(KeyFactory.java:108)
   [junit4]    > at net.sf.cglib.core.KeyFactory.create(KeyFactory.java:104)
   [junit4]    > at net.sf.cglib.proxy.Enhancer.<clinit>(Enhancer.java:69)
   [junit4]    > at org.easymock.internal.ClassProxyFactory.createEnhancer(ClassProxyFactory.java:259)
   [junit4]    > at org.easymock.internal.ClassProxyFactory.createProxy(ClassProxyFactory.java:174)
   [junit4]    > at org.easymock.internal.MocksControl.createMock(MocksControl.java:60)
   [junit4]    > at org.easymock.EasyMock.createMock(EasyMock.java:104)
   [junit4]    > at org.apache.solr.handler.admin.TestCoreAdminApis.getCoreContainerMock(TestCoreAdminApis.java:83)
   [junit4]    > at org.apache.solr.handler.admin.TestApiFramework.testFramework(TestApiFramework.java:59)
   [junit4]    > at java.base/jdk.internal.reflect.NativeMethodAccessorImpl.invoke0(Native Method)
   [junit4]    > at java.base/jdk.internal.reflect.NativeMethodAccessorImpl.invoke(NativeMethodAccessorImpl.java:62)
   [junit4]    > at java.base/jdk.internal.reflect.DelegatingMethodAccessorImpl.invoke(DelegatingMethodAccessorImpl.java:43)
   [junit4]    > at java.base/java.lang.reflect.Method.invoke(Method.java:543)
   [junit4]    > at java.base/java.lang.Thread.run(Thread.java:844)
   [junit4]    > Caused by: java.lang.reflect.InaccessibleObjectException: Unable to make protected final java.lang.Class java.lang.ClassLoader.defineClass(java.lang.String,byte[],int,int,java.security.ProtectionDomain) throws java.lang.ClassFormatError accessible: module java.base does not "opens java.lang" to unnamed module @494ee399
   [junit4]    > at java.base/java.lang.reflect.AccessibleObject.checkCanSetAccessible(AccessibleObject.java:207)
   [junit4]    > at java.base/java.lang.reflect.Method.checkCanSetAccessible(Method.java:192)
   [junit4]    > at java.base/java.lang.reflect.Method.setAccessible(Method.java:186)
   [junit4]    > at net.sf.cglib.core.ReflectUtils$2.run(ReflectUtils.java:56)
   [junit4]    > at java.base/java.security.AccessController.doPrivileged(Native Method)
   [junit4]    > at net.sf.cglib.core.ReflectUtils.<clinit>(ReflectUtils.java:46)
   [junit4]    > ... 52 more
   [junit4]   2> 1949536 INFO  (SUITE-TestApiFramework-seed#[98F85471534EEC5]-worker) [    ] o.a.s.SolrTestCaseJ4 ###deleteCore
   [junit4]   2> NOTE: leaving temporary files on disk at: /home/jenkins/workspace/Lucene-Solr-6.x-Linux/solr/build/solr-core/test/J1/temp/solr.handler.admin.TestApiFramework_98F85471534EEC5-001
   [junit4]   2> NOTE: test params are: codec=CheapBastard, sim=RandomSimilarity(queryNorm=true,coord=no): {}, locale=kde-TZ, timezone=Europe/Jersey
   [junit4]   2> NOTE: Linux 4.4.0-53-generic amd64/Oracle Corporation 9-ea (64-bit)/cpus=12,threads=1,free=180521888,total=495452160
   [junit4]   2> NOTE: All tests run in this JVM: [RAMDirectoryFactoryTest, TestEmbeddedSolrServerConstructors, AsyncCallRequestStatusResponseTest, TestStressVersions, CollectionTooManyReplicasTest, FullHLLTest, TestElisionMultitermQuery, TestSolrCloudWithKerberosAlt, TestSearchPerf, TestRebalanceLeaders, ZkCLITest, TestSimpleTrackingShardHandler, TestCSVResponseWriter, TestHdfsCloudBackupRestore, CoreMergeIndexesAdminHandlerTest, JSONWriterTest, TestPerFieldSimilarityClassic, RemoteQueryErrorTest, ShardRoutingTest, TestLRUCache, TestFuzzyAnalyzedSuggestions, TestManagedSchemaAPI, SolrInfoMBeanTest, TestShortCircuitedRequests, HdfsChaosMonkeySafeLeaderTest, ZkSolrClientTest, TestNumericTerms32, RequestLoggingTest, DistributedMLTComponentTest, DistributedFacetExistsSmallTest, SortSpecParsingTest, TestDocBasedVersionConstraints, DirectSolrSpellCheckerTest, SolrGraphiteReporterTest, TestJsonFacetRefinement, TestPivotHelperCode, TestPartialUpdateDeduplication, TestLMDirichletSimilarityFactory, DistributedFacetPivotSmallAdvancedTest, V2ApiIntegrationTest, OverseerTaskQueueTest, DocumentBuilderTest, HdfsUnloadDistributedZkTest, SolrCmdDistributorTest, TestFieldTypeCollectionResource, CdcrVersionReplicationTest, OverseerModifyCollectionTest, TestConfigSets, OutOfBoxZkACLAndCredentialsProvidersTest, TestSurroundQueryParser, TestSolrXml, DataDrivenBlockJoinTest, PKIAuthenticationIntegrationTest, ZkControllerTest, TestRuleBasedAuthorizationPlugin, JvmMetricsTest, TestOrdValues, DistributedVersionInfoTest, SaslZkACLProviderTest, CloneFieldUpdateProcessorFactoryTest, TestCoreContainer, URLClassifyProcessorTest, TestReloadDeadlock, TermVectorComponentTest, TestTrie, TestDefaultStatsCache, SuggesterFSTTest, TestRestManager, TestStressLiveNodes, DistribDocExpirationUpdateProcessorTest, ConvertedLegacyTest, TestSmileRequest, SchemaVersionSpecificBehaviorTest, OpenCloseCoreStressTest, DistributedIntervalFacetingTest, TestCoreAdminApis, TestFieldCacheVsDocValues, TermsComponentTest, HdfsBasicDistributedZk2Test, DateMathParserTest, UUIDUpdateProcessorFallbackTest, TestGraphMLResponseWriter, TestCollectionAPI, SimplePostToolTest, GraphQueryTest, IndexBasedSpellCheckerTest, SpellingQueryConverterTest, TestRawResponseWriter, EchoParamsTest, DirectSolrConnectionTest, TestRestoreCore, TestOverriddenPrefixQueryForCustomFieldType, TestFieldCacheSanityChecker, BadCopyFieldTest, TestGraphTermsQParserPlugin, SpellCheckComponentTest, ShardRoutingCustomTest, TestHdfsBackupRestoreCore, ManagedSchemaRoundRobinCloudTest, SoftAutoCommitTest, SolrIndexConfigTest, TestHashPartitioner, TestIntervalFaceting, SystemInfoHandlerTest, TestDocTermOrds, RestartWhileUpdatingTest, TemplateUpdateProcessorTest, TestConfigSetsAPIZkFailure, TestQueryTypes, TestWordDelimiterFilterFactory, SpellCheckCollatorTest, CollectionsAPIDistributedZkTest, ChaosMonkeySafeLeaderTest, LeaderElectionIntegrationTest, RecoveryZkTest, ClusterStateUpdateTest, LeaderElectionTest, AutoCommitTest, TestDistributedGrouping, TestFaceting, TestRealTimeGet, TestStressReorder, TestJoin, TestReload, DistributedTermsComponentTest, TestGroupingSearch, BadIndexSchemaTest, TestFiltering, HighlighterTest, ShowFileRequestHandlerTest, CurrencyFieldXmlFileTest, SolrIndexSplitterTest, TestExtendedDismaxParser, TestFoldingMultitermQuery, DocValuesTest, DocValuesMultiTest, DisMaxRequestHandlerTest, TestReversedWildcardFilterFactory, TestValueSourceCache, FieldAnalysisRequestHandlerTest, LoggingHandlerTest, TestJmxIntegration, JSONWriterTest, UniqFieldsUpdateProcessorFactoryTest, CSVRequestHandlerTest, HighlighterConfigTest, SOLR749Test, TestQuerySenderListener, UpdateParamsTest, TestSolrIndexConfig, CopyFieldTest, TestSolrDeletionPolicy2, MultiTermTest, SampleTest, TestDocSet, NumericFieldsTest, OutputWriterTest, TestLuceneMatchVersion, TestCharFilters, TestPerFieldSimilarity, TestIBSimilarityFactory, TestFastWriter, ResourceLoaderTest, ScriptEngineTest, PreAnalyzedFieldTest, TestSystemIdResolver, TestSuggestSpellingConverter, DateFieldTest, DOMUtilTest, ClusterStateTest, TestSolrJ, TestDocumentBuilder, SliceStateTest, FileUtilsTest, CircularListTest, TestRTGBase, CursorPagingTest, SolrTestCaseJ4Test, TestCrossCoreJoin, TestCursorMarkWithoutUniqueKey, TestDistributedMissingSort, TestHighlightDedupGrouping, AliasIntegrationTest, CdcrReplicationDistributedZkTest, CdcrRequestHandlerTest, CloudExitableDirectoryReaderTest, CollectionsAPIAsyncDistributedZkTest, ConcurrentDeleteAndCreateCollectionTest, CreateCollectionCleanupTest, DeleteShardTest, DocValuesNotIndexedTest, HttpPartitionTest, SharedFSAutoReplicaFailoverUtilsTest, SolrCLIZkUtilsTest, SolrCloudExampleTest, TestCloudDeleteByQuery, TestCloudPseudoReturnFields, TestClusterProperties, TestConfigSetsAPIExclusivity, TestDistribDocBasedVersion, TestLocalFSCloudBackupRestore, TestOnReconnectListenerSupport, TestRandomFlRTGCloud, TestTolerantUpdateProcessorRandomCloud, VMParamsZkACLAndCredentialsProvidersTest, HdfsChaosMonkeyNothingIsSafeTest, HdfsNNFailoverTest, HdfsRecoverLeaseTest, HdfsSyncSliceTest, HdfsTlogReplayBufferedWhileIndexingTest, TestClusterStateMutator, RuleEngineTest, BlobRepositoryCloudTest, CoreSorterTest, DirectoryFactoryTest, ExitableDirectoryReaderTest, HdfsDirectoryFactoryTest, TestConfigOverlay, TestCorePropertiesReload, TestDynamicLoading, CoreAdminCreateDiscoverTest, SecurityConfHandlerTest, SegmentsInfoRequestHandlerTest, StatsReloadRaceTest, TestApiFramework]
   [junit4] Completed [567/692 (1!)] on J1 in 0.05s, 2 tests, 1 error <<< FAILURES!

[...truncated 52080 lines...]



---------------------------------------------------------------------
To unsubscribe, e-mail: [hidden email]
For additional commands, e-mail: [hidden email]
Reply | Threaded
Open this post in threaded view
|

[JENKINS-EA] Lucene-Solr-6.x-Linux (64bit/jdk-9-ea+155) - Build # 2875 - Still Unstable!

Policeman Jenkins Server-2
Build: https://jenkins.thetaphi.de/job/Lucene-Solr-6.x-Linux/2875/
Java: 64bit/jdk-9-ea+155 -XX:-UseCompressedOops -XX:+UseG1GC

1 tests failed.
FAILED:  org.apache.solr.handler.admin.TestApiFramework.testFramework

Error Message:


Stack Trace:
java.lang.ExceptionInInitializerError
        at __randomizedtesting.SeedInfo.seed([E4FCF4080402A14F:F38A3E2F02D64D72]:0)
        at net.sf.cglib.core.KeyFactory$Generator.generateClass(KeyFactory.java:166)
        at net.sf.cglib.core.DefaultGeneratorStrategy.generate(DefaultGeneratorStrategy.java:25)
        at net.sf.cglib.core.AbstractClassGenerator.create(AbstractClassGenerator.java:216)
        at net.sf.cglib.core.KeyFactory$Generator.create(KeyFactory.java:144)
        at net.sf.cglib.core.KeyFactory.create(KeyFactory.java:116)
        at net.sf.cglib.core.KeyFactory.create(KeyFactory.java:108)
        at net.sf.cglib.core.KeyFactory.create(KeyFactory.java:104)
        at net.sf.cglib.proxy.Enhancer.<clinit>(Enhancer.java:69)
        at org.easymock.internal.ClassProxyFactory.createEnhancer(ClassProxyFactory.java:259)
        at org.easymock.internal.ClassProxyFactory.createProxy(ClassProxyFactory.java:174)
        at org.easymock.internal.MocksControl.createMock(MocksControl.java:60)
        at org.easymock.EasyMock.createMock(EasyMock.java:104)
        at org.apache.solr.handler.admin.TestCoreAdminApis.getCoreContainerMock(TestCoreAdminApis.java:83)
        at org.apache.solr.handler.admin.TestApiFramework.testFramework(TestApiFramework.java:59)
        at java.base/jdk.internal.reflect.NativeMethodAccessorImpl.invoke0(Native Method)
        at java.base/jdk.internal.reflect.NativeMethodAccessorImpl.invoke(NativeMethodAccessorImpl.java:62)
        at java.base/jdk.internal.reflect.DelegatingMethodAccessorImpl.invoke(DelegatingMethodAccessorImpl.java:43)
        at java.base/java.lang.reflect.Method.invoke(Method.java:543)
        at com.carrotsearch.randomizedtesting.RandomizedRunner.invoke(RandomizedRunner.java:1713)
        at com.carrotsearch.randomizedtesting.RandomizedRunner$8.evaluate(RandomizedRunner.java:907)
        at com.carrotsearch.randomizedtesting.RandomizedRunner$9.evaluate(RandomizedRunner.java:943)
        at com.carrotsearch.randomizedtesting.RandomizedRunner$10.evaluate(RandomizedRunner.java:957)
        at com.carrotsearch.randomizedtesting.rules.SystemPropertiesRestoreRule$1.evaluate(SystemPropertiesRestoreRule.java:57)
        at org.apache.lucene.util.TestRuleSetupTeardownChained$1.evaluate(TestRuleSetupTeardownChained.java:49)
        at org.apache.lucene.util.AbstractBeforeAfterRule$1.evaluate(AbstractBeforeAfterRule.java:45)
        at org.apache.lucene.util.TestRuleThreadAndTestName$1.evaluate(TestRuleThreadAndTestName.java:48)
        at org.apache.lucene.util.TestRuleIgnoreAfterMaxFailures$1.evaluate(TestRuleIgnoreAfterMaxFailures.java:64)
        at org.apache.lucene.util.TestRuleMarkFailure$1.evaluate(TestRuleMarkFailure.java:47)
        at com.carrotsearch.randomizedtesting.rules.StatementAdapter.evaluate(StatementAdapter.java:36)
        at com.carrotsearch.randomizedtesting.ThreadLeakControl$StatementRunner.run(ThreadLeakControl.java:368)
        at com.carrotsearch.randomizedtesting.ThreadLeakControl.forkTimeoutingTask(ThreadLeakControl.java:817)
        at com.carrotsearch.randomizedtesting.ThreadLeakControl$3.evaluate(ThreadLeakControl.java:468)
        at com.carrotsearch.randomizedtesting.RandomizedRunner.runSingleTest(RandomizedRunner.java:916)
        at com.carrotsearch.randomizedtesting.RandomizedRunner$5.evaluate(RandomizedRunner.java:802)
        at com.carrotsearch.randomizedtesting.RandomizedRunner$6.evaluate(RandomizedRunner.java:852)
        at com.carrotsearch.randomizedtesting.RandomizedRunner$7.evaluate(RandomizedRunner.java:863)
        at com.carrotsearch.randomizedtesting.rules.StatementAdapter.evaluate(StatementAdapter.java:36)
        at com.carrotsearch.randomizedtesting.rules.SystemPropertiesRestoreRule$1.evaluate(SystemPropertiesRestoreRule.java:57)
        at org.apache.lucene.util.AbstractBeforeAfterRule$1.evaluate(AbstractBeforeAfterRule.java:45)
        at com.carrotsearch.randomizedtesting.rules.StatementAdapter.evaluate(StatementAdapter.java:36)
        at org.apache.lucene.util.TestRuleStoreClassName$1.evaluate(TestRuleStoreClassName.java:41)
        at com.carrotsearch.randomizedtesting.rules.NoShadowingOrOverridesOnMethodsRule$1.evaluate(NoShadowingOrOverridesOnMethodsRule.java:40)
        at com.carrotsearch.randomizedtesting.rules.NoShadowingOrOverridesOnMethodsRule$1.evaluate(NoShadowingOrOverridesOnMethodsRule.java:40)
        at com.carrotsearch.randomizedtesting.rules.StatementAdapter.evaluate(StatementAdapter.java:36)
        at com.carrotsearch.randomizedtesting.rules.StatementAdapter.evaluate(StatementAdapter.java:36)
        at org.apache.lucene.util.TestRuleAssertionsRequired$1.evaluate(TestRuleAssertionsRequired.java:53)
        at org.apache.lucene.util.TestRuleMarkFailure$1.evaluate(TestRuleMarkFailure.java:47)
        at org.apache.lucene.util.TestRuleIgnoreAfterMaxFailures$1.evaluate(TestRuleIgnoreAfterMaxFailures.java:64)
        at org.apache.lucene.util.TestRuleIgnoreTestSuites$1.evaluate(TestRuleIgnoreTestSuites.java:54)
        at com.carrotsearch.randomizedtesting.rules.StatementAdapter.evaluate(StatementAdapter.java:36)
        at com.carrotsearch.randomizedtesting.ThreadLeakControl$StatementRunner.run(ThreadLeakControl.java:368)
        at java.base/java.lang.Thread.run(Thread.java:844)
Caused by: java.lang.reflect.InaccessibleObjectException: Unable to make protected final java.lang.Class java.lang.ClassLoader.defineClass(java.lang.String,byte[],int,int,java.security.ProtectionDomain) throws java.lang.ClassFormatError accessible: module java.base does not "opens java.lang" to unnamed module @a357393
        at java.base/java.lang.reflect.AccessibleObject.checkCanSetAccessible(AccessibleObject.java:207)
        at java.base/java.lang.reflect.Method.checkCanSetAccessible(Method.java:192)
        at java.base/java.lang.reflect.Method.setAccessible(Method.java:186)
        at net.sf.cglib.core.ReflectUtils$2.run(ReflectUtils.java:56)
        at java.base/java.security.AccessController.doPrivileged(Native Method)
        at net.sf.cglib.core.ReflectUtils.<clinit>(ReflectUtils.java:46)
        ... 52 more




Build Log:
[...truncated 12725 lines...]
   [junit4] Suite: org.apache.solr.handler.admin.TestApiFramework
   [junit4]   2> Creating dataDir: /home/jenkins/workspace/Lucene-Solr-6.x-Linux/solr/build/solr-core/test/J0/temp/solr.handler.admin.TestApiFramework_E4FCF4080402A14F-001/init-core-data-001
   [junit4]   2> 2174374 INFO  (SUITE-TestApiFramework-seed#[E4FCF4080402A14F]-worker) [    ] o.a.s.SolrTestCaseJ4 Using PointFields
   [junit4]   2> 2174375 INFO  (SUITE-TestApiFramework-seed#[E4FCF4080402A14F]-worker) [    ] o.a.s.SolrTestCaseJ4 Randomized ssl (true) and clientAuth (false) via: @org.apache.solr.util.RandomizeSSL(reason="", ssl=0.0/0.0, value=0.0/0.0, clientAuth=0.0/0.0)
   [junit4]   2> 2174377 INFO  (TEST-TestApiFramework.testTrailingTemplatePaths-seed#[E4FCF4080402A14F]) [    ] o.a.s.SolrTestCaseJ4 ###Starting testTrailingTemplatePaths
   [junit4]   2> 2174377 INFO  (TEST-TestApiFramework.testTrailingTemplatePaths-seed#[E4FCF4080402A14F]) [    ] o.a.s.SolrTestCaseJ4 ###Ending testTrailingTemplatePaths
   [junit4]   2> 2174377 INFO  (TEST-TestApiFramework.testFramework-seed#[E4FCF4080402A14F]) [    ] o.a.s.SolrTestCaseJ4 ###Starting testFramework
   [junit4]   2> 2174413 INFO  (TEST-TestApiFramework.testFramework-seed#[E4FCF4080402A14F]) [    ] o.a.s.SolrTestCaseJ4 ###Ending testFramework
   [junit4]   2> NOTE: reproduce with: ant test  -Dtestcase=TestApiFramework -Dtests.method=testFramework -Dtests.seed=E4FCF4080402A14F -Dtests.multiplier=3 -Dtests.slow=true -Dtests.locale=haw -Dtests.timezone=Pacific/Pohnpei -Dtests.asserts=true -Dtests.file.encoding=UTF-8
   [junit4] ERROR   0.04s J0 | TestApiFramework.testFramework <<<
   [junit4]    > Throwable #1: java.lang.ExceptionInInitializerError
   [junit4]    > at __randomizedtesting.SeedInfo.seed([E4FCF4080402A14F:F38A3E2F02D64D72]:0)
   [junit4]    > at net.sf.cglib.core.KeyFactory$Generator.generateClass(KeyFactory.java:166)
   [junit4]    > at net.sf.cglib.core.DefaultGeneratorStrategy.generate(DefaultGeneratorStrategy.java:25)
   [junit4]    > at net.sf.cglib.core.AbstractClassGenerator.create(AbstractClassGenerator.java:216)
   [junit4]    > at net.sf.cglib.core.KeyFactory$Generator.create(KeyFactory.java:144)
   [junit4]    > at net.sf.cglib.core.KeyFactory.create(KeyFactory.java:116)
   [junit4]    > at net.sf.cglib.core.KeyFactory.create(KeyFactory.java:108)
   [junit4]    > at net.sf.cglib.core.KeyFactory.create(KeyFactory.java:104)
   [junit4]    > at net.sf.cglib.proxy.Enhancer.<clinit>(Enhancer.java:69)
   [junit4]    > at org.easymock.internal.ClassProxyFactory.createEnhancer(ClassProxyFactory.java:259)
   [junit4]    > at org.easymock.internal.ClassProxyFactory.createProxy(ClassProxyFactory.java:174)
   [junit4]    > at org.easymock.internal.MocksControl.createMock(MocksControl.java:60)
   [junit4]    > at org.easymock.EasyMock.createMock(EasyMock.java:104)
   [junit4]    > at org.apache.solr.handler.admin.TestCoreAdminApis.getCoreContainerMock(TestCoreAdminApis.java:83)
   [junit4]    > at org.apache.solr.handler.admin.TestApiFramework.testFramework(TestApiFramework.java:59)
   [junit4]    > at java.base/jdk.internal.reflect.NativeMethodAccessorImpl.invoke0(Native Method)
   [junit4]    > at java.base/jdk.internal.reflect.NativeMethodAccessorImpl.invoke(NativeMethodAccessorImpl.java:62)
   [junit4]    > at java.base/jdk.internal.reflect.DelegatingMethodAccessorImpl.invoke(DelegatingMethodAccessorImpl.java:43)
   [junit4]    > at java.base/java.lang.reflect.Method.invoke(Method.java:543)
   [junit4]    > at java.base/java.lang.Thread.run(Thread.java:844)
   [junit4]    > Caused by: java.lang.reflect.InaccessibleObjectException: Unable to make protected final java.lang.Class java.lang.ClassLoader.defineClass(java.lang.String,byte[],int,int,java.security.ProtectionDomain) throws java.lang.ClassFormatError accessible: module java.base does not "opens java.lang" to unnamed module @a357393
   [junit4]    > at java.base/java.lang.reflect.AccessibleObject.checkCanSetAccessible(AccessibleObject.java:207)
   [junit4]    > at java.base/java.lang.reflect.Method.checkCanSetAccessible(Method.java:192)
   [junit4]    > at java.base/java.lang.reflect.Method.setAccessible(Method.java:186)
   [junit4]    > at net.sf.cglib.core.ReflectUtils$2.run(ReflectUtils.java:56)
   [junit4]    > at java.base/java.security.AccessController.doPrivileged(Native Method)
   [junit4]    > at net.sf.cglib.core.ReflectUtils.<clinit>(ReflectUtils.java:46)
   [junit4]    > ... 52 more
   [junit4]   2> 2174414 INFO  (SUITE-TestApiFramework-seed#[E4FCF4080402A14F]-worker) [    ] o.a.s.SolrTestCaseJ4 ###deleteCore
   [junit4]   2> NOTE: leaving temporary files on disk at: /home/jenkins/workspace/Lucene-Solr-6.x-Linux/solr/build/solr-core/test/J0/temp/solr.handler.admin.TestApiFramework_E4FCF4080402A14F-001
   [junit4]   2> NOTE: test params are: codec=Asserting(Lucene62): {}, docValues:{}, maxPointsInLeafNode=1673, maxMBSortInHeap=6.277136258397649, sim=RandomSimilarity(queryNorm=false,coord=crazy): {}, locale=haw, timezone=Pacific/Pohnpei
   [junit4]   2> NOTE: Linux 4.4.0-53-generic amd64/Oracle Corporation 9-ea (64-bit)/cpus=12,threads=1,free=245912696,total=536870912
   [junit4]   2> NOTE: All tests run in this JVM: [TestLazyCores, SharedFSAutoReplicaFailoverTest, TestSolrQueryResponse, TestPseudoReturnFields, CurrencyFieldOpenExchangeTest, TestFieldResource, TestRealTimeGet, SyncSliceTest, BigEndianAscendingWordDeserializerTest, TestSystemCollAutoCreate, RulesTest, VMParamsZkACLAndCredentialsProvidersTest, TestTolerantUpdateProcessorRandomCloud, TestSolrCLIRunExample, ZkNodePropsTest, TestQuerySenderNoQuery, SignatureUpdateProcessorFactoryTest, AtomicUpdatesTest, BlockJoinFacetSimpleTest, TestFoldingMultitermQuery, TestSQLHandlerNonCloud, RegexBoostProcessorTest, DateFieldTest, SolrSlf4jReporterTest, ReturnFieldsTest, TestAnalyzeInfixSuggestions, CdcrBootstrapTest, TestJoin, AnalyticsQueryTest, TestConfigsApi, TestFreeTextSuggestions, ConnectionReuseTest, TestFilteredDocIdSet, TestSolr4Spatial, JavabinLoaderTest, TestClusterProperties, TestFieldCacheReopen, TestCSVLoader, TestComplexPhraseQParserPlugin, JsonValidatorTest, SolrMetricManagerTest, DocumentAnalysisRequestHandlerTest, TestConfigSetProperties, TestCloudPivotFacet, ExternalFileFieldSortTest, BasicZkTest, TestUninvertingReader, TestHighlightDedupGrouping, HdfsRestartWhileUpdatingTest, HdfsLockFactoryTest, SuggestComponentContextFilterQueryTest, TestSubQueryTransformerCrossCore, SimpleMLTQParserTest, TestPHPSerializedResponseWriter, DistributedSpellCheckComponentTest, TestRangeQuery, StandardRequestHandlerTest, XsltUpdateRequestHandlerTest, DistributedFacetPivotWhiteBoxTest, TestInfoStreamLogging, TestFunctionQuery, BasicDistributedZkTest, TestPKIAuthenticationPlugin, UUIDFieldTest, DisMaxRequestHandlerTest, ClassificationUpdateProcessorTest, UniqFieldsUpdateProcessorFactoryTest, TestSegmentSorting, TestJmxIntegration, TestInitQParser, DistributedQueryElevationComponentTest, BJQParserTest, TestMacros, TestConfigReload, TestManagedSchema, TestSchemaNameResource, TestFaceting, CollectionsAPISolrJTest, TestAtomicUpdateErrorCases, FastVectorHighlighterTest, DistributedExpandComponentTest, TolerantUpdateProcessorTest, TestExactSharedStatsCache, MBeansHandlerTest, DefaultValueUpdateProcessorTest, QueryEqualityTest, TestRemoteStreaming, TestDynamicFieldCollectionResource, TestDeleteCollectionOnDownNodes, TestFastLRUCache, LeaderElectionIntegrationTest, AnalysisAfterCoreReloadTest, PathHierarchyTokenizerFactoryTest, BlockDirectoryTest, TestAuthenticationFramework, DistributedSuggestComponentTest, ClusterStateTest, TestComponentsName, OverseerCollectionConfigSetProcessorTest, ExplicitHLLTest, TestDocSet, CollectionStateFormat2Test, RecoveryAfterSoftCommitTest, ConnectionManagerTest, StatsReloadRaceTest, TestReplicationHandler, TestSimpleQParserPlugin, TestFastWriter, QueryElevationComponentTest, TestValueSourceCache, BasicDistributedZk2Test, OverseerTest, ClusterStateUpdateTest, TestRandomDVFaceting, TestDistributedGrouping, ZkControllerTest, HardAutoCommitTest, SolrCoreTest, TestGroupingSearch, ConvertedLegacyTest, TestSort, CurrencyFieldXmlFileTest, TestCoreDiscovery, SpellCheckCollatorTest, SuggesterTSTTest, SuggesterTest, TestStressLucene, PolyFieldTest, NoCacheHeaderTest, WordBreakSolrSpellCheckerTest, SchemaVersionSpecificBehaviorTest, SolrCoreCheckLockOnStartupTest, DocValuesMultiTest, DebugComponentTest, TestSurroundQueryParser, TestQueryUtils, TestReversedWildcardFilterFactory, TestOmitPositions, RequestHandlersTest, TestIndexingPerformance, IndexSchemaRuntimeFieldTest, JSONWriterTest, TestPartialUpdateDeduplication, SearchHandlerTest, MultiTermTest, NumericFieldsTest, TestFuzzyAnalyzedSuggestions, DirectSolrConnectionTest, TestLuceneMatchVersion, SynonymTokenizerTest, TestXIncludeConfig, EchoParamsTest, TestSweetSpotSimilarityFactory, TestDFRSimilarityFactory, TestPerFieldSimilarity, TestLMJelinekMercerSimilarityFactory, TestJmxMonitoredMap, ScriptEngineTest, PluginInfoTest, PrimUtilsTest, SpellingQueryConverterTest, DOMUtilTest, TestLRUCache, TestDocumentBuilder, DistributedMLTComponentTest, CursorPagingTest, SolrTestCaseJ4Test, TestCrossCoreJoin, TestCursorMarkWithoutUniqueKey, TestSimpleTrackingShardHandler, CdcrReplicationHandlerTest, CdcrRequestHandlerTest, CdcrVersionReplicationTest, CreateCollectionCleanupTest, CustomCollectionTest, DistribDocExpirationUpdateProcessorTest, LeaderElectionContextKeyTest, LeaderFailoverAfterPartitionTest, LeaderInitiatedRecoveryOnShardRestartTest, MigrateRouteKeyTest, OutOfBoxZkACLAndCredentialsProvidersTest, OverseerTaskQueueTest, ReplaceNodeTest, SimpleCollectionCreateDeleteTest, SolrCLIZkUtilsTest, TestCloudPseudoReturnFields, TestCloudRecovery, TestDownShardTolerantSearch, TestExclusionRuleCollectionAccess, TestLeaderElectionZkExpiry, TestLockTree, TestMiniSolrCloudClusterSSL, TestRequestForwarding, TestRequestStatusCollectionAPI, TestSolrCloudWithDelegationTokens, TestStressLiveNodes, TestTolerantUpdateProcessorCloud, TlogReplayBufferedWhileIndexingTest, TriLevelCompositeIdRoutingTest, TestBackupRepositoryFactory, TestConfigSetImmutable, TestImplicitCoreProperties, TestInitParams, TestNRTOpen, TestReloadAndDeleteDocs, TestSolrConfigHandler, RequestLoggingTest, TestBlobHandler, TestSolrConfigHandlerConcurrent, CoreAdminRequestStatusTest, CoreMergeIndexesAdminHandlerTest, MetricsHandlerTest, SecurityConfHandlerTest, SegmentsInfoRequestHandlerTest, TestApiFramework]
   [junit4] Completed [573/692 (1!)] on J0 in 0.05s, 2 tests, 1 error <<< FAILURES!

[...truncated 52066 lines...]



---------------------------------------------------------------------
To unsubscribe, e-mail: [hidden email]
For additional commands, e-mail: [hidden email]
Reply | Threaded
Open this post in threaded view
|

[JENKINS-EA] Lucene-Solr-6.x-Linux (32bit/jdk-9-ea+155) - Build # 2876 - Still Unstable!

Policeman Jenkins Server-2
Build: https://jenkins.thetaphi.de/job/Lucene-Solr-6.x-Linux/2876/
Java: 32bit/jdk-9-ea+155 -server -XX:+UseConcMarkSweepGC

1 tests failed.
FAILED:  org.apache.solr.handler.admin.TestApiFramework.testFramework

Error Message:


Stack Trace:
java.lang.ExceptionInInitializerError
        at __randomizedtesting.SeedInfo.seed([1CCAFBD1B6E5450F:BBC31F6B031A932]:0)
        at net.sf.cglib.core.KeyFactory$Generator.generateClass(KeyFactory.java:166)
        at net.sf.cglib.core.DefaultGeneratorStrategy.generate(DefaultGeneratorStrategy.java:25)
        at net.sf.cglib.core.AbstractClassGenerator.create(AbstractClassGenerator.java:216)
        at net.sf.cglib.core.KeyFactory$Generator.create(KeyFactory.java:144)
        at net.sf.cglib.core.KeyFactory.create(KeyFactory.java:116)
        at net.sf.cglib.core.KeyFactory.create(KeyFactory.java:108)
        at net.sf.cglib.core.KeyFactory.create(KeyFactory.java:104)
        at net.sf.cglib.proxy.Enhancer.<clinit>(Enhancer.java:69)
        at org.easymock.internal.ClassProxyFactory.createEnhancer(ClassProxyFactory.java:259)
        at org.easymock.internal.ClassProxyFactory.createProxy(ClassProxyFactory.java:174)
        at org.easymock.internal.MocksControl.createMock(MocksControl.java:60)
        at org.easymock.EasyMock.createMock(EasyMock.java:104)
        at org.apache.solr.handler.admin.TestCoreAdminApis.getCoreContainerMock(TestCoreAdminApis.java:83)
        at org.apache.solr.handler.admin.TestApiFramework.testFramework(TestApiFramework.java:59)
        at java.base/jdk.internal.reflect.NativeMethodAccessorImpl.invoke0(Native Method)
        at java.base/jdk.internal.reflect.NativeMethodAccessorImpl.invoke(NativeMethodAccessorImpl.java:62)
        at java.base/jdk.internal.reflect.DelegatingMethodAccessorImpl.invoke(DelegatingMethodAccessorImpl.java:43)
        at java.base/java.lang.reflect.Method.invoke(Method.java:543)
        at com.carrotsearch.randomizedtesting.RandomizedRunner.invoke(RandomizedRunner.java:1713)
        at com.carrotsearch.randomizedtesting.RandomizedRunner$8.evaluate(RandomizedRunner.java:907)
        at com.carrotsearch.randomizedtesting.RandomizedRunner$9.evaluate(RandomizedRunner.java:943)
        at com.carrotsearch.randomizedtesting.RandomizedRunner$10.evaluate(RandomizedRunner.java:957)
        at com.carrotsearch.randomizedtesting.rules.SystemPropertiesRestoreRule$1.evaluate(SystemPropertiesRestoreRule.java:57)
        at org.apache.lucene.util.TestRuleSetupTeardownChained$1.evaluate(TestRuleSetupTeardownChained.java:49)
        at org.apache.lucene.util.AbstractBeforeAfterRule$1.evaluate(AbstractBeforeAfterRule.java:45)
        at org.apache.lucene.util.TestRuleThreadAndTestName$1.evaluate(TestRuleThreadAndTestName.java:48)
        at org.apache.lucene.util.TestRuleIgnoreAfterMaxFailures$1.evaluate(TestRuleIgnoreAfterMaxFailures.java:64)
        at org.apache.lucene.util.TestRuleMarkFailure$1.evaluate(TestRuleMarkFailure.java:47)
        at com.carrotsearch.randomizedtesting.rules.StatementAdapter.evaluate(StatementAdapter.java:36)
        at com.carrotsearch.randomizedtesting.ThreadLeakControl$StatementRunner.run(ThreadLeakControl.java:368)
        at com.carrotsearch.randomizedtesting.ThreadLeakControl.forkTimeoutingTask(ThreadLeakControl.java:817)
        at com.carrotsearch.randomizedtesting.ThreadLeakControl$3.evaluate(ThreadLeakControl.java:468)
        at com.carrotsearch.randomizedtesting.RandomizedRunner.runSingleTest(RandomizedRunner.java:916)
        at com.carrotsearch.randomizedtesting.RandomizedRunner$5.evaluate(RandomizedRunner.java:802)
        at com.carrotsearch.randomizedtesting.RandomizedRunner$6.evaluate(RandomizedRunner.java:852)
        at com.carrotsearch.randomizedtesting.RandomizedRunner$7.evaluate(RandomizedRunner.java:863)
        at com.carrotsearch.randomizedtesting.rules.StatementAdapter.evaluate(StatementAdapter.java:36)
        at com.carrotsearch.randomizedtesting.rules.SystemPropertiesRestoreRule$1.evaluate(SystemPropertiesRestoreRule.java:57)
        at org.apache.lucene.util.AbstractBeforeAfterRule$1.evaluate(AbstractBeforeAfterRule.java:45)
        at com.carrotsearch.randomizedtesting.rules.StatementAdapter.evaluate(StatementAdapter.java:36)
        at org.apache.lucene.util.TestRuleStoreClassName$1.evaluate(TestRuleStoreClassName.java:41)
        at com.carrotsearch.randomizedtesting.rules.NoShadowingOrOverridesOnMethodsRule$1.evaluate(NoShadowingOrOverridesOnMethodsRule.java:40)
        at com.carrotsearch.randomizedtesting.rules.NoShadowingOrOverridesOnMethodsRule$1.evaluate(NoShadowingOrOverridesOnMethodsRule.java:40)
        at com.carrotsearch.randomizedtesting.rules.StatementAdapter.evaluate(StatementAdapter.java:36)
        at com.carrotsearch.randomizedtesting.rules.StatementAdapter.evaluate(StatementAdapter.java:36)
        at org.apache.lucene.util.TestRuleAssertionsRequired$1.evaluate(TestRuleAssertionsRequired.java:53)
        at org.apache.lucene.util.TestRuleMarkFailure$1.evaluate(TestRuleMarkFailure.java:47)
        at org.apache.lucene.util.TestRuleIgnoreAfterMaxFailures$1.evaluate(TestRuleIgnoreAfterMaxFailures.java:64)
        at org.apache.lucene.util.TestRuleIgnoreTestSuites$1.evaluate(TestRuleIgnoreTestSuites.java:54)
        at com.carrotsearch.randomizedtesting.rules.StatementAdapter.evaluate(StatementAdapter.java:36)
        at com.carrotsearch.randomizedtesting.ThreadLeakControl$StatementRunner.run(ThreadLeakControl.java:368)
        at java.base/java.lang.Thread.run(Thread.java:844)
Caused by: java.lang.reflect.InaccessibleObjectException: Unable to make protected final java.lang.Class java.lang.ClassLoader.defineClass(java.lang.String,byte[],int,int,java.security.ProtectionDomain) throws java.lang.ClassFormatError accessible: module java.base does not "opens java.lang" to unnamed module @1bd7288
        at java.base/java.lang.reflect.AccessibleObject.checkCanSetAccessible(AccessibleObject.java:207)
        at java.base/java.lang.reflect.Method.checkCanSetAccessible(Method.java:192)
        at java.base/java.lang.reflect.Method.setAccessible(Method.java:186)
        at net.sf.cglib.core.ReflectUtils$2.run(ReflectUtils.java:56)
        at java.base/java.security.AccessController.doPrivileged(Native Method)
        at net.sf.cglib.core.ReflectUtils.<clinit>(ReflectUtils.java:46)
        ... 52 more




Build Log:
[...truncated 1686 lines...]
   [junit4] JVM J2: stderr was not empty, see: /home/jenkins/workspace/Lucene-Solr-6.x-Linux/lucene/build/core/test/temp/junit4-J2-20170217_114708_37717359623493577038909.syserr
   [junit4] >>> JVM J2 emitted unexpected output (verbatim) ----
   [junit4] Java HotSpot(TM) Server VM warning: Option UseConcMarkSweepGC was deprecated in version 9.0 and will likely be removed in a future release.
   [junit4] <<< JVM J2: EOF ----

[...truncated 3 lines...]
   [junit4] JVM J1: stderr was not empty, see: /home/jenkins/workspace/Lucene-Solr-6.x-Linux/lucene/build/core/test/temp/junit4-J1-20170217_114708_37717640546512354109757.syserr
   [junit4] >>> JVM J1 emitted unexpected output (verbatim) ----
   [junit4] Java HotSpot(TM) Server VM warning: Option UseConcMarkSweepGC was deprecated in version 9.0 and will likely be removed in a future release.
   [junit4] <<< JVM J1: EOF ----

[...truncated 3 lines...]
   [junit4] JVM J0: stderr was not empty, see: /home/jenkins/workspace/Lucene-Solr-6.x-Linux/lucene/build/core/test/temp/junit4-J0-20170217_114708_3779138294687944216523.syserr
   [junit4] >>> JVM J0 emitted unexpected output (verbatim) ----
   [junit4] Java HotSpot(TM) Server VM warning: Option UseConcMarkSweepGC was deprecated in version 9.0 and will likely be removed in a future release.
   [junit4] <<< JVM J0: EOF ----

[...truncated 275 lines...]
   [junit4] JVM J1: stderr was not empty, see: /home/jenkins/workspace/Lucene-Solr-6.x-Linux/lucene/build/test-framework/test/temp/junit4-J1-20170217_115838_5953318200787524203984.syserr
   [junit4] >>> JVM J1 emitted unexpected output (verbatim) ----
   [junit4] Java HotSpot(TM) Server VM warning: Option UseConcMarkSweepGC was deprecated in version 9.0 and will likely be removed in a future release.
   [junit4] <<< JVM J1: EOF ----

[...truncated 9 lines...]
   [junit4] JVM J0: stderr was not empty, see: /home/jenkins/workspace/Lucene-Solr-6.x-Linux/lucene/build/test-framework/test/temp/junit4-J0-20170217_115838_5955154365758903897072.syserr
   [junit4] >>> JVM J0 emitted unexpected output (verbatim) ----
   [junit4] Java HotSpot(TM) Server VM warning: Option UseConcMarkSweepGC was deprecated in version 9.0 and will likely be removed in a future release.
   [junit4] <<< JVM J0: EOF ----

[...truncated 3 lines...]
   [junit4] JVM J2: stderr was not empty, see: /home/jenkins/workspace/Lucene-Solr-6.x-Linux/lucene/build/test-framework/test/temp/junit4-J2-20170217_115838_5954495555189442549506.syserr
   [junit4] >>> JVM J2 emitted unexpected output (verbatim) ----
   [junit4] Java HotSpot(TM) Server VM warning: Option UseConcMarkSweepGC was deprecated in version 9.0 and will likely be removed in a future release.
   [junit4] <<< JVM J2: EOF ----

[...truncated 1027 lines...]
   [junit4] JVM J1: stderr was not empty, see: /home/jenkins/workspace/Lucene-Solr-6.x-Linux/lucene/build/analysis/common/test/temp/junit4-J1-20170217_120123_6028237318822387082708.syserr
   [junit4] >>> JVM J1 emitted unexpected output (verbatim) ----
   [junit4] Java HotSpot(TM) Server VM warning: Option UseConcMarkSweepGC was deprecated in version 9.0 and will likely be removed in a future release.
   [junit4] <<< JVM J1: EOF ----

[...truncated 3 lines...]
   [junit4] JVM J2: stderr was not empty, see: /home/jenkins/workspace/Lucene-Solr-6.x-Linux/lucene/build/analysis/common/test/temp/junit4-J2-20170217_120123_60215019397716583601344.syserr
   [junit4] >>> JVM J2 emitted unexpected output (verbatim) ----
   [junit4] Java HotSpot(TM) Server VM warning: Option UseConcMarkSweepGC was deprecated in version 9.0 and will likely be removed in a future release.
   [junit4] <<< JVM J2: EOF ----

[...truncated 5 lines...]
   [junit4] JVM J0: stderr was not empty, see: /home/jenkins/workspace/Lucene-Solr-6.x-Linux/lucene/build/analysis/common/test/temp/junit4-J0-20170217_120123_60213042619817645762249.syserr
   [junit4] >>> JVM J0 emitted unexpected output (verbatim) ----
   [junit4] Java HotSpot(TM) Server VM warning: Option UseConcMarkSweepGC was deprecated in version 9.0 and will likely be removed in a future release.
   [junit4] <<< JVM J0: EOF ----

[...truncated 213 lines...]
   [junit4] JVM J2: stderr was not empty, see: /home/jenkins/workspace/Lucene-Solr-6.x-Linux/lucene/build/analysis/icu/test/temp/junit4-J2-20170217_120617_81810504603656556646886.syserr
   [junit4] >>> JVM J2 emitted unexpected output (verbatim) ----
   [junit4] Java HotSpot(TM) Server VM warning: Option UseConcMarkSweepGC was deprecated in version 9.0 and will likely be removed in a future release.
   [junit4] <<< JVM J2: EOF ----

[...truncated 5 lines...]
   [junit4] JVM J1: stderr was not empty, see: /home/jenkins/workspace/Lucene-Solr-6.x-Linux/lucene/build/analysis/icu/test/temp/junit4-J1-20170217_120617_81818353343987272600568.syserr
   [junit4] >>> JVM J1 emitted unexpected output (verbatim) ----
   [junit4] Java HotSpot(TM) Server VM warning: Option UseConcMarkSweepGC was deprecated in version 9.0 and will likely be removed in a future release.
   [junit4] <<< JVM J1: EOF ----

[...truncated 3 lines...]
   [junit4] JVM J0: stderr was not empty, see: /home/jenkins/workspace/Lucene-Solr-6.x-Linux/lucene/build/analysis/icu/test/temp/junit4-J0-20170217_120617_81812516226788510441965.syserr
   [junit4] >>> JVM J0 emitted unexpected output (verbatim) ----
   [junit4] Java HotSpot(TM) Server VM warning: Option UseConcMarkSweepGC was deprecated in version 9.0 and will likely be removed in a future release.
   [junit4] <<< JVM J0: EOF ----

[...truncated 237 lines...]
   [junit4] JVM J0: stderr was not empty, see: /home/jenkins/workspace/Lucene-Solr-6.x-Linux/lucene/build/analysis/kuromoji/test/temp/junit4-J0-20170217_120633_0702445077534355245137.syserr
   [junit4] >>> JVM J0 emitted unexpected output (verbatim) ----
   [junit4] Java HotSpot(TM) Server VM warning: Option UseConcMarkSweepGC was deprecated in version 9.0 and will likely be removed in a future release.
   [junit4] <<< JVM J0: EOF ----

[...truncated 3 lines...]
   [junit4] JVM J2: stderr was not empty, see: /home/jenkins/workspace/Lucene-Solr-6.x-Linux/lucene/build/analysis/kuromoji/test/temp/junit4-J2-20170217_120633_070546649582834201647.syserr
   [junit4] >>> JVM J2 emitted unexpected output (verbatim) ----
   [junit4] Java HotSpot(TM) Server VM warning: Option UseConcMarkSweepGC was deprecated in version 9.0 and will likely be removed in a future release.
   [junit4] <<< JVM J2: EOF ----

[...truncated 3 lines...]
   [junit4] JVM J1: stderr was not empty, see: /home/jenkins/workspace/Lucene-Solr-6.x-Linux/lucene/build/analysis/kuromoji/test/temp/junit4-J1-20170217_120633_0706928233143654055651.syserr
   [junit4] >>> JVM J1 emitted unexpected output (verbatim) ----
   [junit4] Java HotSpot(TM) Server VM warning: Option UseConcMarkSweepGC was deprecated in version 9.0 and will likely be removed in a future release.
   [junit4] <<< JVM J1: EOF ----

[...truncated 146 lines...]
   [junit4] JVM J1: stderr was not empty, see: /home/jenkins/workspace/Lucene-Solr-6.x-Linux/lucene/build/analysis/morfologik/test/temp/junit4-J1-20170217_120706_22213008089120864251666.syserr
   [junit4] >>> JVM J1 emitted unexpected output (verbatim) ----
   [junit4] Java HotSpot(TM) Server VM warning: Option UseConcMarkSweepGC was deprecated in version 9.0 and will likely be removed in a future release.
   [junit4] <<< JVM J1: EOF ----

[...truncated 3 lines...]
   [junit4] JVM J2: stderr was not empty, see: /home/jenkins/workspace/Lucene-Solr-6.x-Linux/lucene/build/analysis/morfologik/test/temp/junit4-J2-20170217_120706_23111691008873288782128.syserr
   [junit4] >>> JVM J2 emitted unexpected output (verbatim) ----
   [junit4] Java HotSpot(TM) Server VM warning: Option UseConcMarkSweepGC was deprecated in version 9.0 and will likely be removed in a future release.
   [junit4] <<< JVM J2: EOF ----

[...truncated 3 lines...]
   [junit4] JVM J0: stderr was not empty, see: /home/jenkins/workspace/Lucene-Solr-6.x-Linux/lucene/build/analysis/morfologik/test/temp/junit4-J0-20170217_120706_2205421251304076358045.syserr
   [junit4] >>> JVM J0 emitted unexpected output (verbatim) ----
   [junit4] Java HotSpot(TM) Server VM warning: Option UseConcMarkSweepGC was deprecated in version 9.0 and will likely be removed in a future release.
   [junit4] <<< JVM J0: EOF ----

[...truncated 161 lines...]
   [junit4] JVM J2: stderr was not empty, see: /home/jenkins/workspace/Lucene-Solr-6.x-Linux/lucene/build/analysis/phonetic/test/temp/junit4-J2-20170217_120712_1274457735277143921872.syserr
   [junit4] >>> JVM J2 emitted unexpected output (verbatim) ----
   [junit4] Java HotSpot(TM) Server VM warning: Option UseConcMarkSweepGC was deprecated in version 9.0 and will likely be removed in a future release.
   [junit4] <<< JVM J2: EOF ----

   [junit4] JVM J1: stderr was not empty, see: /home/jenkins/workspace/Lucene-Solr-6.x-Linux/lucene/build/analysis/phonetic/test/temp/junit4-J1-20170217_120712_12715122178467974173687.syserr
   [junit4] >>> JVM J1 emitted unexpected output (verbatim) ----
   [junit4] Java HotSpot(TM) Server VM warning: Option UseConcMarkSweepGC was deprecated in version 9.0 and will likely be removed in a future release.
   [junit4] <<< JVM J1: EOF ----

[...truncated 3 lines...]
   [junit4] JVM J0: stderr was not empty, see: /home/jenkins/workspace/Lucene-Solr-6.x-Linux/lucene/build/analysis/phonetic/test/temp/junit4-J0-20170217_120712_12713095579021798835292.syserr
   [junit4] >>> JVM J0 emitted unexpected output (verbatim) ----
   [junit4] Java HotSpot(TM) Server VM warning: Option UseConcMarkSweepGC was deprecated in version 9.0 and will likely be removed in a future release.
   [junit4] <<< JVM J0: EOF ----

[...truncated 145 lines...]
   [junit4] JVM J0: stderr was not empty, see: /home/jenkins/workspace/Lucene-Solr-6.x-Linux/lucene/build/analysis/smartcn/test/temp/junit4-J0-20170217_120728_88011256923200687714577.syserr
   [junit4] >>> JVM J0 emitted unexpected output (verbatim) ----
   [junit4] Java HotSpot(TM) Server VM warning: Option UseConcMarkSweepGC was deprecated in version 9.0 and will likely be removed in a future release.
   [junit4] <<< JVM J0: EOF ----

[...truncated 3 lines...]
   [junit4] JVM J1: stderr was not empty, see: /home/jenkins/workspace/Lucene-Solr-6.x-Linux/lucene/build/analysis/smartcn/test/temp/junit4-J1-20170217_120728_8805193598903298247574.syserr
   [junit4] >>> JVM J1 emitted unexpected output (verbatim) ----
   [junit4] Java HotSpot(TM) Server VM warning: Option UseConcMarkSweepGC was deprecated in version 9.0 and will likely be removed in a future release.
   [junit4] <<< JVM J1: EOF ----

[...truncated 149 lines...]
   [junit4] JVM J2: stderr was not empty, see: /home/jenkins/workspace/Lucene-Solr-6.x-Linux/lucene/build/analysis/stempel/test/temp/junit4-J2-20170217_120740_7694409419505356581169.syserr
   [junit4] >>> JVM J2 emitted unexpected output (verbatim) ----
   [junit4] Java HotSpot(TM) Server VM warning: Option UseConcMarkSweepGC was deprecated in version 9.0 and will likely be removed in a future release.
   [junit4] <<< JVM J2: EOF ----

   [junit4] JVM J1: stderr was not empty, see: /home/jenkins/workspace/Lucene-Solr-6.x-Linux/lucene/build/analysis/stempel/test/temp/junit4-J1-20170217_120740_7693791535736158539890.syserr
   [junit4] >>> JVM J1 emitted unexpected output (verbatim) ----
   [junit4] Java HotSpot(TM) Server VM warning: Option UseConcMarkSweepGC was deprecated in version 9.0 and will likely be removed in a future release.
   [junit4] <<< JVM J1: EOF ----

[...truncated 3 lines...]
   [junit4] JVM J0: stderr was not empty, see: /home/jenkins/workspace/Lucene-Solr-6.x-Linux/lucene/build/analysis/stempel/test/temp/junit4-J0-20170217_120740_7695669205172461172678.syserr
   [junit4] >>> JVM J0 emitted unexpected output (verbatim) ----
   [junit4] Java HotSpot(TM) Server VM warning: Option UseConcMarkSweepGC was deprecated in version 9.0 and will likely be removed in a future release.
   [junit4] <<< JVM J0: EOF ----

[...truncated 161 lines...]
   [junit4] JVM J0: stderr was not empty, see: /home/jenkins/workspace/Lucene-Solr-6.x-Linux/lucene/build/analysis/uima/test/temp/junit4-J0-20170217_120744_0709040195440798054144.syserr
   [junit4] >>> JVM J0 emitted unexpected output (verbatim) ----
   [junit4] Java HotSpot(TM) Server VM warning: Option UseConcMarkSweepGC was deprecated in version 9.0 and will likely be removed in a future release.
   [junit4] <<< JVM J0: EOF ----

[...truncated 150 lines...]
   [junit4] JVM J2: stderr was not empty, see: /home/jenkins/workspace/Lucene-Solr-6.x-Linux/lucene/build/backward-codecs/test/temp/junit4-J2-20170217_120755_5972637541627526022852.syserr
   [junit4] >>> JVM J2 emitted unexpected output (verbatim) ----
   [junit4] Java HotSpot(TM) Server VM warning: Option UseConcMarkSweepGC was deprecated in version 9.0 and will likely be removed in a future release.
   [junit4] <<< JVM J2: EOF ----

[...truncated 7 lines...]
   [junit4] JVM J1: stderr was not empty, see: /home/jenkins/workspace/Lucene-Solr-6.x-Linux/lucene/build/backward-codecs/test/temp/junit4-J1-20170217_120755_597309846067854140295.syserr
   [junit4] >>> JVM J1 emitted unexpected output (verbatim) ----
   [junit4] Java HotSpot(TM) Server VM warning: Option UseConcMarkSweepGC was deprecated in version 9.0 and will likely be removed in a future release.
   [junit4] <<< JVM J1: EOF ----

[...truncated 26 lines...]
   [junit4] JVM J0: stderr was not empty, see: /home/jenkins/workspace/Lucene-Solr-6.x-Linux/lucene/build/backward-codecs/test/temp/junit4-J0-20170217_120755_597253506370990013610.syserr
   [junit4] >>> JVM J0 emitted unexpected output (verbatim) ----
   [junit4] Java HotSpot(TM) Server VM warning: Option UseConcMarkSweepGC was deprecated in version 9.0 and will likely be removed in a future release.
   [junit4] <<< JVM J0: EOF ----

[...truncated 1344 lines...]
   [junit4] JVM J1: stderr was not empty, see: /home/jenkins/workspace/Lucene-Solr-6.x-Linux/lucene/build/benchmark/test/temp/junit4-J1-20170217_121144_5888667423286935598262.syserr
   [junit4] >>> JVM J1 emitted unexpected output (verbatim) ----
   [junit4] Java HotSpot(TM) Server VM warning: Option UseConcMarkSweepGC was deprecated in version 9.0 and will likely be removed in a future release.
   [junit4] <<< JVM J1: EOF ----

   [junit4] JVM J2: stderr was not empty, see: /home/jenkins/workspace/Lucene-Solr-6.x-Linux/lucene/build/benchmark/test/temp/junit4-J2-20170217_121144_5882407511740951538107.syserr
   [junit4] >>> JVM J2 emitted unexpected output (verbatim) ----
   [junit4] Java HotSpot(TM) Server VM warning: Option UseConcMarkSweepGC was deprecated in version 9.0 and will likely be removed in a future release.
   [junit4] <<< JVM J2: EOF ----

[...truncated 3 lines...]
   [junit4] JVM J0: stderr was not empty, see: /home/jenkins/workspace/Lucene-Solr-6.x-Linux/lucene/build/benchmark/test/temp/junit4-J0-20170217_121144_5889557147305072189165.syserr
   [junit4] >>> JVM J0 emitted unexpected output (verbatim) ----
   [junit4] Java HotSpot(TM) Server VM warning: Option UseConcMarkSweepGC was deprecated in version 9.0 and will likely be removed in a future release.
   [junit4] <<< JVM J0: EOF ----

[...truncated 223 lines...]
   [junit4] JVM J0: stderr was not empty, see: /home/jenkins/workspace/Lucene-Solr-6.x-Linux/lucene/build/classification/test/temp/junit4-J0-20170217_121153_6799934117181134375770.syserr
   [junit4] >>> JVM J0 emitted unexpected output (verbatim) ----
   [junit4] Java HotSpot(TM) Server VM warning: Option UseConcMarkSweepGC was deprecated in version 9.0 and will likely be removed in a future release.
   [junit4] <<< JVM J0: EOF ----

[...truncated 3 lines...]
   [junit4] JVM J1: stderr was not empty, see: /home/jenkins/workspace/Lucene-Solr-6.x-Linux/lucene/build/classification/test/temp/junit4-J1-20170217_121153_67915752767007018008800.syserr
   [junit4] >>> JVM J1 emitted unexpected output (verbatim) ----
   [junit4] Java HotSpot(TM) Server VM warning: Option UseConcMarkSweepGC was deprecated in version 9.0 and will likely be removed in a future release.
   [junit4] <<< JVM J1: EOF ----

[...truncated 3 lines...]
   [junit4] JVM J2: stderr was not empty, see: /home/jenkins/workspace/Lucene-Solr-6.x-Linux/lucene/build/classification/test/temp/junit4-J2-20170217_121153_6798544780337483118107.syserr
   [junit4] >>> JVM J2 emitted unexpected output (verbatim) ----
   [junit4] Java HotSpot(TM) Server VM warning: Option UseConcMarkSweepGC was deprecated in version 9.0 and will likely be removed in a future release.
   [junit4] <<< JVM J2: EOF ----

[...truncated 246 lines...]
   [junit4] JVM J0: stderr was not empty, see: /home/jenkins/workspace/Lucene-Solr-6.x-Linux/lucene/build/codecs/test/temp/junit4-J0-20170217_121203_0379987001849208987098.syserr
   [junit4] >>> JVM J0 emitted unexpected output (verbatim) ----
   [junit4] Java HotSpot(TM) Server VM warning: Option UseConcMarkSweepGC was deprecated in version 9.0 and will likely be removed in a future release.
   [junit4] <<< JVM J0: EOF ----

[...truncated 7 lines...]
   [junit4] JVM J1: stderr was not empty, see: /home/jenkins/workspace/Lucene-Solr-6.x-Linux/lucene/build/codecs/test/temp/junit4-J1-20170217_121203_0388681262823536261091.syserr
   [junit4] >>> JVM J1 emitted unexpected output (verbatim) ----
   [junit4] Java HotSpot(TM) Server VM warning: Option UseConcMarkSweepGC was deprecated in version 9.0 and will likely be removed in a future release.
   [junit4] <<< JVM J1: EOF ----

[...truncated 3 lines...]
   [junit4] JVM J2: stderr was not empty, see: /home/jenkins/workspace/Lucene-Solr-6.x-Linux/lucene/build/codecs/test/temp/junit4-J2-20170217_121203_03814430537500842239977.syserr
   [junit4] >>> JVM J2 emitted unexpected output (verbatim) ----
   [junit4] Java HotSpot(TM) Server VM warning: Option UseConcMarkSweepGC was deprecated in version 9.0 and will likely be removed in a future release.
   [junit4] <<< JVM J2: EOF ----

[...truncated 223 lines...]
   [junit4] JVM J0: stderr was not empty, see: /home/jenkins/workspace/Lucene-Solr-6.x-Linux/lucene/build/demo/test/temp/junit4-J0-20170217_121614_8773197381064383004097.syserr
   [junit4] >>> JVM J0 emitted unexpected output (verbatim) ----
   [junit4] Java HotSpot(TM) Server VM warning: Option UseConcMarkSweepGC was deprecated in version 9.0 and will likely be removed in a future release.
   [junit4] <<< JVM J0: EOF ----

[...truncated 6 lines...]
   [junit4] JVM J1: stderr was not empty, see: /home/jenkins/workspace/Lucene-Solr-6.x-Linux/lucene/build/demo/test/temp/junit4-J1-20170217_121614_8789892937116531841305.syserr
   [junit4] >>> JVM J1 emitted unexpected output (verbatim) ----
   [junit4] Java HotSpot(TM) Server VM warning: Option UseConcMarkSweepGC was deprecated in version 9.0 and will likely be removed in a future release.
   [junit4] <<< JVM J1: EOF ----

   [junit4] JVM J2: stderr was not empty, see: /home/jenkins/workspace/Lucene-Solr-6.x-Linux/lucene/build/demo/test/temp/junit4-J2-20170217_121614_8784866109347644524842.syserr
   [junit4] >>> JVM J2 emitted unexpected output (verbatim) ----
   [junit4] Java HotSpot(TM) Server VM warning: Option UseConcMarkSweepGC was deprecated in version 9.0 and will likely be removed in a future release.
   [junit4] <<< JVM J2: EOF ----

[...truncated 162 lines...]
   [junit4] JVM J2: stderr was not empty, see: /home/jenkins/workspace/Lucene-Solr-6.x-Linux/lucene/build/expressions/test/temp/junit4-J2-20170217_121618_2992628052673157126506.syserr
   [junit4] >>> JVM J2 emitted unexpected output (verbatim) ----
   [junit4] Java HotSpot(TM) Server VM warning: Option UseConcMarkSweepGC was deprecated in version 9.0 and will likely be removed in a future release.
   [junit4] <<< JVM J2: EOF ----

   [junit4] JVM J1: stderr was not empty, see: /home/jenkins/workspace/Lucene-Solr-6.x-Linux/lucene/build/expressions/test/temp/junit4-J1-20170217_121618_29915439065477675186923.syserr
   [junit4] >>> JVM J1 emitted unexpected output (verbatim) ----
   [junit4] Java HotSpot(TM) Server VM warning: Option UseConcMarkSweepGC was deprecated in version 9.0 and will likely be removed in a future release.
   [junit4] <<< JVM J1: EOF ----

[...truncated 6 lines...]
   [junit4] JVM J0: stderr was not empty, see: /home/jenkins/workspace/Lucene-Solr-6.x-Linux/lucene/build/expressions/test/temp/junit4-J0-20170217_121618_2975883515968517792552.syserr
   [junit4] >>> JVM J0 emitted unexpected output (verbatim) ----
   [junit4] Java HotSpot(TM) Server VM warning: Option UseConcMarkSweepGC was deprecated in version 9.0 and will likely be removed in a future release.
   [junit4] <<< JVM J0: EOF ----

[...truncated 209 lines...]
   [junit4] JVM J2: stderr was not empty, see: /home/jenkins/workspace/Lucene-Solr-6.x-Linux/lucene/build/facet/test/temp/junit4-J2-20170217_121626_7967037409642508856118.syserr
   [junit4] >>> JVM J2 emitted unexpected output (verbatim) ----
   [junit4] Java HotSpot(TM) Server VM warning: Option UseConcMarkSweepGC was deprecated in version 9.0 and will likely be removed in a future release.
   [junit4] <<< JVM J2: EOF ----

[...truncated 3 lines...]
   [junit4] JVM J0: stderr was not empty, see: /home/jenkins/workspace/Lucene-Solr-6.x-Linux/lucene/build/facet/test/temp/junit4-J0-20170217_121626_79611900626697426120261.syserr
   [junit4] >>> JVM J0 emitted unexpected output (verbatim) ----
   [junit4] Java HotSpot(TM) Server VM warning: Option UseConcMarkSweepGC was deprecated in version 9.0 and will likely be removed in a future release.
   [junit4] <<< JVM J0: EOF ----

[...truncated 3 lines...]
   [junit4] JVM J1: stderr was not empty, see: /home/jenkins/workspace/Lucene-Solr-6.x-Linux/lucene/build/facet/test/temp/junit4-J1-20170217_121626_79612383885355272514240.syserr
   [junit4] >>> JVM J1 emitted unexpected output (verbatim) ----
   [junit4] Java HotSpot(TM) Server VM warning: Option UseConcMarkSweepGC was deprecated in version 9.0 and will likely be removed in a future release.
   [junit4] <<< JVM J1: EOF ----

[...truncated 156 lines...]
   [junit4] JVM J1: stderr was not empty, see: /home/jenkins/workspace/Lucene-Solr-6.x-Linux/lucene/build/grouping/test/temp/junit4-J1-20170217_121702_2684772311925344297825.syserr
   [junit4] >>> JVM J1 emitted unexpected output (verbatim) ----
   [junit4] Java HotSpot(TM) Server VM warning: Option UseConcMarkSweepGC was deprecated in version 9.0 and will likely be removed in a future release.
   [junit4] <<< JVM J1: EOF ----

[...truncated 3 lines...]
   [junit4] JVM J2: stderr was not empty, see: /home/jenkins/workspace/Lucene-Solr-6.x-Linux/lucene/build/grouping/test/temp/junit4-J2-20170217_121702_2689830589200706196918.syserr
   [junit4] >>> JVM J2 emitted unexpected output (verbatim) ----
   [junit4] Java HotSpot(TM) Server VM warning: Option UseConcMarkSweepGC was deprecated in version 9.0 and will likely be removed in a future release.
   [junit4] <<< JVM J2: EOF ----

[...truncated 3 lines...]
   [junit4] JVM J0: stderr was not empty, see: /home/jenkins/workspace/Lucene-Solr-6.x-Linux/lucene/build/grouping/test/temp/junit4-J0-20170217_121702_2682169455043686979189.syserr
   [junit4] >>> JVM J0 emitted unexpected output (verbatim) ----
   [junit4] Java HotSpot(TM) Server VM warning: Option UseConcMarkSweepGC was deprecated in version 9.0 and will likely be removed in a future release.
   [junit4] <<< JVM J0: EOF ----

[...truncated 244 lines...]
   [junit4] JVM J1: stderr was not empty, see: /home/jenkins/workspace/Lucene-Solr-6.x-Linux/lucene/build/highlighter/test/temp/junit4-J1-20170217_121716_25313256994221943542580.syserr
   [junit4] >>> JVM J1 emitted unexpected output (verbatim) ----
   [junit4] Java HotSpot(TM) Server VM warning: Option UseConcMarkSweepGC was deprecated in version 9.0 and will likely be removed in a future release.
   [junit4] <<< JVM J1: EOF ----

[...truncated 6 lines...]
   [junit4] JVM J2: stderr was not empty, see: /home/jenkins/workspace/Lucene-Solr-6.x-Linux/lucene/build/highlighter/test/temp/junit4-J2-20170217_121716_25510455582817485838025.syserr
   [junit4] >>> JVM J2 emitted unexpected output (verbatim) ----
   [junit4] Java HotSpot(TM) Server VM warning: Option UseConcMarkSweepGC was deprecated in version 9.0 and will likely be removed in a future release.
   [junit4] <<< JVM J2: EOF ----

   [junit4] JVM J0: stderr was not empty, see: /home/jenkins/workspace/Lucene-Solr-6.x-Linux/lucene/build/highlighter/test/temp/junit4-J0-20170217_121716_2523510019473365599467.syserr
   [junit4] >>> JVM J0 emitted unexpected output (verbatim) ----
   [junit4] Java HotSpot(TM) Server VM warning: Option UseConcMarkSweepGC was deprecated in version 9.0 and will likely be removed in a future release.
   [junit4] <<< JVM J0: EOF ----

[...truncated 152 lines...]
   [junit4] JVM J2: stderr was not empty, see: /home/jenkins/workspace/Lucene-Solr-6.x-Linux/lucene/build/join/test/temp/junit4-J2-20170217_121741_0129564229248241247243.syserr
   [junit4] >>> JVM J2 emitted unexpected output (verbatim) ----
   [junit4] Java HotSpot(TM) Server VM warning: Option UseConcMarkSweepGC was deprecated in version 9.0 and will likely be removed in a future release.
   [junit4] <<< JVM J2: EOF ----

[...truncated 3 lines...]
   [junit4] JVM J0: stderr was not empty, see: /home/jenkins/workspace/Lucene-Solr-6.x-Linux/lucene/build/join/test/temp/junit4-J0-20170217_121741_01213355953317704735569.syserr
   [junit4] >>> JVM J0 emitted unexpected output (verbatim) ----
   [junit4] Java HotSpot(TM) Server VM warning: Option UseConcMarkSweepGC was deprecated in version 9.0 and will likely be removed in a future release.
   [junit4] <<< JVM J0: EOF ----

[...truncated 3 lines...]
   [junit4] JVM J1: stderr was not empty, see: /home/jenkins/workspace/Lucene-Solr-6.x-Linux/lucene/build/join/test/temp/junit4-J1-20170217_121741_0129681546762245784729.syserr
   [junit4] >>> JVM J1 emitted unexpected output (verbatim) ----
   [junit4] Java HotSpot(TM) Server VM warning: Option UseConcMarkSweepGC was deprecated in version 9.0 and will likely be removed in a future release.
   [junit4] <<< JVM J1: EOF ----

[...truncated 143 lines...]
   [junit4] JVM J0: stderr was not empty, see: /home/jenkins/workspace/Lucene-Solr-6.x-Linux/lucene/build/memory/test/temp/junit4-J0-20170217_121801_0274887046414270406918.syserr
   [junit4] >>> JVM J0 emitted unexpected output (verbatim) ----
   [junit4] Java HotSpot(TM) Server VM warning: Option UseConcMarkSweepGC was deprecated in version 9.0 and will likely be removed in a future release.
   [junit4] <<< JVM J0: EOF ----

[...truncated 3 lines...]
   [junit4] JVM J1: stderr was not empty, see: /home/jenkins/workspace/Lucene-Solr-6.x-Linux/lucene/build/memory/test/temp/junit4-J1-20170217_121801_02713240150314424602817.syserr
   [junit4] >>> JVM J1 emitted unexpected output (verbatim) ----
   [junit4] Java HotSpot(TM) Server VM warning: Option UseConcMarkSweepGC was deprecated in version 9.0 and will likely be removed in a future release.
   [junit4] <<< JVM J1: EOF ----

[...truncated 202 lines...]
   [junit4] JVM J0: stderr was not empty, see: /home/jenkins/workspace/Lucene-Solr-6.x-Linux/lucene/build/misc/test/temp/junit4-J0-20170217_121816_56512197251901294792628.syserr
   [junit4] >>> JVM J0 emitted unexpected output (verbatim) ----
   [junit4] Java HotSpot(TM) Server VM warning: Option UseConcMarkSweepGC was deprecated in version 9.0 and will likely be removed in a future release.
   [junit4] <<< JVM J0: EOF ----

[...truncated 3 lines...]
   [junit4] JVM J1: stderr was not empty, see: /home/jenkins/workspace/Lucene-Solr-6.x-Linux/lucene/build/misc/test/temp/junit4-J1-20170217_121816_5657752451647730080898.syserr
   [junit4] >>> JVM J1 emitted unexpected output (verbatim) ----
   [junit4] Java HotSpot(TM) Server VM warning: Option UseConcMarkSweepGC was deprecated in version 9.0 and will likely be removed in a future release.
   [junit4] <<< JVM J1: EOF ----

[...truncated 5 lines...]
   [junit4] JVM J2: stderr was not empty, see: /home/jenkins/workspace/Lucene-Solr-6.x-Linux/lucene/build/misc/test/temp/junit4-J2-20170217_121816_5657012589006249882484.syserr
   [junit4] >>> JVM J2 emitted unexpected output (verbatim) ----
   [junit4] Java HotSpot(TM) Server VM warning: Option UseConcMarkSweepGC was deprecated in version 9.0 and will likely be removed in a future release.
   [junit4] <<< JVM J2: EOF ----

[...truncated 224 lines...]
   [junit4] JVM J0: stderr was not empty, see: /home/jenkins/workspace/Lucene-Solr-6.x-Linux/lucene/build/queries/test/temp/junit4-J0-20170217_121845_4538655835785085213965.syserr
   [junit4] >>> JVM J0 emitted unexpected output (verbatim) ----
   [junit4] Java HotSpot(TM) Server VM warning: Option UseConcMarkSweepGC was deprecated in version 9.0 and will likely be removed in a future release.
   [junit4] <<< JVM J0: EOF ----

[...truncated 3 lines...]
   [junit4] JVM J2: stderr was not empty, see: /home/jenkins/workspace/Lucene-Solr-6.x-Linux/lucene/build/queries/test/temp/junit4-J2-20170217_121845_4531811620426832937852.syserr
   [junit4] >>> JVM J2 emitted unexpected output (verbatim) ----
   [junit4] Java HotSpot(TM) Server VM warning: Option UseConcMarkSweepGC was deprecated in version 9.0 and will likely be removed in a future release.
   [junit4] <<< JVM J2: EOF ----

[...truncated 3 lines...]
   [junit4] JVM J1: stderr was not empty, see: /home/jenkins/workspace/Lucene-Solr-6.x-Linux/lucene/build/queries/test/temp/junit4-J1-20170217_121845_45310506403896764525531.syserr
   [junit4] >>> JVM J1 emitted unexpected output (verbatim) ----
   [junit4] Java HotSpot(TM) Server VM warning: Option UseConcMarkSweepGC was deprecated in version 9.0 and will likely be removed in a future release.
   [junit4] <<< JVM J1: EOF ----

[...truncated 227 lines...]
   [junit4] JVM J1: stderr was not empty, see: /home/jenkins/workspace/Lucene-Solr-6.x-Linux/lucene/build/queryparser/test/temp/junit4-J1-20170217_121855_18517315034476086766470.syserr
   [junit4] >>> JVM J1 emitted unexpected output (verbatim) ----
   [junit4] Java HotSpot(TM) Server VM warning: Option UseConcMarkSweepGC was deprecated in version 9.0 and will likely be removed in a future release.
   [junit4] <<< JVM J1: EOF ----

[...truncated 3 lines...]
   [junit4] JVM J0: stderr was not empty, see: /home/jenkins/workspace/Lucene-Solr-6.x-Linux/lucene/build/queryparser/test/temp/junit4-J0-20170217_121855_18412497756065992899698.syserr
   [junit4] >>> JVM J0 emitted unexpected output (verbatim) ----
   [junit4] Java HotSpot(TM) Server VM warning: Option UseConcMarkSweepGC was deprecated in version 9.0 and will likely be removed in a future release.
   [junit4] <<< JVM J0: EOF ----

[...truncated 3 lines...]
   [junit4] JVM J2: stderr was not empty, see: /home/jenkins/workspace/Lucene-Solr-6.x-Linux/lucene/build/queryparser/test/temp/junit4-J2-20170217_121855_18513100544266147808355.syserr
   [junit4] >>> JVM J2 emitted unexpected output (verbatim) ----
   [junit4] Java HotSpot(TM) Server VM warning: Option UseConcMarkSweepGC was deprecated in version 9.0 and will likely be removed in a future release.
   [junit4] <<< JVM J2: EOF ----

[...truncated 191 lines...]
   [junit4] JVM J1: stderr was not empty, see: /home/jenkins/workspace/Lucene-Solr-6.x-Linux/lucene/build/replicator/test/temp/junit4-J1-20170217_121903_25413992032961068977007.syserr
   [junit4] >>> JVM J1 emitted unexpected output (verbatim) ----
   [junit4] Java HotSpot(TM) Server VM warning: Option UseConcMarkSweepGC was deprecated in version 9.0 and will likely be removed in a future release.
   [junit4] <<< JVM J1: EOF ----

[...truncated 11 lines...]
   [junit4] JVM J2: stderr was not empty, see: /home/jenkins/workspace/Lucene-Solr-6.x-Linux/lucene/build/replicator/test/temp/junit4-J2-20170217_121903_25410858988464366942578.syserr
   [junit4] >>> JVM J2 emitted unexpected output (verbatim) ----
   [junit4] Java HotSpot(TM) Server VM warning: Option UseConcMarkSweepGC was deprecated in version 9.0 and will likely be removed in a future release.
   [junit4] <<< JVM J2: EOF ----

[...truncated 3 lines...]
   [junit4] JVM J0: stderr was not empty, see: /home/jenkins/workspace/Lucene-Solr-6.x-Linux/lucene/build/replicator/test/temp/junit4-J0-20170217_121903_25410868399779354534585.syserr
   [junit4] >>> JVM J0 emitted unexpected output (verbatim) ----
   [junit4] Java HotSpot(TM) Server VM warning: Option UseConcMarkSweepGC was deprecated in version 9.0 and will likely be removed in a future release.
   [junit4] <<< JVM J0: EOF ----

[...truncated 214 lines...]
   [junit4] JVM J0: stderr was not empty, see: /home/jenkins/workspace/Lucene-Solr-6.x-Linux/lucene/build/sandbox/test/temp/junit4-J0-20170217_121916_69916220871926323917698.syserr
   [junit4] >>> JVM J0 emitted unexpected output (verbatim) ----
   [junit4] Java HotSpot(TM) Server VM warning: Option UseConcMarkSweepGC was deprecated in version 9.0 and will likely be removed in a future release.
   [junit4] <<< JVM J0: EOF ----

[...truncated 21 lines...]
   [junit4] JVM J2: stderr was not empty, see: /home/jenkins/workspace/Lucene-Solr-6.x-Linux/lucene/build/sandbox/test/temp/junit4-J2-20170217_121916_7001667734986854221847.syserr
   [junit4] >>> JVM J2 emitted unexpected output (verbatim) ----
   [junit4] Java HotSpot(TM) Server VM warning: Option UseConcMarkSweepGC was deprecated in version 9.0 and will likely be removed in a future release.
   [junit4] <<< JVM J2: EOF ----

[...truncated 7 lines...]
   [junit4] JVM J1: stderr was not empty, see: /home/jenkins/workspace/Lucene-Solr-6.x-Linux/lucene/build/sandbox/test/temp/junit4-J1-20170217_121916_6993773456953748484429.syserr
   [junit4] >>> JVM J1 emitted unexpected output (verbatim) ----
   [junit4] Java HotSpot(TM) Server VM warning: Option UseConcMarkSweepGC was deprecated in version 9.0 and will likely be removed in a future release.
   [junit4] <<< JVM J1: EOF ----

[...truncated 208 lines...]
   [junit4] JVM J0: stderr was not empty, see: /home/jenkins/workspace/Lucene-Solr-6.x-Linux/lucene/build/spatial-extras/test/temp/junit4-J0-20170217_122036_9503304571816746641441.syserr
   [junit4] >>> JVM J0 emitted unexpected output (verbatim) ----
   [junit4] Java HotSpot(TM) Server VM warning: Option UseConcMarkSweepGC was deprecated in version 9.0 and will likely be removed in a future release.
   [junit4] <<< JVM J0: EOF ----

[...truncated 3 lines...]
   [junit4] JVM J1: stderr was not empty, see: /home/jenkins/workspace/Lucene-Solr-6.x-Linux/lucene/build/spatial-extras/test/temp/junit4-J1-20170217_122036_9501233381803825718551.syserr
   [junit4] >>> JVM J1 emitted unexpected output (verbatim) ----
   [junit4] Java HotSpot(TM) Server VM warning: Option UseConcMarkSweepGC was deprecated in version 9.0 and will likely be removed in a future release.
   [junit4] <<< JVM J1: EOF ----

[...truncated 3 lines...]
   [junit4] JVM J2: stderr was not empty, see: /home/jenkins/workspace/Lucene-Solr-6.x-Linux/lucene/build/spatial-extras/test/temp/junit4-J2-20170217_122036_9508211851494875577648.syserr
   [junit4] >>> JVM J2 emitted unexpected output (verbatim) ----
   [junit4] Java HotSpot(TM) Server VM warning: Option UseConcMarkSweepGC was deprecated in version 9.0 and will likely be removed in a future release.
   [junit4] <<< JVM J2: EOF ----

[...truncated 151 lines...]
   [junit4] JVM J2: stderr was not empty, see: /home/jenkins/workspace/Lucene-Solr-6.x-Linux/lucene/build/spatial/test/temp/junit4-J2-20170217_122050_23112884205156975115162.syserr
   [junit4] >>> JVM J2 emitted unexpected output (verbatim) ----
   [junit4] Java HotSpot(TM) Server VM warning: Option UseConcMarkSweepGC was deprecated in version 9.0 and will likely be removed in a future release.
   [junit4] <<< JVM J2: EOF ----

[...truncated 7 lines...]
   [junit4] JVM J0: stderr was not empty, see: /home/jenkins/workspace/Lucene-Solr-6.x-Linux/lucene/build/spatial/test/temp/junit4-J0-20170217_122050_23112358840250022042806.syserr
   [junit4] >>> JVM J0 emitted unexpected output (verbatim) ----
   [junit4] Java HotSpot(TM) Server VM warning: Option UseConcMarkSweepGC was deprecated in version 9.0 and will likely be removed in a future release.
   [junit4] <<< JVM J0: EOF ----

[...truncated 11 lines...]
   [junit4] JVM J1: stderr was not empty, see: /home/jenkins/workspace/Lucene-Solr-6.x-Linux/lucene/build/spatial/test/temp/junit4-J1-20170217_122050_23115408252817155271773.syserr
   [junit4] >>> JVM J1 emitted unexpected output (verbatim) ----
   [junit4] Java HotSpot(TM) Server VM warning: Option UseConcMarkSweepGC was deprecated in version 9.0 and will likely be removed in a future release.
   [junit4] <<< JVM J1: EOF ----

[...truncated 164 lines...]
   [junit4] JVM J1: stderr was not empty, see: /home/jenkins/workspace/Lucene-Solr-6.x-Linux/lucene/build/spatial3d/test/temp/junit4-J1-20170217_122205_8557944915985447869607.syserr
   [junit4] >>> JVM J1 emitted unexpected output (verbatim) ----
   [junit4] Java HotSpot(TM) Server VM warning: Option UseConcMarkSweepGC was deprecated in version 9.0 and will likely be removed in a future release.
   [junit4] <<< JVM J1: EOF ----

   [junit4] JVM J2: stderr was not empty, see: /home/jenkins/workspace/Lucene-Solr-6.x-Linux/lucene/build/spatial3d/test/temp/junit4-J2-20170217_122205_8564352970579492853627.syserr
   [junit4] >>> JVM J2 emitted unexpected output (verbatim) ----
   [junit4] Java HotSpot(TM) Server VM warning: Option UseConcMarkSweepGC was deprecated in version 9.0 and will likely be removed in a future release.
   [junit4] <<< JVM J2: EOF ----

[...truncated 6 lines...]
   [junit4] JVM J0: stderr was not empty, see: /home/jenkins/workspace/Lucene-Solr-6.x-Linux/lucene/build/spatial3d/test/temp/junit4-J0-20170217_122205_85512221517774481644698.syserr
   [junit4] >>> JVM J0 emitted unexpected output (verbatim) ----
   [junit4] Java HotSpot(TM) Server VM warning: Option UseConcMarkSweepGC was deprecated in version 9.0 and will likely be removed in a future release.
   [junit4] <<< JVM J0: EOF ----

[...truncated 290 lines...]
   [junit4] JVM J2: stderr was not empty, see: /home/jenkins/workspace/Lucene-Solr-6.x-Linux/lucene/build/suggest/test/temp/junit4-J2-20170217_122323_75111427306070243539920.syserr
   [junit4] >>> JVM J2 emitted unexpected output (verbatim) ----
   [junit4] Java HotSpot(TM) Server VM warning: Option UseConcMarkSweepGC was deprecated in version 9.0 and will likely be removed in a future release.
   [junit4] <<< JVM J2: EOF ----

[...truncated 18 lines...]
   [junit4] JVM J1: stderr was not empty, see: /home/jenkins/workspace/Lucene-Solr-6.x-Linux/lucene/build/suggest/test/temp/junit4-J1-20170217_122323_7519307705128948069562.syserr
   [junit4] >>> JVM J1 emitted unexpected output (verbatim) ----
   [junit4] Java HotSpot(TM) Server VM warning: Option UseConcMarkSweepGC was deprecated in version 9.0 and will likely be removed in a future release.
   [junit4] <<< JVM J1: EOF ----

[...truncated 3 lines...]
   [junit4] JVM J0: stderr was not empty, see: /home/jenkins/workspace/Lucene-Solr-6.x-Linux/lucene/build/suggest/test/temp/junit4-J0-20170217_122323_7517703962021935951382.syserr
   [junit4] >>> JVM J0 emitted unexpected output (verbatim) ----
   [junit4] Java HotSpot(TM) Server VM warning: Option UseConcMarkSweepGC was deprecated in version 9.0 and will likely be removed in a future release.
   [junit4] <<< JVM J0: EOF ----

[...truncated 2210 lines...]
   [junit4] Suite: org.apache.solr.handler.admin.TestApiFramework
   [junit4]   2> Creating dataDir: /home/jenkins/workspace/Lucene-Solr-6.x-Linux/solr/build/solr-core/test/J1/temp/solr.handler.admin.TestApiFramework_1CCAFBD1B6E5450F-001/init-core-data-001
   [junit4]   2> 1127924 INFO  (SUITE-TestApiFramework-seed#[1CCAFBD1B6E5450F]-worker) [    ] o.a.s.SolrTestCaseJ4 Using PointFields
   [junit4]   2> 1127926 INFO  (SUITE-TestApiFramework-seed#[1CCAFBD1B6E5450F]-worker) [    ] o.a.s.SolrTestCaseJ4 Randomized ssl (true) and clientAuth (true) via: @org.apache.solr.util.RandomizeSSL(reason="", ssl=0.0/0.0, value=0.0/0.0, clientAuth=0.0/0.0)
   [junit4]   2> 1127928 INFO  (TEST-TestApiFramework.testFramework-seed#[1CCAFBD1B6E5450F]) [    ] o.a.s.SolrTestCaseJ4 ###Starting testFramework
   [junit4]   2> 1127972 INFO  (TEST-TestApiFramework.testFramework-seed#[1CCAFBD1B6E5450F]) [    ] o.a.s.SolrTestCaseJ4 ###Ending testFramework
   [junit4]   2> NOTE: reproduce with: ant test  -Dtestcase=TestApiFramework -Dtests.method=testFramework -Dtests.seed=1CCAFBD1B6E5450F -Dtests.multiplier=3 -Dtests.slow=true -Dtests.locale=en-CM -Dtests.timezone=America/Argentina/San_Luis -Dtests.asserts=true -Dtests.file.encoding=US-ASCII
   [junit4] ERROR   0.05s J1 | TestApiFramework.testFramework <<<
   [junit4]    > Throwable #1: java.lang.ExceptionInInitializerError
   [junit4]    > at __randomizedtesting.SeedInfo.seed([1CCAFBD1B6E5450F:BBC31F6B031A932]:0)
   [junit4]    > at net.sf.cglib.core.KeyFactory$Generator.generateClass(KeyFactory.java:166)
   [junit4]    > at net.sf.cglib.core.DefaultGeneratorStrategy.generate(DefaultGeneratorStrategy.java:25)
   [junit4]    > at net.sf.cglib.core.AbstractClassGenerator.create(AbstractClassGenerator.java:216)
   [junit4]    > at net.sf.cglib.core.KeyFactory$Generator.create(KeyFactory.java:144)
   [junit4]    > at net.sf.cglib.core.KeyFactory.create(KeyFactory.java:116)
   [junit4]    > at net.sf.cglib.core.KeyFactory.create(KeyFactory.java:108)
   [junit4]    > at net.sf.cglib.core.KeyFactory.create(KeyFactory.java:104)
   [junit4]    > at net.sf.cglib.proxy.Enhancer.<clinit>(Enhancer.java:69)
   [junit4]    > at org.easymock.internal.ClassProxyFactory.createEnhancer(ClassProxyFactory.java:259)
   [junit4]    > at org.easymock.internal.ClassProxyFactory.createProxy(ClassProxyFactory.java:174)
   [junit4]    > at org.easymock.internal.MocksControl.createMock(MocksControl.java:60)
   [junit4]    > at org.easymock.EasyMock.createMock(EasyMock.java:104)
   [junit4]    > at org.apache.solr.handler.admin.TestCoreAdminApis.getCoreContainerMock(TestCoreAdminApis.java:83)
   [junit4]    > at org.apache.solr.handler.admin.TestApiFramework.testFramework(TestApiFramework.java:59)
   [junit4]    > at java.base/jdk.internal.reflect.NativeMethodAccessorImpl.invoke0(Native Method)
   [junit4]    > at java.base/jdk.internal.reflect.NativeMethodAccessorImpl.invoke(NativeMethodAccessorImpl.java:62)
   [junit4]    > at java.base/jdk.internal.reflect.DelegatingMethodAccessorImpl.invoke(DelegatingMethodAccessorImpl.java:43)
   [junit4]    > at java.base/java.lang.reflect.Method.invoke(Method.java:543)
   [junit4]    > at java.base/java.lang.Thread.run(Thread.java:844)
   [junit4]    > Caused by: java.lang.reflect.InaccessibleObjectException: Unable to make protected final java.lang.Class java.lang.ClassLoader.defineClass(java.lang.String,byte[],int,int,java.security.ProtectionDomain) throws java.lang.ClassFormatError accessible: module java.base does not "opens java.lang" to unnamed module @1bd7288
   [junit4]    > at java.base/java.lang.reflect.AccessibleObject.checkCanSetAccessible(AccessibleObject.java:207)
   [junit4]    > at java.base/java.lang.reflect.Method.checkCanSetAccessible(Method.java:192)
   [junit4]    > at java.base/java.lang.reflect.Method.setAccessible(Method.java:186)
   [junit4]    > at net.sf.cglib.core.ReflectUtils$2.run(ReflectUtils.java:56)
   [junit4]    > at java.base/java.security.AccessController.doPrivileged(Native Method)
   [junit4]    > at net.sf.cglib.core.ReflectUtils.<clinit>(ReflectUtils.java:46)
   [junit4]    > ... 52 more
   [junit4]   2> 1127974 INFO  (TEST-TestApiFramework.testTrailingTemplatePaths-seed#[1CCAFBD1B6E5450F]) [    ] o.a.s.SolrTestCaseJ4 ###Starting testTrailingTemplatePaths
   [junit4]   2> 1127975 INFO  (TEST-TestApiFramework.testTrailingTemplatePaths-seed#[1CCAFBD1B6E5450F]) [    ] o.a.s.SolrTestCaseJ4 ###Ending testTrailingTemplatePaths
   [junit4]   2> 1127975 INFO  (SUITE-TestApiFramework-seed#[1CCAFBD1B6E5450F]-worker) [    ] o.a.s.SolrTestCaseJ4 ###deleteCore
   [junit4]   2> NOTE: leaving temporary files on disk at: /home/jenkins/workspace/Lucene-Solr-6.x-Linux/solr/build/solr-core/test/J1/temp/solr.handler.admin.TestApiFramework_1CCAFBD1B6E5450F-001
   [junit4]   2> NOTE: test params are: codec=Asserting(Lucene62): {}, docValues:{}, maxPointsInLeafNode=1883, maxMBSortInHeap=5.249065716753328, sim=RandomSimilarity(queryNorm=true,coord=no): {}, locale=en-CM, timezone=America/Argentina/San_Luis
   [junit4]   2> NOTE: Linux 4.4.0-53-generic i386/Oracle Corporation 9-ea (32-bit)/cpus=12,threads=1,free=201149840,total=330649600
   [junit4]   2> NOTE: All tests run in this JVM: [BigEndianAscendingWordSerializerTest, TestInitParams, CoreMergeIndexesAdminHandlerTest, TestOverriddenPrefixQueryForCustomFieldType, DistributedIntervalFacetingTest, TestMaxScoreQueryParser, CopyFieldTest, TestSchemaManager, RestartWhileUpdatingTest, ZkControllerTest, TestCursorMarkWithoutUniqueKey, SharedFSAutoReplicaFailoverUtilsTest, TestSolrCloudWithKerberosAlt, ParsingFieldUpdateProcessorsTest, SolrIndexConfigTest, RequestLoggingTest, TestSurroundQueryParser, DistribDocExpirationUpdateProcessorTest, TestLuceneMatchVersion, DistributedVersionInfoTest, TestSubQueryTransformerDistrib, TestCollectionAPI, TestWordDelimiterFilterFactory, TestBM25SimilarityFactory, ChaosMonkeySafeLeaderTest, TestLMDirichletSimilarityFactory, EchoParamsTest, SolrIndexSplitterTest, SortByFunctionTest, TermVectorComponentTest, TestOnReconnectListenerSupport, TestFieldCacheVsDocValues, OverseerModifyCollectionTest, TestChildDocTransformer, TlogReplayBufferedWhileIndexingTest, DeleteShardTest, TestSolrXml, TestShardHandlerFactory, SpatialFilterTest, TestCustomDocTransformer, BlobRepositoryCloudTest, SolrInfoMBeanTest, FileUtilsTest, AddBlockUpdateTest, TestBulkSchemaConcurrent, TestPivotHelperCode, SpellCheckComponentTest, BlockJoinFacetDistribTest, RemoteQueryErrorTest, TestClusterStateMutator, TestExactStatsCache, TestClassicSimilarityFactory, TestFieldCacheSanityChecker, SolrGraphiteReporterTest, TestCollapseQParserPlugin, TestDynamicFieldResource, TestObjectReleaseTracker, JSONWriterTest, HdfsDirectoryFactoryTest, TestSolrConfigHandlerCloud, V2ApiIntegrationTest, TestRequestStatusCollectionAPI, FacetPivotSmallTest, TestOrdValues, TestStressLiveNodes, TestIntervalFaceting, SolrCmdDistributorTest, TestNumericTerms32, HttpPartitionTest, TestUniqueKeyFieldResource, TestUpdate, TestReloadDeadlock, SaslZkACLProviderTest, TestDefaultStatsCache, CollectionsAPIDistributedZkTest, TestRawResponseWriter, BufferStoreTest, TestCoreAdminApis, WordBreakSolrSpellCheckerTest, CdcrVersionReplicationTest, TestFastOutputStream, WrapperMergePolicyFactoryTest, HdfsChaosMonkeySafeLeaderTest, TestImpersonationWithHadoopAuth, DocumentBuilderTest, TestHdfsBackupRestoreCore, TestRebalanceLeaders, TestGraphTermsQParserPlugin, SuggestComponentTest, FullHLLTest, SpellingQueryConverterTest, SortSpecParsingTest, TestManagedSchemaAPI, BadCopyFieldTest, TestSmileRequest, SimplePostToolTest, HdfsRecoverLeaseTest, SoftAutoCommitTest, TestConfigSets, TestSerializedLuceneMatchVersion, BasicFunctionalityTest, TestTrieFacet, TestBlendedInfixSuggestions, ClassificationUpdateProcessorFactoryTest, URLClassifyProcessorTest, TestSchemaResource, TestHdfsCloudBackupRestore, HdfsSyncSliceTest, TestSystemIdResolver, SampleTest, CloneFieldUpdateProcessorFactoryTest, TestApiFramework]
   [junit4] Completed [288/692 (1!)] on J1 in 0.06s, 2 tests, 1 error <<< FAILURES!

[...truncated 1332 lines...]
   [junit4] JVM J1: stderr was not empty, see: /home/jenkins/workspace/Lucene-Solr-6.x-Linux/solr/build/solr-core/test/temp/junit4-J1-20170217_122443_2712167465956726174470.syserr
   [junit4] >>> JVM J1 emitted unexpected output (verbatim) ----
   [junit4] Java HotSpot(TM) Server VM warning: Option UseConcMarkSweepGC was deprecated in version 9.0 and will likely be removed in a future release.
   [junit4] <<< JVM J1: EOF ----

[...truncated 3 lines...]
   [junit4] JVM J2: stderr was not empty, see: /home/jenkins/workspace/Lucene-Solr-6.x-Linux/solr/build/solr-core/test/temp/junit4-J2-20170217_122443_27113452445416032178839.syserr
   [junit4] >>> JVM J2 emitted unexpected output (verbatim) ----
   [junit4] Java HotSpot(TM) Server VM warning: Option UseConcMarkSweepGC was deprecated in version 9.0 and will likely be removed in a future release.
   [junit4] <<< JVM J2: EOF ----

[...truncated 3 lines...]
   [junit4] JVM J0: stderr was not empty, see: /home/jenkins/workspace/Lucene-Solr-6.x-Linux/solr/build/solr-core/test/temp/junit4-J0-20170217_122443_27115876042902164545189.syserr
   [junit4] >>> JVM J0 emitted unexpected output (verbatim) ----
   [junit4] Java HotSpot(TM) Server VM warning: Option UseConcMarkSweepGC was deprecated in version 9.0 and will likely be removed in a future release.
   [junit4] <<< JVM J0: EOF ----

[...truncated 731 lines...]
   [junit4] JVM J0: stderr was not empty, see: /home/jenkins/workspace/Lucene-Solr-6.x-Linux/solr/build/solr-solrj/test/temp/junit4-J0-20170217_130819_4324496227642329829232.syserr
   [junit4] >>> JVM J0 emitted unexpected output (verbatim) ----
   [junit4] Java HotSpot(TM) Server VM warning: Option UseConcMarkSweepGC was deprecated in version 9.0 and will likely be removed in a future release.
   [junit4] <<< JVM J0: EOF ----

[...truncated 3 lines...]
   [junit4] JVM J2: stderr was not empty, see: /home/jenkins/workspace/Lucene-Solr-6.x-Linux/solr/build/solr-solrj/test/temp/junit4-J2-20170217_130819_432772543671857836261.syserr
   [junit4] >>> JVM J2 emitted unexpected output (verbatim) ----
   [junit4] Java HotSpot(TM) Server VM warning: Option UseConcMarkSweepGC was deprecated in version 9.0 and will likely be removed in a future release.
   [junit4] <<< JVM J2: EOF ----

[...truncated 3 lines...]
   [junit4] JVM J1: stderr was not empty, see: /home/jenkins/workspace/Lucene-Solr-6.x-Linux/solr/build/solr-solrj/test/temp/junit4-J1-20170217_130819_43214643699449270558457.syserr
   [junit4] >>> JVM J1 emitted unexpected output (verbatim) ----
   [junit4] Java HotSpot(TM) Server VM warning: Option UseConcMarkSweepGC was deprecated in version 9.0 and will likely be removed in a future release.
   [junit4] <<< JVM J1: EOF ----

[...truncated 1235 lines...]
   [junit4] JVM J1: stderr was not empty, see: /home/jenkins/workspace/Lucene-Solr-6.x-Linux/solr/build/contrib/solr-analysis-extras/test/temp/junit4-J1-20170217_131220_0017411492260266793590.syserr
   [junit4] >>> JVM J1 emitted unexpected output (verbatim) ----
   [junit4] Java HotSpot(TM) Server VM warning: Option UseConcMarkSweepGC was deprecated in version 9.0 and will likely be removed in a future release.
   [junit4] <<< JVM J1: EOF ----

[...truncated 3 lines...]
   [junit4] JVM J0: stderr was not empty, see: /home/jenkins/workspace/Lucene-Solr-6.x-Linux/solr/build/contrib/solr-analysis-extras/test/temp/junit4-J0-20170217_131220_00114139238253780110831.syserr
   [junit4] >>> JVM J0 emitted unexpected output (verbatim) ----
   [junit4] Java HotSpot(TM) Server VM warning: Option UseConcMarkSweepGC was deprecated in version 9.0 and will likely be removed in a future release.
   [junit4] <<< JVM J0: EOF ----

[...truncated 3 lines...]
   [junit4] JVM J2: stderr was not empty, see: /home/jenkins/workspace/Lucene-Solr-6.x-Linux/solr/build/contrib/solr-analysis-extras/test/temp/junit4-J2-20170217_131220_0015495311052697146914.syserr
   [junit4] >>> JVM J2 emitted unexpected output (verbatim) ----
   [junit4] Java HotSpot(TM) Server VM warning: Option UseConcMarkSweepGC was deprecated in version 9.0 and will likely be removed in a future release.
   [junit4] <<< JVM J2: EOF ----

[...truncated 520 lines...]
   [junit4] JVM J1: stderr was not empty, see: /home/jenkins/workspace/Lucene-Solr-6.x-Linux/solr/build/contrib/solr-analytics/test/temp/junit4-J1-20170217_131230_4309440728047193536011.syserr
   [junit4] >>> JVM J1 emitted unexpected output (verbatim) ----
   [junit4] Java HotSpot(TM) Server VM warning: Option UseConcMarkSweepGC was deprecated in version 9.0 and will likely be removed in a future release.
   [junit4] <<< JVM J1: EOF ----

[...truncated 3 lines...]
   [junit4] JVM J0: stderr was not empty, see: /home/jenkins/workspace/Lucene-Solr-6.x-Linux/solr/build/contrib/solr-analytics/test/temp/junit4-J0-20170217_131230_43013383295141994796427.syserr
   [junit4] >>> JVM J0 emitted unexpected output (verbatim) ----
   [junit4] Java HotSpot(TM) Server VM warning: Option UseConcMarkSweepGC was deprecated in version 9.0 and will likely be removed in a future release.
   [junit4] <<< JVM J0: EOF ----

[...truncated 3 lines...]
   [junit4] JVM J2: stderr was not empty, see: /home/jenkins/workspace/Lucene-Solr-6.x-Linux/solr/build/contrib/solr-analytics/test/temp/junit4-J2-20170217_131230_43011903197181106088527.syserr
   [junit4] >>> JVM J2 emitted unexpected output (verbatim) ----
   [junit4] Java HotSpot(TM) Server VM warning: Option UseConcMarkSweepGC was deprecated in version 9.0 and will likely be removed in a future release.
   [junit4] <<< JVM J2: EOF ----

[...truncated 499 lines...]
   [junit4] JVM J2: stderr was not empty, see: /home/jenkins/workspace/Lucene-Solr-6.x-Linux/solr/build/contrib/solr-clustering/test/temp/junit4-J2-20170217_131246_33916367069311700511785.syserr
   [junit4] >>> JVM J2 emitted unexpected output (verbatim) ----
   [junit4] Java HotSpot(TM) Server VM warning: Option UseConcMarkSweepGC was deprecated in version 9.0 and will likely be removed in a future release.
   [junit4] <<< JVM J2: EOF ----

[...truncated 3 lines...]
   [junit4] JVM J1: stderr was not empty, see: /home/jenkins/workspace/Lucene-Solr-6.x-Linux/solr/build/contrib/solr-clustering/test/temp/junit4-J1-20170217_131246_33818392621787117221375.syserr
   [junit4] >>> JVM J1 emitted unexpected output (verbatim) ----
   [junit4] Java HotSpot(TM) Server VM warning: Option UseConcMarkSweepGC was deprecated in version 9.0 and will likely be removed in a future release.
   [junit4] <<< JVM J1: EOF ----

[...truncated 3 lines...]
   [junit4] JVM J0: stderr was not empty, see: /home/jenkins/workspace/Lucene-Solr-6.x-Linux/solr/build/contrib/solr-clustering/test/temp/junit4-J0-20170217_131246_33816967305719582935655.syserr
   [junit4] >>> JVM J0 emitted unexpected output (verbatim) ----
   [junit4] Java HotSpot(TM) Server VM warning: Option UseConcMarkSweepGC was deprecated in version 9.0 and will likely be removed in a future release.
   [junit4] <<< JVM J0: EOF ----

[...truncated 1134 lines...]
   [junit4] JVM J1: stderr was not empty, see: /home/jenkins/workspace/Lucene-Solr-6.x-Linux/solr/build/contrib/solr-dataimporthandler-extras/test/temp/junit4-J1-20170217_131311_2784005845829400166522.syserr
   [junit4] >>> JVM J1 emitted unexpected output (verbatim) ----
   [junit4] Java HotSpot(TM) Server VM warning: Option UseConcMarkSweepGC was deprecated in version 9.0 and will likely be removed in a future release.
   [junit4] <<< JVM J1: EOF ----

[...truncated 3 lines...]
   [junit4] JVM J0: stderr was not empty, see: /home/jenkins/workspace/Lucene-Solr-6.x-Linux/solr/build/contrib/solr-dataimporthandler-extras/test/temp/junit4-J0-20170217_131311_2778905632448975281942.syserr
   [junit4] >>> JVM J0 emitted unexpected output (verbatim) ----
   [junit4] Java HotSpot(TM) Server VM warning: Option UseConcMarkSweepGC was deprecated in version 9.0 and will likely be removed in a future release.
   [junit4] <<< JVM J0: EOF ----

[...truncated 593 lines...]
   [junit4] JVM J2: stderr was not empty, see: /home/jenkins/workspace/Lucene-Solr-6.x-Linux/solr/build/contrib/solr-dataimporthandler/test/temp/junit4-J2-20170217_131321_7574113811309662980476.syserr
   [junit4] >>> JVM J2 emitted unexpected output (verbatim) ----
   [junit4] Java HotSpot(TM) Server VM warning: Option UseConcMarkSweepGC was deprecated in version 9.0 and will likely be removed in a future release.
   [junit4] <<< JVM J2: EOF ----

   [junit4] JVM J1: stderr was not empty, see: /home/jenkins/workspace/Lucene-Solr-6.x-Linux/solr/build/contrib/solr-dataimporthandler/test/temp/junit4-J1-20170217_131321_7573387520706835883317.syserr
   [junit4] >>> JVM J1 emitted unexpected output (verbatim) ----
   [junit4] Java HotSpot(TM) Server VM warning: Option UseConcMarkSweepGC was deprecated in version 9.0 and will likely be removed in a future release.
   [junit4] <<< JVM J1: EOF ----

[...truncated 3 lines...]
   [junit4] JVM J0: stderr was not empty, see: /home/jenkins/workspace/Lucene-Solr-6.x-Linux/solr/build/contrib/solr-dataimporthandler/test/temp/junit4-J0-20170217_131321_75512388322125754239221.syserr
   [junit4] >>> JVM J0 emitted unexpected output (verbatim) ----
   [junit4] Java HotSpot(TM) Server VM warning: Option UseConcMarkSweepGC was deprecated in version 9.0 and will likely be removed in a future release.
   [junit4] <<< JVM J0: EOF ----

[...truncated 503 lines...]
   [junit4] JVM J0: stderr was not empty, see: /home/jenkins/workspace/Lucene-Solr-6.x-Linux/solr/build/contrib/solr-cell/test/temp/junit4-J0-20170217_131350_88112969025343038103264.syserr
   [junit4] >>> JVM J0 emitted unexpected output (verbatim) ----
   [junit4] Java HotSpot(TM) Server VM warning: Option UseConcMarkSweepGC was deprecated in version 9.0 and will likely be removed in a future release.
   [junit4] <<< JVM J0: EOF ----

[...truncated 3 lines...]
   [junit4] JVM J2: stderr was not empty, see: /home/jenkins/workspace/Lucene-Solr-6.x-Linux/solr/build/contrib/solr-cell/test/temp/junit4-J2-20170217_131350_88116733465151975923840.syserr
   [junit4] >>> JVM J2 emitted unexpected output (verbatim) ----
   [junit4] Java HotSpot(TM) Server VM warning: Option UseConcMarkSweepGC was deprecated in version 9.0 and will likely be removed in a future release.
   [junit4] <<< JVM J2: EOF ----

[...truncated 3 lines...]
   [junit4] JVM J1: stderr was not empty, see: /home/jenkins/workspace/Lucene-Solr-6.x-Linux/solr/build/contrib/solr-cell/test/temp/junit4-J1-20170217_131350_8816416216559361708739.syserr
   [junit4] >>> JVM J1 emitted unexpected output (verbatim) ----
   [junit4] Java HotSpot(TM) Server VM warning: Option UseConcMarkSweepGC was deprecated in version 9.0 and will likely be removed in a future release.
   [junit4] <<< JVM J1: EOF ----

[...truncated 504 lines...]
   [junit4] JVM J1: stderr was not empty, see: /home/jenkins/workspace/Lucene-Solr-6.x-Linux/solr/build/contrib/solr-langid/test/temp/junit4-J1-20170217_131405_8409205167453488366210.syserr
   [junit4] >>> JVM J1 emitted unexpected output (verbatim) ----
   [junit4] Java HotSpot(TM) Server VM warning: Option UseConcMarkSweepGC was deprecated in version 9.0 and will likely be removed in a future release.
   [junit4] <<< JVM J1: EOF ----

[...truncated 3 lines...]
   [junit4] JVM J0: stderr was not empty, see: /home/jenkins/workspace/Lucene-Solr-6.x-Linux/solr/build/contrib/solr-langid/test/temp/junit4-J0-20170217_131405_84012458417568820542333.syserr
   [junit4] >>> JVM J0 emitted unexpected output (verbatim) ----
   [junit4] Java HotSpot(TM) Server VM warning: Option UseConcMarkSweepGC was deprecated in version 9.0 and will likely be removed in a future release.
   [junit4] <<< JVM J0: EOF ----

[...truncated 590 lines...]
   [junit4] JVM J0: stderr was not empty, see: /home/jenkins/workspace/Lucene-Solr-6.x-Linux/solr/build/contrib/solr-ltr/test/temp/junit4-J0-20170217_131415_1892381433816286747939.syserr
   [junit4] >>> JVM J0 emitted unexpected output (verbatim) ----
   [junit4] Java HotSpot(TM) Server VM warning: Option UseConcMarkSweepGC was deprecated in version 9.0 and will likely be removed in a future release.
   [junit4] <<< JVM J0: EOF ----

[...truncated 3 lines...]
   [junit4] JVM J2: stderr was not empty, see: /home/jenkins/workspace/Lucene-Solr-6.x-Linux/solr/build/contrib/solr-ltr/test/temp/junit4-J2-20170217_131415_1897731060669205525917.syserr
   [junit4] >>> JVM J2 emitted unexpected output (verbatim) ----
   [junit4] Java HotSpot(TM) Server VM warning: Option UseConcMarkSweepGC was deprecated in version 9.0 and will likely be removed in a future release.
   [junit4] <<< JVM J2: EOF ----

[...truncated 3 lines...]
   [junit4] JVM J1: stderr was not empty, see: /home/jenkins/workspace/Lucene-Solr-6.x-Linux/solr/build/contrib/solr-ltr/test/temp/junit4-J1-20170217_131415_18911044288456218993272.syserr
   [junit4] >>> JVM J1 emitted unexpected output (verbatim) ----
   [junit4] Java HotSpot(TM) Server VM warning: Option UseConcMarkSweepGC was deprecated in version 9.0 and will likely be removed in a future release.
   [junit4] <<< JVM J1: EOF ----

[...truncated 2200 lines...]
   [junit4] JVM J2: stderr was not empty, see: /home/jenkins/workspace/Lucene-Solr-6.x-Linux/solr/build/contrib/solr-map-reduce/test/temp/junit4-J2-20170217_131502_62016891624406454226948.syserr
   [junit4] >>> JVM J2 emitted unexpected output (verbatim) ----
   [junit4] Java HotSpot(TM) Server VM warning: Option UseConcMarkSweepGC was deprecated in version 9.0 and will likely be removed in a future release.
   [junit4] <<< JVM J2: EOF ----

[...truncated 3 lines...]
   [junit4] JVM J0: stderr was not empty, see: /home/jenkins/workspace/Lucene-Solr-6.x-Linux/solr/build/contrib/solr-map-reduce/test/temp/junit4-J0-20170217_131502_62013276046010250570714.syserr
   [junit4] >>> JVM J0 emitted unexpected output (verbatim) ----
   [junit4] Java HotSpot(TM) Server VM warning: Option UseConcMarkSweepGC was deprecated in version 9.0 and will likely be removed in a future release.
   [junit4] <<< JVM J0: EOF ----

[...truncated 3 lines...]
   [junit4] JVM J1: stderr was not empty, see: /home/jenkins/workspace/Lucene-Solr-6.x-Linux/solr/build/contrib/solr-map-reduce/test/temp/junit4-J1-20170217_131502_6209529359654764471443.syserr
   [junit4] >>> JVM J1 emitted unexpected output (verbatim) ----
   [junit4] Java HotSpot(TM) Server VM warning: Option UseConcMarkSweepGC was deprecated in version 9.0 and will likely be removed in a future release.
   [junit4] <<< JVM J1: EOF ----

[...truncated 1429 lines...]
   [junit4] JVM J0: stderr was not empty, see: /home/jenkins/workspace/Lucene-Solr-6.x-Linux/solr/build/contrib/solr-morphlines-cell/test/temp/junit4-J0-20170217_131515_7944010490656919147979.syserr
   [junit4] >>> JVM J0 emitted unexpected output (verbatim) ----
   [junit4] Java HotSpot(TM) Server VM warning: Option UseConcMarkSweepGC was deprecated in version 9.0 and will likely be removed in a future release.
   [junit4] <<< JVM J0: EOF ----

[...truncated 666 lines...]
   [junit4] JVM J0: stderr was not empty, see: /home/jenkins/workspace/Lucene-Solr-6.x-Linux/solr/build/contrib/solr-morphlines-core/test/temp/junit4-J0-20170217_131522_10817426991704875301324.syserr
   [junit4] >>> JVM J0 emitted unexpected output (verbatim) ----
   [junit4] Java HotSpot(TM) Server VM warning: Option UseConcMarkSweepGC was deprecated in version 9.0 and will likely be removed in a future release.
   [junit4] <<< JVM J0: EOF ----

[...truncated 3 lines...]
   [junit4] JVM J2: stderr was not empty, see: /home/jenkins/workspace/Lucene-Solr-6.x-Linux/solr/build/contrib/solr-morphlines-core/test/temp/junit4-J2-20170217_131522_1099652762566663221080.syserr
   [junit4] >>> JVM J2 emitted unexpected output (verbatim) ----
   [junit4] Java HotSpot(TM) Server VM warning: Option UseConcMarkSweepGC was deprecated in version 9.0 and will likely be removed in a future release.
   [junit4] <<< JVM J2: EOF ----

[...truncated 3 lines...]
   [junit4] JVM J1: stderr was not empty, see: /home/jenkins/workspace/Lucene-Solr-6.x-Linux/solr/build/contrib/solr-morphlines-core/test/temp/junit4-J1-20170217_131522_1098687275660498394504.syserr
   [junit4] >>> JVM J1 emitted unexpected output (verbatim) ----
   [junit4] Java HotSpot(TM) Server VM warning: Option UseConcMarkSweepGC was deprecated in version 9.0 and will likely be removed in a future release.
   [junit4] <<< JVM J1: EOF ----

[...truncated 537 lines...]
   [junit4] JVM J1: stderr was not empty, see: /home/jenkins/workspace/Lucene-Solr-6.x-Linux/solr/build/contrib/solr-uima/test/temp/junit4-J1-20170217_131545_14818037587506446660031.syserr
   [junit4] >>> JVM J1 emitted unexpected output (verbatim) ----
   [junit4] Java HotSpot(TM) Server VM warning: Option UseConcMarkSweepGC was deprecated in version 9.0 and will likely be removed in a future release.
   [junit4] <<< JVM J1: EOF ----

[...truncated 3 lines...]
   [junit4] JVM J0: stderr was not empty, see: /home/jenkins/workspace/Lucene-Solr-6.x-Linux/solr/build/contrib/solr-uima/test/temp/junit4-J0-20170217_131545_14714971866139918152559.syserr
   [junit4] >>> JVM J0 emitted unexpected output (verbatim) ----
   [junit4] Java HotSpot(TM) Server VM warning: Option UseConcMarkSweepGC was deprecated in version 9.0 and will likely be removed in a future release.
   [junit4] <<< JVM J0: EOF ----

[...truncated 494 lines...]
   [junit4] JVM J0: stderr was not empty, see: /home/jenkins/workspace/Lucene-Solr-6.x-Linux/solr/build/contrib/solr-velocity/test/temp/junit4-J0-20170217_131600_56110549110714520960085.syserr
   [junit4] >>> JVM J0 emitted unexpected output (verbatim) ----
   [junit4] Java HotSpot(TM) Server VM warning: Option UseConcMarkSweepGC was deprecated in version 9.0 and will likely be removed in a future release.
   [junit4] <<< JVM J0: EOF ----

[...truncated 39977 lines...]



---------------------------------------------------------------------
To unsubscribe, e-mail: [hidden email]
For additional commands, e-mail: [hidden email]
Reply | Threaded
Open this post in threaded view
|

[JENKINS-EA] Lucene-Solr-6.x-Linux (64bit/jdk-9-ea+155) - Build # 2877 - Still Unstable!

Policeman Jenkins Server-2
Build: https://jenkins.thetaphi.de/job/Lucene-Solr-6.x-Linux/2877/
Java: 64bit/jdk-9-ea+155 -XX:-UseCompressedOops -XX:+UseSerialGC

1 tests failed.
FAILED:  org.apache.solr.handler.admin.TestApiFramework.testFramework

Error Message:


Stack Trace:
java.lang.ExceptionInInitializerError
        at __randomizedtesting.SeedInfo.seed([69F7EC32E9531449:7E812615EF87F874]:0)
        at net.sf.cglib.core.KeyFactory$Generator.generateClass(KeyFactory.java:166)
        at net.sf.cglib.core.DefaultGeneratorStrategy.generate(DefaultGeneratorStrategy.java:25)
        at net.sf.cglib.core.AbstractClassGenerator.create(AbstractClassGenerator.java:216)
        at net.sf.cglib.core.KeyFactory$Generator.create(KeyFactory.java:144)
        at net.sf.cglib.core.KeyFactory.create(KeyFactory.java:116)
        at net.sf.cglib.core.KeyFactory.create(KeyFactory.java:108)
        at net.sf.cglib.core.KeyFactory.create(KeyFactory.java:104)
        at net.sf.cglib.proxy.Enhancer.<clinit>(Enhancer.java:69)
        at org.easymock.internal.ClassProxyFactory.createEnhancer(ClassProxyFactory.java:259)
        at org.easymock.internal.ClassProxyFactory.createProxy(ClassProxyFactory.java:174)
        at org.easymock.internal.MocksControl.createMock(MocksControl.java:60)
        at org.easymock.EasyMock.createMock(EasyMock.java:104)
        at org.apache.solr.handler.admin.TestCoreAdminApis.getCoreContainerMock(TestCoreAdminApis.java:83)
        at org.apache.solr.handler.admin.TestApiFramework.testFramework(TestApiFramework.java:59)
        at java.base/jdk.internal.reflect.NativeMethodAccessorImpl.invoke0(Native Method)
        at java.base/jdk.internal.reflect.NativeMethodAccessorImpl.invoke(NativeMethodAccessorImpl.java:62)
        at java.base/jdk.internal.reflect.DelegatingMethodAccessorImpl.invoke(DelegatingMethodAccessorImpl.java:43)
        at java.base/java.lang.reflect.Method.invoke(Method.java:543)
        at com.carrotsearch.randomizedtesting.RandomizedRunner.invoke(RandomizedRunner.java:1713)
        at com.carrotsearch.randomizedtesting.RandomizedRunner$8.evaluate(RandomizedRunner.java:907)
        at com.carrotsearch.randomizedtesting.RandomizedRunner$9.evaluate(RandomizedRunner.java:943)
        at com.carrotsearch.randomizedtesting.RandomizedRunner$10.evaluate(RandomizedRunner.java:957)
        at com.carrotsearch.randomizedtesting.rules.SystemPropertiesRestoreRule$1.evaluate(SystemPropertiesRestoreRule.java:57)
        at org.apache.lucene.util.TestRuleSetupTeardownChained$1.evaluate(TestRuleSetupTeardownChained.java:49)
        at org.apache.lucene.util.AbstractBeforeAfterRule$1.evaluate(AbstractBeforeAfterRule.java:45)
        at org.apache.lucene.util.TestRuleThreadAndTestName$1.evaluate(TestRuleThreadAndTestName.java:48)
        at org.apache.lucene.util.TestRuleIgnoreAfterMaxFailures$1.evaluate(TestRuleIgnoreAfterMaxFailures.java:64)
        at org.apache.lucene.util.TestRuleMarkFailure$1.evaluate(TestRuleMarkFailure.java:47)
        at com.carrotsearch.randomizedtesting.rules.StatementAdapter.evaluate(StatementAdapter.java:36)
        at com.carrotsearch.randomizedtesting.ThreadLeakControl$StatementRunner.run(ThreadLeakControl.java:368)
        at com.carrotsearch.randomizedtesting.ThreadLeakControl.forkTimeoutingTask(ThreadLeakControl.java:817)
        at com.carrotsearch.randomizedtesting.ThreadLeakControl$3.evaluate(ThreadLeakControl.java:468)
        at com.carrotsearch.randomizedtesting.RandomizedRunner.runSingleTest(RandomizedRunner.java:916)
        at com.carrotsearch.randomizedtesting.RandomizedRunner$5.evaluate(RandomizedRunner.java:802)
        at com.carrotsearch.randomizedtesting.RandomizedRunner$6.evaluate(RandomizedRunner.java:852)
        at com.carrotsearch.randomizedtesting.RandomizedRunner$7.evaluate(RandomizedRunner.java:863)
        at com.carrotsearch.randomizedtesting.rules.StatementAdapter.evaluate(StatementAdapter.java:36)
        at com.carrotsearch.randomizedtesting.rules.SystemPropertiesRestoreRule$1.evaluate(SystemPropertiesRestoreRule.java:57)
        at org.apache.lucene.util.AbstractBeforeAfterRule$1.evaluate(AbstractBeforeAfterRule.java:45)
        at com.carrotsearch.randomizedtesting.rules.StatementAdapter.evaluate(StatementAdapter.java:36)
        at org.apache.lucene.util.TestRuleStoreClassName$1.evaluate(TestRuleStoreClassName.java:41)
        at com.carrotsearch.randomizedtesting.rules.NoShadowingOrOverridesOnMethodsRule$1.evaluate(NoShadowingOrOverridesOnMethodsRule.java:40)
        at com.carrotsearch.randomizedtesting.rules.NoShadowingOrOverridesOnMethodsRule$1.evaluate(NoShadowingOrOverridesOnMethodsRule.java:40)
        at com.carrotsearch.randomizedtesting.rules.StatementAdapter.evaluate(StatementAdapter.java:36)
        at com.carrotsearch.randomizedtesting.rules.StatementAdapter.evaluate(StatementAdapter.java:36)
        at org.apache.lucene.util.TestRuleAssertionsRequired$1.evaluate(TestRuleAssertionsRequired.java:53)
        at org.apache.lucene.util.TestRuleMarkFailure$1.evaluate(TestRuleMarkFailure.java:47)
        at org.apache.lucene.util.TestRuleIgnoreAfterMaxFailures$1.evaluate(TestRuleIgnoreAfterMaxFailures.java:64)
        at org.apache.lucene.util.TestRuleIgnoreTestSuites$1.evaluate(TestRuleIgnoreTestSuites.java:54)
        at com.carrotsearch.randomizedtesting.rules.StatementAdapter.evaluate(StatementAdapter.java:36)
        at com.carrotsearch.randomizedtesting.ThreadLeakControl$StatementRunner.run(ThreadLeakControl.java:368)
        at java.base/java.lang.Thread.run(Thread.java:844)
Caused by: java.lang.reflect.InaccessibleObjectException: Unable to make protected final java.lang.Class java.lang.ClassLoader.defineClass(java.lang.String,byte[],int,int,java.security.ProtectionDomain) throws java.lang.ClassFormatError accessible: module java.base does not "opens java.lang" to unnamed module @6cfd58f4
        at java.base/java.lang.reflect.AccessibleObject.checkCanSetAccessible(AccessibleObject.java:207)
        at java.base/java.lang.reflect.Method.checkCanSetAccessible(Method.java:192)
        at java.base/java.lang.reflect.Method.setAccessible(Method.java:186)
        at net.sf.cglib.core.ReflectUtils$2.run(ReflectUtils.java:56)
        at java.base/java.security.AccessController.doPrivileged(Native Method)
        at net.sf.cglib.core.ReflectUtils.<clinit>(ReflectUtils.java:46)
        ... 52 more




Build Log:
[...truncated 11411 lines...]
   [junit4] Suite: org.apache.solr.handler.admin.TestApiFramework
   [junit4]   2> Creating dataDir: /home/jenkins/workspace/Lucene-Solr-6.x-Linux/solr/build/solr-core/test/J1/temp/solr.handler.admin.TestApiFramework_69F7EC32E9531449-001/init-core-data-001
   [junit4]   2> 539251 INFO  (SUITE-TestApiFramework-seed#[69F7EC32E9531449]-worker) [    ] o.a.s.SolrTestCaseJ4 Using TrieFields
   [junit4]   2> 539252 INFO  (SUITE-TestApiFramework-seed#[69F7EC32E9531449]-worker) [    ] o.a.s.SolrTestCaseJ4 Randomized ssl (false) and clientAuth (true) via: @org.apache.solr.util.RandomizeSSL(reason="", ssl=0.0/0.0, value=0.0/0.0, clientAuth=0.0/0.0)
   [junit4]   2> 539253 INFO  (TEST-TestApiFramework.testFramework-seed#[69F7EC32E9531449]) [    ] o.a.s.SolrTestCaseJ4 ###Starting testFramework
   [junit4]   2> 539290 INFO  (TEST-TestApiFramework.testFramework-seed#[69F7EC32E9531449]) [    ] o.a.s.SolrTestCaseJ4 ###Ending testFramework
   [junit4]   2> NOTE: reproduce with: ant test  -Dtestcase=TestApiFramework -Dtests.method=testFramework -Dtests.seed=69F7EC32E9531449 -Dtests.multiplier=3 -Dtests.slow=true -Dtests.locale=mg -Dtests.timezone=Canada/Pacific -Dtests.asserts=true -Dtests.file.encoding=UTF-8
   [junit4] ERROR   0.04s J1 | TestApiFramework.testFramework <<<
   [junit4]    > Throwable #1: java.lang.ExceptionInInitializerError
   [junit4]    > at __randomizedtesting.SeedInfo.seed([69F7EC32E9531449:7E812615EF87F874]:0)
   [junit4]    > at net.sf.cglib.core.KeyFactory$Generator.generateClass(KeyFactory.java:166)
   [junit4]    > at net.sf.cglib.core.DefaultGeneratorStrategy.generate(DefaultGeneratorStrategy.java:25)
   [junit4]    > at net.sf.cglib.core.AbstractClassGenerator.create(AbstractClassGenerator.java:216)
   [junit4]    > at net.sf.cglib.core.KeyFactory$Generator.create(KeyFactory.java:144)
   [junit4]    > at net.sf.cglib.core.KeyFactory.create(KeyFactory.java:116)
   [junit4]    > at net.sf.cglib.core.KeyFactory.create(KeyFactory.java:108)
   [junit4]    > at net.sf.cglib.core.KeyFactory.create(KeyFactory.java:104)
   [junit4]    > at net.sf.cglib.proxy.Enhancer.<clinit>(Enhancer.java:69)
   [junit4]    > at org.easymock.internal.ClassProxyFactory.createEnhancer(ClassProxyFactory.java:259)
   [junit4]    > at org.easymock.internal.ClassProxyFactory.createProxy(ClassProxyFactory.java:174)
   [junit4]    > at org.easymock.internal.MocksControl.createMock(MocksControl.java:60)
   [junit4]    > at org.easymock.EasyMock.createMock(EasyMock.java:104)
   [junit4]    > at org.apache.solr.handler.admin.TestCoreAdminApis.getCoreContainerMock(TestCoreAdminApis.java:83)
   [junit4]    > at org.apache.solr.handler.admin.TestApiFramework.testFramework(TestApiFramework.java:59)
   [junit4]    > at java.base/jdk.internal.reflect.NativeMethodAccessorImpl.invoke0(Native Method)
   [junit4]    > at java.base/jdk.internal.reflect.NativeMethodAccessorImpl.invoke(NativeMethodAccessorImpl.java:62)
   [junit4]    > at java.base/jdk.internal.reflect.DelegatingMethodAccessorImpl.invoke(DelegatingMethodAccessorImpl.java:43)
   [junit4]    > at java.base/java.lang.reflect.Method.invoke(Method.java:543)
   [junit4]    > at java.base/java.lang.Thread.run(Thread.java:844)
   [junit4]    > Caused by: java.lang.reflect.InaccessibleObjectException: Unable to make protected final java.lang.Class java.lang.ClassLoader.defineClass(java.lang.String,byte[],int,int,java.security.ProtectionDomain) throws java.lang.ClassFormatError accessible: module java.base does not "opens java.lang" to unnamed module @6cfd58f4
   [junit4]    > at java.base/java.lang.reflect.AccessibleObject.checkCanSetAccessible(AccessibleObject.java:207)
   [junit4]    > at java.base/java.lang.reflect.Method.checkCanSetAccessible(Method.java:192)
   [junit4]    > at java.base/java.lang.reflect.Method.setAccessible(Method.java:186)
   [junit4]    > at net.sf.cglib.core.ReflectUtils$2.run(ReflectUtils.java:56)
   [junit4]    > at java.base/java.security.AccessController.doPrivileged(Native Method)
   [junit4]    > at net.sf.cglib.core.ReflectUtils.<clinit>(ReflectUtils.java:46)
   [junit4]    > ... 52 more
   [junit4]   2> 539293 INFO  (TEST-TestApiFramework.testTrailingTemplatePaths-seed#[69F7EC32E9531449]) [    ] o.a.s.SolrTestCaseJ4 ###Starting testTrailingTemplatePaths
   [junit4]   2> 539293 INFO  (TEST-TestApiFramework.testTrailingTemplatePaths-seed#[69F7EC32E9531449]) [    ] o.a.s.SolrTestCaseJ4 ###Ending testTrailingTemplatePaths
   [junit4]   2> 539294 INFO  (SUITE-TestApiFramework-seed#[69F7EC32E9531449]-worker) [    ] o.a.s.SolrTestCaseJ4 ###deleteCore
   [junit4]   2> NOTE: leaving temporary files on disk at: /home/jenkins/workspace/Lucene-Solr-6.x-Linux/solr/build/solr-core/test/J1/temp/solr.handler.admin.TestApiFramework_69F7EC32E9531449-001
   [junit4]   2> NOTE: test params are: codec=Asserting(Lucene62): {}, docValues:{}, maxPointsInLeafNode=1682, maxMBSortInHeap=5.259192495864292, sim=RandomSimilarity(queryNorm=false,coord=yes): {}, locale=mg, timezone=Canada/Pacific
   [junit4]   2> NOTE: Linux 4.4.0-53-generic amd64/Oracle Corporation 9-ea (64-bit)/cpus=12,threads=1,free=51332000,total=509214720
   [junit4]   2> NOTE: All tests run in this JVM: [HdfsSyncSliceTest, TestExactStatsCache, TestOnReconnectListenerSupport, DateMathParserTest, TestCharFilters, MoreLikeThisHandlerTest, TestCoreAdminApis, SaslZkACLProviderTest, ConcurrentDeleteAndCreateCollectionTest, TestMiniSolrCloudCluster, HighlighterMaxOffsetTest, SolrInfoMBeanTest, TestRebalanceLeaders, HdfsBasicDistributedZk2Test, TestQuerySenderListener, TestLMDirichletSimilarityFactory, DistributedIntervalFacetingTest, TestFieldCacheSanityChecker, TestCSVResponseWriter, TestGraphTermsQParserPlugin, TestBulkSchemaConcurrent, DataDrivenBlockJoinTest, HttpPartitionTest, TestShortCircuitedRequests, TestSchemaResource, TestClassicSimilarityFactory, TestPerFieldSimilarityClassic, UpdateRequestProcessorFactoryTest, ShardRoutingTest, CollectionTooManyReplicasTest, SpatialFilterTest, TestCopyFieldCollectionResource, ParsingFieldUpdateProcessorsTest, SolrIndexConfigTest, TestHdfsCloudBackupRestore, TestHashPartitioner, TestOrdValues, WrapperMergePolicyFactoryTest, TestJsonFacetRefinement, BlockJoinFacetDistribTest, CloneFieldUpdateProcessorFactoryTest, SimplePostToolTest, TestCollapseQParserPlugin, CursorMarkTest, TestClusterStateMutator, RemoteQueryErrorTest, SchemaVersionSpecificBehaviorTest, DeleteLastCustomShardedReplicaTest, SpellCheckComponentTest, SecurityConfHandlerTest, TestApiFramework]
   [junit4] Completed [175/692 (1!)] on J1 in 0.06s, 2 tests, 1 error <<< FAILURES!

[...truncated 53376 lines...]



---------------------------------------------------------------------
To unsubscribe, e-mail: [hidden email]
For additional commands, e-mail: [hidden email]
Reply | Threaded
Open this post in threaded view
|

[JENKINS-EA] Lucene-Solr-6.x-Linux (32bit/jdk-9-ea+155) - Build # 2878 - Still Unstable!

Policeman Jenkins Server-2
Build: https://jenkins.thetaphi.de/job/Lucene-Solr-6.x-Linux/2878/
Java: 32bit/jdk-9-ea+155 -server -XX:+UseParallelGC

1 tests failed.
FAILED:  org.apache.solr.handler.admin.TestApiFramework.testFramework

Error Message:


Stack Trace:
java.lang.ExceptionInInitializerError
        at __randomizedtesting.SeedInfo.seed([3BF80788F0E02A9:14C94A5F89DAEE94]:0)
        at net.sf.cglib.core.KeyFactory$Generator.generateClass(KeyFactory.java:166)
        at net.sf.cglib.core.DefaultGeneratorStrategy.generate(DefaultGeneratorStrategy.java:25)
        at net.sf.cglib.core.AbstractClassGenerator.create(AbstractClassGenerator.java:216)
        at net.sf.cglib.core.KeyFactory$Generator.create(KeyFactory.java:144)
        at net.sf.cglib.core.KeyFactory.create(KeyFactory.java:116)
        at net.sf.cglib.core.KeyFactory.create(KeyFactory.java:108)
        at net.sf.cglib.core.KeyFactory.create(KeyFactory.java:104)
        at net.sf.cglib.proxy.Enhancer.<clinit>(Enhancer.java:69)
        at org.easymock.internal.ClassProxyFactory.createEnhancer(ClassProxyFactory.java:259)
        at org.easymock.internal.ClassProxyFactory.createProxy(ClassProxyFactory.java:174)
        at org.easymock.internal.MocksControl.createMock(MocksControl.java:60)
        at org.easymock.EasyMock.createMock(EasyMock.java:104)
        at org.apache.solr.handler.admin.TestCoreAdminApis.getCoreContainerMock(TestCoreAdminApis.java:83)
        at org.apache.solr.handler.admin.TestApiFramework.testFramework(TestApiFramework.java:59)
        at java.base/jdk.internal.reflect.NativeMethodAccessorImpl.invoke0(Native Method)
        at java.base/jdk.internal.reflect.NativeMethodAccessorImpl.invoke(NativeMethodAccessorImpl.java:62)
        at java.base/jdk.internal.reflect.DelegatingMethodAccessorImpl.invoke(DelegatingMethodAccessorImpl.java:43)
        at java.base/java.lang.reflect.Method.invoke(Method.java:543)
        at com.carrotsearch.randomizedtesting.RandomizedRunner.invoke(RandomizedRunner.java:1713)
        at com.carrotsearch.randomizedtesting.RandomizedRunner$8.evaluate(RandomizedRunner.java:907)
        at com.carrotsearch.randomizedtesting.RandomizedRunner$9.evaluate(RandomizedRunner.java:943)
        at com.carrotsearch.randomizedtesting.RandomizedRunner$10.evaluate(RandomizedRunner.java:957)
        at com.carrotsearch.randomizedtesting.rules.SystemPropertiesRestoreRule$1.evaluate(SystemPropertiesRestoreRule.java:57)
        at org.apache.lucene.util.TestRuleSetupTeardownChained$1.evaluate(TestRuleSetupTeardownChained.java:49)
        at org.apache.lucene.util.AbstractBeforeAfterRule$1.evaluate(AbstractBeforeAfterRule.java:45)
        at org.apache.lucene.util.TestRuleThreadAndTestName$1.evaluate(TestRuleThreadAndTestName.java:48)
        at org.apache.lucene.util.TestRuleIgnoreAfterMaxFailures$1.evaluate(TestRuleIgnoreAfterMaxFailures.java:64)
        at org.apache.lucene.util.TestRuleMarkFailure$1.evaluate(TestRuleMarkFailure.java:47)
        at com.carrotsearch.randomizedtesting.rules.StatementAdapter.evaluate(StatementAdapter.java:36)
        at com.carrotsearch.randomizedtesting.ThreadLeakControl$StatementRunner.run(ThreadLeakControl.java:368)
        at com.carrotsearch.randomizedtesting.ThreadLeakControl.forkTimeoutingTask(ThreadLeakControl.java:817)
        at com.carrotsearch.randomizedtesting.ThreadLeakControl$3.evaluate(ThreadLeakControl.java:468)
        at com.carrotsearch.randomizedtesting.RandomizedRunner.runSingleTest(RandomizedRunner.java:916)
        at com.carrotsearch.randomizedtesting.RandomizedRunner$5.evaluate(RandomizedRunner.java:802)
        at com.carrotsearch.randomizedtesting.RandomizedRunner$6.evaluate(RandomizedRunner.java:852)
        at com.carrotsearch.randomizedtesting.RandomizedRunner$7.evaluate(RandomizedRunner.java:863)
        at com.carrotsearch.randomizedtesting.rules.StatementAdapter.evaluate(StatementAdapter.java:36)
        at com.carrotsearch.randomizedtesting.rules.SystemPropertiesRestoreRule$1.evaluate(SystemPropertiesRestoreRule.java:57)
        at org.apache.lucene.util.AbstractBeforeAfterRule$1.evaluate(AbstractBeforeAfterRule.java:45)
        at com.carrotsearch.randomizedtesting.rules.StatementAdapter.evaluate(StatementAdapter.java:36)
        at org.apache.lucene.util.TestRuleStoreClassName$1.evaluate(TestRuleStoreClassName.java:41)
        at com.carrotsearch.randomizedtesting.rules.NoShadowingOrOverridesOnMethodsRule$1.evaluate(NoShadowingOrOverridesOnMethodsRule.java:40)
        at com.carrotsearch.randomizedtesting.rules.NoShadowingOrOverridesOnMethodsRule$1.evaluate(NoShadowingOrOverridesOnMethodsRule.java:40)
        at com.carrotsearch.randomizedtesting.rules.StatementAdapter.evaluate(StatementAdapter.java:36)
        at com.carrotsearch.randomizedtesting.rules.StatementAdapter.evaluate(StatementAdapter.java:36)
        at org.apache.lucene.util.TestRuleAssertionsRequired$1.evaluate(TestRuleAssertionsRequired.java:53)
        at org.apache.lucene.util.TestRuleMarkFailure$1.evaluate(TestRuleMarkFailure.java:47)
        at org.apache.lucene.util.TestRuleIgnoreAfterMaxFailures$1.evaluate(TestRuleIgnoreAfterMaxFailures.java:64)
        at org.apache.lucene.util.TestRuleIgnoreTestSuites$1.evaluate(TestRuleIgnoreTestSuites.java:54)
        at com.carrotsearch.randomizedtesting.rules.StatementAdapter.evaluate(StatementAdapter.java:36)
        at com.carrotsearch.randomizedtesting.ThreadLeakControl$StatementRunner.run(ThreadLeakControl.java:368)
        at java.base/java.lang.Thread.run(Thread.java:844)
Caused by: java.lang.reflect.InaccessibleObjectException: Unable to make protected final java.lang.Class java.lang.ClassLoader.defineClass(java.lang.String,byte[],int,int,java.security.ProtectionDomain) throws java.lang.ClassFormatError accessible: module java.base does not "opens java.lang" to unnamed module @cceeb7
        at java.base/java.lang.reflect.AccessibleObject.checkCanSetAccessible(AccessibleObject.java:207)
        at java.base/java.lang.reflect.Method.checkCanSetAccessible(Method.java:192)
        at java.base/java.lang.reflect.Method.setAccessible(Method.java:186)
        at net.sf.cglib.core.ReflectUtils$2.run(ReflectUtils.java:56)
        at java.base/java.security.AccessController.doPrivileged(Native Method)
        at net.sf.cglib.core.ReflectUtils.<clinit>(ReflectUtils.java:46)
        ... 52 more




Build Log:
[...truncated 11273 lines...]
   [junit4] Suite: org.apache.solr.handler.admin.TestApiFramework
   [junit4]   2> Creating dataDir: /home/jenkins/workspace/Lucene-Solr-6.x-Linux/solr/build/solr-core/test/J1/temp/solr.handler.admin.TestApiFramework_3BF80788F0E02A9-001/init-core-data-001
   [junit4]   2> 313100 INFO  (SUITE-TestApiFramework-seed#[3BF80788F0E02A9]-worker) [    ] o.a.s.SolrTestCaseJ4 Using TrieFields
   [junit4]   2> 313102 INFO  (SUITE-TestApiFramework-seed#[3BF80788F0E02A9]-worker) [    ] o.a.s.SolrTestCaseJ4 Randomized ssl (false) and clientAuth (false) via: @org.apache.solr.util.RandomizeSSL(reason="", ssl=0.0/0.0, value=0.0/0.0, clientAuth=0.0/0.0)
   [junit4]   2> 313102 INFO  (TEST-TestApiFramework.testTrailingTemplatePaths-seed#[3BF80788F0E02A9]) [    ] o.a.s.SolrTestCaseJ4 ###Starting testTrailingTemplatePaths
   [junit4]   2> 313103 INFO  (TEST-TestApiFramework.testTrailingTemplatePaths-seed#[3BF80788F0E02A9]) [    ] o.a.s.SolrTestCaseJ4 ###Ending testTrailingTemplatePaths
   [junit4]   2> 313103 INFO  (TEST-TestApiFramework.testFramework-seed#[3BF80788F0E02A9]) [    ] o.a.s.SolrTestCaseJ4 ###Starting testFramework
   [junit4]   2> 313139 INFO  (TEST-TestApiFramework.testFramework-seed#[3BF80788F0E02A9]) [    ] o.a.s.SolrTestCaseJ4 ###Ending testFramework
   [junit4]   2> NOTE: reproduce with: ant test  -Dtestcase=TestApiFramework -Dtests.method=testFramework -Dtests.seed=3BF80788F0E02A9 -Dtests.multiplier=3 -Dtests.slow=true -Dtests.locale=mas -Dtests.timezone=Pacific/Easter -Dtests.asserts=true -Dtests.file.encoding=UTF-8
   [junit4] ERROR   0.04s J1 | TestApiFramework.testFramework <<<
   [junit4]    > Throwable #1: java.lang.ExceptionInInitializerError
   [junit4]    > at __randomizedtesting.SeedInfo.seed([3BF80788F0E02A9:14C94A5F89DAEE94]:0)
   [junit4]    > at net.sf.cglib.core.KeyFactory$Generator.generateClass(KeyFactory.java:166)
   [junit4]    > at net.sf.cglib.core.DefaultGeneratorStrategy.generate(DefaultGeneratorStrategy.java:25)
   [junit4]    > at net.sf.cglib.core.AbstractClassGenerator.create(AbstractClassGenerator.java:216)
   [junit4]    > at net.sf.cglib.core.KeyFactory$Generator.create(KeyFactory.java:144)
   [junit4]    > at net.sf.cglib.core.KeyFactory.create(KeyFactory.java:116)
   [junit4]    > at net.sf.cglib.core.KeyFactory.create(KeyFactory.java:108)
   [junit4]    > at net.sf.cglib.core.KeyFactory.create(KeyFactory.java:104)
   [junit4]    > at net.sf.cglib.proxy.Enhancer.<clinit>(Enhancer.java:69)
   [junit4]    > at org.easymock.internal.ClassProxyFactory.createEnhancer(ClassProxyFactory.java:259)
   [junit4]    > at org.easymock.internal.ClassProxyFactory.createProxy(ClassProxyFactory.java:174)
   [junit4]    > at org.easymock.internal.MocksControl.createMock(MocksControl.java:60)
   [junit4]    > at org.easymock.EasyMock.createMock(EasyMock.java:104)
   [junit4]    > at org.apache.solr.handler.admin.TestCoreAdminApis.getCoreContainerMock(TestCoreAdminApis.java:83)
   [junit4]    > at org.apache.solr.handler.admin.TestApiFramework.testFramework(TestApiFramework.java:59)
   [junit4]    > at java.base/jdk.internal.reflect.NativeMethodAccessorImpl.invoke0(Native Method)
   [junit4]    > at java.base/jdk.internal.reflect.NativeMethodAccessorImpl.invoke(NativeMethodAccessorImpl.java:62)
   [junit4]    > at java.base/jdk.internal.reflect.DelegatingMethodAccessorImpl.invoke(DelegatingMethodAccessorImpl.java:43)
   [junit4]    > at java.base/java.lang.reflect.Method.invoke(Method.java:543)
   [junit4]    > at java.base/java.lang.Thread.run(Thread.java:844)
   [junit4]    > Caused by: java.lang.reflect.InaccessibleObjectException: Unable to make protected final java.lang.Class java.lang.ClassLoader.defineClass(java.lang.String,byte[],int,int,java.security.ProtectionDomain) throws java.lang.ClassFormatError accessible: module java.base does not "opens java.lang" to unnamed module @cceeb7
   [junit4]    > at java.base/java.lang.reflect.AccessibleObject.checkCanSetAccessible(AccessibleObject.java:207)
   [junit4]    > at java.base/java.lang.reflect.Method.checkCanSetAccessible(Method.java:192)
   [junit4]    > at java.base/java.lang.reflect.Method.setAccessible(Method.java:186)
   [junit4]    > at net.sf.cglib.core.ReflectUtils$2.run(ReflectUtils.java:56)
   [junit4]    > at java.base/java.security.AccessController.doPrivileged(Native Method)
   [junit4]    > at net.sf.cglib.core.ReflectUtils.<clinit>(ReflectUtils.java:46)
   [junit4]    > ... 52 more
   [junit4]   2> 313140 INFO  (SUITE-TestApiFramework-seed#[3BF80788F0E02A9]-worker) [    ] o.a.s.SolrTestCaseJ4 ###deleteCore
   [junit4]   2> NOTE: leaving temporary files on disk at: /home/jenkins/workspace/Lucene-Solr-6.x-Linux/solr/build/solr-core/test/J1/temp/solr.handler.admin.TestApiFramework_3BF80788F0E02A9-001
   [junit4]   2> NOTE: test params are: codec=Asserting(Lucene62): {}, docValues:{}, maxPointsInLeafNode=1287, maxMBSortInHeap=6.6485352661907795, sim=RandomSimilarity(queryNorm=true,coord=yes): {}, locale=mas, timezone=Pacific/Easter
   [junit4]   2> NOTE: Linux 4.4.0-53-generic i386/Oracle Corporation 9-ea (32-bit)/cpus=12,threads=1,free=60203832,total=280231936
   [junit4]   2> NOTE: All tests run in this JVM: [TestRequestStatusCollectionAPI, HttpPartitionTest, TestCoreContainer, SolrInfoMBeanTest, SliceStateTest, SortSpecParsingTest, BasicFunctionalityTest, SystemInfoHandlerTest, IndexSchemaTest, TestRawResponseWriter, HdfsRecoverLeaseTest, ClassificationUpdateProcessorFactoryTest, CollectionTooManyReplicasTest, TestFuzzyAnalyzedSuggestions, ParsingFieldUpdateProcessorsTest, IndexSchemaRuntimeFieldTest, TestFastOutputStream, ShardRoutingTest, HdfsChaosMonkeySafeLeaderTest, TestDocTermOrds, TestOrdValues, TermsComponentTest, JvmMetricsTest, MultiTermTest, TestBulkSchemaConcurrent, DataDrivenBlockJoinTest, TestHdfsCloudBackupRestore, TestUseDocValuesAsStored2, SmileWriterTest, TestUniqueKeyFieldResource, TestApiFramework]
   [junit4] Completed [117/692 (1!)] on J1 in 0.05s, 2 tests, 1 error <<< FAILURES!

[...truncated 53521 lines...]



---------------------------------------------------------------------
To unsubscribe, e-mail: [hidden email]
For additional commands, e-mail: [hidden email]