[JENKINS-EA] Lucene-Solr-7.0-Linux (32bit/jdk-9-ea+175) - Build # 26 - Unstable!

Previous Topic Next Topic
 
classic Classic list List threaded Threaded
1 message Options
Reply | Threaded
Open this post in threaded view
|  
Report Content as Inappropriate

[JENKINS-EA] Lucene-Solr-7.0-Linux (32bit/jdk-9-ea+175) - Build # 26 - Unstable!

Policeman Jenkins Server-2
Build: https://jenkins.thetaphi.de/job/Lucene-Solr-7.0-Linux/26/
Java: 32bit/jdk-9-ea+175 -client -XX:+UseG1GC --illegal-access=deny

1 tests failed.
FAILED:  org.apache.solr.handler.admin.MetricsHandlerTest.testPropertyFilter

Error Message:


Stack Trace:
java.lang.AssertionError
        at __randomizedtesting.SeedInfo.seed([B82CD91875945ACD:DA412759BA1A3AF3]:0)
        at org.junit.Assert.fail(Assert.java:92)
        at org.junit.Assert.assertTrue(Assert.java:43)
        at org.junit.Assert.assertNotNull(Assert.java:526)
        at org.junit.Assert.assertNotNull(Assert.java:537)
        at org.apache.solr.handler.admin.MetricsHandlerTest.testPropertyFilter(MetricsHandlerTest.java:201)
        at java.base/jdk.internal.reflect.NativeMethodAccessorImpl.invoke0(Native Method)
        at java.base/jdk.internal.reflect.NativeMethodAccessorImpl.invoke(NativeMethodAccessorImpl.java:62)
        at java.base/jdk.internal.reflect.DelegatingMethodAccessorImpl.invoke(DelegatingMethodAccessorImpl.java:43)
        at java.base/java.lang.reflect.Method.invoke(Method.java:564)
        at com.carrotsearch.randomizedtesting.RandomizedRunner.invoke(RandomizedRunner.java:1713)
        at com.carrotsearch.randomizedtesting.RandomizedRunner$8.evaluate(RandomizedRunner.java:907)
        at com.carrotsearch.randomizedtesting.RandomizedRunner$9.evaluate(RandomizedRunner.java:943)
        at com.carrotsearch.randomizedtesting.RandomizedRunner$10.evaluate(RandomizedRunner.java:957)
        at com.carrotsearch.randomizedtesting.rules.SystemPropertiesRestoreRule$1.evaluate(SystemPropertiesRestoreRule.java:57)
        at org.apache.lucene.util.TestRuleSetupTeardownChained$1.evaluate(TestRuleSetupTeardownChained.java:49)
        at org.apache.lucene.util.AbstractBeforeAfterRule$1.evaluate(AbstractBeforeAfterRule.java:45)
        at org.apache.lucene.util.TestRuleThreadAndTestName$1.evaluate(TestRuleThreadAndTestName.java:48)
        at org.apache.lucene.util.TestRuleIgnoreAfterMaxFailures$1.evaluate(TestRuleIgnoreAfterMaxFailures.java:64)
        at org.apache.lucene.util.TestRuleMarkFailure$1.evaluate(TestRuleMarkFailure.java:47)
        at com.carrotsearch.randomizedtesting.rules.StatementAdapter.evaluate(StatementAdapter.java:36)
        at com.carrotsearch.randomizedtesting.ThreadLeakControl$StatementRunner.run(ThreadLeakControl.java:368)
        at com.carrotsearch.randomizedtesting.ThreadLeakControl.forkTimeoutingTask(ThreadLeakControl.java:817)
        at com.carrotsearch.randomizedtesting.ThreadLeakControl$3.evaluate(ThreadLeakControl.java:468)
        at com.carrotsearch.randomizedtesting.RandomizedRunner.runSingleTest(RandomizedRunner.java:916)
        at com.carrotsearch.randomizedtesting.RandomizedRunner$5.evaluate(RandomizedRunner.java:802)
        at com.carrotsearch.randomizedtesting.RandomizedRunner$6.evaluate(RandomizedRunner.java:852)
        at com.carrotsearch.randomizedtesting.RandomizedRunner$7.evaluate(RandomizedRunner.java:863)
        at com.carrotsearch.randomizedtesting.rules.StatementAdapter.evaluate(StatementAdapter.java:36)
        at com.carrotsearch.randomizedtesting.rules.SystemPropertiesRestoreRule$1.evaluate(SystemPropertiesRestoreRule.java:57)
        at org.apache.lucene.util.AbstractBeforeAfterRule$1.evaluate(AbstractBeforeAfterRule.java:45)
        at com.carrotsearch.randomizedtesting.rules.StatementAdapter.evaluate(StatementAdapter.java:36)
        at org.apache.lucene.util.TestRuleStoreClassName$1.evaluate(TestRuleStoreClassName.java:41)
        at com.carrotsearch.randomizedtesting.rules.NoShadowingOrOverridesOnMethodsRule$1.evaluate(NoShadowingOrOverridesOnMethodsRule.java:40)
        at com.carrotsearch.randomizedtesting.rules.NoShadowingOrOverridesOnMethodsRule$1.evaluate(NoShadowingOrOverridesOnMethodsRule.java:40)
        at com.carrotsearch.randomizedtesting.rules.StatementAdapter.evaluate(StatementAdapter.java:36)
        at com.carrotsearch.randomizedtesting.rules.StatementAdapter.evaluate(StatementAdapter.java:36)
        at org.apache.lucene.util.TestRuleAssertionsRequired$1.evaluate(TestRuleAssertionsRequired.java:53)
        at org.apache.lucene.util.TestRuleMarkFailure$1.evaluate(TestRuleMarkFailure.java:47)
        at org.apache.lucene.util.TestRuleIgnoreAfterMaxFailures$1.evaluate(TestRuleIgnoreAfterMaxFailures.java:64)
        at org.apache.lucene.util.TestRuleIgnoreTestSuites$1.evaluate(TestRuleIgnoreTestSuites.java:54)
        at com.carrotsearch.randomizedtesting.rules.StatementAdapter.evaluate(StatementAdapter.java:36)
        at com.carrotsearch.randomizedtesting.ThreadLeakControl$StatementRunner.run(ThreadLeakControl.java:368)
        at java.base/java.lang.Thread.run(Thread.java:844)




Build Log:
[...truncated 11617 lines...]
   [junit4] Suite: org.apache.solr.handler.admin.MetricsHandlerTest
   [junit4]   2> Creating dataDir: /home/jenkins/workspace/Lucene-Solr-7.0-Linux/solr/build/solr-core/test/J2/temp/solr.handler.admin.MetricsHandlerTest_B82CD91875945ACD-001/init-core-data-001
   [junit4]   2> 566051 WARN  (SUITE-MetricsHandlerTest-seed#[B82CD91875945ACD]-worker) [    ] o.a.s.SolrTestCaseJ4 startTrackingSearchers: numOpens=11 numCloses=11
   [junit4]   2> 566051 INFO  (SUITE-MetricsHandlerTest-seed#[B82CD91875945ACD]-worker) [    ] o.a.s.SolrTestCaseJ4 Using PointFields (NUMERIC_POINTS_SYSPROP=true) w/NUMERIC_DOCVALUES_SYSPROP=false
   [junit4]   2> 566052 INFO  (SUITE-MetricsHandlerTest-seed#[B82CD91875945ACD]-worker) [    ] o.a.s.SolrTestCaseJ4 Randomized ssl (true) and clientAuth (true) via: @org.apache.solr.util.RandomizeSSL(reason="", ssl=0.0/0.0, value=0.0/0.0, clientAuth=0.0/0.0)
   [junit4]   2> 566053 INFO  (SUITE-MetricsHandlerTest-seed#[B82CD91875945ACD]-worker) [    ] o.a.s.SolrTestCaseJ4 ####initCore
   [junit4]   2> 566054 INFO  (SUITE-MetricsHandlerTest-seed#[B82CD91875945ACD]-worker) [    ] o.a.s.c.SolrResourceLoader [null] Added 2 libs to classloader, from paths: [/home/jenkins/workspace/Lucene-Solr-7.0-Linux/solr/core/src/test-files/solr/collection1/lib, /home/jenkins/workspace/Lucene-Solr-7.0-Linux/solr/core/src/test-files/solr/collection1/lib/classes]
   [junit4]   2> 566087 INFO  (SUITE-MetricsHandlerTest-seed#[B82CD91875945ACD]-worker) [    ] o.a.s.c.SolrConfig Using Lucene MatchVersion: 7.0.0
   [junit4]   2> 566110 INFO  (SUITE-MetricsHandlerTest-seed#[B82CD91875945ACD]-worker) [    ] o.a.s.s.IndexSchema [null] Schema name=test
   [junit4]   2> 566280 INFO  (SUITE-MetricsHandlerTest-seed#[B82CD91875945ACD]-worker) [    ] o.a.s.s.IndexSchema Loaded schema test/1.0 with uniqueid field id
   [junit4]   2> 566336 INFO  (SUITE-MetricsHandlerTest-seed#[B82CD91875945ACD]-worker) [    ] o.a.s.m.r.SolrJmxReporter JMX monitoring for 'solr.node' (registry 'solr.node') enabled at server: com.sun.jmx.mbeanserver.JmxMBeanServer@f72a74
   [junit4]   2> 566341 INFO  (SUITE-MetricsHandlerTest-seed#[B82CD91875945ACD]-worker) [    ] o.a.s.m.r.SolrJmxReporter JMX monitoring for 'solr.jvm' (registry 'solr.jvm') enabled at server: com.sun.jmx.mbeanserver.JmxMBeanServer@f72a74
   [junit4]   2> 566342 INFO  (SUITE-MetricsHandlerTest-seed#[B82CD91875945ACD]-worker) [    ] o.a.s.m.r.SolrJmxReporter JMX monitoring for 'solr.jetty' (registry 'solr.jetty') enabled at server: com.sun.jmx.mbeanserver.JmxMBeanServer@f72a74
   [junit4]   2> 566347 INFO  (coreLoadExecutor-1767-thread-1) [    ] o.a.s.c.SolrResourceLoader [null] Added 2 libs to classloader, from paths: [/home/jenkins/workspace/Lucene-Solr-7.0-Linux/solr/core/src/test-files/solr/collection1/lib, /home/jenkins/workspace/Lucene-Solr-7.0-Linux/solr/core/src/test-files/solr/collection1/lib/classes]
   [junit4]   2> 566377 INFO  (coreLoadExecutor-1767-thread-1) [    ] o.a.s.c.SolrConfig Using Lucene MatchVersion: 7.0.0
   [junit4]   2> 566395 INFO  (coreLoadExecutor-1767-thread-1) [    ] o.a.s.s.IndexSchema [collection1] Schema name=test
   [junit4]   2> 566461 INFO  (coreLoadExecutor-1767-thread-1) [    ] o.a.s.s.IndexSchema Loaded schema test/1.0 with uniqueid field id
   [junit4]   2> 566468 INFO  (coreLoadExecutor-1767-thread-1) [    ] o.a.s.c.CoreContainer Creating SolrCore 'collection1' using configuration from instancedir /home/jenkins/workspace/Lucene-Solr-7.0-Linux/solr/core/src/test-files/solr/collection1, trusted=true
   [junit4]   2> 566469 INFO  (coreLoadExecutor-1767-thread-1) [    ] o.a.s.m.r.SolrJmxReporter JMX monitoring for 'solr.core.collection1' (registry 'solr.core.collection1') enabled at server: com.sun.jmx.mbeanserver.JmxMBeanServer@f72a74
   [junit4]   2> 566469 INFO  (coreLoadExecutor-1767-thread-1) [    ] o.a.s.c.SolrCore solr.RecoveryStrategy.Builder
   [junit4]   2> 566469 INFO  (coreLoadExecutor-1767-thread-1) [    ] o.a.s.c.SolrCore [[collection1] ] Opening new SolrCore at [/home/jenkins/workspace/Lucene-Solr-7.0-Linux/solr/core/src/test-files/solr/collection1], dataDir=[/home/jenkins/workspace/Lucene-Solr-7.0-Linux/solr/build/solr-core/test/J2/temp/solr.handler.admin.MetricsHandlerTest_B82CD91875945ACD-001/init-core-data-001/]
   [junit4]   2> 566471 INFO  (coreLoadExecutor-1767-thread-1) [    ] o.a.s.u.RandomMergePolicy RandomMergePolicy wrapping class org.apache.lucene.index.TieredMergePolicy: [TieredMergePolicy: maxMergeAtOnce=30, maxMergeAtOnceExplicit=12, maxMergedSegmentMB=40.8544921875, floorSegmentMB=1.2548828125, forceMergeDeletesPctAllowed=18.404155282579794, segmentsPerTier=19.0, maxCFSSegmentSizeMB=8.796093022207999E12, noCFSRatio=0.0
   [junit4]   2> 566513 INFO  (coreLoadExecutor-1767-thread-1) [    ] o.a.s.u.UpdateHandler Using UpdateLog implementation: org.apache.solr.update.UpdateLog
   [junit4]   2> 566513 INFO  (coreLoadExecutor-1767-thread-1) [    ] o.a.s.u.UpdateLog Initializing UpdateLog: dataDir= defaultSyncLevel=FLUSH numRecordsToKeep=100 maxNumLogsToKeep=10 numVersionBuckets=65536
   [junit4]   2> 566514 INFO  (coreLoadExecutor-1767-thread-1) [    ] o.a.s.u.CommitTracker Hard AutoCommit: disabled
   [junit4]   2> 566514 INFO  (coreLoadExecutor-1767-thread-1) [    ] o.a.s.u.CommitTracker Soft AutoCommit: disabled
   [junit4]   2> 566515 INFO  (coreLoadExecutor-1767-thread-1) [    ] o.a.s.u.RandomMergePolicy RandomMergePolicy wrapping class org.apache.lucene.index.AlcoholicMergePolicy: [AlcoholicMergePolicy: minMergeSize=0, mergeFactor=10, maxMergeSize=2084253271, maxMergeSizeForForcedMerge=9223372036854775807, calibrateSizeByDeletes=true, maxMergeDocs=2147483647, maxCFSSegmentSizeMB=8.796093022207999E12, noCFSRatio=0.1]
   [junit4]   2> 566515 INFO  (coreLoadExecutor-1767-thread-1) [    ] o.a.s.s.SolrIndexSearcher Opening [Searcher@8999d5[collection1] main]
   [junit4]   2> 566516 INFO  (coreLoadExecutor-1767-thread-1) [    ] o.a.s.h.c.SpellCheckComponent Initializing spell checkers
   [junit4]   2> 566538 INFO  (coreLoadExecutor-1767-thread-1) [    ] o.a.s.s.DirectSolrSpellChecker init: {name=direct,classname=DirectSolrSpellChecker,field=lowerfilt,minQueryLength=3}
   [junit4]   2> 566599 INFO  (coreLoadExecutor-1767-thread-1) [    ] o.a.s.h.ReplicationHandler Commits will be reserved for  10000
   [junit4]   2> 566599 INFO  (coreLoadExecutor-1767-thread-1) [    ] o.a.s.u.UpdateLog Could not find max version in index or recent updates, using new clock 1573032644271144960
   [junit4]   2> 566600 INFO  (searcherExecutor-1768-thread-1) [    ] o.a.s.h.c.SpellCheckComponent Loading spell index for spellchecker: default
   [junit4]   2> 566601 INFO  (searcherExecutor-1768-thread-1) [    ] o.a.s.h.c.SpellCheckComponent Loading spell index for spellchecker: direct
   [junit4]   2> 566601 INFO  (searcherExecutor-1768-thread-1) [    ] o.a.s.h.c.SpellCheckComponent Loading spell index for spellchecker: wordbreak
   [junit4]   2> 566601 INFO  (searcherExecutor-1768-thread-1) [    ] o.a.s.h.c.SpellCheckComponent Loading spell index for spellchecker: multipleFields
   [junit4]   2> 566601 INFO  (searcherExecutor-1768-thread-1) [    ] o.a.s.h.c.SpellCheckComponent Loading spell index for spellchecker: jarowinkler
   [junit4]   2> 566601 INFO  (searcherExecutor-1768-thread-1) [    ] o.a.s.h.c.SpellCheckComponent Loading spell index for spellchecker: external
   [junit4]   2> 566601 INFO  (searcherExecutor-1768-thread-1) [    ] o.a.s.h.c.SpellCheckComponent Loading spell index for spellchecker: freq
   [junit4]   2> 566602 INFO  (searcherExecutor-1768-thread-1) [    ] o.a.s.h.c.SpellCheckComponent Loading spell index for spellchecker: fqcn
   [junit4]   2> 566602 INFO  (searcherExecutor-1768-thread-1) [    ] o.a.s.h.c.SpellCheckComponent Loading spell index for spellchecker: perDict
   [junit4]   2> 566602 INFO  (SUITE-MetricsHandlerTest-seed#[B82CD91875945ACD]-worker) [    ] o.a.s.SolrTestCaseJ4 ####initCore end
   [junit4]   2> 566604 INFO  (TEST-MetricsHandlerTest.testPropertyFilter-seed#[B82CD91875945ACD]) [    ] o.a.s.SolrTestCaseJ4 ###Starting testPropertyFilter
   [junit4]   2> 566606 INFO  (TEST-MetricsHandlerTest.testPropertyFilter-seed#[B82CD91875945ACD]) [    ] o.a.s.SolrTestCaseJ4 ###Ending testPropertyFilter
   [junit4]   2> NOTE: reproduce with: ant test  -Dtestcase=MetricsHandlerTest -Dtests.method=testPropertyFilter -Dtests.seed=B82CD91875945ACD -Dtests.multiplier=3 -Dtests.slow=true -Dtests.locale=yo-NG -Dtests.timezone=IET -Dtests.asserts=true -Dtests.file.encoding=UTF-8
   [junit4] FAILURE 0.00s J2 | MetricsHandlerTest.testPropertyFilter <<<
   [junit4]    > Throwable #1: java.lang.AssertionError
   [junit4]    > at __randomizedtesting.SeedInfo.seed([B82CD91875945ACD:DA412759BA1A3AF3]:0)
   [junit4]    > at org.apache.solr.handler.admin.MetricsHandlerTest.testPropertyFilter(MetricsHandlerTest.java:201)
   [junit4]    > at java.base/jdk.internal.reflect.NativeMethodAccessorImpl.invoke0(Native Method)
   [junit4]    > at java.base/jdk.internal.reflect.NativeMethodAccessorImpl.invoke(NativeMethodAccessorImpl.java:62)
   [junit4]    > at java.base/jdk.internal.reflect.DelegatingMethodAccessorImpl.invoke(DelegatingMethodAccessorImpl.java:43)
   [junit4]    > at java.base/java.lang.reflect.Method.invoke(Method.java:564)
   [junit4]    > at java.base/java.lang.Thread.run(Thread.java:844)
   [junit4]   2> 566609 INFO  (searcherExecutor-1768-thread-1) [    ] o.a.s.c.SolrCore [collection1] Registered new searcher Searcher@8999d5[collection1] main{ExitableDirectoryReader(UninvertingDirectoryReader())}
   [junit4]   2> 566615 INFO  (TEST-MetricsHandlerTest.testCompact-seed#[B82CD91875945ACD]) [    ] o.a.s.SolrTestCaseJ4 ###Starting testCompact
   [junit4]   2> 566622 INFO  (TEST-MetricsHandlerTest.testCompact-seed#[B82CD91875945ACD]) [    ] o.a.s.c.TransientSolrCoreCacheDefault Allocating transient cache for 2147483647 transient cores
   [junit4]   2> 566639 INFO  (TEST-MetricsHandlerTest.testCompact-seed#[B82CD91875945ACD]) [    ] o.a.s.SolrTestCaseJ4 ###Ending testCompact
   [junit4]   2> 566646 INFO  (TEST-MetricsHandlerTest.test-seed#[B82CD91875945ACD]) [    ] o.a.s.SolrTestCaseJ4 ###Starting test
   [junit4]   2> 566672 INFO  (TEST-MetricsHandlerTest.test-seed#[B82CD91875945ACD]) [    ] o.a.s.SolrTestCaseJ4 ###Ending test
   [junit4]   2> 566673 INFO  (SUITE-MetricsHandlerTest-seed#[B82CD91875945ACD]-worker) [    ] o.a.s.SolrTestCaseJ4 ###deleteCore
   [junit4]   2> 566673 INFO  (SUITE-MetricsHandlerTest-seed#[B82CD91875945ACD]-worker) [    ] o.a.s.c.CoreContainer Shutting down CoreContainer instance=8976589
   [junit4]   2> 566673 INFO  (SUITE-MetricsHandlerTest-seed#[B82CD91875945ACD]-worker) [    ] o.a.s.m.SolrMetricManager Closing metric reporters for registry=solr.node, tag=null
   [junit4]   2> 566674 INFO  (SUITE-MetricsHandlerTest-seed#[B82CD91875945ACD]-worker) [    ] o.a.s.m.SolrMetricManager Closing metric reporters for registry=solr.jvm, tag=null
   [junit4]   2> 566685 INFO  (SUITE-MetricsHandlerTest-seed#[B82CD91875945ACD]-worker) [    ] o.a.s.m.SolrMetricManager Closing metric reporters for registry=solr.jetty, tag=null
   [junit4]   2> 566686 INFO  (coreCloseExecutor-1773-thread-1) [    ] o.a.s.c.SolrCore [collection1]  CLOSING SolrCore org.apache.solr.core.SolrCore@1701e0b
   [junit4]   2> 566701 INFO  (coreCloseExecutor-1773-thread-1) [    ] o.a.s.m.SolrMetricManager Closing metric reporters for registry=solr.core.collection1, tag=24124939
   [junit4]   2> NOTE: leaving temporary files on disk at: /home/jenkins/workspace/Lucene-Solr-7.0-Linux/solr/build/solr-core/test/J2/temp/solr.handler.admin.MetricsHandlerTest_B82CD91875945ACD-001
   [junit4]   2> NOTE: test params are: codec=Lucene70, sim=RandomSimilarity(queryNorm=false): {}, locale=yo-NG, timezone=IET
   [junit4]   2> NOTE: Linux 4.10.0-26-generic i386/Oracle Corporation 9 (32-bit)/cpus=8,threads=1,free=159274152,total=536870912
   [junit4]   2> NOTE: All tests run in this JVM: [TestStressUserVersions, TestClassicSimilarityFactory, DirectUpdateHandlerOptimizeTest, JvmMetricsTest, AtomicUpdatesTest, HdfsRestartWhileUpdatingTest, SubstringBytesRefFilterTest, PKIAuthenticationIntegrationTest, HdfsChaosMonkeyNothingIsSafeTest, TestPerFieldSimilarityWithDefaultOverride, TestSurroundQueryParser, TestCloudInspectUtil, TestPseudoReturnFields, SimpleFacetsTest, TestRestoreCore, OverriddenZkACLAndCredentialsProvidersTest, TestStressInPlaceUpdates, BlockDirectoryTest, SimpleCollectionCreateDeleteTest, TestPolicyCloud, TestAnalyzedSuggestions, TestSolrDeletionPolicy2, TestPivotHelperCode, UniqFieldsUpdateProcessorFactoryTest, TestMacroExpander, TestRandomCollapseQParserPlugin, SuggesterTest, TestDocBasedVersionConstraints, TestLMJelinekMercerSimilarityFactory, PathHierarchyTokenizerFactoryTest, MetricUtilsTest, ResponseLogComponentTest, UninvertDocValuesMergePolicyTest, OverseerTest, TestDistributedStatsComponentCardinality, StatsComponentTest, ReplaceNodeTest, PeerSyncReplicationTest, HdfsTlogReplayBufferedWhileIndexingTest, VersionInfoTest, TestMultiWordSynonyms, CircularListTest, PrimitiveFieldTypeTest, DocumentBuilderTest, TestSuggestSpellingConverter, TestFastWriter, TestManagedResource, DistributedQueryComponentOptimizationTest, TestLegacyNumericRangeQueryBuilder, TestSolrCloudWithKerberosAlt, TestCollapseQParserPlugin, TestFreeTextSuggestions, TestLRUStatsCache, UnloadDistributedZkTest, TestBulkSchemaAPI, TestQuerySenderListener, AliasIntegrationTest, TestHdfsBackupRestoreCore, BitVectorTest, CoreAdminRequestStatusTest, TestCorePropertiesReload, PingRequestHandlerTest, TestShortCircuitedRequests, TermsComponentTest, TestLeaderInitiatedRecoveryThread, TestSubQueryTransformer, TestSimpleTextCodec, TestRequestStatusCollectionAPI, MetricsHandlerTest]
   [junit4] Completed [236/727 (1!)] on J2 in 0.67s, 3 tests, 1 failure <<< FAILURES!

[...truncated 38146 lines...]


---------------------------------------------------------------------
To unsubscribe, e-mail: [hidden email]
For additional commands, e-mail: [hidden email]
Loading...