[JENKINS-EA] Lucene-Solr-7.0-Windows (64bit/jdk-9-ea+181) - Build # 84 - Unstable!

Previous Topic Next Topic
 
classic Classic list List threaded Threaded
1 message Options
Reply | Threaded
Open this post in threaded view
|

[JENKINS-EA] Lucene-Solr-7.0-Windows (64bit/jdk-9-ea+181) - Build # 84 - Unstable!

Policeman Jenkins Server-2
Build: https://jenkins.thetaphi.de/job/Lucene-Solr-7.0-Windows/84/
Java: 64bit/jdk-9-ea+181 -XX:+UseCompressedOops -XX:+UseG1GC --illegal-access=deny

3 tests failed.
FAILED:  org.apache.solr.cloud.TestTlogReplica.testOnlyLeaderIndexes

Error Message:


Stack Trace:
java.lang.AssertionError
        at __randomizedtesting.SeedInfo.seed([EF3FC2C764EA3A25:F33EBF4A114F44B6]:0)
        at org.junit.Assert.fail(Assert.java:92)
        at org.junit.Assert.assertTrue(Assert.java:43)
        at org.junit.Assert.assertFalse(Assert.java:68)
        at org.junit.Assert.assertFalse(Assert.java:79)
        at org.apache.solr.cloud.TestTlogReplica.testOnlyLeaderIndexes(TestTlogReplica.java:497)
        at java.base/jdk.internal.reflect.NativeMethodAccessorImpl.invoke0(Native Method)
        at java.base/jdk.internal.reflect.NativeMethodAccessorImpl.invoke(NativeMethodAccessorImpl.java:62)
        at java.base/jdk.internal.reflect.DelegatingMethodAccessorImpl.invoke(DelegatingMethodAccessorImpl.java:43)
        at java.base/java.lang.reflect.Method.invoke(Method.java:564)
        at com.carrotsearch.randomizedtesting.RandomizedRunner.invoke(RandomizedRunner.java:1713)
        at com.carrotsearch.randomizedtesting.RandomizedRunner$8.evaluate(RandomizedRunner.java:907)
        at com.carrotsearch.randomizedtesting.RandomizedRunner$9.evaluate(RandomizedRunner.java:943)
        at com.carrotsearch.randomizedtesting.RandomizedRunner$10.evaluate(RandomizedRunner.java:957)
        at com.carrotsearch.randomizedtesting.rules.SystemPropertiesRestoreRule$1.evaluate(SystemPropertiesRestoreRule.java:57)
        at org.apache.lucene.util.TestRuleSetupTeardownChained$1.evaluate(TestRuleSetupTeardownChained.java:49)
        at org.apache.lucene.util.AbstractBeforeAfterRule$1.evaluate(AbstractBeforeAfterRule.java:45)
        at org.apache.lucene.util.TestRuleThreadAndTestName$1.evaluate(TestRuleThreadAndTestName.java:48)
        at org.apache.lucene.util.TestRuleIgnoreAfterMaxFailures$1.evaluate(TestRuleIgnoreAfterMaxFailures.java:64)
        at org.apache.lucene.util.TestRuleMarkFailure$1.evaluate(TestRuleMarkFailure.java:47)
        at com.carrotsearch.randomizedtesting.rules.StatementAdapter.evaluate(StatementAdapter.java:36)
        at com.carrotsearch.randomizedtesting.ThreadLeakControl$StatementRunner.run(ThreadLeakControl.java:368)
        at com.carrotsearch.randomizedtesting.ThreadLeakControl.forkTimeoutingTask(ThreadLeakControl.java:817)
        at com.carrotsearch.randomizedtesting.ThreadLeakControl$3.evaluate(ThreadLeakControl.java:468)
        at com.carrotsearch.randomizedtesting.RandomizedRunner.runSingleTest(RandomizedRunner.java:916)
        at com.carrotsearch.randomizedtesting.RandomizedRunner$5.evaluate(RandomizedRunner.java:802)
        at com.carrotsearch.randomizedtesting.RandomizedRunner$6.evaluate(RandomizedRunner.java:852)
        at com.carrotsearch.randomizedtesting.RandomizedRunner$7.evaluate(RandomizedRunner.java:863)
        at com.carrotsearch.randomizedtesting.rules.StatementAdapter.evaluate(StatementAdapter.java:36)
        at com.carrotsearch.randomizedtesting.rules.SystemPropertiesRestoreRule$1.evaluate(SystemPropertiesRestoreRule.java:57)
        at org.apache.lucene.util.AbstractBeforeAfterRule$1.evaluate(AbstractBeforeAfterRule.java:45)
        at com.carrotsearch.randomizedtesting.rules.StatementAdapter.evaluate(StatementAdapter.java:36)
        at org.apache.lucene.util.TestRuleStoreClassName$1.evaluate(TestRuleStoreClassName.java:41)
        at com.carrotsearch.randomizedtesting.rules.NoShadowingOrOverridesOnMethodsRule$1.evaluate(NoShadowingOrOverridesOnMethodsRule.java:40)
        at com.carrotsearch.randomizedtesting.rules.NoShadowingOrOverridesOnMethodsRule$1.evaluate(NoShadowingOrOverridesOnMethodsRule.java:40)
        at com.carrotsearch.randomizedtesting.rules.StatementAdapter.evaluate(StatementAdapter.java:36)
        at com.carrotsearch.randomizedtesting.rules.StatementAdapter.evaluate(StatementAdapter.java:36)
        at org.apache.lucene.util.TestRuleAssertionsRequired$1.evaluate(TestRuleAssertionsRequired.java:53)
        at org.apache.lucene.util.TestRuleMarkFailure$1.evaluate(TestRuleMarkFailure.java:47)
        at org.apache.lucene.util.TestRuleIgnoreAfterMaxFailures$1.evaluate(TestRuleIgnoreAfterMaxFailures.java:64)
        at org.apache.lucene.util.TestRuleIgnoreTestSuites$1.evaluate(TestRuleIgnoreTestSuites.java:54)
        at com.carrotsearch.randomizedtesting.rules.StatementAdapter.evaluate(StatementAdapter.java:36)
        at com.carrotsearch.randomizedtesting.ThreadLeakControl$StatementRunner.run(ThreadLeakControl.java:368)
        at java.base/java.lang.Thread.run(Thread.java:844)


FAILED:  junit.framework.TestSuite.org.apache.solr.core.AlternateDirectoryTest

Error Message:
Could not remove the following files (in the order of attempts):    C:\Users\jenkins\workspace\Lucene-Solr-7.0-Windows\solr\build\solr-core\test\J0\temp\solr.core.AlternateDirectoryTest_EF3FC2C764EA3A25-001\init-core-data-001: java.nio.file.AccessDeniedException: C:\Users\jenkins\workspace\Lucene-Solr-7.0-Windows\solr\build\solr-core\test\J0\temp\solr.core.AlternateDirectoryTest_EF3FC2C764EA3A25-001\init-core-data-001    C:\Users\jenkins\workspace\Lucene-Solr-7.0-Windows\solr\build\solr-core\test\J0\temp\solr.core.AlternateDirectoryTest_EF3FC2C764EA3A25-001: java.nio.file.DirectoryNotEmptyException: C:\Users\jenkins\workspace\Lucene-Solr-7.0-Windows\solr\build\solr-core\test\J0\temp\solr.core.AlternateDirectoryTest_EF3FC2C764EA3A25-001

Stack Trace:
java.io.IOException: Could not remove the following files (in the order of attempts):
   C:\Users\jenkins\workspace\Lucene-Solr-7.0-Windows\solr\build\solr-core\test\J0\temp\solr.core.AlternateDirectoryTest_EF3FC2C764EA3A25-001\init-core-data-001: java.nio.file.AccessDeniedException: C:\Users\jenkins\workspace\Lucene-Solr-7.0-Windows\solr\build\solr-core\test\J0\temp\solr.core.AlternateDirectoryTest_EF3FC2C764EA3A25-001\init-core-data-001
   C:\Users\jenkins\workspace\Lucene-Solr-7.0-Windows\solr\build\solr-core\test\J0\temp\solr.core.AlternateDirectoryTest_EF3FC2C764EA3A25-001: java.nio.file.DirectoryNotEmptyException: C:\Users\jenkins\workspace\Lucene-Solr-7.0-Windows\solr\build\solr-core\test\J0\temp\solr.core.AlternateDirectoryTest_EF3FC2C764EA3A25-001

        at __randomizedtesting.SeedInfo.seed([EF3FC2C764EA3A25]:0)
        at org.apache.lucene.util.IOUtils.rm(IOUtils.java:329)
        at org.apache.lucene.util.TestRuleTemporaryFilesCleanup.afterAlways(TestRuleTemporaryFilesCleanup.java:216)
        at com.carrotsearch.randomizedtesting.rules.TestRuleAdapter$1.afterAlways(TestRuleAdapter.java:31)
        at com.carrotsearch.randomizedtesting.rules.StatementAdapter.evaluate(StatementAdapter.java:43)
        at com.carrotsearch.randomizedtesting.rules.StatementAdapter.evaluate(StatementAdapter.java:36)
        at org.apache.lucene.util.TestRuleAssertionsRequired$1.evaluate(TestRuleAssertionsRequired.java:53)
        at org.apache.lucene.util.TestRuleMarkFailure$1.evaluate(TestRuleMarkFailure.java:47)
        at org.apache.lucene.util.TestRuleIgnoreAfterMaxFailures$1.evaluate(TestRuleIgnoreAfterMaxFailures.java:64)
        at org.apache.lucene.util.TestRuleIgnoreTestSuites$1.evaluate(TestRuleIgnoreTestSuites.java:54)
        at com.carrotsearch.randomizedtesting.rules.StatementAdapter.evaluate(StatementAdapter.java:36)
        at com.carrotsearch.randomizedtesting.ThreadLeakControl$StatementRunner.run(ThreadLeakControl.java:368)
        at java.base/java.lang.Thread.run(Thread.java:844)


FAILED:  org.apache.solr.update.AutoCommitTest.testMaxDocs

Error Message:
Exception during query

Stack Trace:
java.lang.RuntimeException: Exception during query
        at __randomizedtesting.SeedInfo.seed([EF3FC2C764EA3A25:56BE141848003EAF]:0)
        at org.apache.solr.SolrTestCaseJ4.assertQ(SolrTestCaseJ4.java:885)
        at org.apache.solr.update.AutoCommitTest.testMaxDocs(AutoCommitTest.java:225)
        at java.base/jdk.internal.reflect.NativeMethodAccessorImpl.invoke0(Native Method)
        at java.base/jdk.internal.reflect.NativeMethodAccessorImpl.invoke(NativeMethodAccessorImpl.java:62)
        at java.base/jdk.internal.reflect.DelegatingMethodAccessorImpl.invoke(DelegatingMethodAccessorImpl.java:43)
        at java.base/java.lang.reflect.Method.invoke(Method.java:564)
        at com.carrotsearch.randomizedtesting.RandomizedRunner.invoke(RandomizedRunner.java:1713)
        at com.carrotsearch.randomizedtesting.RandomizedRunner$8.evaluate(RandomizedRunner.java:907)
        at com.carrotsearch.randomizedtesting.RandomizedRunner$9.evaluate(RandomizedRunner.java:943)
        at com.carrotsearch.randomizedtesting.RandomizedRunner$10.evaluate(RandomizedRunner.java:957)
        at com.carrotsearch.randomizedtesting.rules.SystemPropertiesRestoreRule$1.evaluate(SystemPropertiesRestoreRule.java:57)
        at org.apache.lucene.util.TestRuleSetupTeardownChained$1.evaluate(TestRuleSetupTeardownChained.java:49)
        at org.apache.lucene.util.AbstractBeforeAfterRule$1.evaluate(AbstractBeforeAfterRule.java:45)
        at org.apache.lucene.util.TestRuleThreadAndTestName$1.evaluate(TestRuleThreadAndTestName.java:48)
        at org.apache.lucene.util.TestRuleIgnoreAfterMaxFailures$1.evaluate(TestRuleIgnoreAfterMaxFailures.java:64)
        at org.apache.lucene.util.TestRuleMarkFailure$1.evaluate(TestRuleMarkFailure.java:47)
        at com.carrotsearch.randomizedtesting.rules.StatementAdapter.evaluate(StatementAdapter.java:36)
        at com.carrotsearch.randomizedtesting.ThreadLeakControl$StatementRunner.run(ThreadLeakControl.java:368)
        at com.carrotsearch.randomizedtesting.ThreadLeakControl.forkTimeoutingTask(ThreadLeakControl.java:817)
        at com.carrotsearch.randomizedtesting.ThreadLeakControl$3.evaluate(ThreadLeakControl.java:468)
        at com.carrotsearch.randomizedtesting.RandomizedRunner.runSingleTest(RandomizedRunner.java:916)
        at com.carrotsearch.randomizedtesting.RandomizedRunner$5.evaluate(RandomizedRunner.java:802)
        at com.carrotsearch.randomizedtesting.RandomizedRunner$6.evaluate(RandomizedRunner.java:852)
        at com.carrotsearch.randomizedtesting.RandomizedRunner$7.evaluate(RandomizedRunner.java:863)
        at com.carrotsearch.randomizedtesting.rules.StatementAdapter.evaluate(StatementAdapter.java:36)
        at com.carrotsearch.randomizedtesting.rules.SystemPropertiesRestoreRule$1.evaluate(SystemPropertiesRestoreRule.java:57)
        at org.apache.lucene.util.AbstractBeforeAfterRule$1.evaluate(AbstractBeforeAfterRule.java:45)
        at com.carrotsearch.randomizedtesting.rules.StatementAdapter.evaluate(StatementAdapter.java:36)
        at org.apache.lucene.util.TestRuleStoreClassName$1.evaluate(TestRuleStoreClassName.java:41)
        at com.carrotsearch.randomizedtesting.rules.NoShadowingOrOverridesOnMethodsRule$1.evaluate(NoShadowingOrOverridesOnMethodsRule.java:40)
        at com.carrotsearch.randomizedtesting.rules.NoShadowingOrOverridesOnMethodsRule$1.evaluate(NoShadowingOrOverridesOnMethodsRule.java:40)
        at com.carrotsearch.randomizedtesting.rules.StatementAdapter.evaluate(StatementAdapter.java:36)
        at com.carrotsearch.randomizedtesting.rules.StatementAdapter.evaluate(StatementAdapter.java:36)
        at org.apache.lucene.util.TestRuleAssertionsRequired$1.evaluate(TestRuleAssertionsRequired.java:53)
        at org.apache.lucene.util.TestRuleMarkFailure$1.evaluate(TestRuleMarkFailure.java:47)
        at org.apache.lucene.util.TestRuleIgnoreAfterMaxFailures$1.evaluate(TestRuleIgnoreAfterMaxFailures.java:64)
        at org.apache.lucene.util.TestRuleIgnoreTestSuites$1.evaluate(TestRuleIgnoreTestSuites.java:54)
        at com.carrotsearch.randomizedtesting.rules.StatementAdapter.evaluate(StatementAdapter.java:36)
        at com.carrotsearch.randomizedtesting.ThreadLeakControl$StatementRunner.run(ThreadLeakControl.java:368)
        at java.base/java.lang.Thread.run(Thread.java:844)
Caused by: java.lang.RuntimeException: REQUEST FAILED: xpath=//result[@numFound=1]
        xml response was: <?xml version="1.0" encoding="UTF-8"?>
<response>
<lst name="responseHeader"><int name="status">0</int><int name="QTime">0</int></lst><result name="response" numFound="0" start="0"></result>
</response>

        request was:q=id:14&qt=&start=0&rows=20&version=2.2
        at org.apache.solr.SolrTestCaseJ4.assertQ(SolrTestCaseJ4.java:878)
        ... 39 more




Build Log:
[...truncated 11001 lines...]
   [junit4] Suite: org.apache.solr.update.AutoCommitTest
   [junit4]   2> Creating dataDir: C:\Users\jenkins\workspace\Lucene-Solr-7.0-Windows\solr\build\solr-core\test\J1\temp\solr.update.AutoCommitTest_EF3FC2C764EA3A25-001\init-core-data-001
   [junit4]   2> 185082 WARN  (SUITE-AutoCommitTest-seed#[EF3FC2C764EA3A25]-worker) [    ] o.a.s.SolrTestCaseJ4 startTrackingSearchers: numOpens=2 numCloses=2
   [junit4]   2> 185083 INFO  (SUITE-AutoCommitTest-seed#[EF3FC2C764EA3A25]-worker) [    ] o.a.s.SolrTestCaseJ4 Using PointFields (NUMERIC_POINTS_SYSPROP=true) w/NUMERIC_DOCVALUES_SYSPROP=false
   [junit4]   2> 185084 INFO  (SUITE-AutoCommitTest-seed#[EF3FC2C764EA3A25]-worker) [    ] o.a.s.SolrTestCaseJ4 Randomized ssl (false) and clientAuth (false) via: @org.apache.solr.util.RandomizeSSL(reason="", ssl=0.0/0.0, value=0.0/0.0, clientAuth=0.0/0.0)
   [junit4]   2> 185084 INFO  (SUITE-AutoCommitTest-seed#[EF3FC2C764EA3A25]-worker) [    ] o.a.s.SolrTestCaseJ4 ####initCore
   [junit4]   2> 185086 INFO  (SUITE-AutoCommitTest-seed#[EF3FC2C764EA3A25]-worker) [    ] o.a.s.c.SolrResourceLoader [null] Added 2 libs to classloader, from paths: [/C:/Users/jenkins/workspace/Lucene-Solr-7.0-Windows/solr/core/src/test-files/solr/collection1/lib, /C:/Users/jenkins/workspace/Lucene-Solr-7.0-Windows/solr/core/src/test-files/solr/collection1/lib/classes]
   [junit4]   2> 185121 INFO  (SUITE-AutoCommitTest-seed#[EF3FC2C764EA3A25]-worker) [    ] o.a.s.c.SolrConfig Using Lucene MatchVersion: 7.0.0
   [junit4]   2> 185168 INFO  (SUITE-AutoCommitTest-seed#[EF3FC2C764EA3A25]-worker) [    ] o.a.s.s.IndexSchema [null] Schema name=test
   [junit4]   2> 185295 INFO  (SUITE-AutoCommitTest-seed#[EF3FC2C764EA3A25]-worker) [    ] o.a.s.s.IndexSchema Loaded schema test/1.0 with uniqueid field id
   [junit4]   2> 185355 INFO  (SUITE-AutoCommitTest-seed#[EF3FC2C764EA3A25]-worker) [    ] o.a.s.m.r.SolrJmxReporter JMX monitoring for 'solr.node' (registry 'solr.node') enabled at server: com.sun.jmx.mbeanserver.JmxMBeanServer@7bffb8d5
   [junit4]   2> 185359 INFO  (SUITE-AutoCommitTest-seed#[EF3FC2C764EA3A25]-worker) [    ] o.a.s.m.r.SolrJmxReporter JMX monitoring for 'solr.jvm' (registry 'solr.jvm') enabled at server: com.sun.jmx.mbeanserver.JmxMBeanServer@7bffb8d5
   [junit4]   2> 185359 INFO  (SUITE-AutoCommitTest-seed#[EF3FC2C764EA3A25]-worker) [    ] o.a.s.m.r.SolrJmxReporter JMX monitoring for 'solr.jetty' (registry 'solr.jetty') enabled at server: com.sun.jmx.mbeanserver.JmxMBeanServer@7bffb8d5
   [junit4]   2> 185379 INFO  (coreLoadExecutor-833-thread-1) [    ] o.a.s.c.SolrResourceLoader [null] Added 2 libs to classloader, from paths: [/C:/Users/jenkins/workspace/Lucene-Solr-7.0-Windows/solr/core/src/test-files/solr/collection1/lib, /C:/Users/jenkins/workspace/Lucene-Solr-7.0-Windows/solr/core/src/test-files/solr/collection1/lib/classes]
   [junit4]   2> 185408 INFO  (coreLoadExecutor-833-thread-1) [    ] o.a.s.c.SolrConfig Using Lucene MatchVersion: 7.0.0
   [junit4]   2> 185438 INFO  (coreLoadExecutor-833-thread-1) [    ] o.a.s.s.IndexSchema [collection1] Schema name=test
   [junit4]   2> 185503 INFO  (coreLoadExecutor-833-thread-1) [    ] o.a.s.s.IndexSchema Loaded schema test/1.0 with uniqueid field id
   [junit4]   2> 185514 INFO  (coreLoadExecutor-833-thread-1) [    ] o.a.s.c.CoreContainer Creating SolrCore 'collection1' using configuration from instancedir C:\Users\jenkins\workspace\Lucene-Solr-7.0-Windows\solr\core\src\test-files\solr\collection1, trusted=true
   [junit4]   2> 185514 INFO  (coreLoadExecutor-833-thread-1) [    ] o.a.s.m.r.SolrJmxReporter JMX monitoring for 'solr.core.collection1' (registry 'solr.core.collection1') enabled at server: com.sun.jmx.mbeanserver.JmxMBeanServer@7bffb8d5
   [junit4]   2> 185514 INFO  (coreLoadExecutor-833-thread-1) [    ] o.a.s.c.SolrCore solr.RecoveryStrategy.Builder
   [junit4]   2> 185514 INFO  (coreLoadExecutor-833-thread-1) [    ] o.a.s.c.SolrCore [[collection1] ] Opening new SolrCore at [C:\Users\jenkins\workspace\Lucene-Solr-7.0-Windows\solr\core\src\test-files\solr\collection1], dataDir=[C:\Users\jenkins\workspace\Lucene-Solr-7.0-Windows\solr\build\solr-core\test\J1\temp\solr.update.AutoCommitTest_EF3FC2C764EA3A25-001\init-core-data-001\]
   [junit4]   2> 185514 INFO  (coreLoadExecutor-833-thread-1) [    ] o.a.s.u.RandomMergePolicy RandomMergePolicy wrapping class org.apache.lucene.index.TieredMergePolicy: [TieredMergePolicy: maxMergeAtOnce=38, maxMergeAtOnceExplicit=16, maxMergedSegmentMB=8.5869140625, floorSegmentMB=1.53515625, forceMergeDeletesPctAllowed=20.226175462987705, segmentsPerTier=24.0, maxCFSSegmentSizeMB=8.796093022207999E12, noCFSRatio=0.0
   [junit4]   2> 185578 INFO  (coreLoadExecutor-833-thread-1) [    ] o.a.s.u.UpdateHandler Using UpdateLog implementation: org.apache.solr.update.UpdateLog
   [junit4]   2> 185578 INFO  (coreLoadExecutor-833-thread-1) [    ] o.a.s.u.UpdateLog Initializing UpdateLog: dataDir= defaultSyncLevel=FLUSH numRecordsToKeep=100 maxNumLogsToKeep=10 numVersionBuckets=65536
   [junit4]   2> 185579 INFO  (coreLoadExecutor-833-thread-1) [    ] o.a.s.u.CommitTracker Hard AutoCommit: disabled
   [junit4]   2> 185579 INFO  (coreLoadExecutor-833-thread-1) [    ] o.a.s.u.CommitTracker Soft AutoCommit: disabled
   [junit4]   2> 185581 INFO  (coreLoadExecutor-833-thread-1) [    ] o.a.s.u.RandomMergePolicy RandomMergePolicy wrapping class org.apache.lucene.index.TieredMergePolicy: [TieredMergePolicy: maxMergeAtOnce=35, maxMergeAtOnceExplicit=44, maxMergedSegmentMB=27.0634765625, floorSegmentMB=1.32421875, forceMergeDeletesPctAllowed=19.771888617510175, segmentsPerTier=15.0, maxCFSSegmentSizeMB=8.796093022207999E12, noCFSRatio=0.352456751806695
   [junit4]   2> 185583 INFO  (coreLoadExecutor-833-thread-1) [    ] o.a.s.s.SolrIndexSearcher Opening [Searcher@6fcc2e9e[collection1] main]
   [junit4]   2> 185584 INFO  (coreLoadExecutor-833-thread-1) [    ] o.a.s.h.c.SpellCheckComponent Initializing spell checkers
   [junit4]   2> 185591 INFO  (coreLoadExecutor-833-thread-1) [    ] o.a.s.s.DirectSolrSpellChecker init: {name=direct,classname=DirectSolrSpellChecker,field=lowerfilt,minQueryLength=3}
   [junit4]   2> 185660 INFO  (coreLoadExecutor-833-thread-1) [    ] o.a.s.h.ReplicationHandler Commits will be reserved for  10000
   [junit4]   2> 185660 INFO  (searcherExecutor-834-thread-1) [    ] o.a.s.h.c.SpellCheckComponent Loading spell index for spellchecker: default
   [junit4]   2> 185660 INFO  (coreLoadExecutor-833-thread-1) [    ] o.a.s.u.UpdateLog Could not find max version in index or recent updates, using new clock 1575553633981825024
   [junit4]   2> 185664 INFO  (SUITE-AutoCommitTest-seed#[EF3FC2C764EA3A25]-worker) [    ] o.a.s.SolrTestCaseJ4 ####initCore end
   [junit4]   2> 185665 INFO  (TEST-AutoCommitTest.testMaxDocs-seed#[EF3FC2C764EA3A25]) [    ] o.a.s.SolrTestCaseJ4 ###Starting testMaxDocs
   [junit4]   2> 185666 INFO  (TEST-AutoCommitTest.testMaxDocs-seed#[EF3FC2C764EA3A25]) [    ] o.a.s.u.DirectUpdateHandler2 [collection1] REMOVING ALL DOCUMENTS FROM INDEX
   [junit4]   2> 185666 INFO  (searcherExecutor-834-thread-1) [    ] o.a.s.h.c.SpellCheckComponent Loading spell index for spellchecker: direct
   [junit4]   2> 185666 INFO  (searcherExecutor-834-thread-1) [    ] o.a.s.h.c.SpellCheckComponent Loading spell index for spellchecker: wordbreak
   [junit4]   2> 185666 INFO  (searcherExecutor-834-thread-1) [    ] o.a.s.h.c.SpellCheckComponent Loading spell index for spellchecker: multipleFields
   [junit4]   2> 185667 INFO  (TEST-AutoCommitTest.testMaxDocs-seed#[EF3FC2C764EA3A25]) [    ] o.a.s.s.SolrIndexSearcher Opening [Searcher@5af641f[collection1] realtime]
   [junit4]   2> 185669 INFO  (TEST-AutoCommitTest.testMaxDocs-seed#[EF3FC2C764EA3A25]) [    ] o.a.s.u.p.LogUpdateProcessorFactory [collection1]  webapp=null path=null params={_version_=-9223372036854775807&update.distrib=FROMLEADER&versions=true&wt=json&indent=true}{deleteByQuery=*:* (-9223372036854775807)} 0 3
   [junit4]   2> 185670 ERROR (TEST-AutoCommitTest.testMaxDocs-seed#[EF3FC2C764EA3A25]) [    ] o.a.s.c.CorePropertiesLocator Couldn't load core descriptor from C:\Users\jenkins\workspace\Lucene-Solr-7.0-Windows\solr\core\src\test-files\solr\collection1\core.properties:java.nio.file.NoSuchFileException: C:\Users\jenkins\workspace\Lucene-Solr-7.0-Windows\solr\core\src\test-files\solr\collection1\core.properties
   [junit4]   2> 185670 INFO  (TEST-AutoCommitTest.testMaxDocs-seed#[EF3FC2C764EA3A25]) [    ] o.a.s.c.SolrResourceLoader [null] Added 2 libs to classloader, from paths: [/C:/Users/jenkins/workspace/Lucene-Solr-7.0-Windows/solr/core/src/test-files/solr/collection1/lib, /C:/Users/jenkins/workspace/Lucene-Solr-7.0-Windows/solr/core/src/test-files/solr/collection1/lib/classes]
   [junit4]   2> 185671 INFO  (searcherExecutor-834-thread-1) [    ] o.a.s.h.c.SpellCheckComponent Loading spell index for spellchecker: jarowinkler
   [junit4]   2> 185674 INFO  (searcherExecutor-834-thread-1) [    ] o.a.s.h.c.SpellCheckComponent Loading spell index for spellchecker: external
   [junit4]   2> 185676 INFO  (searcherExecutor-834-thread-1) [    ] o.a.s.h.c.SpellCheckComponent Loading spell index for spellchecker: freq
   [junit4]   2> 185677 INFO  (searcherExecutor-834-thread-1) [    ] o.a.s.h.c.SpellCheckComponent Loading spell index for spellchecker: fqcn
   [junit4]   2> 185677 INFO  (searcherExecutor-834-thread-1) [    ] o.a.s.h.c.SpellCheckComponent Loading spell index for spellchecker: perDict
   [junit4]   2> 185679 INFO  (searcherExecutor-834-thread-1) [    ] o.a.s.c.SolrCore [collection1] Registered new searcher Searcher@6fcc2e9e[collection1] main{ExitableDirectoryReader(UninvertingDirectoryReader())}
   [junit4]   2> 185700 INFO  (TEST-AutoCommitTest.testMaxDocs-seed#[EF3FC2C764EA3A25]) [    ] o.a.s.c.SolrConfig Using Lucene MatchVersion: 7.0.0
   [junit4]   2> 185714 INFO  (TEST-AutoCommitTest.testMaxDocs-seed#[EF3FC2C764EA3A25]) [    ] o.a.s.s.IndexSchema [collection1] Schema name=test
   [junit4]   2> 185774 INFO  (TEST-AutoCommitTest.testMaxDocs-seed#[EF3FC2C764EA3A25]) [    ] o.a.s.s.IndexSchema Loaded schema test/1.0 with uniqueid field id
   [junit4]   2> 185786 INFO  (TEST-AutoCommitTest.testMaxDocs-seed#[EF3FC2C764EA3A25]) [    ] o.a.s.c.CoreContainer Reloading SolrCore 'collection1' using configuration from instancedir C:\Users\jenkins\workspace\Lucene-Solr-7.0-Windows\solr\core\src\test-files\solr\collection1
   [junit4]   2> 185797 INFO  (TEST-AutoCommitTest.testMaxDocs-seed#[EF3FC2C764EA3A25]) [    ] o.a.s.m.r.SolrJmxReporter JMX monitoring for 'solr.core.collection1' (registry 'solr.core.collection1') enabled at server: com.sun.jmx.mbeanserver.JmxMBeanServer@7bffb8d5
   [junit4]   2> 185797 INFO  (TEST-AutoCommitTest.testMaxDocs-seed#[EF3FC2C764EA3A25]) [    ] o.a.s.c.SolrCore [[collection1] ] Opening new SolrCore at [C:\Users\jenkins\workspace\Lucene-Solr-7.0-Windows\solr\core\src\test-files\solr\collection1], dataDir=[C:\Users\jenkins\workspace\Lucene-Solr-7.0-Windows\solr\build\solr-core\test\J1\temp\solr.update.AutoCommitTest_EF3FC2C764EA3A25-001\init-core-data-001\]
   [junit4]   2> 185870 INFO  (TEST-AutoCommitTest.testMaxDocs-seed#[EF3FC2C764EA3A25]) [    ] o.a.s.u.CommitTracker Hard AutoCommit: disabled
   [junit4]   2> 185870 INFO  (TEST-AutoCommitTest.testMaxDocs-seed#[EF3FC2C764EA3A25]) [    ] o.a.s.u.CommitTracker Soft AutoCommit: disabled
   [junit4]   2> 185871 INFO  (TEST-AutoCommitTest.testMaxDocs-seed#[EF3FC2C764EA3A25]) [    ] o.a.s.s.SolrIndexSearcher Opening [Searcher@5c3b0b17[collection1] main]
   [junit4]   2> 185873 INFO  (TEST-AutoCommitTest.testMaxDocs-seed#[EF3FC2C764EA3A25]) [    ] o.a.s.h.c.SpellCheckComponent Initializing spell checkers
   [junit4]   2> 185884 INFO  (TEST-AutoCommitTest.testMaxDocs-seed#[EF3FC2C764EA3A25]) [    ] o.a.s.s.DirectSolrSpellChecker init: {name=direct,classname=DirectSolrSpellChecker,field=lowerfilt,minQueryLength=3}
   [junit4]   2> 185899 INFO  (TEST-AutoCommitTest.testMaxDocs-seed#[EF3FC2C764EA3A25]) [    ] o.a.s.h.ReplicationHandler Commits will be reserved for  10000
   [junit4]   2> 185899 INFO  (searcherExecutor-839-thread-1) [    ] o.a.s.h.c.SpellCheckComponent Loading spell index for spellchecker: default
   [junit4]   2> 185900 INFO  (TEST-AutoCommitTest.testMaxDocs-seed#[EF3FC2C764EA3A25]) [    ] o.a.s.u.UpdateLog Could not find max version in index or recent updates, using new clock 1575553634233483264
   [junit4]   2> 185906 INFO  (searcherExecutor-839-thread-1) [    ] o.a.s.h.c.SpellCheckComponent Loading spell index for spellchecker: direct
   [junit4]   2> 185906 INFO  (searcherExecutor-839-thread-1) [    ] o.a.s.h.c.SpellCheckComponent Loading spell index for spellchecker: wordbreak
   [junit4]   2> 185906 INFO  (searcherExecutor-839-thread-1) [    ] o.a.s.h.c.SpellCheckComponent Loading spell index for spellchecker: multipleFields
   [junit4]   2> 185911 INFO  (searcherExecutor-839-thread-1) [    ] o.a.s.h.c.SpellCheckComponent Loading spell index for spellchecker: jarowinkler
   [junit4]   2> 185912 INFO  (searcherExecutor-839-thread-1) [    ] o.a.s.h.c.SpellCheckComponent Loading spell index for spellchecker: external
   [junit4]   2> 185913 INFO  (searcherExecutor-839-thread-1) [    ] o.a.s.h.c.SpellCheckComponent Loading spell index for spellchecker: freq
   [junit4]   2> 185916 INFO  (TEST-AutoCommitTest.testMaxDocs-seed#[EF3FC2C764EA3A25]) [    ] o.a.s.u.RandomMergePolicy RandomMergePolicy wrapping class org.apache.lucene.index.TieredMergePolicy: [TieredMergePolicy: maxMergeAtOnce=20, maxMergeAtOnceExplicit=32, maxMergedSegmentMB=37.501953125, floorSegmentMB=0.7841796875, forceMergeDeletesPctAllowed=18.69121408835776, segmentsPerTier=11.0, maxCFSSegmentSizeMB=8.796093022207999E12, noCFSRatio=0.0
   [junit4]   2> 185917 INFO  (searcherExecutor-839-thread-1) [    ] o.a.s.h.c.SpellCheckComponent Loading spell index for spellchecker: fqcn
   [junit4]   2> 185918 INFO  (TEST-AutoCommitTest.testMaxDocs-seed#[EF3FC2C764EA3A25]) [    ] o.a.s.u.DefaultSolrCoreState New IndexWriter is ready to be used.
   [junit4]   2> 185918 INFO  (searcherExecutor-839-thread-1) [    ] o.a.s.h.c.SpellCheckComponent Loading spell index for spellchecker: perDict
   [junit4]   2> 185919 INFO  (searcherExecutor-839-thread-1) [    ] o.a.s.c.SolrCore [collection1] Registered new searcher Searcher@5c3b0b17[collection1] main{ExitableDirectoryReader(UninvertingDirectoryReader())}
   [junit4]   2> 185919 INFO  (TEST-AutoCommitTest.testMaxDocs-seed#[EF3FC2C764EA3A25]) [    ] o.a.s.s.SolrIndexSearcher Opening [Searcher@78a6a2e2[collection1] main]
   [junit4]   2> 185921 INFO  (TEST-AutoCommitTest.testMaxDocs-seed#[EF3FC2C764EA3A25]) [    ] o.a.s.c.SolrCore [collection1]  CLOSING SolrCore org.apache.solr.core.SolrCore@5432ba3f
   [junit4]   2> 185921 INFO  (TEST-AutoCommitTest.testMaxDocs-seed#[EF3FC2C764EA3A25]) [    ] o.a.s.m.SolrMetricManager Closing metric reporters for registry=solr.core.collection1, tag=1412610623
   [junit4]   2> 185934 INFO  (searcherExecutor-839-thread-1) [    ] o.a.s.c.SolrCore [collection1] Registered new searcher Searcher@78a6a2e2[collection1] main{ExitableDirectoryReader(UninvertingDirectoryReader())}
   [junit4]   2> 185936 INFO  (TEST-AutoCommitTest.testMaxDocs-seed#[EF3FC2C764EA3A25]) [    ] o.a.s.u.p.LogUpdateProcessorFactory [collection1] {add=[0 (1575553634265989120)]} 0 5
   [junit4]   2> 185937 INFO  (TEST-AutoCommitTest.testMaxDocs-seed#[EF3FC2C764EA3A25]) [    ] o.a.s.u.p.LogUpdateProcessorFactory [collection1] {add=[1 (1575553634272280576)]} 0 6
   [junit4]   2> 185938 INFO  (TEST-AutoCommitTest.testMaxDocs-seed#[EF3FC2C764EA3A25]) [    ] o.a.s.u.p.LogUpdateProcessorFactory [collection1] {add=[2 (1575553634272280577)]} 0 6
   [junit4]   2> 185939 INFO  (TEST-AutoCommitTest.testMaxDocs-seed#[EF3FC2C764EA3A25]) [    ] o.a.s.u.p.LogUpdateProcessorFactory [collection1] {add=[3 (1575553634273329152)]} 0 9
   [junit4]   2> 185941 INFO  (TEST-AutoCommitTest.testMaxDocs-seed#[EF3FC2C764EA3A25]) [    ] o.a.s.u.p.LogUpdateProcessorFactory [collection1] {add=[4 (1575553634274377728)]} 0 10
   [junit4]   2> 185944 INFO  (TEST-AutoCommitTest.testMaxDocs-seed#[EF3FC2C764EA3A25]) [    ] o.a.s.u.p.LogUpdateProcessorFactory [collection1] {add=[5 (1575553634276474880)]} 0 14
   [junit4]   2> 185946 INFO  (TEST-AutoCommitTest.testMaxDocs-seed#[EF3FC2C764EA3A25]) [    ] o.a.s.u.p.LogUpdateProcessorFactory [collection1] {add=[6 (1575553634279620608)]} 0 15
   [junit4]   2> 185948 INFO  (TEST-AutoCommitTest.testMaxDocs-seed#[EF3FC2C764EA3A25]) [    ] o.a.s.u.p.LogUpdateProcessorFactory [collection1] {add=[7 (1575553634281717760)]} 0 17
   [junit4]   2> 185949 INFO  (TEST-AutoCommitTest.testMaxDocs-seed#[EF3FC2C764EA3A25]) [    ] o.a.s.u.p.LogUpdateProcessorFactory [collection1] {add=[8 (1575553634283814912)]} 0 18
   [junit4]   2> 185949 INFO  (TEST-AutoCommitTest.testMaxDocs-seed#[EF3FC2C764EA3A25]) [    ] o.a.s.u.p.LogUpdateProcessorFactory [collection1] {add=[9 (1575553634284863488)]} 0 18
   [junit4]   2> 185949 INFO  (TEST-AutoCommitTest.testMaxDocs-seed#[EF3FC2C764EA3A25]) [    ] o.a.s.u.p.LogUpdateProcessorFactory [collection1] {add=[10 (1575553634284863489)]} 0 18
   [junit4]   2> 185951 INFO  (TEST-AutoCommitTest.testMaxDocs-seed#[EF3FC2C764EA3A25]) [    ] o.a.s.u.p.LogUpdateProcessorFactory [collection1] {add=[11 (1575553634285912064)]} 0 20
   [junit4]   2> 185955 INFO  (TEST-AutoCommitTest.testMaxDocs-seed#[EF3FC2C764EA3A25]) [    ] o.a.s.u.p.LogUpdateProcessorFactory [collection1] {add=[12 (1575553634286960640)]} 0 24
   [junit4]   2> 185957 INFO  (TEST-AutoCommitTest.testMaxDocs-seed#[EF3FC2C764EA3A25]) [    ] o.a.s.u.p.LogUpdateProcessorFactory [collection1] {add=[13 (1575553634291154944)]} 0 26
   [junit4]   2> 185958 INFO  (TEST-AutoCommitTest.testMaxDocs-seed#[EF3FC2C764EA3A25]) [    ] o.a.s.c.S.Request [collection1]  webapp=null path=null params={q=id:1&qt=&start=0&rows=20&version=2.2} hits=0 status=0 QTime=0
   [junit4]   2> 185961 INFO  (TEST-AutoCommitTest.testMaxDocs-seed#[EF3FC2C764EA3A25]) [    ] o.a.s.u.p.LogUpdateProcessorFactory [collection1] {add=[14 (1575553634296397824)]} 0 30
   [junit4]   2> 185962 INFO  (TEST-AutoCommitTest.testMaxDocs-seed#[EF3FC2C764EA3A25]) [    ] o.a.s.u.p.LogUpdateProcessorFactory [collection1] {add=[15 (1575553634298494976)]} 0 31
   [junit4]   2> 185962 INFO  (TEST-AutoCommitTest.testMaxDocs-seed#[EF3FC2C764EA3A25]) [    ] o.a.s.c.S.Request [collection1]  webapp=null path=null params={q=id:14&qt=&start=0&rows=20&version=2.2} hits=0 status=0 QTime=0
   [junit4]   2> 185963 ERROR (TEST-AutoCommitTest.testMaxDocs-seed#[EF3FC2C764EA3A25]) [    ] o.a.s.SolrTestCaseJ4 REQUEST FAILED: xpath=//result[@numFound=1]
   [junit4]   2> xml response was: <?xml version="1.0" encoding="UTF-8"?>
   [junit4]   2> <response>
   [junit4]   2> <lst name="responseHeader"><int name="status">0</int><int name="QTime">0</int></lst><result name="response" numFound="0" start="0"></result>
   [junit4]   2> </response>
   [junit4]   2>
   [junit4]   2> request was:q=id:14&qt=&start=0&rows=20&version=2.2
   [junit4]   2> 185964 ERROR (TEST-AutoCommitTest.testMaxDocs-seed#[EF3FC2C764EA3A25]) [    ] o.a.s.SolrTestCaseJ4 REQUEST FAILED: q=id:14&qt=&start=0&rows=20&version=2.2:java.lang.RuntimeException: REQUEST FAILED: xpath=//result[@numFound=1]
   [junit4]   2> xml response was: <?xml version="1.0" encoding="UTF-8"?>
   [junit4]   2> <response>
   [junit4]   2> <lst name="responseHeader"><int name="status">0</int><int name="QTime">0</int></lst><result name="response" numFound="0" start="0"></result>
   [junit4]   2> </response>
   [junit4]   2>
   [junit4]   2> request was:q=id:14&qt=&start=0&rows=20&version=2.2
   [junit4]   2> at org.apache.solr.SolrTestCaseJ4.assertQ(SolrTestCaseJ4.java:878)
   [junit4]   2> at org.apache.solr.update.AutoCommitTest.testMaxDocs(AutoCommitTest.java:225)
   [junit4]   2> at java.base/jdk.internal.reflect.NativeMethodAccessorImpl.invoke0(Native Method)
   [junit4]   2> at java.base/jdk.internal.reflect.NativeMethodAccessorImpl.invoke(NativeMethodAccessorImpl.java:62)
   [junit4]   2> at java.base/jdk.internal.reflect.DelegatingMethodAccessorImpl.invoke(DelegatingMethodAccessorImpl.java:43)
   [junit4]   2> at java.base/java.lang.reflect.Method.invoke(Method.java:564)
   [junit4]   2> at com.carrotsearch.randomizedtesting.RandomizedRunner.invoke(RandomizedRunner.java:1713)
   [junit4]   2> at com.carrotsearch.randomizedtesting.RandomizedRunner$8.evaluate(RandomizedRunner.java:907)
   [junit4]   2> at com.carrotsearch.randomizedtesting.RandomizedRunner$9.evaluate(RandomizedRunner.java:943)
   [junit4]   2> at com.carrotsearch.randomizedtesting.RandomizedRunner$10.evaluate(RandomizedRunner.java:957)
   [junit4]   2> at com.carrotsearch.randomizedtesting.rules.SystemPropertiesRestoreRule$1.evaluate(SystemPropertiesRestoreRule.java:57)
   [junit4]   2> at org.apache.lucene.util.TestRuleSetupTeardownChained$1.evaluate(TestRuleSetupTeardownChained.java:49)
   [junit4]   2> at org.apache.lucene.util.AbstractBeforeAfterRule$1.evaluate(AbstractBeforeAfterRule.java:45)
   [junit4]   2> at org.apache.lucene.util.TestRuleThreadAndTestName$1.evaluate(TestRuleThreadAndTestName.java:48)
   [junit4]   2> at org.apache.lucene.util.TestRuleIgnoreAfterMaxFailures$1.evaluate(TestRuleIgnoreAfterMaxFailures.java:64)
   [junit4]   2> at org.apache.lucene.util.TestRuleMarkFailure$1.evaluate(TestRuleMarkFailure.java:47)
   [junit4]   2> at com.carrotsearch.randomizedtesting.rules.StatementAdapter.evaluate(StatementAdapter.java:36)
   [junit4]   2> at com.carrotsearch.randomizedtesting.ThreadLeakControl$StatementRunner.run(ThreadLeakControl.java:368)
   [junit4]   2> at com.carrotsearch.randomizedtesting.ThreadLeakControl.forkTimeoutingTask(ThreadLeakControl.java:817)
   [junit4]   2> at com.carrotsearch.randomizedtesting.ThreadLeakControl$3.evaluate(ThreadLeakControl.java:468)
   [junit4]   2> at com.carrotsearch.randomizedtesting.RandomizedRunner.runSingleTest(RandomizedRunner.java:916)
   [junit4]   2> at com.carrotsearch.randomizedtesting.RandomizedRunner$5.evaluate(RandomizedRunner.java:802)
   [junit4]   2> at com.carrotsearch.randomizedtesting.RandomizedRunner$6.evaluate(RandomizedRunner.java:852)
   [junit4]   2> at com.carrotsearch.randomizedtesting.RandomizedRunner$7.evaluate(RandomizedRunner.java:863)
   [junit4]   2> at com.carrotsearch.randomizedtesting.rules.StatementAdapter.evaluate(StatementAdapter.java:36)
   [junit4]   2> at com.carrotsearch.randomizedtesting.rules.SystemPropertiesRestoreRule$1.evaluate(SystemPropertiesRestoreRule.java:57)
   [junit4]   2> at org.apache.lucene.util.AbstractBeforeAfterRule$1.evaluate(AbstractBeforeAfterRule.java:45)
   [junit4]   2> at com.carrotsearch.randomizedtesting.rules.StatementAdapter.evaluate(StatementAdapter.java:36)
   [junit4]   2> at org.apache.lucene.util.TestRuleStoreClassName$1.evaluate(TestRuleStoreClassName.java:41)
   [junit4]   2> at com.carrotsearch.randomizedtesting.rules.NoShadowingOrOverridesOnMethodsRule$1.evaluate(NoShadowingOrOverridesOnMethodsRule.java:40)
   [junit4]   2> at com.carrotsearch.randomizedtesting.rules.NoShadowingOrOverridesOnMethodsRule$1.evaluate(NoShadowingOrOverridesOnMethodsRule.java:40)
   [junit4]   2> at com.carrotsearch.randomizedtesting.rules.StatementAdapter.evaluate(StatementAdapter.java:36)
   [junit4]   2> at com.carrotsearch.randomizedtesting.rules.StatementAdapter.evaluate(StatementAdapter.java:36)
   [junit4]   2> at org.apache.lucene.util.TestRuleAssertionsRequired$1.evaluate(TestRuleAssertionsRequired.java:53)
   [junit4]   2> at org.apache.lucene.util.TestRuleMarkFailure$1.evaluate(TestRuleMarkFailure.java:47)
   [junit4]   2> at org.apache.lucene.util.TestRuleIgnoreAfterMaxFailures$1.evaluate(TestRuleIgnoreAfterMaxFailures.java:64)
   [junit4]   2> at org.apache.lucene.util.TestRuleIgnoreTestSuites$1.evaluate(TestRuleIgnoreTestSuites.java:54)
   [junit4]   2> at com.carrotsearch.randomizedtesting.rules.StatementAdapter.evaluate(StatementAdapter.java:36)
   [junit4]   2> at com.carrotsearch.randomizedtesting.ThreadLeakControl$StatementRunner.run(ThreadLeakControl.java:368)
   [junit4]   2> at java.base/java.lang.Thread.run(Thread.java:844)
   [junit4]   2>
   [junit4]   2> 185965 INFO  (TEST-AutoCommitTest.testMaxDocs-seed#[EF3FC2C764EA3A25]) [    ] o.a.s.SolrTestCaseJ4 ###Ending testMaxDocs
   [junit4]   2> NOTE: reproduce with: ant test  -Dtestcase=AutoCommitTest -Dtests.method=testMaxDocs -Dtests.seed=EF3FC2C764EA3A25 -Dtests.slow=true -Dtests.locale=gsw-CH -Dtests.timezone=Africa/Banjul -Dtests.asserts=true -Dtests.file.encoding=Cp1252
   [junit4] ERROR   0.30s J1 | AutoCommitTest.testMaxDocs <<<
   [junit4]    > Throwable #1: java.lang.RuntimeException: Exception during query
   [junit4]    > at __randomizedtesting.SeedInfo.seed([EF3FC2C764EA3A25:56BE141848003EAF]:0)
   [junit4]    > at org.apache.solr.SolrTestCaseJ4.assertQ(SolrTestCaseJ4.java:885)
   [junit4]    > at org.apache.solr.update.AutoCommitTest.testMaxDocs(AutoCommitTest.java:225)
   [junit4]    > at java.base/jdk.internal.reflect.NativeMethodAccessorImpl.invoke0(Native Method)
   [junit4]    > at java.base/jdk.internal.reflect.NativeMethodAccessorImpl.invoke(NativeMethodAccessorImpl.java:62)
   [junit4]    > at java.base/jdk.internal.reflect.DelegatingMethodAccessorImpl.invoke(DelegatingMethodAccessorImpl.java:43)
   [junit4]    > at java.base/java.lang.reflect.Method.invoke(Method.java:564)
   [junit4]    > at java.base/java.lang.Thread.run(Thread.java:844)
   [junit4]    > Caused by: java.lang.RuntimeException: REQUEST FAILED: xpath=//result[@numFound=1]
   [junit4]    > xml response was: <?xml version="1.0" encoding="UTF-8"?>
   [junit4]    > <response>
   [junit4]    > <lst name="responseHeader"><int name="status">0</int><int name="QTime">0</int></lst><result name="response" numFound="0" start="0"></result>
   [junit4]    > </response>
   [junit4]    > request was:q=id:14&qt=&start=0&rows=20&version=2.2
   [junit4]    > at org.apache.solr.SolrTestCaseJ4.assertQ(SolrTestCaseJ4.java:878)
   [junit4]    > ... 39 more
   [junit4]   2> 185980 INFO  (TEST-AutoCommitTest.testMaxTime-seed#[EF3FC2C764EA3A25]) [    ] o.a.s.SolrTestCaseJ4 ###Starting testMaxTime
   [junit4]   2> 185981 INFO  (TEST-AutoCommitTest.testMaxTime-seed#[EF3FC2C764EA3A25]) [    ] o.a.s.u.DirectUpdateHandler2 [collection1] REMOVING ALL DOCUMENTS FROM INDEX
   [junit4]   2> 185981 INFO  (commitScheduler-842-thread-1) [    ] o.a.s.u.DirectUpdateHandler2 start commit{,optimize=false,openSearcher=true,waitSearcher=true,expungeDeletes=false,softCommit=true,prepareCommit=false}
   [junit4]   2> 185984 INFO  (TEST-AutoCommitTest.testMaxTime-seed#[EF3FC2C764EA3A25]) [    ] o.a.s.s.SolrIndexSearcher Opening [Searcher@1a7e563d[collection1] realtime]
   [junit4]   2> 185985 INFO  (commitScheduler-842-thread-1) [    ] o.a.s.s.SolrIndexSearcher Opening [Searcher@34f135d8[collection1] main]
   [junit4]   2> 185985 INFO  (commitScheduler-842-thread-1) [    ] o.a.s.u.DirectUpdateHandler2 end_commit_flush
   [junit4]   2> 185991 INFO  (searcherExecutor-839-thread-1) [    ] o.a.s.c.SolrCore [collection1] Registered new searcher Searcher@34f135d8[collection1] main{ExitableDirectoryReader(UninvertingDirectoryReader())}
   [junit4]   2> 185991 INFO  (TEST-AutoCommitTest.testMaxTime-seed#[EF3FC2C764EA3A25]) [    ] o.a.s.u.p.LogUpdateProcessorFactory [collection1]  webapp=null path=null params={_version_=-9223372036854775807&update.distrib=FROMLEADER&versions=true&wt=json&indent=true}{deleteByQuery=*:* (-9223372036854775807)} 0 10
   [junit4]   2> 185993 ERROR (TEST-AutoCommitTest.testMaxTime-seed#[EF3FC2C764EA3A25]) [    ] o.a.s.c.CorePropertiesLocator Couldn't load core descriptor from C:\Users\jenkins\workspace\Lucene-Solr-7.0-Windows\solr\core\src\test-files\solr\collection1\core.properties:java.nio.file.NoSuchFileException: C:\Users\jenkins\workspace\Lucene-Solr-7.0-Windows\solr\core\src\test-files\solr\collection1\core.properties
   [junit4]   2> 185994 INFO  (TEST-AutoCommitTest.testMaxTime-seed#[EF3FC2C764EA3A25]) [    ] o.a.s.c.SolrResourceLoader [null] Added 2 libs to classloader, from paths: [/C:/Users/jenkins/workspace/Lucene-Solr-7.0-Windows/solr/core/src/test-files/solr/collection1/lib, /C:/Users/jenkins/workspace/Lucene-Solr-7.0-Windows/solr/core/src/test-files/solr/collection1/lib/classes]
   [junit4]   2> 186036 INFO  (TEST-AutoCommitTest.testMaxTime-seed#[EF3FC2C764EA3A25]) [    ] o.a.s.c.SolrConfig Using Lucene MatchVersion: 7.0.0
   [junit4]   2> 186063 INFO  (TEST-AutoCommitTest.testMaxTime-seed#[EF3FC2C764EA3A25]) [    ] o.a.s.s.IndexSchema [collection1] Schema name=test
   [junit4]   2> 186182 INFO  (TEST-AutoCommitTest.testMaxTime-seed#[EF3FC2C764EA3A25]) [    ] o.a.s.s.IndexSchema Loaded schema test/1.0 with uniqueid field id
   [junit4]   2> 186193 INFO  (TEST-AutoCommitTest.testMaxTime-seed#[EF3FC2C764EA3A25]) [    ] o.a.s.c.CoreContainer Reloading SolrCore 'collection1' using configuration from instancedir C:\Users\jenkins\workspace\Lucene-Solr-7.0-Windows\solr\core\src\test-files\solr\collection1
   [junit4]   2> 186202 INFO  (TEST-AutoCommitTest.testMaxTime-seed#[EF3FC2C764EA3A25]) [    ] o.a.s.m.r.SolrJmxReporter JMX monitoring for 'solr.core.collection1' (registry 'solr.core.collection1') enabled at server: com.sun.jmx.mbeanserver.JmxMBeanServer@7bffb8d5
   [junit4]   2> 186202 INFO  (TEST-AutoCommitTest.testMaxTime-seed#[EF3FC2C764EA3A25]) [    ] o.a.s.c.SolrCore [[collection1] ] Opening new SolrCore at [C:\Users\jenkins\workspace\Lucene-Solr-7.0-Windows\solr\core\src\test-files\solr\collection1], dataDir=[C:\Users\jenkins\workspace\Lucene-Solr-7.0-Windows\solr\build\solr-core\test\J1\temp\solr.update.AutoCommitTest_EF3FC2C764EA3A25-001\init-core-data-001\]
   [junit4]   2> 186297 INFO  (TEST-AutoCommitTest.testMaxTime-seed#[EF3FC2C764EA3A25]) [    ] o.a.s.u.CommitTracker Hard AutoCommit: disabled
   [junit4]   2> 186297 INFO  (TEST-AutoCommitTest.testMaxTime-seed#[EF3FC2C764EA3A25]) [    ] o.a.s.u.CommitTracker Soft AutoCommit: disabled
   [junit4]   2> 186298 INFO  (TEST-AutoCommitTest.testMaxTime-seed#[EF3FC2C764EA3A25]) [    ] o.a.s.s.SolrIndexSearcher Opening [Searcher@135ef3b9[collection1] main]
   [junit4]   2> 186299 INFO  (TEST-AutoCommitTest.testMaxTime-seed#[EF3FC2C764EA3A25]) [    ] o.a.s.h.c.SpellCheckComponent Initializing spell checkers
   [junit4]   2> 186302 INFO  (TEST-AutoCommitTest.testMaxTime-seed#[EF3FC2C764EA3A25]) [    ] o.a.s.s.DirectSolrSpellChecker init: {name=direct,classname=DirectSolrSpellChecker,field=lowerfilt,minQueryLength=3}
   [junit4]   2> 186307 INFO  (TEST-AutoCommitTest.testMaxTime-seed#[EF3FC2C764EA3A25]) [    ] o.a.s.h.ReplicationHandler Commits will be reserved for  10000
   [junit4]   2> 186308 INFO  (searcherExecutor-843-thread-1) [    ] o.a.s.h.c.SpellCheckComponent Loading spell index for spellchecker: default
   [junit4]   2> 186308 INFO  (searcherExecutor-843-thread-1) [    ] o.a.s.h.c.SpellCheckComponent Loading spell index for spellchecker: direct
   [junit4]   2> 186308 INFO  (searcherExecutor-843-thread-1) [    ] o.a.s.h.c.SpellCheckComponent Loading spell index for spellchecker: wordbreak
   [junit4]   2> 186308 INFO  (searcherExecutor-843-thread-1) [    ] o.a.s.h.c.SpellCheckComponent Loading spell index for spellchecker: multipleFields
   [junit4]   2> 186308 INFO  (searcherExecutor-843-thread-1) [    ] o.a.s.h.c.SpellCheckComponent Loading spell index for spellchecker: jarowinkler
   [junit4]   2> 186309 INFO  (searcherExecutor-843-thread-1) [    ] o.a.s.h.c.SpellCheckComponent Loading spell index for spellchecker: external
   [junit4]   2> 186309 INFO  (searcherExecutor-843-thread-1) [    ] o.a.s.h.c.SpellCheckComponent Loading spell index for spellchecker: freq
   [junit4]   2> 186309 INFO  (searcherExecutor-843-thread-1) [    ] o.a.s.h.c.SpellCheckComponent Loading spell index for spellchecker: fqcn
   [junit4]   2> 186310 INFO  (searcherExecutor-843-thread-1) [    ] o.a.s.h.c.SpellCheckComponent Loading spell index for spellchecker: perDict
   [junit4]   2> 186310 INFO  (TEST-AutoCommitTest.testMaxTime-seed#[EF3FC2C764EA3A25]) [    ] o.a.s.u.RandomMergePolicy RandomMergePolicy wrapping class org.apache.lucene.index.LogDocMergePolicy: [LogDocMergePolicy: minMergeSize=1000, mergeFactor=19, maxMergeSize=9223372036854775807, maxMergeSizeForForcedMerge=9223372036854775807, calibrateSizeByDeletes=false, maxMergeDocs=2147483647, maxCFSSegmentSizeMB=8.796093022207999E12, noCFSRatio=0.7934940112019325]
   [junit4]   2> 186310 INFO  (TEST-AutoCommitTest.testMaxTime-seed#[EF3FC2C764EA3A25]) [    ] o.a.s.u.DefaultSolrCoreState New IndexWriter is ready to be used.
   [junit4]   2> 186311 INFO  (searcherExecutor-843-thread-1) [    ] o.a.s.c.SolrCore [collection1] Registered new searcher Searcher@135ef3b9[collection1] main{ExitableDirectoryReader(UninvertingDirectoryReader())}
   [junit4]   2> 186311 INFO  (TEST-AutoCommitTest.testMaxTime-seed#[EF3FC2C764EA3A25]) [    ] o.a.s.s.SolrIndexSearcher Opening [Searcher@b863559[collection1] main]
   [junit4]   2> 186312 INFO  (TEST-AutoCommitTest.testMaxTime-seed#[EF3FC2C764EA3A25]) [    ] o.a.s.c.SolrCore [collection1]  CLOSING SolrCore org.apache.solr.core.SolrCore@242716b4
   [junit4]   2> 186312 INFO  (TEST-AutoCommitTest.testMaxTime-seed#[EF3FC2C764EA3A25]) [    ] o.a.s.m.SolrMetricManager Closing metric reporters for registry=solr.core.collection1, tag=606541492
   [junit4]   2> 186313 INFO  (searcherExecutor-843-thread-1) [    ] o.a.s.c.SolrCore [collection1] Registered new searcher Searcher@b863559[collection1] main{ExitableDirectoryReader(UninvertingDirectoryReader())}
   [junit4]   2> 186316 INFO  (TEST-AutoCommitTest.testMaxTime-seed#[EF3FC2C764EA3A25]) [    ] o.a.s.u.p.LogUpdateProcessorFactory [collection1] {add=[529 (1575553634668642304)]} 0 1
   [junit4]   2> 186316 INFO  (TEST-AutoCommitTest.testMaxTime-seed#[EF3FC2C764EA3A25]) [    ] o.a.s.c.S.Request [collection1]  webapp=null path=null params={q=id:529&qt=&start=0&rows=20&version=2.2} hits=0 status=0 QTime=0
   [junit4]   2> 187816 INFO  (commitScheduler-846-thread-1) [    ] o.a.s.u.DirectUpdateHandler2 start commit{,optimize=false,openSearcher=true,waitSearcher=true,expungeDeletes=false,softCommit=true,prepareCommit=false}
   [junit4]   2> 187821 INFO  (commitScheduler-846-thread-1) [    ] o.a.s.s.SolrIndexSearcher Opening [Searcher@563310c[collection1] main]
   [junit4]   2> 187821 INFO  (commitScheduler-846-thread-1) [    ] o.a.s.u.DirectUpdateHandler2 end_commit_flush
   [junit4]   2> 187822 INFO  (searcherExecutor-843-thread-1) [    ] o.a.s.c.SolrCore [collection1] Registered new searcher Searcher@563310c[collection1] main{ExitableDirectoryReader(UninvertingDirectoryReader(Uninverting(_1(7.0.0):C1)))}
   [junit4]   2> 188072 INFO  (TEST-AutoCommitTest.testMaxTime-seed#[EF3FC2C764EA3A25]) [    ] o.a.s.u.p.LogUpdateProcessorFactory [collection1] {add=[530 (1575553636509941760)]} 0 1757
   [junit4]   2> 188072 INFO  (TEST-AutoCommitTest.testMaxTime-seed#[EF3FC2C764EA3A25]) [    ] o.a.s.c.S.Request [collection1]  webapp=null path=null params={q=id:529&qt=&start=0&rows=20&version=2.2} hits=1 status=0 QTime=0
   [junit4]   2> 188075 INFO  (TEST-AutoCommitTest.testMaxTime-seed#[EF3FC2C764EA3A25]) [    ] o.a.s.c.S.Request [collection1]  webapp=null path=null params={q=id:530&qt=&start=0&rows=20&version=2.2} hits=0 status=0 QTime=0
   [junit4]   2> 188076 INFO  (TEST-AutoCommitTest.testMaxTime-seed#[EF3FC2C764EA3A25]) [    ] o.a.s.u.p.LogUpdateProcessorFactory [collection1]  webapp=null path=null params={}{delete=[529 (-1575553636514136064)]} 0 0
   [junit4]   2> 188077 INFO  (TEST-AutoCommitTest.testMaxTime-seed#[EF3FC2C764EA3A25]) [    ] o.a.s.c.S.Request [collection1]  webapp=null path=null params={q=id:529&qt=&start=0&rows=20&version=2.2} hits=1 status=0 QTime=0
   [junit4]   2> 189575 INFO  (commitScheduler-846-thread-1) [    ] o.a.s.u.DirectUpdateHandler2 start commit{,optimize=false,openSearcher=true,waitSearcher=true,expungeDeletes=false,softCommit=true,prepareCommit=false}
   [junit4]   2> 189587 INFO  (commitScheduler-846-thread-1) [    ] o.a.s.s.SolrIndexSearcher Opening [Searcher@25c56b0a[collection1] main]
   [junit4]   2> 189587 INFO  (commitScheduler-846-thread-1) [    ] o.a.s.u.DirectUpdateHandler2 end_commit_flush
   [junit4]   2> 189589 INFO  (searcherExecutor-843-thread-1) [    ] o.a.s.c.SolrCore [collection1] Registered new searcher Searcher@25c56b0a[collection1] main{ExitableDirectoryReader(UninvertingDirectoryReader(Uninverting(_2(7.0.0):C1)))}
   [junit4]   2> 189834 INFO  (TEST-AutoCommitTest.testMaxTime-seed#[EF3FC2C764EA3A25]) [    ] o.a.s.u.p.LogUpdateProcessorFactory [collection1] {add=[550 (1575553638357532672)]} 0 3520
   [junit4]   2> 189836 INFO  (TEST-AutoCommitTest.testMaxTime-seed#[EF3FC2C764EA3A25]) [    ] o.a.s.c.S.Request [collection1]  webapp=null path=null params={q=id:529&qt=&start=0&rows=20&version=2.2} hits=0 status=0 QTime=0
   [junit4]   2> 189838 INFO  (TEST-AutoCommitTest.testMaxTime-seed#[EF3FC2C764EA3A25]) [    ] o.a.s.u.p.LogUpdateProcessorFactory [collection1] {add=[500 (1575553638361726976)]} 0 3523
   [junit4]   2> 189838 INFO  (TEST-AutoCommitTest.testMaxTime-seed#[EF3FC2C764EA3A25]) [    ] o.a.s.u.p.LogUpdateProcessorFactory [collection1] {add=[500 (1575553638362775552)]} 0 3523
   [junit4]   2> 189838 INFO  (TEST-AutoCommitTest.testMaxTime-seed#[EF3FC2C764EA3A25]) [    ] o.a.s.u.p.LogUpdateProcessorFactory [collection1] {add=[500 (1575553638362775553)]} 0 3523
   [junit4]   2> 189838 INFO  (TEST-AutoCommitTest.testMaxTime-seed#[EF3FC2C764EA3A25]) [    ] o.a.s.u.p.LogUpdateProcessorFactory [collection1] {add=[500 (1575553638362775554)]} 0 3523
   [junit4]   2> 189839 INFO  (TEST-AutoCommitTest.testMaxTime-seed#[EF3FC2C764EA3A25]) [    ] o.a.s.u.p.LogUpdateProcessorFactory [collection1] {add=[500 (1575553638362775555)]} 0 3524
   [junit4]   2> 189839 INFO  (TEST-AutoCommitTest.testMaxTime-seed#[EF3FC2C764EA3A25]) [    ] o.a.s.u.p.LogUpdateProcessorFactory [collection1] {add=[500 (1575553638363824128)]} 0 3524
   [junit4]   2> 189839 INFO  (TEST-AutoCommitTest.testMaxTime-seed#[EF3FC2C764EA3A25]) [    ] o.a.s.u.p.LogUpdateProcessorFactory [collection1] {add=[500 (1575553638363824129)]} 0 3524
   [junit4]   2> 189840 INFO  (TEST-AutoCommitTest.testMaxTime-seed#[EF3FC2C764EA3A25]) [    ] o.a.s.u.p.LogUpdateProcessorFactory [collection1] {add=[500 (1575553638363824130)]} 0 3525
   [junit4]   2> 189840 INFO  (TEST-AutoCommitTest.testMaxTime-seed#[EF3FC2C764EA3A25]) [    ] o.a.s.u.p.LogUpdateProcessorFactory [collection1] {add=[500 (1575553638364872704)]} 0 3525
   [junit4]   2> 189841 INFO  (TEST-AutoCommitTest.testMaxTime-seed#[EF3FC2C764EA3A25]) [    ] o.a.s.u.p.LogUpdateProcessorFactory [collection1] {add=[500 (1575553638365921280)]} 0 3526
   [junit4]   2> 189841 INFO  (TEST-AutoCommitTest.testMaxTime-seed#[EF3FC2C764EA3A25]) [    ] o.a.s.c.S.Request [collection1]  webapp=null path=null params={q=id:500&qt=&start=0&rows=20&version=2.2} hits=0 status=0 QTime=0
   [junit4]   2> 191338 INFO  (commitScheduler-846-thread-1) [    ] o.a.s.u.DirectUpdateHandler2 start commit{,optimize=false,openSearcher=true,waitSearcher=true,expungeDeletes=false,softCommit=true,prepareCommit=false}
   [junit4]   2> 191340 INFO  (commitScheduler-846-thread-1) [    ] o.a.s.s.SolrIndexSearcher Opening [Searcher@49594136[collection1] main]
   [junit4]   2> 191340 INFO  (searcherExecutor-843-thread-1) [    ] o.a.s.c.SolrCore [collection1] Registered new searcher Searcher@49594136[collection1] main{ExitableDirectoryReader(UninvertingDirectoryReader(Uninverting(_2(7.0.0):C1) Uninverting(_3(7.0.0):C11/9:delGen=1)))}
   [junit4]   2> 191340 INFO  (commitScheduler-846-thread-1) [    ] o.a.s.u.DirectUpdateHandler2 end_commit_flush
   [junit4]   2> 191349 INFO  (TEST-AutoCommitTest.testMaxTime-seed#[EF3FC2C764EA3A25]) [    ] o.a.s.u.p.LogUpdateProcessorFactory [collection1] {add=[531 (1575553639947173888)]} 0 5036
   [junit4]   2> 191349 INFO  (TEST-AutoCommitTest.testMaxTime-seed#[EF3FC2C764EA3A25]) [    ] o.a.s.c.S.Request [collection1]  webapp=null path=null params={q=id:500&qt=&start=0&rows=20&version=2.2} hits=1 status=0 QTime=0
   [junit4]   2> 191349 INFO  (TEST-AutoCommitTest.testMaxTime-seed#[EF3FC2C764EA3A25]) [    ] o.a.s.SolrTestCaseJ4 ###Ending testMaxTime
   [junit4]   2> 191355 INFO  (TEST-AutoCommitTest.testCommitWithin-seed#[EF3FC2C764EA3A25]) [    ] o.a.s.SolrTestCaseJ4 ###Starting testCommitWithin
   [junit4]   2> 191355 INFO  (TEST-AutoCommitTest.testCommitWithin-seed#[EF3FC2C764EA3A25]) [    ] o.a.s.u.DirectUpdateHandler2 [collection1] REMOVING ALL DOCUMENTS FROM INDEX
   [junit4]   2> 191355 INFO  (TEST-AutoCommitTest.testCommitWithin-seed#[EF3FC2C764EA3A25]) [    ] o.a.s.s.SolrIndexSearcher Opening [Searcher@562798ed[collection1] realtime]
   [junit4]   2> 191355 INFO  (TEST-AutoCommitTest.testCommitWithin-seed#[EF3FC2C764EA3A25]) [    ] o.a.s.u.p.LogUpdateProcessorFactory [collection1]  webapp=null path=null params={_version_=-9223372036854775807&update.distrib=FROMLEADER&versions=true&wt=json&indent=true}{deleteByQuery=*:* (-9223372036854775807)} 0 1
   [junit4]   2> 191355 ERROR (TEST-AutoCommitTest.testCommitWithin-seed#[EF3FC2C764EA3A25]) [    ] o.a.s.c.CorePropertiesLocator Couldn't load core descriptor from C:\Users\jenkins\workspace\Lucene-Solr-7.0-Windows\solr\core\src\test-files\solr\collection1\core.properties:java.nio.file.NoSuchFileException: C:\Users\jenkins\workspace\Lucene-Solr-7.0-Windows\solr\core\src\test-files\solr\collection1\core.properties
   [junit4]   2> 191355 INFO  (TEST-AutoCommitTest.testCommitWithin-seed#[EF3FC2C764EA3A25]) [    ] o.a.s.c.SolrResourceLoader [null] Added 2 libs to classloader, from paths: [/C:/Users/jenkins/workspace/Lucene-Solr-7.0-Windows/solr/core/src/test-files/solr/collection1/lib, /C:/Users/jenkins/workspace/Lucene-Solr-7.0-Windows/solr/core/src/test-files/solr/collection1/lib/classes]
   [junit4]   2> 191436 INFO  (TEST-AutoCommitTest.testCommitWithin-seed#[EF3FC2C764EA3A25]) [    ] o.a.s.c.SolrConfig Using Lucene MatchVersion: 7.0.0
   [junit4]   2> 191459 INFO  (TEST-AutoCommitTest.testCommitWithin-seed#[EF3FC2C764EA3A25]) [    ] o.a.s.s.IndexSchema [collection1] Schema name=test
   [junit4]   2> 191554 INFO  (TEST-AutoCommitTest.testCommitWithin-seed#[EF3FC2C764EA3A25]) [    ] o.a.s.s.IndexSchema Loaded schema test/1.0 with uniqueid field id
   [junit4]   2> 191571 INFO  (TEST-AutoCommitTest.testCommitWithin-seed#[EF3FC2C764EA3A25]) [    ] o.a.s.c.CoreContainer Reloading SolrCore 'collection1' using configuration from instancedir C:\Users\jenkins\workspace\Lucene-Solr-7.0-Windows\solr\core\src\test-files\solr\collection1
   [junit4]   2> 191597 INFO  (TEST-AutoCommitTest.testCommitWithin-seed#[EF3FC2C764EA3A25]) [    ] o.a.s.m.r.SolrJmxReporter JMX monitoring for 'solr.core.collection1' (registry 'solr.core.collection1') enabled at server: com.sun.jmx.mbeanserver.JmxMBeanServer@7bffb8d5
   [junit4]   2> 191597 INFO  (TEST-AutoCommitTest.testCommitWithin-seed#[EF3FC2C764EA3A25]) [    ] o.a.s.c.SolrCore [[collection1] ] Opening new SolrCore at [C:\Users\jenkins\workspace\Lucene-Solr-7.0-Windows\solr\core\src\test-files\solr\collection1], dataDir=[C:\Users\jenkins\workspace\Lucene-Solr-7.0-Windows\solr\build\solr-core\test\J1\temp\solr.update.AutoCommitTest_EF3FC2C764EA3A25-001\init-core-data-001\]
   [junit4]   2> 191779 INFO  (TEST-AutoCommitTest.testCommitWithin-seed#[EF3FC2C764EA3A25]) [    ] o.a.s.u.CommitTracker Hard AutoCommit: disabled
   [junit4]   2> 191779 INFO  (TEST-AutoCommitTest.testCommitWithin-seed#[EF3FC2C764EA3A25]) [    ] o.a.s.u.CommitTracker Soft AutoCommit: disabled
   [junit4]   2> 191783 INFO  (TEST-AutoCommitTest.testCommitWithin-seed#[EF3FC2C764EA3A25]) [    ] o.a.s.s.SolrIndexSearcher Opening [Searcher@4013160e[collection1] main]
   [junit4]   2> 191785 INFO  (TEST-AutoCommitTest.testCommitWithin-seed#[EF3FC2C764EA3A25]) [    ] o.a.s.h.c.SpellCheckComponent Initializing spell checkers
   [junit4]   2> 191786 INFO  (TEST-AutoCommitTest.testCommitWithin-seed#[EF3FC2C764EA3A25]) [    ] o.a.s.s.DirectSolrSpellChecker init: {name=direct,classname=DirectSolrSpellChecker,field=lowerfilt,minQueryLength=3}
   [junit4]   2> 191802 INFO  (TEST-AutoCommitTest.testCommitWithin-seed#[EF3FC2C764EA3A25]) [    ] o.a.s.h.ReplicationHandler Commits will be reserved for  10000
   [junit4]   2> 191802 INFO  (searcherExecutor-847-thread-1) [    ] o.a.s.h.c.SpellCheckComponent Loading spell index for spellchecker: default
   [junit4]   2> 191808 INFO  (searcherExecutor-847-thread-1) [    ] o.a.s.h.c.SpellCheckComponent Loading spell index for spellchecker: direct
   [junit4]   2> 191808 INFO  (searcherExecutor-847-thread-1) [    ] o.a.s.h.c.SpellCheckComponent Loading spell index for spellchecker: wordbreak
   [junit4]   2> 191808 INFO  (searcherExecutor-847-thread-1) [    ] o.a.s.h.c.SpellCheckComponent Loading spell index for spellchecker: multipleFields
   [junit4]   2> 191809 INFO  (searcherExecutor-847-thread-1) [    ] o.a.s.h.c.SpellCheckComponent Loading spell index for spellchecker: jarowinkler
   [junit4]   2> 191811 INFO  (searcherExecutor-847-thread-1) [    ] o.a.s.h.c.SpellCheckComponent Loading spell index for spellchecker: external
   [junit4]   2> 191813 INFO  (searcherExecutor-847-thread-1) [    ] o.a.s.h.c.SpellCheckComponent Loading spell index for spellchecker: freq
   [junit4]   2> 191817 INFO  (searcherExecutor-847-thread-1) [    ] o.a.s.h.c.SpellCheckComponent Loading spell index for spellchecker: fqcn
   [junit4]   2> 191818 INFO  (searcherExecutor-847-thread-1) [    ] o.a.s.h.c.SpellCheckComponent Loading spell index for spellchecker: perDict
   [junit4]   2> 191820 INFO  (searcherExecutor-847-thread-1) [    ] o.a.s.c.SolrCore [collection1] Registered new searcher Searcher@4013160e[collection1] main{ExitableDirectoryReader(UninvertingDirectoryReader())}
   [junit4]   2> 191820 INFO  (TEST-AutoCommitTest.testCommitWithin-seed#[EF3FC2C764EA3A25]) [    ] o.a.s.u.RandomMergePolicy RandomMergePolicy wrapping class org.apache.lucene.index.TieredMergePolicy: [TieredMergePolicy: maxMergeAtOnce=35, maxMergeAtOnceExplicit=27, maxMergedSegmentMB=34.5341796875, floorSegmentMB=1.5283203125, forceMergeDeletesPctAllowed=14.130957448102121, segmentsPerTier=14.0, maxCFSSegmentSizeMB=8.796093022207999E12, noCFSRatio=0.6659406440101625
   [junit4]   2> 191850 INFO  (TEST-AutoCommitTest.testCommitWithin-seed#[EF3FC2C764EA3A25]) [    ] o.a.s.u.DefaultSolrCoreState New IndexWriter is ready to be used.
   [junit4]   2> 191850 INFO  (TEST-AutoCommitTest.testCommitWithin-seed#[EF3FC2C764EA3A25]) [    ] o.a.s.s.SolrIndexSearcher Opening [Searcher@7980ef98[collection1] main]
   [junit4]   2> 191853 INFO  (searcherExecutor-847-thread-1) [    ] o.a.s.c.SolrCore [collection1] Registered new searcher Searcher@7980ef98[collection1] main{ExitableDirectoryReader(UninvertingDirectoryReader())}
   [junit4]   2> 191853 INFO  (TEST-AutoCommitTest.testCommitWithin-seed#[EF3FC2C764EA3A25]) [    ] o.a.s.c.SolrCore [collection1]  CLOSING SolrCore org.apache.solr.core.SolrCore@1872ce9d
   [junit4]   2> 191854 INFO  (TEST-AutoCommitTest.testCommitWithin-seed#[EF3FC2C764EA3A25]) [    ] o.a.s.m.SolrMetricManager Closing metric reporters for registry=solr.core.collection1, tag=410177181
   [junit4]   2> 191864 INFO  (TEST-AutoCommitTest.testCommitWithin-seed#[EF3FC2C764EA3A25]) [    ] o.a.s.u.p.LogUpdateProcessorFactory [collection1] {add=[529 (1575553640484044800)]} 0 3
   [junit4]   2> 191865 INFO  (TEST-AutoCommitTest.testCommitWithin-seed#[EF3FC2C764EA3A25]) [    ] o.a.s.c.S.Request [collection1]  webapp=null path=null params={q=id:529&qt=&start=0&rows=20&version=2.2} hits=0 status=0 QTime=0
   [junit4]   2> 195865 INFO  (commitScheduler-850-thread-1) [    ] o.a.s.u.DirectUpdateHandler2 start commit{,optimize=false,openSearcher=true,waitSearcher=true,expungeDeletes=false,softCommit=true,prepareCommit=false}
   [junit4]   2> 195867 INFO  (commitScheduler-850-thread-1) [    ] o.a.s.s.SolrIndexSearcher Opening [Searcher@57c31ea1[collection1] main]
   [junit4]   2> 195867 INFO  (commitScheduler-850-thread-1) [    ] o.a.s.u.DirectUpdateHandler2 end_commit_flush
   [junit4]   2> 195867 INFO  (searcherExecutor-847-thread-1) [    ] o.a.s.c.SolrCore [collection1] Registered new searcher Searcher@57c31ea1[collection1] main{ExitableDirectoryReader(UninvertingDirectoryReader(Uninverting(_5(7.0.0):C1)))}
   [junit4]   2> 195966 INFO  (TEST-AutoCommitTest.testCommitWithin-seed#[EF3FC2C764EA3A25]) [    ] o.a.s.u.p.LogUpdateProcessorFactory [collection1] {add=[530 (1575553644784254976)]} 0 4105
   [junit4]   2> 195967 INFO  (TEST-AutoCommitTest.testCommitWithin-seed#[EF3FC2C764EA3A25]) [    ] o.a.s.c.S.Request [collection1]  webapp=null path=null params={q=id:530&qt=&start=0&rows=20&version=2.2} hits=0 status=0 QTime=0
   [junit4]   2> 195968 INFO  (TEST-AutoCommitTest.testCommitWithin-seed#[EF3FC2C764EA3A25]) [    ] o.a.s.u.p.LogUpdateProcessorFactory [collection1] {delete=[529 (-1575553644790546432)]} 0 4106
   [junit4]   2> 195968 INFO  (TEST-AutoCommitTest.testCommitWithin-seed#[EF3FC2C764EA3A25]) [    ] o.a.s.c.S.Request [collection1]  webapp=null path=null params={q=id:529&qt=&start=0&rows=20&version=2.2} hits=1 status=0 QTime=0
   [junit4]   2> 197969 INFO  (commitScheduler-850-thread-1) [    ] o.a.s.u.DirectUpdateHandler2 start commit{,optimize=false,openSearcher=true,waitSearcher=true,expungeDeletes=false,softCommit=true,prepareCommit=false}
   [junit4]   2> 198081 INFO  (commitScheduler-850-thread-1) [    ] o.a.s.s.SolrIndexSearcher Opening [Searcher@556132ab[collection1] main]
   [junit4]   2> 198081 INFO  (commitScheduler-850-thread-1) [    ] o.a.s.u.DirectUpdateHandler2 end_commit_flush
   [junit4]   2> 198083 INFO  (searcherExecutor-847-thread-1) [    ] o.a.s.c.SolrCore [collection1] Registered new searcher Searcher@556132ab[collection1] main{ExitableDirectoryReader(UninvertingDirectoryReader(Uninverting(_6(7.0.0):C1)))}
   [junit4]   2> 198309 INFO  (TEST-AutoCommitTest.testCommitWithin-seed#[EF3FC2C764EA3A25]) [    ] o.a.s.c.S.Request [collection1]  webapp=null path=null params={q=id:529&qt=&start=0&rows=20&version=2.2} hits=0 status=0 QTime=0
   [junit4]   2> 198310 INFO  (TEST-AutoCommitTest.testCommitWithin-seed#[EF3FC2C764EA3A25]) [    ] o.a.s.c.S.Request [collection1]  webapp=null path=null params={q=id:530&qt=&start=0&rows=20&version=2.2} hits=1 status=0 QTime=0
   [junit4]   2> 198316 INFO  (TEST-AutoCommitTest.testCommitWithin-seed#[EF3FC2C764EA3A25]) [    ] o.a.s.u.p.LogUpdateProcessorFactory [collection1] {add=[500 (1575553647250505728)]} 0 6455
   [junit4]   2> 198316 INFO  (TEST-AutoCommitTest.testCommitWithin-seed#[EF3FC2C764EA3A25]) [    ] o.a.s.u.p.LogUpdateProcessorFactory [collection1] {add=[500 (1575553647252602880)]} 0 6455
   [junit4]   2> 198316 INFO  (TEST-AutoCommitTest.testCommitWithin-seed#[EF3FC2C764EA3A25]) [    ] o.a.s.u.p.LogUpdateProcessorFactory [collection1] {add=[500 (1575553647252602881)]} 0 6456
   [junit4]   2> 198319 INFO  (TEST-AutoCommitTest.testCommitWithin-seed#[EF3FC2C764EA3A25]) [    ] o.a.s.u.p.LogUpdateProcessorFactory [collection1] {add=[500 (1575553647253651456)]} 0 6458
   [junit4]   2> 198319 INFO  (TEST-AutoCommitTest.testCommitWithin-seed#[EF3FC2C764EA3A25]) [    ] o.a.s.u.p.LogUpdateProcessorFactory [collection1] {add=[500 (1575553647255748608)]} 0 6458
   [junit4]   2> 198319 INFO  (TEST-AutoCommitTest.testCommitWithin-seed#[EF3FC2C764EA3A25]) [    ] o.a.s.u.p.LogUpdateProcessorFactory [collection1] {add=[500 (1575553647255748609)]} 0 6458
   [junit4]   2> 198319 INFO  (TEST-AutoCommitTest.testCommitWithin-seed#[EF3FC2C764EA3A25]) [    ] o.a.s.u.p.LogUpdateProcessorFactory [collection1] {add=[500 (1575553647255748610)]} 0 6459
   [junit4]   2> 198319 INFO  (TEST-AutoCommitTest.testCommitWithin-seed#[EF3FC2C764EA3A25]) [    ] o.a.s.u.p.LogUpdateProcessorFactory [collection1] {add=[500 (1575553647255748611)]} 0 6459
   [junit4]   2> 198319 INFO  (TEST-AutoCommitTest.testCommitWithin-seed#[EF3FC2C764EA3A25]) [    ] o.a.s.u.p.LogUpdateProcessorFactory [collection1] {add=[500 (1575553647255748612)]} 0 6459
   [junit4]   2> 198319 INFO  (TEST-AutoCommitTest.testCommitWithin-seed#[EF3FC2C764EA3A25]) [    ] o.a.s.u.p.LogUpdateProcessorFactory [collection1] {add=[500 (1575553647255748613)]} 0 6459
   [junit4]   2> 198319 INFO  (TEST-AutoCommitTest.testCommitWithin-seed#[EF3FC2C764EA3A25]) [    ] o.a.s.c.S.Request [collection1]  webapp=null path=null params={q=id:500&qt=&start=0&rows=20&version=2.2} hits=0 status=0 QTime=0
   [junit4]   2> 198319 INFO  (TEST-AutoCommitTest.testCommitWithin-seed#[EF3FC2C764EA3A25]) [    ] o.a.s.u.p.LogUpdateProcessorFactory [collection1] {delete=[530 (-1575553647255748614)]} 0 6460
   [junit4]   2> 198319 INFO  (TEST-AutoCommitTest.testCommitWithin-seed#[EF3FC2C764EA3A25]) [    ] o.a.s.u.p.LogUpdateProcessorFactory [collection1] {delete=[530 (-1575553647255748615)]} 0 6460
   [junit4]   2> 198319 INFO  (TEST-AutoCommitTest.testCommitWithin-seed#[EF3FC2C764EA3A25]) [    ] o.a.s.u.p.LogUpdateProcessorFactory [collection1] {delete=[530 (-1575553647255748616)]} 0 6460
   [junit4]   2> 198319 INFO  (TEST-AutoCommitTest.testCommitWithin-seed#[EF3FC2C764EA3A25]) [    ] o.a.s.u.p.LogUpdateProcessorFactory [collection1] {delete=[530 (-1575553647255748617)]} 0 6460
   [junit4]   2> 198319 INFO  (TEST-AutoCommitTest.testCommitWithin-seed#[EF3FC2C764EA3A25]) [    ] o.a.s.u.p.LogUpdateProcessorFactory [collection1] {delete=[530 (-1575553647255748618)]} 0 6461
   [junit4]   2> 198319 INFO  (TEST-AutoCommitTest.testCommitWithin-seed#[EF3FC2C764EA3A25]) [    ] o.a.s.u.p.LogUpdateProcessorFactory [collection1] {delete=[530 (-1575553647255748619)]} 0 6461
   [junit4]   2> 198337 INFO  (TEST-AutoCommitTest.testCommitWithin-seed#[EF3FC2C764EA3A25]) [    ] o.a.s.u.p.LogUpdateProcessorFactory [collection1] {delete=[530 (-1575553647274622976)]} 0 6476
   [junit4]   2> 198338 INFO  (TEST-AutoCommitTest.testCommitWithin-seed#[EF3FC2C764EA3A25]) [    ] o.a.s.u.p.LogUpdateProcessorFactory [collection1] {delete=[530 (-1575553647275671552)]} 0 6477
   [junit4]   2> 198338 INFO  (TEST-AutoCommitTest.testCommitWithin-seed#[EF3FC2C764EA3A25]) [    ] o.a.s.u.p.LogUpdateProcessorFactory [collection1] {delete=[530 (-1575553647275671553)]} 0 6477
   [junit4]   2> 198338 INFO  (TEST-AutoCommitTest.testCommitWithin-seed#[EF3FC2C764EA3A25]) [    ] o.a.s.u.p.LogUpdateProcessorFactory [collection1] {delete=[530 (-1575553647275671554)]} 0 6478
   [junit4]   2> 198338 INFO  (TEST-AutoCommitTest.testCommitWithin-seed#[EF3FC2C764EA3A25]) [    ] o.a.s.c.S.Request [collection1]  webapp=null path=null params={q=id:530&qt=&start=0&rows=20&version=2.2} hits=1 status=0 QTime=0
   [junit4]   2> 199323 INFO  (commitScheduler-850-thread-1) [    ] o.a.s.u.DirectUpdateHandler2 start commit{,optimize=false,openSearcher=true,waitSearcher=true,expungeDeletes=false,softCommit=true,prepareCommit=false}
   [junit4]   2> 199331 INFO  (commitScheduler-850-thread-1) [    ] o.a.s.s.SolrIndexSearcher Opening [Searcher@1625cc9a[collection1] main]
   [junit4]   2> 199333 INFO  (searcherExecutor-847-thread-1) [    ] o.a.s.c.SolrCore [collection1] Registered new searcher Searcher@1625cc9a[collection1] main{ExitableDirectoryReader(UninvertingDirectoryReader(Uninverting(_7(7.0.0):C10/9:delGen=1)))}
   [junit4]   2> 199333 INFO  (commitScheduler-850-thread-1) [    ] o.a.s.u.DirectUpdateHandler2 end_commit_flush
   [junit4]   2> 199340 INFO  (TEST-AutoCommitTest.testCommitWithin-seed#[EF3FC2C764EA3A25]) [    ] o.a.s.c.S.Request [collection1]  webapp=null path=null params={q=id:500&qt=&start=0&rows=20&version=2.2} hits=1 status=0 QTime=0
   [junit4]   2> 199341 INFO  (TEST-AutoCommitTest.testCommitWithin-seed#[EF3FC2C764EA3A25]) [    ] o.a.s.c.S.Request [collection1]  webapp=null path=null params={q=id:530&qt=&start=0&rows=20&version=2.2} hits=0 status=0 QTime=0
   [junit4]   2> 199341 INFO  (TEST-AutoCommitTest.testCommitWithin-seed#[EF3FC2C764EA3A25]) [    ] o.a.s.SolrTestCaseJ4 ###Ending testCommitWithin
   [junit4]   2> 199342 INFO  (SUITE-AutoCommitTest-seed#[EF3FC2C764EA3A25]-worker) [    ] o.a.s.SolrTestCaseJ4 ###deleteCore
   [junit4]   2> 199342 INFO  (SUITE-AutoCommitTest-seed#[EF3FC2C764EA3A25]-worker) [    ] o.a.s.c.CoreContainer Shutting down CoreContainer instance=1976449856
   [junit4]   2> 199342 INFO  (SUITE-AutoCommitTest-seed#[EF3FC2C764EA3A25]-worker) [    ] o.a.s.m.SolrMetricManager Closing metric reporters for registry=solr.node, tag=null
   [junit4]   2> 199343 INFO  (SUITE-AutoCommitTest-seed#[EF3FC2C764EA3A25]-worker) [    ] o.a.s.m.SolrMetricManager Closing metric reporters for registry=solr.jvm, tag=null
   [junit4]   2> 199344 INFO  (SUITE-AutoCommitTest-seed#[EF3FC2C764EA3A25]-worker) [    ] o.a.s.m.SolrMetricManager Closing metric reporters for registry=solr.jetty, tag=null
   [junit4]   2> 199344 INFO  (SUITE-AutoCommitTest-seed#[EF3FC2C764EA3A25]-worker) [    ] o.a.s.c.TransientSolrCoreCacheDefault Allocating transient cache for 2147483647 transient cores
   [junit4]   2> 199344 INFO  (coreCloseExecutor-851-thread-1) [    ] o.a.s.c.SolrCore [collection1]  CLOSING SolrCore org.apache.solr.core.SolrCore@72948fd1
   [junit4]   2> 199346 INFO  (coreCloseExecutor-851-thread-1) [    ] o.a.s.u.DirectUpdateHandler2 Committing on IndexWriter close.
   [junit4]   2> 199346 INFO  (coreCloseExecutor-851-thread-1) [    ] o.a.s.u.SolrIndexWriter Calling setCommitData with IW:org.apache.solr.update.SolrIndexWriter@616a627a commitCommandVersion:0
   [junit4]   2> 199354 INFO  (coreCloseExecutor-851-thread-1) [    ] o.a.s.m.SolrMetricManager Closing metric reporters for registry=solr.core.collection1, tag=1922338769
   [junit4]   2> NOTE: leaving temporary files on disk at: C:\Users\jenkins\workspace\Lucene-Solr-7.0-Windows\solr\build\solr-core\test\J1\temp\solr.update.AutoCommitTest_EF3FC2C764EA3A25-001
   [junit4]   2> NOTE: test params are: codec=FastDecompressionCompressingStoredFields(storedFieldsFormat=CompressingStoredFieldsFormat(compressionMode=FAST_DECOMPRESSION, chunkSize=22427, maxDocsPerChunk=67, blockSize=5), termVectorsFormat=CompressingTermVectorsFormat(compressionMode=FAST_DECOMPRESSION, chunkSize=22427, blockSize=5)), sim=RandomSimilarity(queryNorm=true): {}, locale=gsw-CH, timezone=Africa/Banjul
   [junit4]   2> NOTE: Windows 10 10.0 amd64/Oracle Corporation 9 (64-bit)/cpus=3,threads=1,free=85142040,total=243269632
   [junit4]   2> NOTE: All tests run in this JVM: [DistributedQueryElevationComponentTest, TestComponentsName, GraphQueryTest, SecurityConfHandlerTest, SystemInfoHandlerTest, MoveReplicaTest, TestLegacyFieldReuse, ClassificationUpdateProcessorTest, TestLockTree, SuggesterTSTTest, CloudMLTQParserTest, TermVectorComponentDistributedTest, CustomCollectionTest, TestDocBasedVersionConstraints, TestNestedDocsSort, TestClassicSimilarityFactory, TestJettySolrRunner, TestMergePolicyConfig, HLLSerializationTest, ConfigureRecoveryStrategyTest, SchemaVersionSpecificBehaviorTest, TriLevelCompositeIdRoutingTest, SmileWriterTest, JavabinLoaderTest, ReplicaListTransformerTest, QueryEqualityTest, AutoCommitTest]
   [junit4] Completed [55/728 (1!)] on J1 in 14.29s, 3 tests, 1 error <<< FAILURES!

[...truncated 562 lines...]
   [junit4] Suite: org.apache.solr.core.AlternateDirectoryTest
   [junit4]   2> Creating dataDir: C:\Users\jenkins\workspace\Lucene-Solr-7.0-Windows\solr\build\solr-core\test\J0\temp\solr.core.AlternateDirectoryTest_EF3FC2C764EA3A25-001\init-core-data-001
   [junit4]   2> 720639 WARN  (SUITE-AlternateDirectoryTest-seed#[EF3FC2C764EA3A25]-worker) [    ] o.a.s.SolrTestCaseJ4 startTrackingSearchers: numOpens=7 numCloses=7
   [junit4]   2> 720640 INFO  (SUITE-AlternateDirectoryTest-seed#[EF3FC2C764EA3A25]-worker) [    ] o.a.s.SolrTestCaseJ4 Using PointFields (NUMERIC_POINTS_SYSPROP=true) w/NUMERIC_DOCVALUES_SYSPROP=false
   [junit4]   2> 720641 INFO  (SUITE-AlternateDirectoryTest-seed#[EF3FC2C764EA3A25]-worker) [    ] o.a.s.SolrTestCaseJ4 Randomized ssl (false) and clientAuth (false) via: @org.apache.solr.util.RandomizeSSL(reason="", value=0.0/0.0, ssl=0.0/0.0, clientAuth=0.0/0.0)
   [junit4]   2> 720641 INFO  (SUITE-AlternateDirectoryTest-seed#[EF3FC2C764EA3A25]-worker) [    ] o.a.s.SolrTestCaseJ4 ####initCore
   [junit4]   2> 720643 INFO  (SUITE-AlternateDirectoryTest-seed#[EF3FC2C764EA3A25]-worker) [    ] o.a.s.c.SolrResourceLoader [null] Added 2 libs to classloader, from paths: [/C:/Users/jenkins/workspace/Lucene-Solr-7.0-Windows/solr/core/src/test-files/solr/collection1/lib, /C:/Users/jenkins/workspace/Lucene-Solr-7.0-Windows/solr/core/src/test-files/solr/collection1/lib/classes]
   [junit4]   2> 720657 INFO  (SUITE-AlternateDirectoryTest-seed#[EF3FC2C764EA3A25]-worker) [    ] o.a.s.c.SolrConfig Using Lucene MatchVersion: 7.0.0
   [junit4]   2> 720663 INFO  (SUITE-AlternateDirectoryTest-seed#[EF3FC2C764EA3A25]-worker) [    ] o.a.s.s.IndexSchema [null] Schema name=test
   [junit4]   2> 720732 INFO  (SUITE-AlternateDirectoryTest-seed#[EF3FC2C764EA3A25]-worker) [    ] o.a.s.s.IndexSchema Loaded schema test/1.0 with uniqueid field id
   [junit4]   2> 720892 INFO  (SUITE-AlternateDirectoryTest-seed#[EF3FC2C764EA3A25]-worker) [    ] o.a.s.m.r.SolrJmxReporter JMX monitoring for 'solr.node' (registry 'solr.node') enabled at server: com.sun.jmx.mbeanserver.JmxMBeanServer@4e3f925a
   [junit4]   2> 720895 INFO  (SUITE-AlternateDirectoryTest-seed#[EF3FC2C764EA3A25]-worker) [    ] o.a.s.m.r.SolrJmxReporter JMX monitoring for 'solr.jvm' (registry 'solr.jvm') enabled at server: com.sun.jmx.mbeanserver.JmxMBeanServer@4e3f925a
   [junit4]   2> 720895 INFO  (SUITE-AlternateDirectoryTest-seed#[EF3FC2C764EA3A25]-worker) [    ] o.a.s.m.r.SolrJmxReporter JMX monitoring for 'solr.jetty' (registry 'solr.jetty') enabled at server: com.sun.jmx.mbeanserver.JmxMBeanServer@4e3f925a
   [junit4]   2> 720897 INFO  (coreLoadExecutor-3323-thread-1) [    ] o.a.s.c.SolrResourceLoader [null] Added 2 libs to classloader, from paths: [/C:/Users/jenkins/workspace/Lucene-Solr-7.0-Windows/solr/core/src/test-files/solr/collection1/lib, /C:/Users/jenkins/workspace/Lucene-Solr-7.0-Windows/solr/core/src/test-files/solr/collection1/lib/classes]
   [junit4]   2> 720949 INFO  (coreLoadExecutor-3323-thread-1) [    ] o.a.s.c.SolrConfig Using Lucene MatchVersion: 7.0.0
   [junit4]   2> 720957 INFO  (coreLoadExecutor-3323-thread-1) [    ] o.a.s.s.IndexSchema [collection1] Schema name=test
   [junit4]   2> 721054 INFO  (coreLoadExecutor-3323-thread-1) [    ] o.a.s.s.IndexSchema Loaded schema test/1.0 with uniqueid field id
   [junit4]   2> 721070 INFO  (coreLoadExecutor-3323-thread-1) [    ] o.a.s.c.CoreContainer Creating SolrCore 'collection1' using configuration from instancedir C:\Users\jenkins\workspace\Lucene-Solr-7.0-Windows\solr\core\src\test-files\solr\collection1, trusted=true
   [junit4]   2> 721070 INFO  (coreLoadExecutor-3323-thread-1) [    ] o.a.s.m.r.SolrJmxReporter JMX monitoring for 'solr.core.collection1' (registry 'solr.core.collection1') enabled at server: com.sun.jmx.mbeanserver.JmxMBeanServer@4e3f925a
   [junit4]   2> 721071 INFO  (coreLoadExecutor-3323-thread-1) [    ] o.a.s.c.SolrCore solr.RecoveryStrategy.Builder
   [junit4]   2> 721071 INFO  (coreLoadExecutor-3323-thread-1) [    ] o.a.s.c.SolrCore [[collection1] ] Opening new SolrCore at [C:\Users\jenkins\workspace\Lucene-Solr-7.0-Windows\solr\core\src\test-files\solr\collection1], dataDir=[C:\Users\jenkins\workspace\Lucene-Solr-7.0-Windows\solr\build\solr-core\test\J0\temp\solr.core.AlternateDirectoryTest_EF3FC2C764EA3A25-001\init-core-data-001\]
   [junit4]   2> 721079 INFO  (coreLoadExecutor-3323-thread-1) [    ] o.a.s.u.RandomMergePolicy RandomMergePolicy wrapping class org.apache.lucene.index.TieredMergePolicy: [TieredMergePolicy: maxMergeAtOnce=50, maxMergeAtOnceExplicit=33, maxMergedSegmentMB=19.375, floorSegmentMB=1.6474609375, forceMergeDeletesPctAllowed=0.5649506537700988, segmentsPerTier=41.0, maxCFSSegmentSizeMB=8.796093022207999E12, noCFSRatio=1.0
   [junit4]   2> 721151 INFO  (coreLoadExecutor-3323-thread-1) [    ] o.a.s.u.CommitTracker Hard AutoCommit: disabled
   [junit4]   2> 721151 INFO  (coreLoadExecutor-3323-thread-1) [    ] o.a.s.u.CommitTracker Soft AutoCommit: disabled
   [junit4]   2> 721153 INFO  (coreLoadExecutor-3323-thread-1) [    ] o.a.s.u.RandomMergePolicy RandomMergePolicy wrapping class org.apache.lucene.index.LogByteSizeMergePolicy: [LogByteSizeMergePolicy: minMergeSize=1677721, mergeFactor=16, maxMergeSize=2147483648, maxMergeSizeForForcedMerge=9223372036854775807, calibrateSizeByDeletes=true, maxMergeDocs=2147483647, maxCFSSegmentSizeMB=8.796093022207999E12, noCFSRatio=1.0]
   [junit4]   2> 721155 INFO  (coreLoadExecutor-3323-thread-1) [    ] o.a.s.s.SolrIndexSearcher Opening [Searcher@23cf6f0f[collection1] main]
   [junit4]   2> 721155 WARN  (coreLoadExecutor-3323-thread-1) [    ] o.a.s.r.ManagedResourceStorage Cannot write to config directory C:\Users\jenkins\workspace\Lucene-Solr-7.0-Windows\solr\core\src\test-files\solr\collection1\conf; switching to use InMemory storage instead.
   [junit4]   2> 721156 INFO  (coreLoadExecutor-3323-thread-1) [    ] o.a.s.h.ReplicationHandler Commits will be reserved for  10000
   [junit4]   2> 721157 INFO  (searcherExecutor-3324-thread-1) [    ] o.a.s.c.SolrCore [collection1] Registered new searcher Searcher@23cf6f0f[collection1] main{ExitableDirectoryReader(UninvertingDirectoryReader())}
   [junit4]   2> 721160 INFO  (SUITE-AlternateDirectoryTest-seed#[EF3FC2C764EA3A25]-worker) [    ] o.a.s.SolrTestCaseJ4 ####initCore end
   [junit4]   2> 721162 INFO  (TEST-AlternateDirectoryTest.testAltDirectoryUsed-seed#[EF3FC2C764EA3A25]) [    ] o.a.s.SolrTestCaseJ4 ###Starting testAltDirectoryUsed
   [junit4]   2> 721163 INFO  (TEST-AlternateDirectoryTest.testAltDirectoryUsed-seed#[EF3FC2C764EA3A25]) [    ] o.a.s.c.S.Request [collection1]  webapp=null path=null params={q=*:*&qt=/select&wt=xml} hits=0 status=0 QTime=0
   [junit4]   2> 721163 INFO  (TEST-AlternateDirectoryTest.testAltDirectoryUsed-seed#[EF3FC2C764EA3A25]) [    ] o.a.s.SolrTestCaseJ4 ###Ending testAltDirectoryUsed
   [junit4]   2> 721165 INFO  (TEST-AlternateDirectoryTest.testAltReaderUsed-seed#[EF3FC2C764EA3A25]) [    ] o.a.s.SolrTestCaseJ4 ###Starting testAltReaderUsed
   [junit4]   2> 721165 INFO  (TEST-AlternateDirectoryTest.testAltReaderUsed-seed#[EF3FC2C764EA3A25]) [    ] o.a.s.SolrTestCaseJ4 ###Ending testAltReaderUsed
   [junit4]   2> 721165 INFO  (SUITE-AlternateDirectoryTest-seed#[EF3FC2C764EA3A25]-worker) [    ] o.a.s.SolrTestCaseJ4 ###deleteCore
   [junit4]   2> 721165 INFO  (SUITE-AlternateDirectoryTest-seed#[EF3FC2C764EA3A25]-worker) [    ] o.a.s.c.CoreContainer Shutting down CoreContainer instance=1053092564
   [junit4]   2> 721166 INFO  (SUITE-AlternateDirectoryTest-seed#[EF3FC2C764EA3A25]-worker) [    ] o.a.s.m.SolrMetricManager Closing metric reporters for registry=solr.node, tag=null
   [junit4]   2> 721167 INFO  (SUITE-AlternateDirectoryTest-seed#[EF3FC2C764EA3A25]-worker) [    ] o.a.s.m.SolrMetricManager Closing metric reporters for registry=solr.jvm, tag=null
   [junit4]   2> 721168 INFO  (SUITE-AlternateDirectoryTest-seed#[EF3FC2C764EA3A25]-worker) [    ] o.a.s.m.SolrMetricManager Closing metric reporters for registry=solr.jetty, tag=null
   [junit4]   2> 721169 INFO  (SUITE-AlternateDirectoryTest-seed#[EF3FC2C764EA3A25]-worker) [    ] o.a.s.c.TransientSolrCoreCacheDefault Allocating transient cache for 2147483647 transient cores
   [junit4]   2> 721170 INFO  (coreCloseExecutor-3328-thread-1) [    ] o.a.s.c.SolrCore [collection1]  CLOSING SolrCore org.apache.solr.core.SolrCore@7891cf12
   [junit4]   2> 721171 INFO  (coreCloseExecutor-3328-thread-1) [    ] o.a.s.m.SolrMetricManager Closing metric reporters for registry=solr.core.collection1, tag=2022821650
   [junit4]   2> 721176 INFO  (SUITE-AlternateDirectoryTest-seed#[EF3FC2C764EA3A25]-worker) [    ] o.a.s.SolrTestCaseJ4 ------------------------------------------------------- Done waiting for tracked resources to be released
   [junit4]   2> Aug 12, 2017 7:19:32 PM com.carrotsearch.randomizedtesting.ThreadLeakControl checkThreadLeaks
   [junit4]   2> WARNING: Will linger awaiting termination of 2 leaked thread(s).
   [junit4]   2> NOTE: test params are: codec=Asserting(Lucene70): {}, docValues:{}, maxPointsInLeafNode=35, maxMBSortInHeap=5.58578362217808, sim=RandomSimilarity(queryNorm=true): {}, locale=pa-PK, timezone=America/Argentina/Jujuy
   [junit4]   2> NOTE: Windows 10 10.0 amd64/Oracle Corporation 9 (64-bit)/cpus=3,threads=1,free=368785512,total=524288000
   [junit4]   2> NOTE: All tests run in this JVM: [BigEndianAscendingWordDeserializerTest, DistributedSpellCheckComponentTest, QueryParsingTest, TestJsonRequest, XmlUpdateRequestHandlerTest, CoreAdminRequestStatusTest, OutOfBoxZkACLAndCredentialsProvidersTest, TestLegacyNumericUtils, CloneFieldUpdateProcessorFactoryTest, TestHashPartitioner, BlockDirectoryTest, TestDFRSimilarityFactory, TestTrackingShardHandlerFactory, DeleteInactiveReplicaTest, TestInPlaceUpdatesDistrib, SimpleMLTQParserTest, TestLMDirichletSimilarityFactory, ConnectionReuseTest, TestCorePropertiesReload, HLLUtilTest, ZkStateWriterTest, NumericFieldsTest, TestStressLiveNodes, TestMacroExpander, TestSlowCompositeReaderWrapper, QueryElevationComponentTest, UUIDFieldTest, PeerSyncTest, InfixSuggestersTest, HdfsNNFailoverTest, TestPrepRecovery, DefaultValueUpdateProcessorTest, ClusterStateTest, BitVectorTest, TemplateUpdateProcessorTest, TestConfigsApi, MergeStrategyTest, TestPerFieldSimilarityWithDefaultOverride, DirectUpdateHandlerTest, MultiTermTest, TestExtendedDismaxParser, HdfsSyncSliceTest, TestManagedResource, TestFieldTypeCollectionResource, RequestHandlersTest, BlockJoinFacetSimpleTest, LeaderElectionContextKeyTest, ConjunctionSolrSpellCheckerTest, AliasIntegrationTest, TestStressReorder, CreateCollectionCleanupTest, TestFieldCacheWithThreads, HdfsRecoveryZkTest, TestRandomCollapseQParserPlugin, ScriptEngineTest, TestFoldingMultitermQuery, TestHdfsCloudBackupRestore, DateMathParserTest, DistributedFacetPivotLongTailTest, RestartWhileUpdatingTest, QueryResultKeyTest, IgnoreCommitOptimizeUpdateProcessorFactoryTest, TestFaceting, CleanupOldIndexTest, TestOverriddenPrefixQueryForCustomFieldType, TestOmitPositions, ZkCLITest, SolrShardReporterTest, AnalysisAfterCoreReloadTest, RAMDirectoryFactoryTest, ZkControllerTest, TestNRTOpen, TestDeleteCollectionOnDownNodes, TestAtomicUpdateErrorCases, CollectionTooManyReplicasTest, TestClassNameShortening, RegexBoostProcessorTest, TestSolrConfigHandlerCloud, FastVectorHighlighterTest, MultiThreadedOCPTest, PrimUtilsTest, SolrTestCaseJ4Test, TestStressCloudBlindAtomicUpdates, DistributedFacetPivotSmallTest, DistribCursorPagingTest, TestMultiValuedNumericRangeQuery, TestSQLHandler, AddSchemaFieldsUpdateProcessorFactoryTest, TestPhraseSuggestions, PathHierarchyTokenizerFactoryTest, TestPushWriter, HdfsBasicDistributedZkTest, RuleEngineTest, DistanceFunctionTest, HdfsWriteToMultipleCollectionsTest, HttpSolrCallGetCoreTest, TestGraphTermsQParserPlugin, TestLocalFSCloudBackupRestore, VMParamsZkACLAndCredentialsProvidersTest, ReturnFieldsTest, TestPayloadScoreQParserPlugin, TestRandomRequestDistribution, CoreAdminHandlerTest, AlternateDirectoryTest]
   [junit4]   2> NOTE: reproduce with: ant test  -Dtestcase=AlternateDirectoryTest -Dtests.seed=EF3FC2C764EA3A25 -Dtests.slow=true -Dtests.locale=pa-PK -Dtests.timezone=America/Argentina/Jujuy -Dtests.asserts=true -Dtests.file.encoding=Cp1252
   [junit4] ERROR   0.00s J0 | AlternateDirectoryTest (suite) <<<
   [junit4]    > Throwable #1: java.io.IOException: Could not remove the following files (in the order of attempts):
   [junit4]    >    C:\Users\jenkins\workspace\Lucene-Solr-7.0-Windows\solr\build\solr-core\test\J0\temp\solr.core.AlternateDirectoryTest_EF3FC2C764EA3A25-001\init-core-data-001: java.nio.file.AccessDeniedException: C:\Users\jenkins\workspace\Lucene-Solr-7.0-Windows\solr\build\solr-core\test\J0\temp\solr.core.AlternateDirectoryTest_EF3FC2C764EA3A25-001\init-core-data-001
   [junit4]    >    C:\Users\jenkins\workspace\Lucene-Solr-7.0-Windows\solr\build\solr-core\test\J0\temp\solr.core.AlternateDirectoryTest_EF3FC2C764EA3A25-001: java.nio.file.DirectoryNotEmptyException: C:\Users\jenkins\workspace\Lucene-Solr-7.0-Windows\solr\build\solr-core\test\J0\temp\solr.core.AlternateDirectoryTest_EF3FC2C764EA3A25-001
   [junit4]    > at __randomizedtesting.SeedInfo.seed([EF3FC2C764EA3A25]:0)
   [junit4]    > at org.apache.lucene.util.IOUtils.rm(IOUtils.java:329)
   [junit4]    > at java.base/java.lang.Thread.run(Thread.java:844)
   [junit4] Completed [222/728 (2!)] on J0 in 0.80s, 2 tests, 1 error <<< FAILURES!

[...truncated 207 lines...]
   [junit4] Suite: org.apache.solr.cloud.TestTlogReplica
   [junit4]   2> Creating dataDir: C:\Users\jenkins\workspace\Lucene-Solr-7.0-Windows\solr\build\solr-core\test\J1\temp\solr.cloud.TestTlogReplica_EF3FC2C764EA3A25-001\init-core-data-001
   [junit4]   2> 942680 WARN  (SUITE-TestTlogReplica-seed#[EF3FC2C764EA3A25]-worker) [    ] o.a.s.SolrTestCaseJ4 startTrackingSearchers: numOpens=3 numCloses=3
   [junit4]   2> 942680 INFO  (SUITE-TestTlogReplica-seed#[EF3FC2C764EA3A25]-worker) [    ] o.a.s.SolrTestCaseJ4 Using PointFields (NUMERIC_POINTS_SYSPROP=true) w/NUMERIC_DOCVALUES_SYSPROP=false
   [junit4]   2> 942681 INFO  (SUITE-TestTlogReplica-seed#[EF3FC2C764EA3A25]-worker) [    ] o.a.s.SolrTestCaseJ4 Randomized ssl (true) and clientAuth (false) via: @org.apache.solr.util.RandomizeSSL(reason="", ssl=0.0/0.0, value=0.0/0.0, clientAuth=0.0/0.0)
   [junit4]   2> 942682 INFO  (SUITE-TestTlogReplica-seed#[EF3FC2C764EA3A25]-worker) [    ] o.a.s.c.MiniSolrCloudCluster Starting cluster of 2 servers in C:\Users\jenkins\workspace\Lucene-Solr-7.0-Windows\solr\build\solr-core\test\J1\temp\solr.cloud.TestTlogReplica_EF3FC2C764EA3A25-001\tempDir-001
   [junit4]   2> 942682 INFO  (SUITE-TestTlogReplica-seed#[EF3FC2C764EA3A25]-worker) [    ] o.a.s.c.ZkTestServer STARTING ZK TEST SERVER
   [junit4]   2> 942683 INFO  (Thread-2209) [    ] o.a.s.c.ZkTestServer client port:0.0.0.0/0.0.0.0:0
   [junit4]   2> 942683 INFO  (Thread-2209) [    ] o.a.s.c.ZkTestServer Starting server
   [junit4]   2> 942688 ERROR (Thread-2209) [    ] o.a.z.s.ZooKeeperServer ZKShutdownHandler is not registered, so ZooKeeper server won't take any action on ERROR or SHUTDOWN server state changes
   [junit4]   2> 942783 INFO  (SUITE-TestTlogReplica-seed#[EF3FC2C764EA3A25]-worker) [    ] o.a.s.c.ZkTestServer start zk server on port:63851
   [junit4]   2> 942793 WARN  (NIOServerCxn.Factory:0.0.0.0/0.0.0.0:0) [    ] o.a.z.s.NIOServerCnxn caught end of stream exception
   [junit4]   2> EndOfStreamException: Unable to read additional data from client sessionid 0x15dd7e678840000, likely client has closed socket
   [junit4]   2> at org.apache.zookeeper.server.NIOServerCnxn.doIO(NIOServerCnxn.java:239)
   [junit4]   2> at org.apache.zookeeper.server.NIOServerCnxnFactory.run(NIOServerCnxnFactory.java:203)
   [junit4]   2> at java.base/java.lang.Thread.run(Thread.java:844)
   [junit4]   2> 942798 INFO  (jetty-launcher-1368-thread-1) [    ] o.e.j.s.Server jetty-9.3.14.v20161028
   [junit4]   2> 942798 INFO  (jetty-launcher-1368-thread-2) [    ] o.e.j.s.Server jetty-9.3.14.v20161028
   [junit4]   2> 942799 INFO  (jetty-launcher-1368-thread-1) [    ] o.e.j.s.h.ContextHandler Started o.e.j.s.ServletContextHandler@2f4d9959{/solr,null,AVAILABLE}
   [junit4]   2> 942799 INFO  (jetty-launcher-1368-thread-2) [    ] o.e.j.s.h.ContextHandler Started o.e.j.s.ServletContextHandler@7e97843a{/solr,null,AVAILABLE}
   [junit4]   2> 942804 INFO  (jetty-launcher-1368-thread-1) [    ] o.e.j.s.AbstractConnector Started ServerConnector@654818c4{SSL,[ssl, http/1.1]}{127.0.0.1:63855}
   [junit4]   2> 942805 INFO  (jetty-launcher-1368-thread-1) [    ] o.e.j.s.Server Started @945858ms
   [junit4]   2> 942805 INFO  (jetty-launcher-1368-thread-1) [    ] o.a.s.c.s.e.JettySolrRunner Jetty properties: {hostContext=/solr, hostPort=63855}
   [junit4]   2> 942805 INFO  (jetty-launcher-1368-thread-2) [    ] o.e.j.s.AbstractConnector Started ServerConnector@2b07961c{SSL,[ssl, http/1.1]}{127.0.0.1:63856}
   [junit4]   2> 942821 INFO  (jetty-launcher-1368-thread-2) [    ] o.e.j.s.Server Started @945875ms
   [junit4]   2> 942821 INFO  (jetty-launcher-1368-thread-2) [    ] o.a.s.c.s.e.JettySolrRunner Jetty properties: {hostContext=/solr, hostPort=63856}
   [junit4]   2> 942821 ERROR (jetty-launcher-1368-thread-1) [    ] o.a.s.s.StartupLoggingUtils Missing Java Option solr.log.dir. Logging may be missing or incomplete.
   [junit4]   2> 942821 INFO  (jetty-launcher-1368-thread-1) [    ] o.a.s.s.SolrDispatchFilter  ___      _       Welcome to Apache Solr™ version 7.0.0
   [junit4]   2> 942822 INFO  (jetty-launcher-1368-thread-1) [    ] o.a.s.s.SolrDispatchFilter / __| ___| |_ _   Starting in cloud mode on port null
   [junit4]   2> 942822 INFO  (jetty-launcher-1368-thread-1) [    ] o.a.s.s.SolrDispatchFilter \__ \/ _ \ | '_|  Install dir: null, Default config dir: null
   [junit4]   2> 942822 INFO  (jetty-launcher-1368-thread-1) [    ] o.a.s.s.SolrDispatchFilter |___/\___/_|_|    Start time: 2017-08-12T19:23:12.011122400Z
   [junit4]   2> 942822 ERROR (jetty-launcher-1368-thread-2) [    ] o.a.s.s.StartupLoggingUtils Missing Java Option solr.log.dir. Logging may be missing or incomplete.
   [junit4]   2> 942822 INFO  (jetty-launcher-1368-thread-2) [    ] o

[...truncated too long message...]

eporters for registry=solr.jetty, tag=null
   [junit4]   2> 1050810 INFO  (jetty-closer-1369-thread-2) [    ] o.a.s.m.SolrMetricManager Closing metric reporters for registry=solr.jetty, tag=null
   [junit4]   2> 1050810 INFO  (jetty-closer-1369-thread-1) [    ] o.a.s.m.SolrMetricManager Closing metric reporters for registry=solr.cluster, tag=null
   [junit4]   2> 1050814 INFO  (jetty-closer-1369-thread-2) [    ] o.a.s.m.SolrMetricManager Closing metric reporters for registry=solr.cluster, tag=null
   [junit4]   2> 1050817 INFO  (jetty-closer-1369-thread-1) [    ] o.a.s.c.Overseer Overseer (id=98472151736385562-127.0.0.1:63855_solr-n_0000000007) closing
   [junit4]   2> 1050818 INFO  (OverseerStateUpdate-98472151736385562-127.0.0.1:63855_solr-n_0000000007) [    ] o.a.s.c.Overseer Overseer Loop exiting : 127.0.0.1:63855_solr
   [junit4]   2> 1050819 WARN  (NIOServerCxn.Factory:0.0.0.0/0.0.0.0:0) [    ] o.a.z.s.NIOServerCnxn caught end of stream exception
   [junit4]   2> EndOfStreamException: Unable to read additional data from client sessionid 0x15dd7e67884001d, likely client has closed socket
   [junit4]   2> at org.apache.zookeeper.server.NIOServerCnxn.doIO(NIOServerCnxn.java:239)
   [junit4]   2> at org.apache.zookeeper.server.NIOServerCnxnFactory.run(NIOServerCnxnFactory.java:203)
   [junit4]   2> at java.base/java.lang.Thread.run(Thread.java:844)
   [junit4]   2> 1050820 WARN  (zkCallback-1437-thread-1) [    ] o.a.s.c.c.ZkStateReader ZooKeeper watch triggered, but Solr cannot talk to ZK: [KeeperErrorCode = Session expired for /live_nodes]
   [junit4]   2> 1050821 WARN  (NIOServerCxn.Factory:0.0.0.0/0.0.0.0:0) [    ] o.a.z.s.NIOServerCnxn caught end of stream exception
   [junit4]   2> EndOfStreamException: Unable to read additional data from client sessionid 0x15dd7e67884001a, likely client has closed socket
   [junit4]   2> at org.apache.zookeeper.server.NIOServerCnxn.doIO(NIOServerCnxn.java:239)
   [junit4]   2> at org.apache.zookeeper.server.NIOServerCnxnFactory.run(NIOServerCnxnFactory.java:203)
   [junit4]   2> at java.base/java.lang.Thread.run(Thread.java:844)
   [junit4]   2> 1050821 INFO  (jetty-closer-1369-thread-2) [    ] o.e.j.s.h.ContextHandler Stopped o.e.j.s.ServletContextHandler@1452c9bf{/solr,null,UNAVAILABLE}
   [junit4]   2> 1052332 WARN  (zkCallback-1430-thread-3) [    ] o.a.s.c.c.ZkStateReader ZooKeeper watch triggered, but Solr cannot talk to ZK: [KeeperErrorCode = Session expired for /live_nodes]
   [junit4]   2> 1052332 INFO  (jetty-closer-1369-thread-1) [    ] o.e.j.s.h.ContextHandler Stopped o.e.j.s.ServletContextHandler@143d248b{/solr,null,UNAVAILABLE}
   [junit4]   2> 1052332 ERROR (SUITE-TestTlogReplica-seed#[EF3FC2C764EA3A25]-worker) [    ] o.a.z.s.ZooKeeperServer ZKShutdownHandler is not registered, so ZooKeeper server won't take any action on ERROR or SHUTDOWN server state changes
   [junit4]   2> 1052332 INFO  (SUITE-TestTlogReplica-seed#[EF3FC2C764EA3A25]-worker) [    ] o.a.s.c.ZkTestServer connecting to 127.0.0.1:63851 63851
   [junit4]   2> 1052348 INFO  (Thread-2209) [    ] o.a.s.c.ZkTestServer connecting to 127.0.0.1:63851 63851
   [junit4]   2> 1052348 WARN  (Thread-2209) [    ] o.a.s.c.ZkTestServer Watch limit violations:
   [junit4]   2> Maximum concurrent create/delete watches above limit:
   [junit4]   2>
   [junit4]   2> 33 /solr/configs/conf
   [junit4]   2> 10 /solr/aliases.json
   [junit4]   2> 9 /solr/security.json
   [junit4]   2>
   [junit4]   2> Maximum concurrent data watches above limit:
   [junit4]   2>
   [junit4]   2> 44 /solr/collections/tlog_replica_test_recovery/state.json
   [junit4]   2> 28 /solr/collections/tlog_replica_test_create_delete/state.json
   [junit4]   2> 27 /solr/collections/tlog_replica_test_kill_leader/state.json
   [junit4]   2> 27 /solr/collections/tlog_replica_test_remove_leader/state.json
   [junit4]   2> 27 /solr/collections/tlog_replica_test_kill_tlog_replica/state.json
   [junit4]   2> 26 /solr/collections/tlog_replica_test_basic_leader_election/state.json
   [junit4]   2> 24 /solr/collections/tlog_replica_test_out_of_order_db_qwith_in_place_updates/state.json
   [junit4]   2> 23 /solr/collections/tlog_replica_test_add_remove_tlog_replica/state.json
   [junit4]   2> 15 /solr/collections/tlog_replica_test_real_time_get/state.json
   [junit4]   2> 15 /solr/collections/tlog_replica_test_only_leader_indexes/state.json
   [junit4]   2> 15 /solr/collections/tlog_replica_test_delete_by_id/state.json
   [junit4]   2> 10 /solr/clusterprops.json
   [junit4]   2> 10 /solr/clusterstate.json
   [junit4]   2> 6 /solr/collections/tlog_replica_test_add_docs/state.json
   [junit4]   2> 4 /solr/collections/tlog_replica_test_recovery/leader_elect/shard1/election/98472151736385542-core_node2-n_0000000000
   [junit4]   2> 3 /solr/overseer_elect/election/98472151736385542-127.0.0.1:63856_solr-n_0000000001
   [junit4]   2> 2 /solr/overseer_elect/election/98472151736385553-1270.0.1:63855_solr-n_0000000004
   [junit4]   2> 2 /solr/collections/tlog_replica_test_create_delete/leader_elect/shard1/election/98472151736385559-core_node4-n_0000000000
   [junit4]   2>
   [junit4]   2> Maximum concurrent children watches above limit:
   [junit4]   2>
   [junit4]   2> 10 /solr/collections
   [junit4]   2> 5 /solr/overseer/queue
   [junit4]   2> 5 /solr/overseer/collection-queue-work
   [junit4]   2> 3 /solr/live_nodes
   [junit4]   2> 2 /solr/overseer/queue-work
   [junit4]   2>
   [junit4]   2> NOTE: leaving temporary files on disk at: C:\Users\jenkins\workspace\Lucene-Solr-7.0-Windows\solr\build\solr-core\test\J1\temp\solr.cloud.TestTlogReplica_EF3FC2C764EA3A25-001
   [junit4]   2> Aug 12, 2017 7:25:01 PM com.carrotsearch.randomizedtesting.ThreadLeakControl checkThreadLeaks
   [junit4]   2> WARNING: Will linger awaiting termination of 1 leaked thread(s).
   [junit4]   2> NOTE: test params are: codec=Asserting(Lucene70): {foo=PostingsFormat(name=Asserting), title_s=PostingsFormat(name=Asserting), id=Lucene50(blocksize=128), foo_s=PostingsFormat(name=Asserting)}, docValues:{_version_=DocValuesFormat(name=Asserting), id=DocValuesFormat(name=Lucene70), inplace_updatable_int=DocValuesFormat(name=Direct)}, maxPointsInLeafNode=105, maxMBSortInHeap=6.699377603176713, sim=RandomSimilarity(queryNorm=true): {}, locale=brx-IN, timezone=SystemV/YST9
   [junit4]   2> NOTE: Windows 10 10.0 amd64/Oracle Corporation 9 (64-bit)/cpus=3,threads=1,free=158919864,total=536870912
   [junit4]   2> NOTE: All tests run in this JVM: [DistributedQueryElevationComponentTest, TestComponentsName, GraphQueryTest, SecurityConfHandlerTest, SystemInfoHandlerTest, MoveReplicaTest, TestLegacyFieldReuse, ClassificationUpdateProcessorTest, TestLockTree, SuggesterTSTTest, CloudMLTQParserTest, TermVectorComponentDistributedTest, CustomCollectionTest, TestDocBasedVersionConstraints, TestNestedDocsSort, TestClassicSimilarityFactory, TestJettySolrRunner, TestMergePolicyConfig, HLLSerializationTest, ConfigureRecoveryStrategyTest, SchemaVersionSpecificBehaviorTest, TriLevelCompositeIdRoutingTest, SmileWriterTest, JavabinLoaderTest, ReplicaListTransformerTest, QueryEqualityTest, AutoCommitTest, TestIntervalFaceting, FacetPivotSmallTest, HdfsUnloadDistributedZkTest, TestRequestForwarding, DocExpirationUpdateProcessorFactoryTest, CheckHdfsIndexTest, BigEndianAscendingWordSerializerTest, StatelessScriptUpdateProcessorFactoryTest, DistributedExpandComponentTest, TestComplexPhraseLeadingWildcard, TestLMJelinekMercerSimilarityFactory, TestNumericTerms64, PreAnalyzedFieldManagedSchemaCloudTest, TestFiltering, ZkStateReaderTest, TestDynamicFieldResource, TestUniqueKeyFieldResource, TestConfig, TestOrdValues, FullSolrCloudDistribCmdsTest, ResponseHeaderTest, UninvertDocValuesMergePolicyTest, ActionThrottleTest, TestSearcherReuse, ConnectionManagerTest, BufferStoreTest, StressHdfsTest, TestRTGBase, TestIndexSearcher, DOMUtilTest, DistributedFacetPivotWhiteBoxTest, RollingRestartTest, TestBackupRepositoryFactory, FieldMutatingUpdateProcessorTest, TestRemoteStreaming, ChaosMonkeySafeLeaderTest, TestQueryTypes, TestUseDocValuesAsStored2, HdfsChaosMonkeyNothingIsSafeTest, SolrCloudReportersTest, BasicFunctionalityTest, TestBadConfig, HdfsCollectionsAPIDistributedZkTest, TestSolrXml, TestLeaderElectionWithEmptyReplica, SolrCmdDistributorTest, CollectionsAPIAsyncDistributedZkTest, TestFieldTypeResource, SignatureUpdateProcessorFactoryTest, LukeRequestHandlerTest, TermVectorComponentTest, MoveReplicaHDFSTest, SolrPluginUtilsTest, TestDistributedGrouping, TestZkChroot, DistributedMLTComponentTest, DeleteStatusTest, TestLegacyTerms, LoggingHandlerTest, VersionInfoTest, SuggesterFSTTest, TestLuceneMatchVersion, TestSubQueryTransformerDistrib, HdfsRestartWhileUpdatingTest, DirectoryFactoryTest, TestXmlQParserPlugin, RulesTest, TestZkAclsWithHadoopAuth, TestLRUCache, TestPullReplica, HdfsBasicDistributedZk2Test, TestCustomSort, TestQueryUtils, TestShortCircuitedRequests, StatsReloadRaceTest, HdfsDirectoryFactoryTest, DistributedQueryComponentOptimizationTest, AssignTest, TestOnReconnectListenerSupport, TestTolerantUpdateProcessorRandomCloud, DistributedIntervalFacetingTest, TestCoreAdminApis, TestFastLRUCache, TestBulkSchemaAPI, TestRecovery, TestConfigSets, SpellCheckCollatorWithCollapseTest, TestPartialUpdateDeduplication, CdcrRequestHandlerTest, CoreAdminCreateDiscoverTest, SolrGangliaReporterTest, BlockJoinFacetRandomTest, TestPointFields, TestDistribIDF, TestSimpleTextCodec, TestCustomStream, BadCopyFieldTest, TestExactStatsCache, TestValueSourceCache, TestStressInPlaceUpdates, TestSuggestSpellingConverter, BadIndexSchemaTest, TestSolr4Spatial, TestRandomFaceting, AutoScalingHandlerTest, SubstringBytesRefFilterTest, TestLegacyNumericRangeQueryBuilder, TestPayloadCheckQParserPlugin, TestTlogReplica]
   [junit4] Completed [285/728 (3!)] on J1 in 110.19s, 13 tests, 1 failure <<< FAILURES!

[...truncated 38013 lines...]


---------------------------------------------------------------------
To unsubscribe, e-mail: [hidden email]
For additional commands, e-mail: [hidden email]