[JENKINS-EA] Lucene-Solr-7.x-Linux (64bit/jdk-9-ea+181) - Build # 403 - Unstable!

Previous Topic Next Topic
 
classic Classic list List threaded Threaded
1 message Options
Reply | Threaded
Open this post in threaded view
|

[JENKINS-EA] Lucene-Solr-7.x-Linux (64bit/jdk-9-ea+181) - Build # 403 - Unstable!

Policeman Jenkins Server-2
Build: https://jenkins.thetaphi.de/job/Lucene-Solr-7.x-Linux/403/
Java: 64bit/jdk-9-ea+181 -XX:+UseCompressedOops -XX:+UseParallelGC --illegal-access=deny

1 tests failed.
FAILED:  org.apache.solr.update.TestInPlaceUpdatesDistrib.test

Error Message:
inplace_updatable_float didn't match for replica at client: http://127.0.0.1:42357/collection1 expected:<111.0> but was:<1.0>

Stack Trace:
java.lang.AssertionError: inplace_updatable_float didn't match for replica at client: http://127.0.0.1:42357/collection1 expected:<111.0> but was:<1.0>
        at __randomizedtesting.SeedInfo.seed([32ACE6FA7DBECC89:BAF8D920D342A171]:0)
        at org.junit.Assert.fail(Assert.java:93)
        at org.junit.Assert.failNotEquals(Assert.java:647)
        at org.junit.Assert.assertEquals(Assert.java:128)
        at org.apache.solr.update.TestInPlaceUpdatesDistrib.assertReplicaValue(TestInPlaceUpdatesDistrib.java:980)
        at org.apache.solr.update.TestInPlaceUpdatesDistrib.outOfOrderUpdatesIndividualReplicaTest(TestInPlaceUpdatesDistrib.java:643)
        at org.apache.solr.update.TestInPlaceUpdatesDistrib.test(TestInPlaceUpdatesDistrib.java:144)
        at java.base/jdk.internal.reflect.NativeMethodAccessorImpl.invoke0(Native Method)
        at java.base/jdk.internal.reflect.NativeMethodAccessorImpl.invoke(NativeMethodAccessorImpl.java:62)
        at java.base/jdk.internal.reflect.DelegatingMethodAccessorImpl.invoke(DelegatingMethodAccessorImpl.java:43)
        at java.base/java.lang.reflect.Method.invoke(Method.java:564)
        at com.carrotsearch.randomizedtesting.RandomizedRunner.invoke(RandomizedRunner.java:1737)
        at com.carrotsearch.randomizedtesting.RandomizedRunner$8.evaluate(RandomizedRunner.java:934)
        at com.carrotsearch.randomizedtesting.RandomizedRunner$9.evaluate(RandomizedRunner.java:970)
        at com.carrotsearch.randomizedtesting.RandomizedRunner$10.evaluate(RandomizedRunner.java:984)
        at org.apache.solr.BaseDistributedSearchTestCase$ShardsRepeatRule$ShardsFixedStatement.callStatement(BaseDistributedSearchTestCase.java:993)
        at org.apache.solr.BaseDistributedSearchTestCase$ShardsRepeatRule$ShardsStatement.evaluate(BaseDistributedSearchTestCase.java:968)
        at com.carrotsearch.randomizedtesting.rules.SystemPropertiesRestoreRule$1.evaluate(SystemPropertiesRestoreRule.java:57)
        at org.apache.lucene.util.TestRuleSetupTeardownChained$1.evaluate(TestRuleSetupTeardownChained.java:49)
        at org.apache.lucene.util.AbstractBeforeAfterRule$1.evaluate(AbstractBeforeAfterRule.java:45)
        at org.apache.lucene.util.TestRuleThreadAndTestName$1.evaluate(TestRuleThreadAndTestName.java:48)
        at org.apache.lucene.util.TestRuleIgnoreAfterMaxFailures$1.evaluate(TestRuleIgnoreAfterMaxFailures.java:64)
        at org.apache.lucene.util.TestRuleMarkFailure$1.evaluate(TestRuleMarkFailure.java:47)
        at com.carrotsearch.randomizedtesting.rules.StatementAdapter.evaluate(StatementAdapter.java:36)
        at com.carrotsearch.randomizedtesting.ThreadLeakControl$StatementRunner.run(ThreadLeakControl.java:368)
        at com.carrotsearch.randomizedtesting.ThreadLeakControl.forkTimeoutingTask(ThreadLeakControl.java:817)
        at com.carrotsearch.randomizedtesting.ThreadLeakControl$3.evaluate(ThreadLeakControl.java:468)
        at com.carrotsearch.randomizedtesting.RandomizedRunner.runSingleTest(RandomizedRunner.java:943)
        at com.carrotsearch.randomizedtesting.RandomizedRunner$5.evaluate(RandomizedRunner.java:829)
        at com.carrotsearch.randomizedtesting.RandomizedRunner$6.evaluate(RandomizedRunner.java:879)
        at com.carrotsearch.randomizedtesting.RandomizedRunner$7.evaluate(RandomizedRunner.java:890)
        at com.carrotsearch.randomizedtesting.rules.StatementAdapter.evaluate(StatementAdapter.java:36)
        at com.carrotsearch.randomizedtesting.rules.SystemPropertiesRestoreRule$1.evaluate(SystemPropertiesRestoreRule.java:57)
        at org.apache.lucene.util.AbstractBeforeAfterRule$1.evaluate(AbstractBeforeAfterRule.java:45)
        at com.carrotsearch.randomizedtesting.rules.StatementAdapter.evaluate(StatementAdapter.java:36)
        at org.apache.lucene.util.TestRuleStoreClassName$1.evaluate(TestRuleStoreClassName.java:41)
        at com.carrotsearch.randomizedtesting.rules.NoShadowingOrOverridesOnMethodsRule$1.evaluate(NoShadowingOrOverridesOnMethodsRule.java:40)
        at com.carrotsearch.randomizedtesting.rules.NoShadowingOrOverridesOnMethodsRule$1.evaluate(NoShadowingOrOverridesOnMethodsRule.java:40)
        at com.carrotsearch.randomizedtesting.rules.StatementAdapter.evaluate(StatementAdapter.java:36)
        at com.carrotsearch.randomizedtesting.rules.StatementAdapter.evaluate(StatementAdapter.java:36)
        at org.apache.lucene.util.TestRuleAssertionsRequired$1.evaluate(TestRuleAssertionsRequired.java:53)
        at org.apache.lucene.util.TestRuleMarkFailure$1.evaluate(TestRuleMarkFailure.java:47)
        at org.apache.lucene.util.TestRuleIgnoreAfterMaxFailures$1.evaluate(TestRuleIgnoreAfterMaxFailures.java:64)
        at org.apache.lucene.util.TestRuleIgnoreTestSuites$1.evaluate(TestRuleIgnoreTestSuites.java:54)
        at com.carrotsearch.randomizedtesting.rules.StatementAdapter.evaluate(StatementAdapter.java:36)
        at com.carrotsearch.randomizedtesting.ThreadLeakControl$StatementRunner.run(ThreadLeakControl.java:368)
        at java.base/java.lang.Thread.run(Thread.java:844)




Build Log:
[...truncated 12056 lines...]
   [junit4] Suite: org.apache.solr.update.TestInPlaceUpdatesDistrib
   [junit4]   2> 882663 INFO  (SUITE-TestInPlaceUpdatesDistrib-seed#[32ACE6FA7DBECC89]-worker) [    ] o.a.s.SolrTestCaseJ4 SecureRandom sanity checks: test.solr.allowed.securerandom=null & java.security.egd=file:/dev/./urandom
   [junit4]   2> Creating dataDir: /home/jenkins/workspace/Lucene-Solr-7.x-Linux/solr/build/solr-core/test/J0/temp/solr.update.TestInPlaceUpdatesDistrib_32ACE6FA7DBECC89-001/init-core-data-001
   [junit4]   2> 882663 INFO  (SUITE-TestInPlaceUpdatesDistrib-seed#[32ACE6FA7DBECC89]-worker) [    ] o.a.s.SolrTestCaseJ4 Using PointFields (NUMERIC_POINTS_SYSPROP=true) w/NUMERIC_DOCVALUES_SYSPROP=true
   [junit4]   2> 882664 INFO  (SUITE-TestInPlaceUpdatesDistrib-seed#[32ACE6FA7DBECC89]-worker) [    ] o.a.s.SolrTestCaseJ4 Randomized ssl (false) and clientAuth (true) via: @org.apache.solr.util.RandomizeSSL(reason="", ssl=0.0/0.0, value=0.0/0.0, clientAuth=0.0/0.0)
   [junit4]   2> 882664 INFO  (SUITE-TestInPlaceUpdatesDistrib-seed#[32ACE6FA7DBECC89]-worker) [    ] o.a.s.BaseDistributedSearchTestCase Setting hostContext system property: /
   [junit4]   2> 882664 INFO  (SUITE-TestInPlaceUpdatesDistrib-seed#[32ACE6FA7DBECC89]-worker) [    ] o.a.s.SolrTestCaseJ4 ####initCore
   [junit4]   2> 882664 INFO  (SUITE-TestInPlaceUpdatesDistrib-seed#[32ACE6FA7DBECC89]-worker) [    ] o.a.s.c.SolrResourceLoader [null] Added 2 libs to classloader, from paths: [/home/jenkins/workspace/Lucene-Solr-7.x-Linux/solr/core/src/test-files/solr/collection1/lib, /home/jenkins/workspace/Lucene-Solr-7.x-Linux/solr/core/src/test-files/solr/collection1/lib/classes]
   [junit4]   2> 882678 INFO  (SUITE-TestInPlaceUpdatesDistrib-seed#[32ACE6FA7DBECC89]-worker) [    ] o.a.s.c.SolrConfig Using Lucene MatchVersion: 7.1.0
   [junit4]   2> 882684 INFO  (SUITE-TestInPlaceUpdatesDistrib-seed#[32ACE6FA7DBECC89]-worker) [    ] o.a.s.s.IndexSchema [null] Schema name=inplace-updates
   [junit4]   2> 882685 INFO  (SUITE-TestInPlaceUpdatesDistrib-seed#[32ACE6FA7DBECC89]-worker) [    ] o.a.s.s.IndexSchema Loaded schema inplace-updates/1.6 with uniqueid field id
   [junit4]   2> 882706 INFO  (SUITE-TestInPlaceUpdatesDistrib-seed#[32ACE6FA7DBECC89]-worker) [    ] o.a.s.m.r.SolrJmxReporter JMX monitoring for 'solr.node' (registry 'solr.node') enabled at server: com.sun.jmx.mbeanserver.JmxMBeanServer@2770cc8b
   [junit4]   2> 882710 INFO  (SUITE-TestInPlaceUpdatesDistrib-seed#[32ACE6FA7DBECC89]-worker) [    ] o.a.s.m.r.SolrJmxReporter JMX monitoring for 'solr.jvm' (registry 'solr.jvm') enabled at server: com.sun.jmx.mbeanserver.JmxMBeanServer@2770cc8b
   [junit4]   2> 882711 INFO  (SUITE-TestInPlaceUpdatesDistrib-seed#[32ACE6FA7DBECC89]-worker) [    ] o.a.s.m.r.SolrJmxReporter JMX monitoring for 'solr.jetty' (registry 'solr.jetty') enabled at server: com.sun.jmx.mbeanserver.JmxMBeanServer@2770cc8b
   [junit4]   2> 882711 INFO  (coreLoadExecutor-3976-thread-1) [    ] o.a.s.c.SolrResourceLoader [null] Added 2 libs to classloader, from paths: [/home/jenkins/workspace/Lucene-Solr-7.x-Linux/solr/core/src/test-files/solr/collection1/lib, /home/jenkins/workspace/Lucene-Solr-7.x-Linux/solr/core/src/test-files/solr/collection1/lib/classes]
   [junit4]   2> 882721 INFO  (coreLoadExecutor-3976-thread-1) [    ] o.a.s.c.SolrConfig Using Lucene MatchVersion: 7.1.0
   [junit4]   2> 882726 INFO  (coreLoadExecutor-3976-thread-1) [    ] o.a.s.s.IndexSchema [collection1] Schema name=inplace-updates
   [junit4]   2> 882727 INFO  (coreLoadExecutor-3976-thread-1) [    ] o.a.s.s.IndexSchema Loaded schema inplace-updates/1.6 with uniqueid field id
   [junit4]   2> 882727 INFO  (coreLoadExecutor-3976-thread-1) [    ] o.a.s.c.CoreContainer Creating SolrCore 'collection1' using configuration from instancedir /home/jenkins/workspace/Lucene-Solr-7.x-Linux/solr/core/src/test-files/solr/collection1, trusted=true
   [junit4]   2> 882727 INFO  (coreLoadExecutor-3976-thread-1) [    ] o.a.s.m.r.SolrJmxReporter JMX monitoring for 'solr.core.collection1' (registry 'solr.core.collection1') enabled at server: com.sun.jmx.mbeanserver.JmxMBeanServer@2770cc8b
   [junit4]   2> 882727 INFO  (coreLoadExecutor-3976-thread-1) [    ] o.a.s.c.SolrCore solr.RecoveryStrategy.Builder
   [junit4]   2> 882727 INFO  (coreLoadExecutor-3976-thread-1) [    ] o.a.s.c.SolrCore [[collection1] ] Opening new SolrCore at [/home/jenkins/workspace/Lucene-Solr-7.x-Linux/solr/core/src/test-files/solr/collection1], dataDir=[/home/jenkins/workspace/Lucene-Solr-7.x-Linux/solr/build/solr-core/test/J0/temp/solr.update.TestInPlaceUpdatesDistrib_32ACE6FA7DBECC89-001/init-core-data-001/]
   [junit4]   2> 882729 WARN  (coreLoadExecutor-3976-thread-1) [    ] o.a.s.c.RequestHandlers INVALID paramSet a in requestHandler {type = requestHandler,name = /dump,class = DumpRequestHandler,attributes = {initParams=a, name=/dump, class=DumpRequestHandler},args = {defaults={a=A,b=B}}}
   [junit4]   2> 882752 INFO  (coreLoadExecutor-3976-thread-1) [    ] o.a.s.u.UpdateHandler Using UpdateLog implementation: org.apache.solr.update.UpdateLog
   [junit4]   2> 882752 INFO  (coreLoadExecutor-3976-thread-1) [    ] o.a.s.u.UpdateLog Initializing UpdateLog: dataDir= defaultSyncLevel=FLUSH numRecordsToKeep=100 maxNumLogsToKeep=10 numVersionBuckets=65536
   [junit4]   2> 882753 INFO  (coreLoadExecutor-3976-thread-1) [    ] o.a.s.u.CommitTracker Hard AutoCommit: disabled
   [junit4]   2> 882753 INFO  (coreLoadExecutor-3976-thread-1) [    ] o.a.s.u.CommitTracker Soft AutoCommit: disabled
   [junit4]   2> 882753 INFO  (coreLoadExecutor-3976-thread-1) [    ] o.a.s.s.SolrIndexSearcher Opening [Searcher@65aa4216[collection1] main]
   [junit4]   2> 882754 WARN  (coreLoadExecutor-3976-thread-1) [    ] o.a.s.r.ManagedResourceStorage Cannot write to config directory /home/jenkins/workspace/Lucene-Solr-7.x-Linux/solr/core/src/test-files/solr/collection1/conf; switching to use InMemory storage instead.
   [junit4]   2> 882754 INFO  (coreLoadExecutor-3976-thread-1) [    ] o.a.s.h.ReplicationHandler Commits will be reserved for  10000
   [junit4]   2> 882754 INFO  (searcherExecutor-3977-thread-1) [    ] o.a.s.c.SolrCore [collection1] Registered new searcher Searcher@65aa4216[collection1] main{ExitableDirectoryReader(UninvertingDirectoryReader())}
   [junit4]   2> 882754 INFO  (coreLoadExecutor-3976-thread-1) [    ] o.a.s.u.UpdateLog Could not find max version in index or recent updates, using new clock 1578379016487829504
   [junit4]   2> 882756 INFO  (SUITE-TestInPlaceUpdatesDistrib-seed#[32ACE6FA7DBECC89]-worker) [    ] o.a.s.SolrTestCaseJ4 ####initCore end
   [junit4]   2> 882757 INFO  (TEST-TestInPlaceUpdatesDistrib.test-seed#[32ACE6FA7DBECC89]) [    ] o.a.s.c.ZkTestServer STARTING ZK TEST SERVER
   [junit4]   2> 882757 INFO  (Thread-2045) [    ] o.a.s.c.ZkTestServer client port:0.0.0.0/0.0.0.0:0
   [junit4]   2> 882757 INFO  (Thread-2045) [    ] o.a.s.c.ZkTestServer Starting server
   [junit4]   2> 882759 ERROR (Thread-2045) [    ] o.a.z.s.ZooKeeperServer ZKShutdownHandler is not registered, so ZooKeeper server won't take any action on ERROR or SHUTDOWN server state changes
   [junit4]   2> 882858 INFO  (TEST-TestInPlaceUpdatesDistrib.test-seed#[32ACE6FA7DBECC89]) [    ] o.a.s.c.ZkTestServer start zk server on port:39287
   [junit4]   2> 882861 WARN  (NIOServerCxn.Factory:0.0.0.0/0.0.0.0:0) [    ] o.a.z.s.NIOServerCnxn caught end of stream exception
   [junit4]   2> EndOfStreamException: Unable to read additional data from client sessionid 0x15e7875a56f0000, likely client has closed socket
   [junit4]   2> at org.apache.zookeeper.server.NIOServerCnxn.doIO(NIOServerCnxn.java:239)
   [junit4]   2> at org.apache.zookeeper.server.NIOServerCnxnFactory.run(NIOServerCnxnFactory.java:203)
   [junit4]   2> at java.base/java.lang.Thread.run(Thread.java:844)
   [junit4]   2> 882865 INFO  (TEST-TestInPlaceUpdatesDistrib.test-seed#[32ACE6FA7DBECC89]) [    ] o.a.s.c.AbstractZkTestCase put /home/jenkins/workspace/Lucene-Solr-7.x-Linux/solr/core/src/test-files/solr/collection1/conf/solrconfig-tlog.xml to /configs/conf1/solrconfig.xml
   [junit4]   2> 882866 INFO  (TEST-TestInPlaceUpdatesDistrib.test-seed#[32ACE6FA7DBECC89]) [    ] o.a.s.c.AbstractZkTestCase put /home/jenkins/workspace/Lucene-Solr-7.x-Linux/solr/core/src/test-files/solr/collection1/conf/schema-inplace-updates.xml to /configs/conf1/schema.xml
   [junit4]   2> 882866 INFO  (TEST-TestInPlaceUpdatesDistrib.test-seed#[32ACE6FA7DBECC89]) [    ] o.a.s.c.AbstractZkTestCase put /home/jenkins/workspace/Lucene-Solr-7.x-Linux/solr/core/src/test-files/solr/collection1/conf/solrconfig.snippet.randomindexconfig.xml to /configs/conf1/solrconfig.snippet.randomindexconfig.xml
   [junit4]   2> 882867 INFO  (TEST-TestInPlaceUpdatesDistrib.test-seed#[32ACE6FA7DBECC89]) [    ] o.a.s.c.AbstractZkTestCase put /home/jenkins/workspace/Lucene-Solr-7.x-Linux/solr/core/src/test-files/solr/collection1/conf/stopwords.txt to /configs/conf1/stopwords.txt
   [junit4]   2> 882868 INFO  (TEST-TestInPlaceUpdatesDistrib.test-seed#[32ACE6FA7DBECC89]) [    ] o.a.s.c.AbstractZkTestCase put /home/jenkins/workspace/Lucene-Solr-7.x-Linux/solr/core/src/test-files/solr/collection1/conf/protwords.txt to /configs/conf1/protwords.txt
   [junit4]   2> 882868 INFO  (TEST-TestInPlaceUpdatesDistrib.test-seed#[32ACE6FA7DBECC89]) [    ] o.a.s.c.AbstractZkTestCase put /home/jenkins/workspace/Lucene-Solr-7.x-Linux/solr/core/src/test-files/solr/collection1/conf/currency.xml to /configs/conf1/currency.xml
   [junit4]   2> 882869 INFO  (TEST-TestInPlaceUpdatesDistrib.test-seed#[32ACE6FA7DBECC89]) [    ] o.a.s.c.AbstractZkTestCase put /home/jenkins/workspace/Lucene-Solr-7.x-Linux/solr/core/src/test-files/solr/collection1/conf/enumsConfig.xml to /configs/conf1/enumsConfig.xml
   [junit4]   2> 882870 INFO  (TEST-TestInPlaceUpdatesDistrib.test-seed#[32ACE6FA7DBECC89]) [    ] o.a.s.c.AbstractZkTestCase put /home/jenkins/workspace/Lucene-Solr-7.x-Linux/solr/core/src/test-files/solr/collection1/conf/open-exchange-rates.json to /configs/conf1/open-exchange-rates.json
   [junit4]   2> 882871 INFO  (TEST-TestInPlaceUpdatesDistrib.test-seed#[32ACE6FA7DBECC89]) [    ] o.a.s.c.AbstractZkTestCase put /home/jenkins/workspace/Lucene-Solr-7.x-Linux/solr/core/src/test-files/solr/collection1/conf/mapping-ISOLatin1Accent.txt to /configs/conf1/mapping-ISOLatin1Accent.txt
   [junit4]   2> 882871 INFO  (TEST-TestInPlaceUpdatesDistrib.test-seed#[32ACE6FA7DBECC89]) [    ] o.a.s.c.AbstractZkTestCase put /home/jenkins/workspace/Lucene-Solr-7.x-Linux/solr/core/src/test-files/solr/collection1/conf/old_synonyms.txt to /configs/conf1/old_synonyms.txt
   [junit4]   2> 882872 INFO  (TEST-TestInPlaceUpdatesDistrib.test-seed#[32ACE6FA7DBECC89]) [    ] o.a.s.c.AbstractZkTestCase put /home/jenkins/workspace/Lucene-Solr-7.x-Linux/solr/core/src/test-files/solr/collection1/conf/synonyms.txt to /configs/conf1/synonyms.txt
   [junit4]   2> 882873 INFO  (TEST-TestInPlaceUpdatesDistrib.test-seed#[32ACE6FA7DBECC89]) [    ] o.a.s.c.AbstractFullDistribZkTestBase Will use TLOG replicas unless explicitly asked otherwise
   [junit4]   2> 882980 INFO  (TEST-TestInPlaceUpdatesDistrib.test-seed#[32ACE6FA7DBECC89]) [    ] o.e.j.s.Server jetty-9.3.20.v20170531
   [junit4]   2> 882981 INFO  (TEST-TestInPlaceUpdatesDistrib.test-seed#[32ACE6FA7DBECC89]) [    ] o.e.j.s.h.ContextHandler Started o.e.j.s.ServletContextHandler@c2bd881{/,null,AVAILABLE}
   [junit4]   2> 882981 INFO  (TEST-TestInPlaceUpdatesDistrib.test-seed#[32ACE6FA7DBECC89]) [    ] o.e.j.s.AbstractConnector Started ServerConnector@6fa83b47{HTTP/1.1,[http/1.1]}{127.0.0.1:34815}
   [junit4]   2> 882981 INFO  (TEST-TestInPlaceUpdatesDistrib.test-seed#[32ACE6FA7DBECC89]) [    ] o.e.j.s.Server Started @886107ms
   [junit4]   2> 882981 INFO  (TEST-TestInPlaceUpdatesDistrib.test-seed#[32ACE6FA7DBECC89]) [    ] o.a.s.c.s.e.JettySolrRunner Jetty properties: {hostContext=/, solr.data.dir=/home/jenkins/workspace/Lucene-Solr-7.x-Linux/solr/build/solr-core/test/J0/temp/solr.update.TestInPlaceUpdatesDistrib_32ACE6FA7DBECC89-001/tempDir-001/control/data, hostPort=34815, coreRootDirectory=/home/jenkins/workspace/Lucene-Solr-7.x-Linux/solr/build/solr-core/test/J0/../../../../../../../../../home/jenkins/workspace/Lucene-Solr-7.x-Linux/solr/build/solr-core/test/J0/temp/solr.update.TestInPlaceUpdatesDistrib_32ACE6FA7DBECC89-001/control-001/cores}
   [junit4]   2> 882981 ERROR (TEST-TestInPlaceUpdatesDistrib.test-seed#[32ACE6FA7DBECC89]) [    ] o.a.s.u.StartupLoggingUtils Missing Java Option solr.log.dir. Logging may be missing or incomplete.
   [junit4]   2> 882982 INFO  (TEST-TestInPlaceUpdatesDistrib.test-seed#[32ACE6FA7DBECC89]) [    ] o.a.s.s.SolrDispatchFilter  ___      _       Welcome to Apache Solr™ version 7.1.0
   [junit4]   2> 882982 INFO  (TEST-TestInPlaceUpdatesDistrib.test-seed#[32ACE6FA7DBECC89]) [    ] o.a.s.s.SolrDispatchFilter / __| ___| |_ _   Starting in cloud mode on port null
   [junit4]   2> 882982 INFO  (TEST-TestInPlaceUpdatesDistrib.test-seed#[32ACE6FA7DBECC89]) [    ] o.a.s.s.SolrDispatchFilter \__ \/ _ \ | '_|  Install dir: null, Default config dir: null
   [junit4]   2> 882982 INFO  (TEST-TestInPlaceUpdatesDistrib.test-seed#[32ACE6FA7DBECC89]) [    ] o.a.s.s.SolrDispatchFilter |___/\___/_|_|    Start time: 2017-09-12T23:38:49.807124Z
   [junit4]   2> 882983 INFO  (TEST-TestInPlaceUpdatesDistrib.test-seed#[32ACE6FA7DBECC89]) [    ] o.a.s.s.SolrDispatchFilter Loading solr.xml from SolrHome (not found in ZooKeeper)
   [junit4]   2> 882984 INFO  (TEST-TestInPlaceUpdatesDistrib.test-seed#[32ACE6FA7DBECC89]) [    ] o.a.s.c.SolrXmlConfig Loading container configuration from /home/jenkins/workspace/Lucene-Solr-7.x-Linux/solr/build/solr-core/test/J0/temp/solr.update.TestInPlaceUpdatesDistrib_32ACE6FA7DBECC89-001/control-001/solr.xml
   [junit4]   2> 882987 INFO  (TEST-TestInPlaceUpdatesDistrib.test-seed#[32ACE6FA7DBECC89]) [    ] o.a.s.c.SolrXmlConfig MBean server found: com.sun.jmx.mbeanserver.JmxMBeanServer@2770cc8b, but no JMX reporters were configured - adding default JMX reporter.
   [junit4]   2> 882989 INFO  (TEST-TestInPlaceUpdatesDistrib.test-seed#[32ACE6FA7DBECC89]) [    ] o.a.s.c.ZkContainer Zookeeper client=127.0.0.1:39287/solr
   [junit4]   2> 883045 INFO  (TEST-TestInPlaceUpdatesDistrib.test-seed#[32ACE6FA7DBECC89]) [    ] o.a.s.c.Overseer Overseer (id=null) closing
   [junit4]   2> 883046 INFO  (TEST-TestInPlaceUpdatesDistrib.test-seed#[32ACE6FA7DBECC89]) [    ] o.a.s.c.OverseerElectionContext I am going to be the leader 127.0.0.1:34815_
   [junit4]   2> 883046 INFO  (TEST-TestInPlaceUpdatesDistrib.test-seed#[32ACE6FA7DBECC89]) [    ] o.a.s.c.Overseer Overseer (id=98648688530751492-127.0.0.1:34815_-n_0000000000) starting
   [junit4]   2> 883052 INFO  (TEST-TestInPlaceUpdatesDistrib.test-seed#[32ACE6FA7DBECC89]) [    ] o.a.s.c.ZkController Register node as live in ZooKeeper:/live_nodes/127.0.0.1:34815_
   [junit4]   2> 883053 INFO  (zkCallback-1189-thread-1) [    ] o.a.s.c.c.ZkStateReader Updated live nodes from ZooKeeper... (0) -> (1)
   [junit4]   2> 883093 INFO  (TEST-TestInPlaceUpdatesDistrib.test-seed#[32ACE6FA7DBECC89]) [    ] o.a.s.m.r.SolrJmxReporter JMX monitoring for 'solr.node' (registry 'solr.node') enabled at server: com.sun.jmx.mbeanserver.JmxMBeanServer@2770cc8b
   [junit4]   2> 883101 INFO  (TEST-TestInPlaceUpdatesDistrib.test-seed#[32ACE6FA7DBECC89]) [    ] o.a.s.m.r.SolrJmxReporter JMX monitoring for 'solr.jvm' (registry 'solr.jvm') enabled at server: com.sun.jmx.mbeanserver.JmxMBeanServer@2770cc8b
   [junit4]   2> 883101 INFO  (TEST-TestInPlaceUpdatesDistrib.test-seed#[32ACE6FA7DBECC89]) [    ] o.a.s.m.r.SolrJmxReporter JMX monitoring for 'solr.jetty' (registry 'solr.jetty') enabled at server: com.sun.jmx.mbeanserver.JmxMBeanServer@2770cc8b
   [junit4]   2> 883102 INFO  (TEST-TestInPlaceUpdatesDistrib.test-seed#[32ACE6FA7DBECC89]) [    ] o.a.s.c.CorePropertiesLocator Found 0 core definitions underneath /home/jenkins/workspace/Lucene-Solr-7.x-Linux/solr/build/solr-core/test/J0/../../../../../../../../../home/jenkins/workspace/Lucene-Solr-7.x-Linux/solr/build/solr-core/test/J0/temp/solr.update.TestInPlaceUpdatesDistrib_32ACE6FA7DBECC89-001/control-001/cores
   [junit4]   2> 883152 INFO  (TEST-TestInPlaceUpdatesDistrib.test-seed#[32ACE6FA7DBECC89]) [    ] o.a.s.c.c.ZkStateReader Updated live nodes from ZooKeeper... (0) -> (1)
   [junit4]   2> 883152 INFO  (TEST-TestInPlaceUpdatesDistrib.test-seed#[32ACE6FA7DBECC89]) [    ] o.a.s.c.s.i.ZkClientClusterStateProvider Cluster at 127.0.0.1:39287/solr ready
   [junit4]   2> 883154 INFO  (qtp2070508171-7987) [    ] o.a.s.h.a.CollectionsHandler Invoked Collection Action :create with params replicationFactor=1&collection.configName=conf1&name=control_collection&nrtReplicas=1&action=CREATE&numShards=1&createNodeSet=127.0.0.1:34815_&wt=javabin&version=2 and sendToOCPQueue=true
   [junit4]   2> 883160 INFO  (OverseerThreadFactory-3987-thread-1) [    ] o.a.s.c.CreateCollectionCmd Create collection control_collection
   [junit4]   2> 883272 INFO  (qtp2070508171-7989) [    ] o.a.s.h.a.CoreAdminOperation core create command qt=/admin/cores&collection.configName=conf1&newCollection=true&name=control_collection_shard1_replica_n1&action=CREATE&numShards=1&collection=control_collection&shard=shard1&wt=javabin&version=2&replicaType=NRT
   [junit4]   2> 883272 INFO  (qtp2070508171-7989) [    ] o.a.s.c.TransientSolrCoreCacheDefault Allocating transient cache for 4 transient cores
   [junit4]   2> 883391 INFO  (zkCallback-1189-thread-1) [    ] o.a.s.c.c.ZkStateReader A cluster state change: [WatchedEvent state:SyncConnected type:NodeDataChanged path:/collections/control_collection/state.json] for collection [control_collection] has occurred - updating... (live nodes size: [1])
   [junit4]   2> 884296 INFO  (qtp2070508171-7989) [    ] o.a.s.c.SolrConfig Using Lucene MatchVersion: 7.1.0
   [junit4]   2> 884300 INFO  (qtp2070508171-7989) [    ] o.a.s.s.IndexSchema [control_collection_shard1_replica_n1] Schema name=inplace-updates
   [junit4]   2> 884301 INFO  (qtp2070508171-7989) [    ] o.a.s.s.IndexSchema Loaded schema inplace-updates/1.6 with uniqueid field id
   [junit4]   2> 884301 INFO  (qtp2070508171-7989) [    ] o.a.s.c.CoreContainer Creating SolrCore 'control_collection_shard1_replica_n1' using configuration from collection control_collection, trusted=true
   [junit4]   2> 884301 INFO  (qtp2070508171-7989) [    ] o.a.s.m.r.SolrJmxReporter JMX monitoring for 'solr.core.control_collection.shard1.replica_n1' (registry 'solr.core.control_collection.shard1.replica_n1') enabled at server: com.sun.jmx.mbeanserver.JmxMBeanServer@2770cc8b
   [junit4]   2> 884302 INFO  (qtp2070508171-7989) [    ] o.a.s.c.SolrCore solr.RecoveryStrategy.Builder
   [junit4]   2> 884302 INFO  (qtp2070508171-7989) [    ] o.a.s.c.SolrCore [[control_collection_shard1_replica_n1] ] Opening new SolrCore at [/home/jenkins/workspace/Lucene-Solr-7.x-Linux/solr/build/solr-core/test/J0/temp/solr.update.TestInPlaceUpdatesDistrib_32ACE6FA7DBECC89-001/control-001/cores/control_collection_shard1_replica_n1], dataDir=[/home/jenkins/workspace/Lucene-Solr-7.x-Linux/solr/build/solr-core/test/J0/../../../../../../../../../home/jenkins/workspace/Lucene-Solr-7.x-Linux/solr/build/solr-core/test/J0/temp/solr.update.TestInPlaceUpdatesDistrib_32ACE6FA7DBECC89-001/control-001/cores/control_collection_shard1_replica_n1/data/]
   [junit4]   2> 884304 WARN  (qtp2070508171-7989) [    ] o.a.s.c.RequestHandlers INVALID paramSet a in requestHandler {type = requestHandler,name = /dump,class = DumpRequestHandler,attributes = {initParams=a, name=/dump, class=DumpRequestHandler},args = {defaults={a=A,b=B}}}
   [junit4]   2> 884327 INFO  (qtp2070508171-7989) [    ] o.a.s.u.UpdateHandler Using UpdateLog implementation: org.apache.solr.update.UpdateLog
   [junit4]   2> 884327 INFO  (qtp2070508171-7989) [    ] o.a.s.u.UpdateLog Initializing UpdateLog: dataDir= defaultSyncLevel=FLUSH numRecordsToKeep=100 maxNumLogsToKeep=10 numVersionBuckets=65536
   [junit4]   2> 884328 INFO  (qtp2070508171-7989) [    ] o.a.s.u.CommitTracker Hard AutoCommit: disabled
   [junit4]   2> 884328 INFO  (qtp2070508171-7989) [    ] o.a.s.u.CommitTracker Soft AutoCommit: disabled
   [junit4]   2> 884329 INFO  (qtp2070508171-7989) [    ] o.a.s.s.SolrIndexSearcher Opening [Searcher@5bb424b1[control_collection_shard1_replica_n1] main]
   [junit4]   2> 884329 INFO  (qtp2070508171-7989) [    ] o.a.s.r.ManagedResourceStorage Configured ZooKeeperStorageIO with znodeBase: /configs/conf1
   [junit4]   2> 884329 INFO  (qtp2070508171-7989) [    ] o.a.s.r.ManagedResourceStorage Loaded null at path _rest_managed.json using ZooKeeperStorageIO:path=/configs/conf1
   [junit4]   2> 884330 INFO  (qtp2070508171-7989) [    ] o.a.s.h.ReplicationHandler Commits will be reserved for  10000
   [junit4]   2> 884330 INFO  (qtp2070508171-7989) [    ] o.a.s.u.UpdateLog Could not find max version in index or recent updates, using new clock 1578379018140385280
   [junit4]   2> 884330 INFO  (searcherExecutor-3990-thread-1) [    ] o.a.s.c.SolrCore [control_collection_shard1_replica_n1] Registered new searcher Searcher@5bb424b1[control_collection_shard1_replica_n1] main{ExitableDirectoryReader(UninvertingDirectoryReader())}
   [junit4]   2> 884332 INFO  (qtp2070508171-7989) [    ] o.a.s.c.ShardLeaderElectionContext Enough replicas found to continue.
   [junit4]   2> 884332 INFO  (qtp2070508171-7989) [    ] o.a.s.c.ShardLeaderElectionContext I may be the new leader - try and sync
   [junit4]   2> 884332 INFO  (qtp2070508171-7989) [    ] o.a.s.c.SyncStrategy Sync replicas to http://127.0.0.1:34815/control_collection_shard1_replica_n1/
   [junit4]   2> 884332 INFO  (qtp2070508171-7989) [    ] o.a.s.c.SyncStrategy Sync Success - now sync replicas to me
   [junit4]   2> 884332 INFO  (qtp2070508171-7989) [    ] o.a.s.c.SyncStrategy http://127.0.0.1:34815/control_collection_shard1_replica_n1/ has no replicas
   [junit4]   2> 884332 INFO  (qtp2070508171-7989) [    ] o.a.s.c.ShardLeaderElectionContext Found all replicas participating in election, clear LIR
   [junit4]   2> 884333 INFO  (qtp2070508171-7989) [    ] o.a.s.c.ShardLeaderElectionContext I am the new leader: http://127.0.0.1:34815/control_collection_shard1_replica_n1/ shard1
   [junit4]   2> 884434 INFO  (zkCallback-1189-thread-1) [    ] o.a.s.c.c.ZkStateReader A cluster state change: [WatchedEvent state:SyncConnected type:NodeDataChanged path:/collections/control_collection/state.json] for collection [control_collection] has occurred - updating... (live nodes size: [1])
   [junit4]   2> 884484 INFO  (qtp2070508171-7989) [    ] o.a.s.c.ZkController I am the leader, no recovery necessary
   [junit4]   2> 884485 INFO  (qtp2070508171-7989) [    ] o.a.s.s.HttpSolrCall [admin] webapp=null path=/admin/cores params={qt=/admin/cores&collection.configName=conf1&newCollection=true&name=control_collection_shard1_replica_n1&action=CREATE&numShards=1&collection=control_collection&shard=shard1&wt=javabin&version=2&replicaType=NRT} status=0 QTime=1212
   [junit4]   2> 884486 INFO  (qtp2070508171-7987) [    ] o.a.s.h.a.CollectionsHandler Wait for new collection to be active for at most 30 seconds. Check all shard replicas
   [junit4]   2> 884586 INFO  (zkCallback-1189-thread-1) [    ] o.a.s.c.c.ZkStateReader A cluster state change: [WatchedEvent state:SyncConnected type:NodeDataChanged path:/collections/control_collection/state.json] for collection [control_collection] has occurred - updating... (live nodes size: [1])
   [junit4]   2> 885162 INFO  (OverseerCollectionConfigSetProcessor-98648688530751492-127.0.0.1:34815_-n_0000000000) [    ] o.a.s.c.OverseerTaskQueue Response ZK path: /overseer/collection-queue-work/qnr-0000000000 doesn't exist.  Requestor may have disconnected from ZooKeeper
   [junit4]   2> 885486 INFO  (qtp2070508171-7987) [    ] o.a.s.s.HttpSolrCall [admin] webapp=null path=/admin/collections params={replicationFactor=1&collection.configName=conf1&name=control_collection&nrtReplicas=1&action=CREATE&numShards=1&createNodeSet=127.0.0.1:34815_&wt=javabin&version=2} status=0 QTime=2332
   [junit4]   2> 885489 INFO  (TEST-TestInPlaceUpdatesDistrib.test-seed#[32ACE6FA7DBECC89]) [    ] o.a.s.c.c.ZkStateReader Updated live nodes from ZooKeeper... (0) -> (1)
   [junit4]   2> 885489 INFO  (TEST-TestInPlaceUpdatesDistrib.test-seed#[32ACE6FA7DBECC89]) [    ] o.a.s.c.s.i.ZkClientClusterStateProvider Cluster at 127.0.0.1:39287/solr ready
   [junit4]   2> 885489 INFO  (TEST-TestInPlaceUpdatesDistrib.test-seed#[32ACE6FA7DBECC89]) [    ] o.a.s.c.ChaosMonkey monkey: init - expire sessions:false cause connection loss:false
   [junit4]   2> 885490 INFO  (qtp2070508171-7987) [    ] o.a.s.h.a.CollectionsHandler Invoked Collection Action :create with params replicationFactor=1&collection.configName=conf1&name=collection1&nrtReplicas=1&action=CREATE&numShards=1&createNodeSet=&stateFormat=2&wt=javabin&version=2 and sendToOCPQueue=true
   [junit4]   2> 885491 INFO  (OverseerThreadFactory-3987-thread-2) [    ] o.a.s.c.CreateCollectionCmd Create collection collection1
   [junit4]   2> 885491 WARN  (OverseerThreadFactory-3987-thread-2) [    ] o.a.s.c.CreateCollectionCmd It is unusual to create a collection (collection1) without cores.
   [junit4]   2> 885694 INFO  (qtp2070508171-7987) [    ] o.a.s.h.a.CollectionsHandler Wait for new collection to be active for at most 30 seconds. Check all shard replicas
   [junit4]   2> 885694 INFO  (qtp2070508171-7987) [    ] o.a.s.s.HttpSolrCall [admin] webapp=null path=/admin/collections params={replicationFactor=1&collection.configName=conf1&name=collection1&nrtReplicas=1&action=CREATE&numShards=1&createNodeSet=&stateFormat=2&wt=javabin&version=2} status=0 QTime=204
   [junit4]   2> 885784 INFO  (TEST-TestInPlaceUpdatesDistrib.test-seed#[32ACE6FA7DBECC89]) [    ] o.a.s.c.AbstractFullDistribZkTestBase create jetty 1 in directory /home/jenkins/workspace/Lucene-Solr-7.x-Linux/solr/build/solr-core/test/J0/temp/solr.update.TestInPlaceUpdatesDistrib_32ACE6FA7DBECC89-001/shard-1-001 of type TLOG
   [junit4]   2> 885785 INFO  (TEST-TestInPlaceUpdatesDistrib.test-seed#[32ACE6FA7DBECC89]) [    ] o.e.j.s.Server jetty-9.3.20.v20170531
   [junit4]   2> 885786 INFO  (TEST-TestInPlaceUpdatesDistrib.test-seed#[32ACE6FA7DBECC89]) [    ] o.e.j.s.h.ContextHandler Started o.e.j.s.ServletContextHandler@1ee02c5f{/,null,AVAILABLE}
   [junit4]   2> 885786 INFO  (TEST-TestInPlaceUpdatesDistrib.test-seed#[32ACE6FA7DBECC89]) [    ] o.e.j.s.AbstractConnector Started ServerConnector@5f218869{HTTP/1.1,[http/1.1]}{127.0.0.1:33613}
   [junit4]   2> 885786 INFO  (TEST-TestInPlaceUpdatesDistrib.test-seed#[32ACE6FA7DBECC89]) [    ] o.e.j.s.Server Started @888912ms
   [junit4]   2> 885786 INFO  (TEST-TestInPlaceUpdatesDistrib.test-seed#[32ACE6FA7DBECC89]) [    ] o.a.s.c.s.e.JettySolrRunner Jetty properties: {hostContext=/, solrconfig=solrconfig.xml, solr.data.dir=/home/jenkins/workspace/Lucene-Solr-7.x-Linux/solr/build/solr-core/test/J0/temp/solr.update.TestInPlaceUpdatesDistrib_32ACE6FA7DBECC89-001/tempDir-001/jetty1, hostPort=33613, coreRootDirectory=/home/jenkins/workspace/Lucene-Solr-7.x-Linux/solr/build/solr-core/test/J0/../../../../../../../../../home/jenkins/workspace/Lucene-Solr-7.x-Linux/solr/build/solr-core/test/J0/temp/solr.update.TestInPlaceUpdatesDistrib_32ACE6FA7DBECC89-001/shard-1-001/cores, replicaType=TLOG}
   [junit4]   2> 885786 ERROR (TEST-TestInPlaceUpdatesDistrib.test-seed#[32ACE6FA7DBECC89]) [    ] o.a.s.u.StartupLoggingUtils Missing Java Option solr.log.dir. Logging may be missing or incomplete.
   [junit4]   2> 885786 INFO  (TEST-TestInPlaceUpdatesDistrib.test-seed#[32ACE6FA7DBECC89]) [    ] o.a.s.s.SolrDispatchFilter  ___      _       Welcome to Apache Solr™ version 7.1.0
   [junit4]   2> 885786 INFO  (TEST-TestInPlaceUpdatesDistrib.test-seed#[32ACE6FA7DBECC89]) [    ] o.a.s.s.SolrDispatchFilter / __| ___| |_ _   Starting in cloud mode on port null
   [junit4]   2> 885786 INFO  (TEST-TestInPlaceUpdatesDistrib.test-seed#[32ACE6FA7DBECC89]) [    ] o.a.s.s.SolrDispatchFilter \__ \/ _ \ | '_|  Install dir: null, Default config dir: null
   [junit4]   2> 885786 INFO  (TEST-TestInPlaceUpdatesDistrib.test-seed#[32ACE6FA7DBECC89]) [    ] o.a.s.s.SolrDispatchFilter |___/\___/_|_|    Start time: 2017-09-12T23:38:52.611907Z
   [junit4]   2> 885788 INFO  (TEST-TestInPlaceUpdatesDistrib.test-seed#[32ACE6FA7DBECC89]) [    ] o.a.s.s.SolrDispatchFilter Loading solr.xml from SolrHome (not found in ZooKeeper)
   [junit4]   2> 885788 INFO  (TEST-TestInPlaceUpdatesDistrib.test-seed#[32ACE6FA7DBECC89]) [    ] o.a.s.c.SolrXmlConfig Loading container configuration from /home/jenkins/workspace/Lucene-Solr-7.x-Linux/solr/build/solr-core/test/J0/temp/solr.update.TestInPlaceUpdatesDistrib_32ACE6FA7DBECC89-001/shard-1-001/solr.xml
   [junit4]   2> 885789 INFO  (TEST-TestInPlaceUpdatesDistrib.test-seed#[32ACE6FA7DBECC89]) [    ] o.a.s.c.SolrXmlConfig MBean server found: com.sun.jmx.mbeanserver.JmxMBeanServer@2770cc8b, but no JMX reporters were configured - adding default JMX reporter.
   [junit4]   2> 885791 INFO  (TEST-TestInPlaceUpdatesDistrib.test-seed#[32ACE6FA7DBECC89]) [    ] o.a.s.c.ZkContainer Zookeeper client=127.0.0.1:39287/solr
   [junit4]   2> 885792 WARN  (NIOServerCxn.Factory:0.0.0.0/0.0.0.0:0) [    ] o.a.z.s.NIOServerCnxn caught end of stream exception
   [junit4]   2> EndOfStreamException: Unable to read additional data from client sessionid 0x15e7875a56f0008, likely client has closed socket
   [junit4]   2> at org.apache.zookeeper.server.NIOServerCnxn.doIO(NIOServerCnxn.java:239)
   [junit4]   2> at org.apache.zookeeper.server.NIOServerCnxnFactory.run(NIOServerCnxnFactory.java:203)
   [junit4]   2> at java.base/java.lang.Thread.run(Thread.java:844)
   [junit4]   2> 885797 INFO  (TEST-TestInPlaceUpdatesDistrib.test-seed#[32ACE6FA7DBECC89]) [    ] o.a.s.c.c.ZkStateReader Updated live nodes from ZooKeeper... (0) -> (1)
   [junit4]   2> 885797 INFO  (TEST-TestInPlaceUpdatesDistrib.test-seed#[32ACE6FA7DBECC89]) [    ] o.a.s.c.Overseer Overseer (id=null) closing
   [junit4]   2> 885798 INFO  (TEST-TestInPlaceUpdatesDistrib.test-seed#[32ACE6FA7DBECC89]) [    ] o.a.s.c.ZkController Register node as live in ZooKeeper:/live_nodes/127.0.0.1:33613_
   [junit4]   2> 885798 INFO  (zkCallback-1201-thread-1) [    ] o.a.s.c.c.ZkStateReader Updated live nodes from ZooKeeper... (1) -> (2)
   [junit4]   2> 885798 INFO  (zkCallback-1189-thread-2) [    ] o.a.s.c.c.ZkStateReader Updated live nodes from ZooKeeper... (1) -> (2)
   [junit4]   2> 885799 INFO  (zkCallback-1196-thread-1) [    ] o.a.s.c.c.ZkStateReader Updated live nodes from ZooKeeper... (1) -> (2)
   [junit4]   2> 885828 INFO  (TEST-TestInPlaceUpdatesDistrib.test-seed#[32ACE6FA7DBECC89]) [    ] o.a.s.m.r.SolrJmxReporter JMX monitoring for 'solr.node' (registry 'solr.node') enabled at server: com.sun.jmx.mbeanserver.JmxMBeanServer@2770cc8b
   [junit4]   2> 885834 INFO  (TEST-TestInPlaceUpdatesDistrib.test-seed#[32ACE6FA7DBECC89]) [    ] o.a.s.m.r.SolrJmxReporter JMX monitoring for 'solr.jvm' (registry 'solr.jvm') enabled at server: com.sun.jmx.mbeanserver.JmxMBeanServer@2770cc8b
   [junit4]   2> 885834 INFO  (TEST-TestInPlaceUpdatesDistrib.test-seed#[32ACE6FA7DBECC89]) [    ] o.a.s.m.r.SolrJmxReporter JMX monitoring for 'solr.jetty' (registry 'solr.jetty') enabled at server: com.sun.jmx.mbeanserver.JmxMBeanServer@2770cc8b
   [junit4]   2> 885835 INFO  (TEST-TestInPlaceUpdatesDistrib.test-seed#[32ACE6FA7DBECC89]) [    ] o.a.s.c.CorePropertiesLocator Found 0 core definitions underneath /home/jenkins/workspace/Lucene-Solr-7.x-Linux/solr/build/solr-core/test/J0/../../../../../../../../../home/jenkins/workspace/Lucene-Solr-7.x-Linux/solr/build/solr-core/test/J0/temp/solr.update.TestInPlaceUpdatesDistrib_32ACE6FA7DBECC89-001/shard-1-001/cores
   [junit4]   2> 885855 INFO  (qtp2070508171-7988) [    ] o.a.s.h.a.CollectionsHandler Invoked Collection Action :addreplica with params node=127.0.0.1:33613_&action=ADDREPLICA&collection=collection1&shard=shard1&type=TLOG&wt=javabin&version=2 and sendToOCPQueue=true
   [junit4]   2> 885856 INFO  (OverseerCollectionConfigSetProcessor-98648688530751492-127.0.0.1:34815_-n_0000000000) [    ] o.a.s.c.OverseerTaskQueue Response ZK path: /overseer/collection-queue-work/qnr-0000000002 doesn't exist.  Requestor may have disconnected from ZooKeeper
   [junit4]   2> 885856 INFO  (OverseerThreadFactory-3987-thread-3) [    ] o.a.s.c.AddReplicaCmd Node Identified 127.0.0.1:33613_ for creating new replica
   [junit4]   2> 885857 INFO  (qtp2081210940-8029) [    ] o.a.s.h.a.CoreAdminOperation core create command qt=/admin/cores&collection.configName=conf1&name=collection1_shard1_replica_t21&action=CREATE&collection=collection1&shard=shard1&wt=javabin&version=2&replicaType=TLOG
   [junit4]   2> 885857 INFO  (qtp2081210940-8029) [    ] o.a.s.c.TransientSolrCoreCacheDefault Allocating transient cache for 4 transient cores
   [junit4]   2> 885959 INFO  (zkCallback-1201-thread-1) [    ] o.a.s.c.c.ZkStateReader A cluster state change: [WatchedEvent state:SyncConnected type:NodeDataChanged path:/collections/collection1/state.json] for collection [collection1] has occurred - updating... (live nodes size: [2])
   [junit4]   2> 886869 INFO  (qtp2081210940-8029) [    ] o.a.s.c.SolrConfig Using Lucene MatchVersion: 7.1.0
   [junit4]   2> 886875 INFO  (qtp2081210940-8029) [    ] o.a.s.s.IndexSchema [collection1_shard1_replica_t21] Schema name=inplace-updates
   [junit4]   2> 886876 INFO  (qtp2081210940-8029) [    ] o.a.s.s.IndexSchema Loaded schema inplace-updates/1.6 with uniqueid field id
   [junit4]   2> 886876 INFO  (qtp2081210940-8029) [    ] o.a.s.c.CoreContainer Creating SolrCore 'collection1_shard1_replica_t21' using configuration from collection collection1, trusted=true
   [junit4]   2> 886877 INFO  (qtp2081210940-8029) [    ] o.a.s.m.r.SolrJmxReporter JMX monitoring for 'solr.core.collection1.shard1.replica_t21' (registry 'solr.core.collection1.shard1.replica_t21') enabled at server: com.sun.jmx.mbeanserver.JmxMBeanServer@2770cc8b
   [junit4]   2> 886877 INFO  (qtp2081210940-8029) [    ] o.a.s.c.SolrCore solr.RecoveryStrategy.Builder
   [junit4]   2> 886877 INFO  (qtp2081210940-8029) [    ] o.a.s.c.SolrCore [[collection1_shard1_replica_t21] ] Opening new SolrCore at [/home/jenkins/workspace/Lucene-Solr-7.x-Linux/solr/build/solr-core/test/J0/temp/solr.update.TestInPlaceUpdatesDistrib_32ACE6FA7DBECC89-001/shard-1-001/cores/collection1_shard1_replica_t21], dataDir=[/home/jenkins/workspace/Lucene-Solr-7.x-Linux/solr/build/solr-core/test/J0/../../../../../../../../../home/jenkins/workspace/Lucene-Solr-7.x-Linux/solr/build/solr-core/test/J0/temp/solr.update.TestInPlaceUpdatesDistrib_32ACE6FA7DBECC89-001/shard-1-001/cores/collection1_shard1_replica_t21/data/]
   [junit4]   2> 886879 WARN  (qtp2081210940-8029) [    ] o.a.s.c.RequestHandlers INVALID paramSet a in requestHandler {type = requestHandler,name = /dump,class = DumpRequestHandler,attributes = {initParams=a, name=/dump, class=DumpRequestHandler},args = {defaults={a=A,b=B}}}
   [junit4]   2> 886902 INFO  (qtp2081210940-8029) [    ] o.a.s.u.UpdateHandler Using UpdateLog implementation: org.apache.solr.update.UpdateLog
   [junit4]   2> 886902 INFO  (qtp2081210940-8029) [    ] o.a.s.u.UpdateLog Initializing UpdateLog: dataDir= defaultSyncLevel=FLUSH numRecordsToKeep=100 maxNumLogsToKeep=10 numVersionBuckets=65536
   [junit4]   2> 886903 INFO  (qtp2081210940-8029) [    ] o.a.s.u.CommitTracker Hard AutoCommit: disabled
   [junit4]   2> 886903 INFO  (qtp2081210940-8029) [    ] o.a.s.u.CommitTracker Soft AutoCommit: disabled
   [junit4]   2> 886904 INFO  (qtp2081210940-8029) [    ] o.a.s.s.SolrIndexSearcher Opening [Searcher@2347bda9[collection1_shard1_replica_t21] main]
   [junit4]   2> 886904 INFO  (qtp2081210940-8029) [    ] o.a.s.r.ManagedResourceStorage Configured ZooKeeperStorageIO with znodeBase: /configs/conf1
   [junit4]   2> 886905 INFO  (qtp2081210940-8029) [    ] o.a.s.r.ManagedResourceStorage Loaded null at path _rest_managed.json using ZooKeeperStorageIO:path=/configs/conf1
   [junit4]   2> 886905 INFO  (qtp2081210940-8029) [    ] o.a.s.h.ReplicationHandler Commits will be reserved for  10000
   [junit4]   2> 886905 INFO  (searcherExecutor-4001-thread-1) [    ] o.a.s.c.SolrCore [collection1_shard1_replica_t21] Registered new searcher Searcher@2347bda9[collection1_shard1_replica_t21] main{ExitableDirectoryReader(UninvertingDirectoryReader())}
   [junit4]   2> 886906 INFO  (qtp2081210940-8029) [    ] o.a.s.u.UpdateLog Could not find max version in index or recent updates, using new clock 1578379020841517056
   [junit4]   2> 886909 INFO  (qtp2081210940-8029) [    ] o.a.s.c.ShardLeaderElectionContext Enough replicas found to continue.
   [junit4]   2> 886909 INFO  (qtp2081210940-8029) [    ] o.a.s.c.ShardLeaderElectionContext I may be the new leader - try and sync
   [junit4]   2> 886909 INFO  (qtp2081210940-8029) [    ] o.a.s.c.SyncStrategy Sync replicas to http://127.0.0.1:33613/collection1_shard1_replica_t21/
   [junit4]   2> 886909 INFO  (qtp2081210940-8029) [    ] o.a.s.c.SyncStrategy Sync Success - now sync replicas to me
   [junit4]   2> 886909 INFO  (qtp2081210940-8029) [    ] o.a.s.c.SyncStrategy http://127.0.0.1:33613/collection1_shard1_replica_t21/ has no replicas
   [junit4]   2> 886909 INFO  (qtp2081210940-8029) [    ] o.a.s.c.ShardLeaderElectionContext Found all replicas participating in election, clear LIR
   [junit4]   2> 886909 INFO  (qtp2081210940-8029) [    ] o.a.s.c.ZkController collection1_shard1_replica_t21 stopping background replication from leader
   [junit4]   2> 886909 INFO  (qtp2081210940-8029) [    ] o.a.s.c.ShardLeaderElectionContext I am the new leader: http://127.0.0.1:33613/collection1_shard1_replica_t21/ shard1
   [junit4]   2> 887011 INFO  (zkCallback-1201-thread-1) [    ] o.a.s.c.c.ZkStateReader A cluster state change: [WatchedEvent state:SyncConnected type:NodeDataChanged path:/collections/collection1/state.json] for collection [collection1] has occurred - updating... (live nodes size: [2])
   [junit4]   2> 887060 INFO  (qtp2081210940-8029) [    ] o.a.s.c.ZkController I am the leader, no recovery necessary
   [junit4]   2> 887061 INFO  (qtp2081210940-8029) [    ] o.a.s.s.HttpSolrCall [admin] webapp=null path=/admin/cores params={qt=/admin/cores&collection.configName=conf1&name=collection1_shard1_replica_t21&action=CREATE&collection=collection1&shard=shard1&wt=javabin&version=2&replicaType=TLOG} status=0 QTime=1204
   [junit4]   2> 887063 INFO  (qtp2070508171-7988) [    ] o.a.s.s.HttpSolrCall [admin] webapp=null path=/admin/collections params={node=127.0.0.1:33613_&action=ADDREPLICA&collection=collection1&shard=shard1&type=TLOG&wt=javabin&version=2} status=0 QTime=1208
   [junit4]   2> 887155 INFO  (TEST-TestInPlaceUpdatesDistrib.test-seed#[32ACE6FA7DBECC89]) [    ] o.a.s.c.AbstractFullDistribZkTestBase create jetty 2 in directory /home/jenkins/workspace/Lucene-Solr-7.x-Linux/solr/build/solr-core/test/J0/temp/solr.update.TestInPlaceUpdatesDistrib_32ACE6FA7DBECC89-001/shard-2-001 of type TLOG
   [junit4]   2> 887156 INFO  (TEST-TestInPlaceUpdatesDistrib.test-seed#[32ACE6FA7DBECC89]) [    ] o.e.j.s.Server jetty-9.3.20.v20170531
   [junit4]   2> 887156 INFO  (TEST-TestInPlaceUpdatesDistrib.test-seed#[32ACE6FA7DBECC89]) [    ] o.e.j.s.h.ContextHandler Started o.e.j.s.ServletContextHandler@389494c4{/,null,AVAILABLE}
   [junit4]   2> 887157 INFO  (TEST-TestInPlaceUpdatesDistrib.test-seed#[32ACE6FA7DBECC89]) [    ] o.e.j.s.AbstractConnector Started ServerConnector@6f2628dc{HTTP/1.1,[http/1.1]}{127.0.0.1:42357}
   [junit4]   2> 887157 INFO  (TEST-TestInPlaceUpdatesDistrib.test-seed#[32ACE6FA7DBECC89]) [    ] o.e.j.s.Server Started @890284ms
   [junit4]   2> 887157 INFO  (TEST-TestInPlaceUpdatesDistrib.test-seed#[32ACE6FA7DBECC89]) [    ] o.a.s.c.s.e.JettySolrRunner Jetty properties: {hostContext=/, solrconfig=solrconfig.xml, solr.data.dir=/home/jenkins/workspace/Lucene-Solr-7.x-Linux/solr/build/solr-core/test/J0/temp/solr.update.TestInPlaceUpdatesDistrib_32ACE6FA7DBECC89-001/tempDir-001/jetty2, hostPort=42357, coreRootDirectory=/home/jenkins/workspace/Lucene-Solr-7.x-Linux/solr/build/solr-core/test/J0/temp/solr.update.TestInPlaceUpdatesDistrib_32ACE6FA7DBECC89-001/shard-2-001/cores, replicaType=TLOG}
   [junit4]   2> 887158 ERROR (TEST-TestInPlaceUpdatesDistrib.test-seed#[32ACE6FA7DBECC89]) [    ] o.a.s.u.StartupLoggingUtils Missing Java Option solr.log.dir. Logging may be missing or incomplete.
   [junit4]   2> 887158 INFO  (TEST-TestInPlaceUpdatesDistrib.test-seed#[32ACE6FA7DBECC89]) [    ] o.a.s.s.SolrDispatchFilter  ___      _       Welcome to Apache Solr™ version 7.1.0
   [junit4]   2> 887158 INFO  (TEST-TestInPlaceUpdatesDistrib.test-seed#[32ACE6FA7DBECC89]) [    ] o.a.s.s.SolrDispatchFilter / __| ___| |_ _   Starting in cloud mode on port null
   [junit4]   2> 887158 INFO  (TEST-TestInPlaceUpdatesDistrib.test-seed#[32ACE6FA7DBECC89]) [    ] o.a.s.s.SolrDispatchFilter \__ \/ _ \ | '_|  Install dir: null, Default config dir: null
   [junit4]   2> 887158 INFO  (TEST-TestInPlaceUpdatesDistrib.test-seed#[32ACE6FA7DBECC89]) [    ] o.a.s.s.SolrDispatchFilter |___/\___/_|_|    Start time: 2017-09-12T23:38:53.983384Z
   [junit4]   2> 887160 INFO  (TEST-TestInPlaceUpdatesDistrib.test-seed#[32ACE6FA7DBECC89]) [    ] o.a.s.s.SolrDispatchFilter Loading solr.xml from SolrHome (not found in ZooKeeper)
   [junit4]   2> 887160 INFO  (TEST-TestInPlaceUpdatesDistrib.test-seed#[32ACE6FA7DBECC89]) [    ] o.a.s.c.SolrXmlConfig Loading container configuration from /home/jenkins/workspace/Lucene-Solr-7.x-Linux/solr/build/solr-core/test/J0/temp/solr.update.TestInPlaceUpdatesDistrib_32ACE6FA7DBECC89-001/shard-2-001/solr.xml
   [junit4]   2> 887162 INFO  (TEST-TestInPlaceUpdatesDistrib.test-seed#[32ACE6FA7DBECC89]) [    ] o.a.s.c.SolrXmlConfig MBean server found: com.sun.jmx.mbeanserver.JmxMBeanServer@2770cc8b, but no JMX reporters were configured - adding default JMX reporter.
   [junit4]   2> 887163 INFO  (zkCallback-1201-thread-1) [    ] o.a.s.c.c.ZkStateReader A cluster state change: [WatchedEvent state:SyncConnected type:NodeDataChanged path:/collections/collection1/state.json] for collection [collection1] has occurred - updating... (live nodes size: [2])
   [junit4]   2> 887164 INFO  (TEST-TestInPlaceUpdatesDistrib.test-seed#[32ACE6FA7DBECC89]) [    ] o.a.s.c.ZkContainer Zookeeper client=127.0.0.1:39287/solr
   [junit4]   2> 887168 INFO  (TEST-TestInPlaceUpdatesDistrib.test-seed#[32ACE6FA7DBECC89]) [    ] o.a.s.c.c.ZkStateReader Updated live nodes from ZooKeeper... (0) -> (2)
   [junit4]   2> 887168 INFO  (TEST-TestInPlaceUpdatesDistrib.test-seed#[32ACE6FA7DBECC89]) [    ] o.a.s.c.Overseer Overseer (id=null) closing
   [junit4]   2> 887170 INFO  (TEST-TestInPlaceUpdatesDistrib.test-seed#[32ACE6FA7DBECC89]) [    ] o.a.s.c.ZkController Register node as live in ZooKeeper:/live_nodes/127.0.0.1:42357_
   [junit4]   2> 887170 INFO  (zkCallback-1196-thread-1) [    ] o.a.s.c.c.ZkStateReader Updated live nodes from ZooKeeper... (2) -> (3)
   [junit4]   2> 887170 INFO  (zkCallback-1201-thread-1) [    ] o.a.s.c.c.ZkStateReader Updated live nodes from ZooKeeper... (2) -> (3)
   [junit4]   2> 887171 INFO  (zkCallback-1207-thread-1) [    ] o.a.s.c.c.ZkStateReader Updated live nodes from ZooKeeper... (2) -> (3)
   [junit4]   2> 887171 INFO  (zkCallback-1189-thread-2) [    ] o.a.s.c.c.ZkStateReader Updated live nodes from ZooKeeper... (2) -> (3)
   [junit4]   2> 887203 INFO  (TEST-TestInPlaceUpdatesDistrib.test-seed#[32ACE6FA7DBECC89]) [    ] o.a.s.m.r.SolrJmxReporter JMX monitoring for 'solr.node' (registry 'solr.node') enabled at server: com.sun.jmx.mbeanserver.JmxMBeanServer@2770cc8b
   [junit4]   2> 887214 INFO  (TEST-TestInPlaceUpdatesDistrib.test-seed#[32ACE6FA7DBECC89]) [    ] o.a.s.m.r.SolrJmxReporter JMX monitoring for 'solr.jvm' (registry 'solr.jvm') enabled at server: com.sun.jmx.mbeanserver.JmxMBeanServer@2770cc8b
   [junit4]   2> 887214 INFO  (TEST-TestInPlaceUpdatesDistrib.test-seed#[32ACE6FA7DBECC89]) [    ] o.a.s.m.r.SolrJmxReporter JMX monitoring for 'solr.jetty' (registry 'solr.jetty') enabled at server: com.sun.jmx.mbeanserver.JmxMBeanServer@2770cc8b
   [junit4]   2> 887216 INFO  (TEST-TestInPlaceUpdatesDistrib.test-seed#[32ACE6FA7DBECC89]) [    ] o.a.s.c.CorePropertiesLocator Found 0 core definitions underneath /home/jenkins/workspace/Lucene-Solr-7.x-Linux/solr/build/solr-core/test/J0/temp/solr.update.TestInPlaceUpdatesDistrib_32ACE6FA7DBECC89-001/shard-2-001/cores
   [junit4]   2> 887240 INFO  (qtp2070508171-7983) [    ] o.a.s.h.a.CollectionsHandler Invoked Collection Action :addreplica with params node=127.0.0.1:42357_&action=ADDREPLICA&collection=collection1&shard=shard1&type=TLOG&wt=javabin&version=2 and sendToOCPQueue=true
   [junit4]   2> 887241 INFO  (OverseerCollectionConfigSetProcessor-98648688530751492-127.0.0.1:34815_-n_0000000000) [    ] o.a.s.c.OverseerTaskQueue Response ZK path: /overseer/collection-queue-work/qnr-0000000004 doesn't exist.  Requestor may have disconnected from ZooKeeper
   [junit4]   2> 887242 INFO  (OverseerThreadFactory-3987-thread-4) [    ] o.a.s.c.AddReplicaCmd Node Identified 127.0.0.1:42357_ for creating new replica
   [junit4]   2> 887243 INFO  (qtp476253594-8058) [    ] o.a.s.h.a.CoreAdminOperation core create command qt=/admin/cores&collection.configName=conf1&name=collection1_shard1_replica_t23&action=CREATE&collection=collection1&shard=shard1&wt=javabin&version=2&replicaType=TLOG
   [junit4]   2> 887243 INFO  (qtp476253594-8058) [    ] o.a.s.c.TransientSolrCoreCacheDefault Allocating transient cache for 4 transient cores
   [junit4]   2> 887345 INFO  (zkCallback-1201-thread-1) [    ] o.a.s.c.c.ZkStateReader A cluster state change: [WatchedEvent state:SyncConnected type:NodeDataChanged path:/collections/collection1/state.json] for collection [collection1] has occurred - updating... (live nodes size: [3])
   [junit4]   2> 887345 INFO  (zkCallback-1207-thread-1) [    ] o.a.s.c.c.ZkStateReader A cluster state change: [WatchedEvent state:SyncConnected type:NodeDataChanged path:/collections/collection1/state.json] for collection [collection1] has occurred - updating... (live nodes size: [3])
   [junit4]   2> 888255 INFO  (qtp476253594-8058) [    ] o.a.s.c.SolrConfig Using Lucene MatchVersion: 7.1.0
   [junit4]   2> 888266 INFO  (qtp476253594-8058) [    ] o.a.s.s.IndexSchema [collection1_shard1_replica_t23] Schema name=inplace-updates
   [junit4]   2> 888269 INFO  (qtp476253594-8058) [    ] o.a.s.s.IndexSchema Loaded schema inplace-updates/1.6 with uniqueid field id
   [junit4]   2> 888269 INFO  (qtp476253594-8058) [    ] o.a.s.c.CoreContainer Creating SolrCore 'collection1_shard1_replica_t23' using configuration from collection collection1, trusted=true
   [junit4]   2> 888269 INFO  (qtp476253594-8058) [    ] o.a.s.m.r.SolrJmxReporter JMX monitoring for 'solr.core.collection1.shard1.replica_t23' (registry 'solr.core.collection1.shard1.replica_t23') enabled at server: com.sun.jmx.mbeanserver.JmxMBeanServer@2770cc8b
   [junit4]   2> 888269 INFO  (qtp476253594-8058) [    ] o.a.s.c.SolrCore solr.RecoveryStrategy.Builder
   [junit4]   2> 888270 INFO  (qtp476253594-8058) [    ] o.a.s.c.SolrCore [[collection1_shard1_replica_t23] ] Opening new SolrCore at [/home/jenkins/workspace/Lucene-Solr-7.x-Linux/solr/build/solr-core/test/J0/temp/solr.update.TestInPlaceUpdatesDistrib_32ACE6FA7DBECC89-001/shard-2-001/cores/collection1_shard1_replica_t23], dataDir=[/home/jenkins/workspace/Lucene-Solr-7.x-Linux/solr/build/solr-core/test/J0/temp/solr.update.TestInPlaceUpdatesDistrib_32ACE6FA7DBECC89-001/shard-2-001/cores/collection1_shard1_replica_t23/data/]
   [junit4]   2> 888274 WARN  (qtp476253594-8058) [    ] o.a.s.c.RequestHandlers INVALID paramSet a in requestHandler {type = requestHandler,name = /dump,class = DumpRequestHandler,attributes = {initParams=a, name=/dump, class=DumpRequestHandler},args = {defaults={a=A,b=B}}}
   [junit4]   2> 888308 INFO  (qtp476253594-8058) [    ] o.a.s.u.UpdateHandler Using UpdateLog implementation: org.apache.solr.update.UpdateLog
   [junit4]   2> 888308 INFO  (qtp476253594-8058) [    ] o.a.s.u.UpdateLog Initializing UpdateLog: dataDir= defaultSyncLevel=FLUSH numRecordsToKeep=100 maxNumLogsToKeep=10 numVersionBuckets=65536
   [junit4]   2> 888309 INFO  (qtp476253594-8058) [    ] o.a.s.u.CommitTracker Hard AutoCommit: disabled
   [junit4]   2> 888309 INFO  (qtp476253594-8058) [    ] o.a.s.u.CommitTracker Soft AutoCommit: disabled
   [junit4]   2> 888310 INFO  (qtp476253594-8058) [    ] o.a.s.s.SolrIndexSearcher Opening [Searcher@6373c742[collection1_shard1_replica_t23] main]
   [junit4]   2> 888311 INFO  (qtp476253594-8058) [    ] o.a.s.r.ManagedResourceStorage Configured ZooKeeperStorageIO with znodeBase: /configs/conf1
   [junit4]   2> 888311 INFO  (qtp476253594-8058) [    ] o.a.s.r.ManagedResourceStorage Loaded null at path _rest_managed.json using ZooKeeperStorageIO:path=/configs/conf1
   [junit4]   2> 888311 INFO  (qtp476253594-8058) [    ] o.a.s.h.ReplicationHandler Commits will be reserved for  10000
   [junit4]   2> 888312 INFO  (searcherExecutor-4012-thread-1) [    ] o.a.s.c.SolrCore [collection1_shard1_replica_t23] Registered new searcher Searcher@6373c742[collection1_shard1_replica_t23] main{ExitableDirectoryReader(UninvertingDirectoryReader())}
   [junit4]   2> 888312 INFO  (qtp476253594-8058) [    ] o.a.s.u.UpdateLog Could not find max version in index or recent updates, using new clock 1578379022315814912
   [junit4]   2> 888315 INFO  (qtp476253594-8058) [    ] o.a.s.c.ZkController Core needs to recover:collection1_shard1_replica_t23
   [junit4]   2> 888315 INFO  (updateExecutor-1204-thread-1) [    ] o.a.s.u.DefaultSolrCoreState Running recovery
   [junit4]   2> 888316 INFO  (recoveryExecutor-1205-thread-1) [    ] o.a.s.c.RecoveryStrategy Starting recovery process. recoveringAfterStartup=true
   [junit4]   2> 888316 INFO  (qtp476253594-8058) [    ] o.a.s.s.HttpSolrCall [admin] webapp=null path=/admin/cores params={qt=/admin/cores&collection.configName=conf1&name=collection1_shard1_replica_t23&action=CREATE&collection=collection1&shard=shard1&wt=javabin&version=2&replicaType=TLOG} status=0 QTime=1073
   [junit4]   2> 888316 INFO  (recoveryExecutor-1205-thread-1) [    ] o.a.s.c.RecoveryStrategy ###### startupVersions=[[]]
   [junit4]   2> 888316 INFO  (recoveryExecutor-1205-thread-1) [    ] o.a.s.c.ZkController collection1_shard1_replica_t23 stopping background replication from leader
   [junit4]   2> 888316 INFO  (recoveryExecutor-1205-thread-1) [    ] o.a.s.c.RecoveryStrategy Begin buffering updates. core=[collection1_shard1_replica_t23]
   [junit4]   2> 888316 INFO  (recoveryExecutor-1205-thread-1) [    ] o.a.s.u.UpdateLog Starting to buffer updates. FSUpdateLog{state=ACTIVE, tlog=null}
   [junit4]   2> 888316 INFO  (recoveryExecutor-1205-thread-1) [    ] o.a.s.c.RecoveryStrategy Publishing state of core [collection1_shard1_replica_t23] as recovering, leader is [http://127.0.0.1:33613/collection1_shard1_replica_t21/] and I am [http://127.0.0.1:42357/collection1_shard1_replica_t23/]
   [junit4]   2> 888317 INFO  (recoveryExecutor-1205-thread-1) [    ] o.a.s.c.RecoveryStrategy Sending prep recovery command to [http://127.0.0.1:33613]; [WaitForState: action=PREPRECOVERY&core=collection1_shard1_replica_t21&nodeName=127.0.0.1:42357_&coreNodeName=core_node24&state=recovering&checkLive=true&onlyIfLeader=true&onlyIfLeaderActive=true]
   [junit4]   2> 888317 INFO  (qtp2070508171-7983) [    ] o.a.s.s.HttpSolrCall [admin] webapp=null path=/admin/collections params={node=127.0.0.1:42357_&action=ADDREPLICA&collection=collection1&shard=shard1&type=TLOG&wt=javabin&version=2} status=0 QTime=1076
   [junit4]   2> 888317 INFO  (qtp2081210940-8031) [    ] o.a.s.h.a.PrepRecoveryOp Going to wait for coreNodeName: core_node24, state: recovering, checkLive: true, onlyIfLeader: true, onlyIfLeaderActive: true, maxTime: 183 s
   [junit4]   2> 888318 INFO  (qtp2081210940-8031) [    ] o.a.s.h.a.PrepRecoveryOp In WaitForState(recovering): collection=collection1, shard=shard1, thisCore=collection1_shard1_replica_t21, leaderDoesNotNeedRecovery=false, isLeader? true, live=true, checkLive=true, currentState=down, localState=active, nodeName=127.0.0.1:42357_, coreNodeName=core_node24, onlyIfActiveCheckResult=false, nodeProps: core_node24:{"core":"collection1_shard1_replica_t23","base_url":"http://127.0.0.1:42357","node_name":"127.0.0.1:42357_","state":"down","type":"TLOG"}
   [junit4]   2> 888379 INFO  (TEST-TestInPlaceUpdatesDistrib.test-seed#[32ACE6FA7DBECC89]) [    ] o.a.s.c.AbstractFullDistribZkTestBase create jetty 3 in directory /home/jenkins/workspace/Lucene-Solr-7.x-Linux/solr/build/solr-core/test/J0/temp/solr.update.TestInPlaceUpdatesDistrib_32ACE6FA7DBECC89-001/shard-3-001 of type TLOG
   [junit4]   2> 888380 INFO  (TEST-TestInPlaceUpdatesDistrib.test-seed#[32ACE6FA7DBECC89]) [    ] o.e.j.s.Server jetty-9.3.20.v20170531
   [junit4]   2> 888381 INFO  (TEST-TestInPlaceUpdatesDistrib.test-seed#[32ACE6FA7DBECC89]) [    ] o.e.j.s.h.ContextHandler Started o.e.j.s.ServletContextHandler@365dd9e4{/,null,AVAILABLE}
   [junit4]   2> 888381 INFO  (TEST-TestInPlaceUpdatesDistrib.test-seed#[32ACE6FA7DBECC89]) [    ] o.e.j.s.AbstractConnector Started ServerConnector@3c8f4ad6{HTTP/1.1,[http/1.1]}{127.0.0.1:40113}
   [junit4]   2> 888381 INFO  (TEST-TestInPlaceUpdatesDistrib.test-seed#[32ACE6FA7DBECC89]) [    ] o.e.j.s.Server Started @891507ms
   [junit4]   2> 888381 INFO  (TEST-TestInPlaceUpdatesDistrib.test-seed#[32ACE6FA7DBECC89]) [    ] o.a.s.c.s.e.JettySolrRunner Jetty properties: {hostContext=/, solrconfig=solrconfig.xml, solr.data.dir=/home/jenkins/workspace/Lucene-Solr-7.x-Linux/solr/build/solr-core/test/J0/temp/solr.update.TestInPlaceUpdatesDistrib_32ACE6FA7DBECC89-001/tempDir-001/jetty3, hostPort=40113, coreRootDirectory=/home/jenkins/workspace/Lucene-Solr-7.x-Linux/solr/build/solr-core/test/J0/temp/solr.update.TestInPlaceUpdatesDistrib_32ACE6FA7DBECC89-001/shard-3-001/cores, replicaType=TLOG}
   [junit4]   2> 888382 ERROR (TEST-TestInPlaceUpdatesDistrib.test-seed#[32ACE6FA7DBECC89]) [    ] o.a.s.u.StartupLoggingUtils Missing Java Option solr.log.dir. Logging may be missing or incomplete.
   [junit4]   2> 888382 INFO  (TEST-TestInPlaceUpdatesDistrib.test-seed#[32ACE6FA7DBECC89]) [    ] o.a.s.s.SolrDispatchFilter  ___      _       Welcome to Apache Solr™ version 7.1.0
   [junit4]   2> 888382 INFO  (TEST-TestInPlaceUpdatesDistrib.test-seed#[32ACE6FA7DBECC89]) [    ] o.a.s.s.SolrDispatchFilter / __| ___| |_ _   Starting in cloud mode on port null
   [junit4]   2> 888382 INFO  (TEST-TestInPlaceUpdatesDistrib.test-seed#[32ACE6FA7DBECC89]) [    ] o.a.s.s.SolrDispatchFilter \__ \/ _ \ | '_|  Install dir: null, Default config dir: null
   [junit4]   2> 888382 INFO  (TEST-TestInPlaceUpdatesDistrib.test-seed#[32ACE6FA7DBECC89]) [    ] o.a.s.s.SolrDispatchFilter |___/\___/_|_|    Start time: 2017-09-12T23:38:55.207347Z
   [junit4]   2> 888383 INFO  (TEST-TestInPlaceUpdatesDistrib.test-seed#[32ACE6FA7DBECC89]) [    ] o.a.s.s.SolrDispatchFilter Loading solr.xml from SolrHome (not found in ZooKeeper)
   [junit4]   2> 888383 INFO  (TEST-TestInPlaceUpdatesDistrib.test-seed#[32ACE6FA7DBECC89]) [    ] o.a.s.c.SolrXmlConfig Loading container configuration from /home/jenkins/workspace/Lucene-Solr-7.x-Linux/solr/build/solr-core/test/J0/temp/solr.update.TestInPlaceUpdatesDistrib_32ACE6FA7DBECC89-001/shard-3-001/solr.xml
   [junit4]   2> 888385 INFO  (TEST-TestInPlaceUpdatesDistrib.test-seed#[32ACE6FA7DBECC89]) [    ] o.a.s.c.SolrXmlConfig MBean server found: com.sun.jmx.mbeanserver.JmxMBeanServer@2770cc8b, but no JMX reporters were configured - adding default JMX reporter.
   [junit4]   2> 888386 INFO  (TEST-TestInPlaceUpdatesDistrib.test-seed#[32ACE6FA7DBECC89]) [    ] o.a.s.c.ZkContainer Zookeeper client=127.0.0.1:39287/solr
   [junit4]   2> 888389 INFO  (TEST-TestInPlaceUpdatesDistrib.test-seed#[32ACE6FA7DBECC89]) [    ] o.a.s.c.c.ZkStateReader Updated live nodes from ZooKeeper... (0) -> (3)
   [junit4]   2> 888390 INFO  (TEST-TestInPlaceUpdatesDistrib.test-seed#[32ACE6FA7DBECC89]) [    ] o.a.s.c.Overseer Overseer (id=null) closing
   [junit4]   2> 888390 INFO  (TEST-TestInPlaceUpdatesDistrib.test-seed#[32ACE6FA7DBECC89]) [    ] o.a.s.c.ZkController Register node as live in ZooKeeper:/live_nodes/127.0.0.1:40113_
   [junit4]   2> 888391 INFO  (zkCallback-1207-thread-1) [    ] o.a.s.c.c.ZkStateReader Updated live nodes from ZooKeeper... (3) -> (4)
   [junit4]   2> 888391 INFO  (zkCallback-1189-thread-2) [    ] o.a.s.c.c.ZkStateReader Updated live nodes from ZooKeeper... (3) -> (4)
   [junit4]   2> 888391 INFO  (zkCallback-1201-thread-1) [    ] o.a.s.c.c.ZkStateReader Updated live nodes from ZooKeeper... (3) -> (4)
   [junit4]   2> 888391 INFO  (zkCallback-1196-thread-1) [    ] o.a.s.c.c.ZkStateReader Updated live nodes from ZooKeeper... (3) -> (4)
   [junit4]   2> 888391 INFO  (zkCallback-1214-thread-1) [    ] o.a.s.c.c.ZkStateReader Updated live nodes from ZooKeeper... (3) -> (4)
   [junit4]   2> 888417 INFO  (TEST-TestInPlaceUpdatesDistrib.test-seed#[32ACE6FA7DBECC89]) [    ] o.a.s.m.r.SolrJmxReporter JMX monitoring for 'solr.node' (registry 'solr.node') enabled at server: com.sun.jmx.mbeanserver.JmxMBeanServer@2770cc8b
   [junit4]   2> 888423 INFO  (TEST-TestInPlaceUpdatesDistrib.test-seed#[32ACE6FA7DBECC89]) [    ] o.a.s.m.r.SolrJmxReporter JMX monitoring for 'solr.jvm' (registry 'solr.jvm') enabled at server: com.sun.jmx.mbeanserver.JmxMBeanServer@2770cc8b
   [junit4]   2> 888423 INFO  (TEST-TestInPlaceUpdatesDistrib.test-seed#[32ACE6FA7DBECC89]) [    ] o.a.s.m.r.SolrJmxReporter JMX monitoring for 'solr.jetty' (registry 'solr.jetty') enabled at server: com.sun.jmx.mbeanserver.JmxMBeanServer@2770cc8b
   [junit4]   2> 888424 INFO  (TEST-TestInPlaceUpdatesDistrib.test-seed#[32ACE6FA7DBECC89]) [    ] o.a.s.c.CorePropertiesLocator Found 0 core definitions underneath /home/jenkins/workspace/Lucene-Solr-7.x-Linux/solr/build/solr-core/test/J0/temp/solr.update.TestInPlaceUpdatesDistrib_32ACE6FA7DBECC89-001/shard-3-001/cores
   [junit4]   2> 888456 INFO  (qtp2070508171-7984) [    ] o.a.s.h.a.CollectionsHandler Invoked Collection Action :addreplica with params node=127.0.0.1:40113_&action=ADDREPLICA&collection=collection1&shard=shard1&type=TLOG&wt=javabin&version=2 and sendToOCPQueue=true
   [junit4]   2> 888458 INFO  (OverseerCollectionConfigSetProcessor-98648688530751492-127.0.0.1:34815_-n_0000000000) [    ] o.a.s.c.OverseerTaskQueue Response ZK path: /overseer/collection-queue-work/qnr-0000000006 doesn't exist.  Requestor may have disconnected from ZooKeeper
   [junit4]   2> 888458 INFO  (OverseerThreadFactory-3987-thread-5) [    ] o.a.s.c.AddReplicaCmd Node Identified 127.0.0.1:40113_ for creating new replica
   [junit4]   2> 888459 INFO  (qtp1438074334-8091) [    ] o.a.s.h.a.CoreAdminOperation core create command qt=/admin/cores&collection.configName=conf1&name=collection1_shard1_replica_t25&action=CREATE&collection=collection1&shard=shard1&wt=javabin&version=2&replicaType=TLOG
   [junit4]   2> 888459 INFO  (qtp1438074334-8091) [    ] o.a.s.c.TransientSolrCoreCacheDefault Allocating transient cache for 4 transient cores
   [junit4]   2> 888562 INFO  (zkCallback-1207-thread-1) [    ] o.a.s.c.c.ZkStateReader A cluster state change: [WatchedEvent state:SyncConnected type:NodeDataChanged path:/collections/collection1/state.json] for collection [collection1] has occurred - updating... (live nodes size: [4])
   [junit4]   2> 888562 INFO  (zkCallback-1214-thread-1) [    ] o.a.s.c.c.ZkStateReader A cluster state change: [WatchedEvent state:SyncConnected type:NodeDataChanged path:/collections/collection1/state.json] for collection [collection1] has occurred - updating... (live nodes size: [4])
   [junit4]   2> 888562 INFO  (zkCallback-1201-thread-1) [    ] o.a.s.c.c.ZkStateReader A cluster state change: [WatchedEvent state:SyncConnected type:NodeDataChanged path:/collections/collection1/state.json] for collection [collection1] has occurred - updating... (live nodes size: [4])
   [junit4]   2> 889318 INFO  (qtp2081210940-8031) [    ] o.a.s.h.a.PrepRecoveryOp In WaitForState(recovering): collection=collection1, shard=shard1, thisCore=collection1_shard1_replica_t21, leaderDoesNotNeedRecovery=false, isLeader? true, live=true, checkLive=true, currentState=recovering, localState=active, nodeName=127.0.0.1:42357_, coreNodeName=core_node24, onlyIfActiveCheckResult=false, nodeProps: core_node24:{"core":"collection1_shard1_replica_t23","base_url":"http://127.0.0.1:42357","node_name":"127.0.0.1:42357_","state":"recovering","type":"TLOG"}
   [junit4]   2> 889318 INFO  (qtp2081210940-8031) [    ] o.a.s.h.a.PrepRecoveryOp Waited coreNodeName: core_node24, state: recovering, checkLive: true, onlyIfLeader: true for: 1 seconds.
   [junit4]   2> 889318 INFO  (qtp2081210940-8031) [    ] o.a.s.s.HttpSolrCall [admin] webapp=null path=/admin/cores params={nodeName=127.0.0.1:42357_&onlyIfLeaderActive=true&core=collection1_shard1_replica_t21&coreNodeName=core_node24&action=PREPRECOVERY&checkLive=true&state=recovering&onlyIfLeader=true&wt=javabin&version=2} status=0 QTime=1000
   [junit4]   2> 889467 INFO  (qtp1438074334-8091) [    ] o.a.s.c.SolrConfig Using Lucene MatchVersion: 7.1.0
   [junit4]   2> 889473 INFO  (qtp1438074334-8091) [    ] o.a.s.s.IndexSchema [collection1_shard1_replica_t25] Schema name=inplace-updates
   [junit4]   2> 889475 INFO  (qtp1438074334-8091) [    ] o.a.s.s.IndexSchema Loaded schema inplace-updates/1.6 with uniqueid field id
   [junit4]   2> 889475 INFO  (qtp1438074334-8091) [    ] o.a.s.c.CoreContainer Creating SolrCore 'collection1_shard1_replica_t25' using configuration from collection collection1, trusted=true
   [junit4]   2> 889475 INFO  (qtp1438074334-8091) [    ] o.a.s.m.r.SolrJmxReporter JMX monitoring for 'solr.core.collection1.shard1.replica_t25' (registry 'solr.core.collection1.shard1.replica_t25') enabled at server: com.sun.jmx.mbeanserver.JmxMBeanServer@2770cc8b
   [junit4]   2> 889475 INFO  (qtp1438074334-8091) [    ] o.a.s.c.SolrCore solr.RecoveryStrategy.Builder
   [junit4]   2> 889475 INFO  (qtp1438074334-8091) [    ] o.a.s.c.SolrCore [[collection1_shard1_replica_t25] ] Opening new SolrCore at [/home/jenkins/workspace/Lucene-Solr-7.x-Linux/solr/build/solr-core/test/J0/temp/solr.update.TestInPlaceUpdatesDistrib_32ACE6FA7DBECC89-001/shard-3-001/cores/collection1_shard1_replica_t25], dataDir=[/home/jenkins/workspace/Lucene-Solr-7.x-Linux/solr/build/solr-core/test/J0/temp/solr.update.TestInPlaceUpdatesDistrib_32ACE6FA7DBECC89-001/shard-3-001/cores/collection1_shard1_replica_t25/data/]
   [junit4]   2> 889479 WARN  (qtp1438074334-8091) [    ] o.a.s.c.RequestHandlers INVALID paramSet a in requestHandler {type = requestHandler,name = /dump,class = DumpRequestHandler,attributes = {initParams=a, name=/dump, class=DumpRequestHandler},args = {defaults={a=A,b=B}}}
   [junit4]   2> 889501 INFO  (qtp1438074334-8091) [    ] o.a.s.u.UpdateHandler Using UpdateLog implementation: org.apache.solr.update.UpdateLog
   [junit4]   2> 889501 INFO  (qtp1438074334-8091) [    ] o.a.s.u.UpdateLog Initializing UpdateLog: dataDir= defaultSyncLevel=FLUSH numRecordsToKeep=100 maxNumLogsToKeep=10 numVersionBuckets=65536
   [junit4]   2> 889510 INFO  (qtp1438074334-8091) [    ] o.a.s.u.CommitTracker Hard AutoCommit: disabled
   [junit4]   2> 889510 INFO  (qtp1438074334-8091) [    ] o.a.s.u.CommitTracker Soft AutoCommit: disabled
   [junit4]   2> 889511 INFO  (qtp1438074334-8091) [    ] o.a.s.s.SolrIndexSearcher Opening [Searcher@61cc799d[collection1_shard1_replica_t25] main]
   [junit4]   2> 889512 INFO  (qtp1438074334-8091) [    ] o.a.s.r.ManagedResourceStorage Configured ZooKeeperStorageIO with znodeBase: /configs/conf1
   [junit4]   2> 889512 INFO  (qtp1438074334-8091) [    ] o.a.s.r.ManagedResourceStorage Loaded null at path _rest_managed.json using ZooKeeperStorageIO:path=/configs/conf1
   [junit4]   2> 889512 INFO  (qtp1438074334-8091) [    ] o.a.s.h.ReplicationHandler Commits will be reserved for  10000
   [junit4]   2> 889512 INFO  (qtp1438074334-8091) [    ] o.a.s.u.UpdateLog Could not find max version in index or recent updates, using new clock 1578379023574106112
   [junit4]   2> 889513 INFO  (searcherExecutor-4023-thread-1) [    ] o.a.s.c.SolrCore [collection1_shard1_replica_t25] Registered new searcher Searcher@61cc799d[collection1_shard1_replica_t25] main{ExitableDirectoryReader(UninvertingDirectoryReader())}
   [junit4]   2> 889514 INFO  (qtp1438074334-8091) [    ] o.a.s.c.ZkController Core needs to recover:collection1_shard1_replica_t25
   [junit4]   2> 889514 INFO  (updateExecutor-1211-thread-1) [    ] o.a.s.u.DefaultSolrCoreState Running recovery
   [junit4]   2> 889514 INFO  (qtp1438074334-8091) [    ] o.a.s.s.HttpSolrCall [admin] webapp=null path=/admin/cores params={qt=/admin/cores&collection.configName=conf1&name=collection1_shard1_replica_t25&action=CREATE&collection=collection1&shard=shard1&wt=javabin&version=2&replicaType=TLOG} status=0 QTime=1055
   [junit4]   2> 889515 INFO  (recoveryExecutor-1212-thread-1) [    ] o.a.s.c.RecoveryStrategy Starting recovery process. recoveringAfterStartup=true
   [junit4]   2> 889515 INFO  (recoveryExecutor-1212-thread-1) [    ] o.a.s.c.RecoveryStrategy ###### startupVersions=[[]]
   [junit4]   2> 889515 INFO  (recoveryExecutor-1212-thread-1) [    ] o.a.s.c.ZkController collection1_shard1_replica_t25 stopping background replication from leader
   [junit4]   2> 889515 INFO  (recoveryExecutor-1212-thread-1) [    ] o.a.s.c.RecoveryStrategy Begin buffering updates. core=[collection1_shard1_replica_t25]
   [junit4]   2> 889515 INFO  (recoveryExecutor-1212-thread-1) [    ] o.a.s.u.UpdateLog Starting to buffer updates. FSUpdateLog{state=ACTIVE, tlog=null}
   [junit4]   2> 889515 INFO  (recoveryExecutor-1212-thread-1) [    ] o.a.s.c.RecoveryStrategy Publishing state of core [collection1_shard1_replica_t25] as recovering, leader is [http://127.0.0.1:33613/collection1_shard1_replica_t21/] and I am [http://127.0.0.1:40113/collection1_shard1_replica_t25/]
   [junit4]   2> 889516 INFO  (qtp2070508171-7984) [    ] o.a.s.s.HttpSolrCall [admin] webapp=null path=/admin/collections params={node=127.0.0.1:40113_&action=ADDREPLICA&collection=collection1&shard=shard1&type=TLOG&wt=javabin&version=2} status=0 QTime=1059
   [junit4]   2> 889516 INFO  (recoveryExecutor-1212-thread-1) [    ] o.a.s.c.RecoveryStrategy Sending prep recovery command to [http://127.0.0.1:33613]; [WaitForState: action=PREPRECOVERY&core=collection1_shard1_replica_t21&nodeName=127.0.0.1:40113_&coreNodeName=core_node26&state=recovering&checkLive=true&onlyIfLeader=true&onlyIfLeaderActive=true]
   [junit4]   2> 889516 INFO  (qtp2081210940-8031) [    ] o.a.s.h.a.PrepRecoveryOp Going to wait for coreNodeName: core_node26, state: recovering, checkLive: true, onlyIfLeader: true, onlyIfLeaderActive: true, maxTime: 183 s
   [junit4]   2> 889516 INFO  (qtp2081210940-8031) [    ] o.a.s.h.a.PrepRecoveryOp In WaitForState(recovering): collection=collection1, shard=shard1, thisCore=collection1_shard1_replica_t21, leaderDoesNotNeedRecovery=false, isLeader? true, live=true, checkLive=true, currentState=down, localState=active, nodeName=127.0.0.1:40113_, coreNodeName=core_node26, onlyIfActiveCheckResult=false, nodeProps: core_node26:{"core":"collection1_shard1_replica_t25","base_url":"http://127.0.0.1:40113","node_name":"127.0.0.1:40113_","state":"down","type":"TLOG"}
   [junit4]   2> 889517 INFO  (TEST-TestInPlaceUpdatesDistrib.test-seed#[32ACE6FA7DBECC89]) [    ] o.a.s.SolrTestCaseJ4 ###Starting test
   [junit4]   2> 889517 INFO  (TEST-TestInPlaceUpdatesDistrib.test-seed#[32ACE6FA7DBECC89]) [    ] o.a.s.c.AbstractDistribZkTestBase Wait for recoveries to finish - collection: collection1 failOnTimeout:true timeout (sec):330
   [junit4]   1> -
   [junit4]   1> replica:core_node22 rstate:active live:true
   [junit4]   1> replica:core_node24 rstate:recovering live:true
   [junit4]   1> replica:core_node26 rstate:down live:true
   [junit4]   2> 889617 INFO  (zkCallback-1207-thread-1) [    ] o.a.s.c.c.ZkStateReader A cluster state change: [WatchedEvent state:SyncConnected type:NodeDataChanged path:/collections/collection1/state.json] for collection [collection1] has occurred - updating... (live nodes size: [4])
   [junit4]   2> 889617 INFO  (zkCallback-1201-thread-1) [    ] o.a.s.c.c.ZkStateReader A cluster state change: [WatchedEvent state:SyncConnected type:NodeDataChanged path:/collections/collection1/state.json] for collection [collection1] has occurred - updating... (live nodes size: [4])
   [junit4]   2> 889617 INFO  (zkCallback-1214-thread-1) [    ] o.a.s.c.c.ZkStateReader A cluster state change: [WatchedEvent state:SyncConnected type:NodeDataChanged path:/collections/collection1/state.json] for collection [collection1] has occurred - updating... (live nodes size: [4])
   [junit4]   2> 889818 INFO  (recoveryExecutor-1205-thread-1) [    ] o.a.s.c.RecoveryStrategy Starting Replication Recovery.
   [junit4]   2> 889818 INFO  (recoveryExecutor-1205-thread-1) [    ] o.a.s.c.RecoveryStrategy Attempting to replicate from [http://127.0.0.1:33613/collection1_shard1_replica_t21/].
   [junit4]   2> 889820 INFO  (qtp2081210940-8025) [    ] o.a.s.u.DirectUpdateHandler2 start commit{_version_=1578379023897067520,optimize=false,openSearcher=false,waitSearcher=true,expungeDeletes=false,softCommit=false,prepareCommit=false}
   [junit4]   2> 889821 INFO  (qtp2081210940-8025) [    ] o.a.s.u.DirectUpdateHandler2 No uncommitted changes. Skipping IW.commit.
   [junit4]   2> 889821 INFO  (qtp2081210940-8025) [    ] o.a.s.u.DirectUpdateHandler2 end_commit_flush
   [junit4]   2> 889821 INFO  (qtp2081210940-8025) [    ] o.a.s.u.p.LogUpdateProcessorFactory [collection1_shard1_replica_t21]  webapp= path=/update params={waitSearcher=true&openSearcher=false&commit=true&softCommit=false&commit_end_point=true&wt=javabin&version=2}{commit=} 0 1
   [junit4]   2> 889823 INFO  (qtp2081210940-8026) [    ] o.a.s.c.S.Request [collection1_shard1_replica_t21]  webapp= path=/replication params={qt=/replication&wt=javabin&version=2&command=indexversion} status=0 QTime=0
   [junit4]   2> 889823 INFO  (recoveryExecutor-1205-thread-1) [    ] o.a.s.h.IndexFetcher Master's generation: 1
   [junit4]   2> 889823 INFO  (recoveryExecutor-1205-thread-1) [    ] o.a.s.h.IndexFetcher Master's version: 0
   [junit4]   2> 889823 INFO  (recoveryExecutor-1205-thread-1) [    ] o.a.s.h.IndexFetcher Slave's generation: 1
   [junit4]   2> 889823 INFO  (recoveryExecutor-1205-thread-1) [    ] o.a.s.h.IndexFetcher Slave's version: 0
   [junit4]   2> 889823 INFO  (recoveryExecutor-1205-thread-1) [    ] o.a.s.c.RecoveryStrategy Replication Recovery was successful.
   [junit4]   2> 889823 INFO  (recoveryExecutor-1205-thread-1) [    ] o.a.s.c.RecoveryStrategy Registering as Active after recovery.
   [junit4]   2> 889823 INFO  (recoveryExecutor-1205-thread-1) [    ] o.a.s.c.ZkController collection1_shard1_replica_t23 starting background replication from leader
   [junit4]   2> 889823 INFO  (recoveryExecutor-1205-thread-1) [    ] o.a.s.c.ReplicateFromLeader Will start replication from leader with poll interval: 00:00:03
   [junit4]   2> 889824 INFO  (recoveryExecutor-1205-thread-1) [    ] o.a.s.h.ReplicationHandler Poll scheduled at an interval of 3000ms
   [junit4]   2> 889825 INFO  (recoveryExecutor-1205-thread-1) [    ] o.a.s.c.RecoveryStrategy Updating version bucket highest from index after successful recovery.
   [junit4]   2> 889825 INFO  (recoveryExecutor-1205-thread-1) [    ] o.a.s.u.UpdateLog Could not find max version in index or recent updates, using new clock 1578379023902310400
   [junit4]   2> 889828 INFO  (recoveryExecutor-1205-thread-1) [    ] o.a.s.c.RecoveryStrategy Finished recovery process, successful=[true]
   [junit4]   2> 889928 INFO  (zkCallback-1207-thread-1) [    ] o.a.s.c.c.ZkStateReader A cluster state change: [WatchedEvent state:SyncConnected type:NodeDataChanged path:/collections/collection1/state.json] for collection [collection1] has occurred - updating... (live nodes size: [4])
   [junit4]   2> 889928 INFO  (zkCallback-1214-thread-1) [    ] o.a.s.c.c.ZkStateReader A cluster state change: [WatchedEvent state:SyncConnected type:NodeDataChanged path:/collections/collection1/state.json] for collection [collection1] has occurred - updating... (live nodes size: [4])
   [junit4]   2> 889928 INFO  (zkCallback-1201-thread-1) [    ] o.a.s.c.c.ZkStateReader A cluster state change: [WatchedEvent state:SyncConnected type:NodeDataChanged path:/collections/collection1/state.json] for collection [collection1] has occurred - updating... (live nodes size: [4])
   [junit4]   2> 890460 INFO  (OverseerCollectionConfigSetProcessor-98648688530751492-127.0.0.1:34815_-n_0000000000) [    ] o.a.s.c.OverseerTaskQueue Response ZK path: /overseer/collection-queue-work/qnr-0000000008 doesn't exist.  Requestor may have disconnected from ZooKeeper
   [junit4]   2> 890517 INFO  (qtp2081210940-8031) [    ] o.a.s.h.a.PrepRecoveryOp In WaitForState(recovering): collection=collection1, shard=shard1, thisCore=collection1_shard1_replica_t21, leaderDoesNotNeedRecovery=false, isLeader? true, live=true, checkLive=true, currentState=recovering, localState=active, nodeName=127.0.0.1:40113_, coreNodeName=core_node26, onlyIfActiveCheckResult=false, nodeProps: core_node26:{"core":"collection1_shard1_replica_t25","base_url":"http://127.0.0.1:40113","node_name":"127.0.0.1:40113_","state":"recovering","type":"TLOG"}
   [junit4]   2> 890517 INFO  (qtp2081210940-8031) [    ] o.a.s.h.a.PrepRecoveryOp Waited coreNodeName: core_node26, state: recovering, checkLive: true, onlyIfLeader: true for: 1 seconds.
   [junit4]   2> 890517 INFO  (qtp2081210940-8031) [    ] o.a.s.s.HttpSolrCall [admin] webapp=null path=/admin/cores params={nodeName=127.0.0.1:40113_&onlyIfLeaderActive=true&core=collection1_shard1_replica_t21&coreNodeName=core_node26&action=PREPRECOVERY&checkLive=true&state=recovering&onlyIfLeader=true&wt=javabin&version=2} status=0 QTime=1000
   [junit4]   1> -
   [junit4]   1> replica:core_node22 rstate:active live:true
   [junit4]   1> replica:core_node24 rstate:active live:true
   [junit4]   1> replica:core_node26 rstate:recovering live:true
   [junit4]   2> 891017 INFO  (recoveryExecutor-1212-thread-1) [    ] o.a.s.c.RecoveryStrategy Starting Replication Recovery.
   [junit4]   2> 891017 INFO  (recoveryExecutor-1212-thread-1) [    ] o.a.s.c.RecoveryStrategy Attempting to replicate from [http://127.0.0.1:33613/collection1_shard1_replica_t21/].
   [junit4]   2> 891018 INFO  (qtp2081210940-8031) [    ] o.a.s.u.DirectUpdateHandler2 start commit{_version_=1578379025153261568,optimize=false,openSearcher=false,waitSearcher=true,expungeDeletes=false,softCommit=false,prepareCommit=false}
   [junit4]   2> 891019 INFO  (qtp2081210940-8031) [    ] o.a.s.u.DirectUpdateHandler2 No uncommitted changes. Skipping IW.commit.
   [junit4]   2> 891019 INFO  (qtp2081210940-8031) [    ] o.a.s.u.DirectUpdateHandler2 end_commit_flush
   [junit4]   2> 891019 INFO  (qtp2081210940-8031) [    ] o.a.s.u.p.LogUpdateProcessorFactory [collection1_shard1_replica_t21]  webapp= path=/update params={waitSearcher=true&openSearcher=false&commit=true&softCommit=false&commit_end_point=true&wt=javabin&version=2}{commit=} 0 0
   [junit4]   2> 891020 INFO  (qtp2081210940-8031) [    ] o.a.s.c.S.Request [collection1_shard1_replica_t21]  webapp= path=/replication params={qt=/replication&wt=javabin&version=2&command=indexversion} status=0 QTime=0
   [junit4]   2> 891020 INFO  (recoveryExecutor-1212-thread-1) [    ] o.a.s.h.IndexFetcher Master's generation: 1
   [junit4]   2> 891020 INFO  (recoveryExecutor-1212-thread-1) [    ] o.a.s.h.IndexFetcher Master's version: 0
   [junit4]   2> 891020 INFO  (recoveryExecutor-1212-thread-1) [    ] o.a.s.h.IndexFetcher Slave's generation: 1
   [junit4]   2> 891020 INFO  (recoveryExecutor-1212-thread-1) [    ] o.a.s.h.IndexFetcher Slave's version: 0
   [junit4]   2> 891020 INFO  (recoveryExecutor-1212-thread-1) [    ] o.a.s.c.RecoveryStrategy Replication Recovery was successful.
   [junit4]   2> 891020 INFO  (recoveryExecutor-1212-thread-1) [    ] o.a.s.c.RecoveryStrategy Registering as Active after recovery.
   [junit4]   2> 891020 INFO  (recoveryExecutor-1212-thread-1) [    ] o.a.s.c.ZkController collection1_shard1_replica_t25 starting background replication from leader
   [junit4]   2> 891020 INFO  (recoveryExecutor-1212-thread-1) [    ] o.a.s.c.ReplicateFromLeader Will start replication from leader with poll interval: 00:00:03
   [junit4]   2> 891020 INFO  (recoveryExecutor-1212-thread-1) [    ] o.a.s.h.ReplicationHandler Poll scheduled at an interval of 3000ms
   [junit4]   2> 891021 INFO  (recoveryExecutor-1212-thread-1) [    ] o.a.s.c.RecoveryStrategy Updating version bucket highest from index after successful recovery.
   [junit4]   2> 891021 INFO  (recoveryExecutor-1212-thread-1) [    ] o.a.s.u.UpdateLog Could not find max version in index or recent updates, using new clock 1578379025156407296
   [junit4]   2> 891022 INFO  (recoveryExecutor-1212-thread-1) [    ] o.a.s.c.RecoveryStrategy Finished recovery process, successful=[true]
   [junit4]   2> 891123 INFO  (zkCallback-1201-thread-1) [    ] o.a.s.c.c.ZkStateReader A cluster state change: [WatchedEvent state:SyncConnected type:NodeDataChanged path:/collections/collection1/state.json] for collection [collection1] has occurred - updating... (live nodes size: [4])
   [junit4]   2> 891123 INFO  (zkCallback-1207-thread-1) [    ] o.a.s.c.c.ZkStateReader A cluster state change: [WatchedEvent state:SyncConnected type:NodeDataChanged path:/collections/collection1/state.json] for collection [collection1] has occurred - updating... (live nodes size: [4])
   [junit4]   2> 891123 INFO  (zkCallback-1214-thread-1) [    ] o.a.s.c.c.ZkStateReader A cluster state change: [WatchedEvent state:SyncConnected type:NodeDataChanged path:/collections/collection1/state.json] for collection [collection1] has occurred - updating... (live nodes size: [4])
   [junit4]   2> 891198 INFO  (indexFetcher-4031-thread-1) [    ] o.a.s.h.IndexFetcher Updated masterUrl to http://127.0.0.1:33613/collection1_shard1_replica_t21/
   [junit4]   2> 891198 INFO  (qtp2081210940-8024) [    ] o.a.s.c.S.Request [collection1_shard1_replica_t21]  webapp= path=/replication params={qt=/replication&wt=javabin&version=2&command=indexversion} status=0 QTime=0
   [junit4]   2> 891199 INFO  (indexFetcher-4031-thread-1) [    ] o.a.s.h.IndexFetcher Master's generation: 1
   [junit4]   2> 891199 INFO  (indexFetcher-4031-thread-1) [    ] o.a.s.h.IndexFetcher Master's version: 0
   [junit4]   2> 891199 INFO  (indexFetcher-4031-thread-1) [    ] o.a.s.h.IndexFetcher Slave's generation: 1
   [junit4]   2> 891199 INFO  (indexFetcher-4031-thread-1) [    ] o.a.s.h.IndexFetcher Slave's version: 0
   [junit4]   1> -
   [junit4]   1> replica:core_node22 rstate:active live:true
   [junit4]   1> replica:core_node24 rstate:active live:true
   [junit4]   1> replica:core_node26 rstate:active live:true
   [junit4]   1> no one is recoverying
   [junit4]   2> 891519 INFO  (TEST-TestInPlaceUpdatesDistrib.test-seed#[32ACE6FA7DBECC89]) [    ] o.a.s.c.AbstractDistribZkTestBase Recoveries finished - collection: collection1
   [junit4]   2> 891522 INFO  (qtp476253594-8060) [    ] o.a.s.c.S.Request [collection1_shard1_replica_t23]  webapp= path=/schema/fields/inplace_updatable_int params={wt=javabin&version=2} status=0 QTime=0
   [junit4]   2> 891523 INFO  (qtp1438074334-8093) [    ] o.a.s.c.S.Request [collection1_shard1_replica_t25]  webapp= path=/schema/fields/inplace_updatable_float params={wt=javabin&version=2} status=0 QTime=0
   [junit4]   2> 891523 INFO  (qtp1438074334-8086) [    ] o.a.s.c.S.Request [collection1_shard1_replica_t25]  webapp= path=/schema/fields/_version_ params={wt=javabin&version=2} status=0 QTime=0
   [junit4]   2> 891524 INFO  (TEST-TestInPlaceUpdatesDistrib.test-seed#[32ACE6FA7DBECC89]) [    ] o.a.s.u.TestInPlaceUpdatesDistrib Trying num docs = 46
   [junit4]   2> 891529 INFO  (qtp476253594-8055) [    ] o.a.s.u.p.LogUpdateProcessorFactory [collection1_shard1_replica_t23]  webapp= path=/update params={update.distrib=FROMLEADER&distrib.from=http://127.0.0.1:33613/collection1_shard1_replica_t21/&wt=javabin&version=2}{add=[-1 (1578379025684889600)]} 0 1
   [junit4]   2> 891530 INFO  (qtp1438074334-8087) [    ] o.a.s.u.p.LogUpdateProcessorFactory [collection1_shard1_replica_t25]  webapp= path=/update params={update.distrib=FROMLEADER&distrib.from=http://127.0.0.1:33613/collection1_shard1_replica_t21/&wt=javabin&version=2}{add=[-1 (1578379025684889600)]} 0 1
   [junit4]   2> 891530 INFO  (qtp2081210940-8029) [    ] o.a.s.u.p.LogUpdateProcessorFactory [collection1_shard1_replica_t21]  webapp= path=/update params={versions=true&wt=javabin&version=2}{add=[-1 (1578379025684889600)]} 0 5
   [junit4]   2> 891531 INFO  (qtp476253594-8054) [    ] o.a.s.u.p.LogUpdateProcessorFactory [collection1_shard1_replica_t23]  webapp= path=/update params={update.distrib=FROMLEADER&distrib.from=http://127.0.0.1:33613/collection1_shard1_replica_t21/&wt=javabin&version=2}{add=[-2 (1578379025690132480)]} 0 0
   [junit4]   2> 891531 INFO  (qtp1438074334-8093) [    ] o.a.s.u.p.LogUpdateProcessorFactory [collection1_shard1_replica_t25]  webapp= path=/update params={update.distrib=FROMLEADER&distrib.from=http://127.0.0.1:33613/collection1_shard1_replica_t21/&wt=javabin&version=2}{add=[-2 (1578379025690132480)]} 0 0
   [junit4]   2> 891532 INFO  (qtp2081210940-8031) [    ] o.a.s.u.p.LogUpdateProcessorFactory [collection1_shard1_replica_t21]  webapp= path=/update params={versions=true&wt=javabin&version=2}{add=[-2 (1578379025690132480)]} 0 1
   [junit4]   2> 891533 INFO  (qtp476253594-8060) [    ] o.a.s.u.p.LogUpdateProcessorFactory [collection1_shard1_replica_t23]  webapp= path=/update params={update.distrib=FROMLEADER&distrib.from=http://127.0.0.1:33613/collection1_shard1_replica_t21/&wt=javabin&version=2}{add=[0 (1578379025692229632)]} 0 0
   [junit4]   2> 891534 INFO  (qtp1438074334-8086) [    ] o.a.s.u.p.LogUpdateProcessorFactory [collection1_shard1_replica_t25]  webapp= path=/update params={update.distrib=FROMLEADER&distrib.from=http://127.0.0.1:33613/collection1_shard1_replica_t21/&wt=javabin&version=2}{add=[0 (1578379025692229632)]} 0 0
   [junit4]   2> 891534 INFO  (qtp2081210940-8024) [    ] o.a.s.u.p.LogUpdateProcessorFactory [collection1_shard1_replica_t21]  webapp= path=/update params={versions=true&wt=javabin&version=2}{add=[0 (1578379025692229632)]} 0 1
   [junit4]   2> 891535 INFO  (qtp476253594-8058) [    ] o.a.s.u.p.LogUpdateProcessorFactory [collection1_shard1_replica_t23]  webapp= path=/update params={update.distrib=FROMLEADER&distrib.from=http://127.0.0.1:33613/collection1_shard1_replica_t21/&wt=javabin&version=2}{add=[-3 (1578379025695375360)]} 0 0
   [junit4]   2> 891536 INFO  (qtp1438074334-8088) [    ] o.a.s.u.p.LogUpdateProcessorFactory [collection1_shard1_replica_t25]  webapp= path=/update params={update.distrib=FROMLEADER&distrib.from=http://127.0.0.1:33613/collection1_shard1_replica_t21/&wt=javabin&version=2}{add=[-3 (1578379025695375360)]} 0 0
   [junit4]   2> 891536 INFO  (qtp2081210940-8027) [    ] o.a.s.u.p.LogUpdateProcessorFactory [collection1_shard1_replica_t21]  webapp= path=/update params={versions=true&wt=javabin&version=2}{add=[-3 (1578379025695375360)]} 0 1
   [junit4]   2> 891537 INFO  (qtp476253594-8055) [    ] o.a.s.u.p.LogUpdateProcessorFactory [collection1_shard1_replica_t23]  webapp= path=/update params={update.distrib=FROMLEADER&distrib.from=http://127.0.0.1:33613/collection1_shard1_replica_t21/&wt=javabin&version=2}{add=[1 (1578379025696423936)]} 0 0
   [junit4]   2> 891537 INFO  (qtp1438074334-8087) [    ] o.a.s.u.p.LogUpdateProcessorFactory [collection1_shard1_replica_t25]  webapp= path=/update params={update.distrib=FROMLEADER&distrib.from=http://127.0.0.1:33613/collection1_shard1_replica_t21/&wt=javabin&version=2}{add=[1 (1578379025696423936)]} 0 0
   [junit4]   2> 891538 INFO  (qtp2081210940-8029) [    ] o.a.s.u.p.LogUpdateProcessorFactory [collection1_shard1_replica_t21]  webapp= path=/update params={versions=true&wt=javabin&version=2}{add=[1 (1578379025696423936)]} 0 1
   [junit4]   2> 891539 INFO  (qtp476253594-8054) [    ] o.a.s.u.p.LogUpdateProcessorFactory [collection1_shard1_replica_t23]  webapp= path=/update params={update.distrib=FROMLEADER&distrib.from=http://127.0.0.1:33613/collection1_shard1_replica_t21/&wt=javabin&version=2}{add=[-4 (

[...truncated too long message...]

 INFO  (zkCallback-1214-thread-2) [    ] o.a.s.m.SolrMetricManager Closing metric reporters for registry=solr.collection.collection1.shard1.leader, tag=2130530585
   [junit4]   2> 954952 INFO  (zkCallback-1214-thread-2) [    ] o.a.s.u.DirectUpdateHandler2 Committing on IndexWriter close.
   [junit4]   2> 954952 INFO  (zkCallback-1214-thread-2) [    ] o.a.s.u.SolrIndexWriter Calling setCommitData with IW:org.apache.solr.update.SolrIndexWriter@51f53b4f commitCommandVersion:0
   [junit4]   2> 954953 INFO  (TEST-TestInPlaceUpdatesDistrib.test-seed#[32ACE6FA7DBECC89]) [    ] o.e.j.s.AbstractConnector Stopped ServerConnector@3c8f4ad6{HTTP/1.1,[http/1.1]}{127.0.0.1:0}
   [junit4]   2> 954953 INFO  (TEST-TestInPlaceUpdatesDistrib.test-seed#[32ACE6FA7DBECC89]) [    ] o.e.j.s.h.ContextHandler Stopped o.e.j.s.ServletContextHandler@365dd9e4{/,null,UNAVAILABLE}
   [junit4]   2> 954954 ERROR (TEST-TestInPlaceUpdatesDistrib.test-seed#[32ACE6FA7DBECC89]) [    ] o.a.z.s.ZooKeeperServer ZKShutdownHandler is not registered, so ZooKeeper server won't take any action on ERROR or SHUTDOWN server state changes
   [junit4]   2> 954954 INFO  (TEST-TestInPlaceUpdatesDistrib.test-seed#[32ACE6FA7DBECC89]) [    ] o.a.s.c.ZkTestServer connecting to 127.0.0.1:39287 39287
   [junit4]   2> 961751 INFO  (Thread-2045) [    ] o.a.s.c.ZkTestServer connecting to 127.0.0.1:39287 39287
   [junit4]   2> 961752 WARN  (Thread-2045) [    ] o.a.s.c.ZkTestServer Watch limit violations:
   [junit4]   2> Maximum concurrent create/delete watches above limit:
   [junit4]   2>
   [junit4]   2> 6 /solr/aliases.json
   [junit4]   2> 4 /solr/security.json
   [junit4]   2> 4 /solr/configs/conf1
   [junit4]   2>
   [junit4]   2> Maximum concurrent data watches above limit:
   [junit4]   2>
   [junit4]   2> 6 /solr/clusterstate.json
   [junit4]   2> 6 /solr/clusterprops.json
   [junit4]   2> 3 /solr/collections/collection1/state.json
   [junit4]   2>
   [junit4]   2> Maximum concurrent children watches above limit:
   [junit4]   2>
   [junit4]   2> 6 /solr/live_nodes
   [junit4]   2> 6 /solr/collections
   [junit4]   2> 3 /solr/overseer/queue
   [junit4]   2> 3 /solr/overseer/collection-queue-work
   [junit4]   2>
   [junit4]   2> NOTE: reproduce with: ant test  -Dtestcase=TestInPlaceUpdatesDistrib -Dtests.method=test -Dtests.seed=32ACE6FA7DBECC89 -Dtests.multiplier=3 -Dtests.slow=true -Dtests.locale=gv-IM -Dtests.timezone=America/Edmonton -Dtests.asserts=true -Dtests.file.encoding=UTF-8
   [junit4] FAILURE 79.0s J0 | TestInPlaceUpdatesDistrib.test <<<
   [junit4]    > Throwable #1: java.lang.AssertionError: inplace_updatable_float didn't match for replica at client: http://127.0.0.1:42357/collection1 expected:<111.0> but was:<1.0>
   [junit4]    > at __randomizedtesting.SeedInfo.seed([32ACE6FA7DBECC89:BAF8D920D342A171]:0)
   [junit4]    > at org.apache.solr.update.TestInPlaceUpdatesDistrib.assertReplicaValue(TestInPlaceUpdatesDistrib.java:980)
   [junit4]    > at org.apache.solr.update.TestInPlaceUpdatesDistrib.outOfOrderUpdatesIndividualReplicaTest(TestInPlaceUpdatesDistrib.java:643)
   [junit4]    > at org.apache.solr.update.TestInPlaceUpdatesDistrib.test(TestInPlaceUpdatesDistrib.java:144)
   [junit4]    > at java.base/jdk.internal.reflect.NativeMethodAccessorImpl.invoke0(Native Method)
   [junit4]    > at java.base/jdk.internal.reflect.NativeMethodAccessorImpl.invoke(NativeMethodAccessorImpl.java:62)
   [junit4]    > at java.base/jdk.internal.reflect.DelegatingMethodAccessorImpl.invoke(DelegatingMethodAccessorImpl.java:43)
   [junit4]    > at java.base/java.lang.reflect.Method.invoke(Method.java:564)
   [junit4]    > at org.apache.solr.BaseDistributedSearchTestCase$ShardsRepeatRule$ShardsFixedStatement.callStatement(BaseDistributedSearchTestCase.java:993)
   [junit4]    > at org.apache.solr.BaseDistributedSearchTestCase$ShardsRepeatRule$ShardsStatement.evaluate(BaseDistributedSearchTestCase.java:968)
   [junit4]    > at java.base/java.lang.Thread.run(Thread.java:844)
   [junit4]   2> 961754 INFO  (SUITE-TestInPlaceUpdatesDistrib-seed#[32ACE6FA7DBECC89]-worker) [    ] o.a.s.SolrTestCaseJ4 ###deleteCore
   [junit4]   2> 961754 INFO  (SUITE-TestInPlaceUpdatesDistrib-seed#[32ACE6FA7DBECC89]-worker) [    ] o.a.s.c.CoreContainer Shutting down CoreContainer instance=2066256552
   [junit4]   2> 961754 INFO  (SUITE-TestInPlaceUpdatesDistrib-seed#[32ACE6FA7DBECC89]-worker) [    ] o.a.s.m.SolrMetricManager Closing metric reporters for registry=solr.node, tag=null
   [junit4]   2> 961754 INFO  (SUITE-TestInPlaceUpdatesDistrib-seed#[32ACE6FA7DBECC89]-worker) [    ] o.a.s.m.r.SolrJmxReporter Closing reporter [org.apache.solr.metrics.reporters.SolrJmxReporter@1961fd6e: rootName = null, domain = solr.node, service url = null, agent id = null] for registry solr.node / com.codahale.metrics.MetricRegistry@2f78f03f
   [junit4]   2> 961755 INFO  (SUITE-TestInPlaceUpdatesDistrib-seed#[32ACE6FA7DBECC89]-worker) [    ] o.a.s.m.SolrMetricManager Closing metric reporters for registry=solr.jvm, tag=null
   [junit4]   2> 961755 INFO  (SUITE-TestInPlaceUpdatesDistrib-seed#[32ACE6FA7DBECC89]-worker) [    ] o.a.s.m.r.SolrJmxReporter Closing reporter [org.apache.solr.metrics.reporters.SolrJmxReporter@ba8771b: rootName = null, domain = solr.jvm, service url = null, agent id = null] for registry solr.jvm / com.codahale.metrics.MetricRegistry@70ff4d75
   [junit4]   2> 961756 INFO  (SUITE-TestInPlaceUpdatesDistrib-seed#[32ACE6FA7DBECC89]-worker) [    ] o.a.s.m.SolrMetricManager Closing metric reporters for registry=solr.jetty, tag=null
   [junit4]   2> 961756 INFO  (SUITE-TestInPlaceUpdatesDistrib-seed#[32ACE6FA7DBECC89]-worker) [    ] o.a.s.m.r.SolrJmxReporter Closing reporter [org.apache.solr.metrics.reporters.SolrJmxReporter@48011f58: rootName = null, domain = solr.jetty, service url = null, agent id = null] for registry solr.jetty / com.codahale.metrics.MetricRegistry@1428f088
   [junit4]   2> 961756 INFO  (SUITE-TestInPlaceUpdatesDistrib-seed#[32ACE6FA7DBECC89]-worker) [    ] o.a.s.c.TransientSolrCoreCacheDefault Allocating transient cache for 2147483647 transient cores
   [junit4]   2> 961756 INFO  (coreCloseExecutor-4067-thread-1) [    ] o.a.s.c.SolrCore [collection1]  CLOSING SolrCore org.apache.solr.core.SolrCore@20b0f810
   [junit4]   2> 961756 INFO  (coreCloseExecutor-4067-thread-1) [    ] o.a.s.m.SolrMetricManager Closing metric reporters for registry=solr.core.collection1, tag=548468752
   [junit4]   2> 961756 INFO  (coreCloseExecutor-4067-thread-1) [    ] o.a.s.m.r.SolrJmxReporter Closing reporter [org.apache.solr.metrics.reporters.SolrJmxReporter@33c3d63: rootName = null, domain = solr.core.collection1, service url = null, agent id = null] for registry solr.core.collection1 / com.codahale.metrics.MetricRegistry@7bc258e1
   [junit4]   2> NOTE: leaving temporary files on disk at: /home/jenkins/workspace/Lucene-Solr-7.x-Linux/solr/build/solr-core/test/J0/temp/solr.update.TestInPlaceUpdatesDistrib_32ACE6FA7DBECC89-001
   [junit4]   2> NOTE: test params are: codec=Asserting(Lucene70): {title_s=PostingsFormat(name=Direct), id=PostingsFormat(name=Memory), id_field_copy_that_does_not_support_in_place_update_s=PostingsFormat(name=LuceneVarGapDocFreqInterval)}, docValues:{inplace_updatable_float=DocValuesFormat(name=Direct), id_i=DocValuesFormat(name=Lucene70), _version_=DocValuesFormat(name=Asserting), id=DocValuesFormat(name=Lucene70), inplace_updatable_int_with_default=DocValuesFormat(name=Direct), inplace_updatable_int=DocValuesFormat(name=Lucene70), inplace_updatable_float_with_default=DocValuesFormat(name=Lucene70)}, maxPointsInLeafNode=884, maxMBSortInHeap=5.075524213755656, sim=RandomSimilarity(queryNorm=false): {}, locale=gv-IM, timezone=America/Edmonton
   [junit4]   2> NOTE: Linux 4.10.0-33-generic amd64/Oracle Corporation 9 (64-bit)/cpus=8,threads=1,free=180130840,total=478674944
   [junit4]   2> NOTE: All tests run in this JVM: [ImplicitSnitchTest, JSONWriterTest, CurrencyFieldTypeTest, TestMiniSolrCloudClusterSSL, TestMaxTokenLenTokenizer, RestartWhileUpdatingTest, MBeansHandlerTest, TolerantUpdateProcessorTest, TestExpandComponent, TestSolrFieldCacheBean, TestComponentsName, TestStreamBody, TestFaceting, HdfsUnloadDistributedZkTest, MissingSegmentRecoveryTest, BinaryUpdateRequestHandlerTest, TestNumericTerms32, TestFieldSortValues, TestRequestForwarding, SharedFSAutoReplicaFailoverUtilsTest, AtomicUpdatesTest, HighlighterConfigTest, DistributedExpandComponentTest, TestBadConfig, ChaosMonkeyNothingIsSafeTest, SolrIndexConfigTest, TestTlogReplica, SyncSliceTest, ReplicaListTransformerTest, TestSolrCloudWithHadoopAuthPlugin, ResponseHeaderTest, QueryElevationComponentTest, BlockJoinFacetDistribTest, TestSolrConfigHandlerConcurrent, TestPayloadScoreQParserPlugin, SuggestComponentContextFilterQueryTest, DistributedSuggestComponentTest, TestLazyCores, CollectionReloadTest, TestFreeTextSuggestions, TestFieldCacheVsDocValues, TestFieldResource, TestOmitPositions, DefaultValueUpdateProcessorTest, WordBreakSolrSpellCheckerTest, TestExtendedDismaxParser, LeaderInitiatedRecoveryOnCommitTest, AliasIntegrationTest, OverseerTaskQueueTest, HdfsBasicDistributedZk2Test, TestRandomDVFaceting, HdfsChaosMonkeySafeLeaderTest, TestSha256AuthenticationProvider, SolrSlf4jReporterTest, TestReplicationHandler, TestSubQueryTransformerDistrib, TestSegmentSorting, TestTrackingShardHandlerFactory, TestMultiValuedNumericRangeQuery, SolrIndexSplitterTest, TestDistributedSearch, TestConfig, SynonymTokenizerTest, TestAnalyzeInfixSuggestions, TestReloadAndDeleteDocs, ExitableDirectoryReaderTest, SolrCloudExampleTest, TestEmbeddedSolrServerAdminHandler, DistributedSpellCheckComponentTest, RemoteQueryErrorTest, FieldAnalysisRequestHandlerTest, TestCloudManagedSchema, TestRandomRequestDistribution, TestDocBasedVersionConstraints, TestConfigsApi, TestInPlaceUpdatesDistrib]
   [junit4] Completed [248/731 (1!)] on J0 in 79.14s, 1 test, 1 failure <<< FAILURES!

[...truncated 40776 lines...]


---------------------------------------------------------------------
To unsubscribe, e-mail: [hidden email]
For additional commands, e-mail: [hidden email]