[JENKINS-EA] Lucene-Solr-8.x-Linux (64bit/jdk-12-ea+23) - Build # 8 - Unstable!

classic Classic list List threaded Threaded
1 message Options
Reply | Threaded
Open this post in threaded view
|

[JENKINS-EA] Lucene-Solr-8.x-Linux (64bit/jdk-12-ea+23) - Build # 8 - Unstable!

Policeman Jenkins Server-2
Build: https://jenkins.thetaphi.de/job/Lucene-Solr-8.x-Linux/8/
Java: 64bit/jdk-12-ea+23 -XX:-UseCompressedOops -XX:+UseSerialGC

5 tests failed.
FAILED:  org.apache.solr.cloud.LeaderTragicEventTest.test

Error Message:
Timeout waiting for new replica become leader Timeout waiting to see state for collection=collection1 :DocCollection(collection1//collections/collection1/state.json/6)={   "pullReplicas":"0",   "replicationFactor":"2",   "shards":{"shard1":{       "range":"80000000-7fffffff",       "state":"active",       "replicas":{         "core_node3":{           "core":"collection1_shard1_replica_n1",           "base_url":"http://127.0.0.1:36181/solr",           "node_name":"127.0.0.1:36181_solr",           "state":"active",           "type":"NRT",           "force_set_state":"false",           "leader":"true"},         "core_node4":{           "core":"collection1_shard1_replica_n2",           "base_url":"http://127.0.0.1:44143/solr",           "node_name":"127.0.0.1:44143_solr",           "state":"active",           "type":"NRT",           "force_set_state":"false"}}}},   "router":{"name":"compositeId"},   "maxShardsPerNode":"1",   "autoAddReplicas":"false",   "nrtReplicas":"2",   "tlogReplicas":"0"} Live Nodes: [127.0.0.1:36181_solr, 127.0.0.1:44143_solr] Last available state: DocCollection(collection1//collections/collection1/state.json/6)={   "pullReplicas":"0",   "replicationFactor":"2",   "shards":{"shard1":{       "range":"80000000-7fffffff",       "state":"active",       "replicas":{         "core_node3":{           "core":"collection1_shard1_replica_n1",           "base_url":"http://127.0.0.1:36181/solr",           "node_name":"127.0.0.1:36181_solr",           "state":"active",           "type":"NRT",           "force_set_state":"false",           "leader":"true"},         "core_node4":{           "core":"collection1_shard1_replica_n2",           "base_url":"http://127.0.0.1:44143/solr",           "node_name":"127.0.0.1:44143_solr",           "state":"active",           "type":"NRT",           "force_set_state":"false"}}}},   "router":{"name":"compositeId"},   "maxShardsPerNode":"1",   "autoAddReplicas":"false",   "nrtReplicas":"2",   "tlogReplicas":"0"}

Stack Trace:
java.lang.AssertionError: Timeout waiting for new replica become leader
Timeout waiting to see state for collection=collection1 :DocCollection(collection1//collections/collection1/state.json/6)={
  "pullReplicas":"0",
  "replicationFactor":"2",
  "shards":{"shard1":{
      "range":"80000000-7fffffff",
      "state":"active",
      "replicas":{
        "core_node3":{
          "core":"collection1_shard1_replica_n1",
          "base_url":"http://127.0.0.1:36181/solr",
          "node_name":"127.0.0.1:36181_solr",
          "state":"active",
          "type":"NRT",
          "force_set_state":"false",
          "leader":"true"},
        "core_node4":{
          "core":"collection1_shard1_replica_n2",
          "base_url":"http://127.0.0.1:44143/solr",
          "node_name":"127.0.0.1:44143_solr",
          "state":"active",
          "type":"NRT",
          "force_set_state":"false"}}}},
  "router":{"name":"compositeId"},
  "maxShardsPerNode":"1",
  "autoAddReplicas":"false",
  "nrtReplicas":"2",
  "tlogReplicas":"0"}
Live Nodes: [127.0.0.1:36181_solr, 127.0.0.1:44143_solr]
Last available state: DocCollection(collection1//collections/collection1/state.json/6)={
  "pullReplicas":"0",
  "replicationFactor":"2",
  "shards":{"shard1":{
      "range":"80000000-7fffffff",
      "state":"active",
      "replicas":{
        "core_node3":{
          "core":"collection1_shard1_replica_n1",
          "base_url":"http://127.0.0.1:36181/solr",
          "node_name":"127.0.0.1:36181_solr",
          "state":"active",
          "type":"NRT",
          "force_set_state":"false",
          "leader":"true"},
        "core_node4":{
          "core":"collection1_shard1_replica_n2",
          "base_url":"http://127.0.0.1:44143/solr",
          "node_name":"127.0.0.1:44143_solr",
          "state":"active",
          "type":"NRT",
          "force_set_state":"false"}}}},
  "router":{"name":"compositeId"},
  "maxShardsPerNode":"1",
  "autoAddReplicas":"false",
  "nrtReplicas":"2",
  "tlogReplicas":"0"}
        at __randomizedtesting.SeedInfo.seed([33346B883441DD03:BB6054529ABDB0FB]:0)
        at org.junit.Assert.fail(Assert.java:88)
        at org.apache.solr.cloud.SolrCloudTestCase.waitForState(SolrCloudTestCase.java:289)
        at org.apache.solr.cloud.SolrCloudTestCase.waitForState(SolrCloudTestCase.java:267)
        at org.apache.solr.cloud.LeaderTragicEventTest.test(LeaderTragicEventTest.java:84)
        at java.base/jdk.internal.reflect.NativeMethodAccessorImpl.invoke0(Native Method)
        at java.base/jdk.internal.reflect.NativeMethodAccessorImpl.invoke(NativeMethodAccessorImpl.java:62)
        at java.base/jdk.internal.reflect.DelegatingMethodAccessorImpl.invoke(DelegatingMethodAccessorImpl.java:43)
        at java.base/java.lang.reflect.Method.invoke(Method.java:567)
        at com.carrotsearch.randomizedtesting.RandomizedRunner.invoke(RandomizedRunner.java:1750)
        at com.carrotsearch.randomizedtesting.RandomizedRunner$8.evaluate(RandomizedRunner.java:938)
        at com.carrotsearch.randomizedtesting.RandomizedRunner$9.evaluate(RandomizedRunner.java:974)
        at com.carrotsearch.randomizedtesting.RandomizedRunner$10.evaluate(RandomizedRunner.java:988)
        at com.carrotsearch.randomizedtesting.rules.SystemPropertiesRestoreRule$1.evaluate(SystemPropertiesRestoreRule.java:57)
        at org.apache.lucene.util.TestRuleSetupTeardownChained$1.evaluate(TestRuleSetupTeardownChained.java:49)
        at org.apache.lucene.util.AbstractBeforeAfterRule$1.evaluate(AbstractBeforeAfterRule.java:45)
        at org.apache.lucene.util.TestRuleThreadAndTestName$1.evaluate(TestRuleThreadAndTestName.java:48)
        at org.apache.lucene.util.TestRuleIgnoreAfterMaxFailures$1.evaluate(TestRuleIgnoreAfterMaxFailures.java:64)
        at org.apache.lucene.util.TestRuleMarkFailure$1.evaluate(TestRuleMarkFailure.java:47)
        at com.carrotsearch.randomizedtesting.rules.StatementAdapter.evaluate(StatementAdapter.java:36)
        at com.carrotsearch.randomizedtesting.ThreadLeakControl$StatementRunner.run(ThreadLeakControl.java:368)
        at com.carrotsearch.randomizedtesting.ThreadLeakControl.forkTimeoutingTask(ThreadLeakControl.java:817)
        at com.carrotsearch.randomizedtesting.ThreadLeakControl$3.evaluate(ThreadLeakControl.java:468)
        at com.carrotsearch.randomizedtesting.RandomizedRunner.runSingleTest(RandomizedRunner.java:947)
        at com.carrotsearch.randomizedtesting.RandomizedRunner$5.evaluate(RandomizedRunner.java:832)
        at com.carrotsearch.randomizedtesting.RandomizedRunner$6.evaluate(RandomizedRunner.java:883)
        at com.carrotsearch.randomizedtesting.RandomizedRunner$7.evaluate(RandomizedRunner.java:894)
        at com.carrotsearch.randomizedtesting.rules.StatementAdapter.evaluate(StatementAdapter.java:36)
        at com.carrotsearch.randomizedtesting.rules.SystemPropertiesRestoreRule$1.evaluate(SystemPropertiesRestoreRule.java:57)
        at org.apache.lucene.util.AbstractBeforeAfterRule$1.evaluate(AbstractBeforeAfterRule.java:45)
        at com.carrotsearch.randomizedtesting.rules.StatementAdapter.evaluate(StatementAdapter.java:36)
        at org.apache.lucene.util.TestRuleStoreClassName$1.evaluate(TestRuleStoreClassName.java:41)
        at com.carrotsearch.randomizedtesting.rules.NoShadowingOrOverridesOnMethodsRule$1.evaluate(NoShadowingOrOverridesOnMethodsRule.java:40)
        at com.carrotsearch.randomizedtesting.rules.NoShadowingOrOverridesOnMethodsRule$1.evaluate(NoShadowingOrOverridesOnMethodsRule.java:40)
        at com.carrotsearch.randomizedtesting.rules.StatementAdapter.evaluate(StatementAdapter.java:36)
        at com.carrotsearch.randomizedtesting.rules.StatementAdapter.evaluate(StatementAdapter.java:36)
        at org.apache.lucene.util.TestRuleAssertionsRequired$1.evaluate(TestRuleAssertionsRequired.java:53)
        at org.apache.lucene.util.TestRuleMarkFailure$1.evaluate(TestRuleMarkFailure.java:47)
        at org.apache.lucene.util.TestRuleIgnoreAfterMaxFailures$1.evaluate(TestRuleIgnoreAfterMaxFailures.java:64)
        at org.apache.lucene.util.TestRuleIgnoreTestSuites$1.evaluate(TestRuleIgnoreTestSuites.java:54)
        at com.carrotsearch.randomizedtesting.rules.StatementAdapter.evaluate(StatementAdapter.java:36)
        at com.carrotsearch.randomizedtesting.ThreadLeakControl$StatementRunner.run(ThreadLeakControl.java:368)
        at java.base/java.lang.Thread.run(Thread.java:835)


FAILED:  org.apache.solr.cloud.LeaderTragicEventTest.test

Error Message:
Timeout waiting for new replica become leader Timeout waiting to see state for collection=collection1 :DocCollection(collection1//collections/collection1/state.json/6)={   "pullReplicas":"0",   "replicationFactor":"2",   "shards":{"shard1":{       "range":"80000000-7fffffff",       "state":"active",       "replicas":{         "core_node3":{           "core":"collection1_shard1_replica_n1",           "base_url":"http://127.0.0.1:45367/solr",           "node_name":"127.0.0.1:45367_solr",           "state":"active",           "type":"NRT",           "force_set_state":"false"},         "core_node4":{           "core":"collection1_shard1_replica_n2",           "base_url":"http://127.0.0.1:34069/solr",           "node_name":"127.0.0.1:34069_solr",           "state":"active",           "type":"NRT",           "force_set_state":"false",           "leader":"true"}}}},   "router":{"name":"compositeId"},   "maxShardsPerNode":"1",   "autoAddReplicas":"false",   "nrtReplicas":"2",   "tlogReplicas":"0"} Live Nodes: [127.0.0.1:34069_solr, 127.0.0.1:45367_solr] Last available state: DocCollection(collection1//collections/collection1/state.json/6)={   "pullReplicas":"0",   "replicationFactor":"2",   "shards":{"shard1":{       "range":"80000000-7fffffff",       "state":"active",       "replicas":{         "core_node3":{           "core":"collection1_shard1_replica_n1",           "base_url":"http://127.0.0.1:45367/solr",           "node_name":"127.0.0.1:45367_solr",           "state":"active",           "type":"NRT",           "force_set_state":"false"},         "core_node4":{           "core":"collection1_shard1_replica_n2",           "base_url":"http://127.0.0.1:34069/solr",           "node_name":"127.0.0.1:34069_solr",           "state":"active",           "type":"NRT",           "force_set_state":"false",           "leader":"true"}}}},   "router":{"name":"compositeId"},   "maxShardsPerNode":"1",   "autoAddReplicas":"false",   "nrtReplicas":"2",   "tlogReplicas":"0"}

Stack Trace:
java.lang.AssertionError: Timeout waiting for new replica become leader
Timeout waiting to see state for collection=collection1 :DocCollection(collection1//collections/collection1/state.json/6)={
  "pullReplicas":"0",
  "replicationFactor":"2",
  "shards":{"shard1":{
      "range":"80000000-7fffffff",
      "state":"active",
      "replicas":{
        "core_node3":{
          "core":"collection1_shard1_replica_n1",
          "base_url":"http://127.0.0.1:45367/solr",
          "node_name":"127.0.0.1:45367_solr",
          "state":"active",
          "type":"NRT",
          "force_set_state":"false"},
        "core_node4":{
          "core":"collection1_shard1_replica_n2",
          "base_url":"http://127.0.0.1:34069/solr",
          "node_name":"127.0.0.1:34069_solr",
          "state":"active",
          "type":"NRT",
          "force_set_state":"false",
          "leader":"true"}}}},
  "router":{"name":"compositeId"},
  "maxShardsPerNode":"1",
  "autoAddReplicas":"false",
  "nrtReplicas":"2",
  "tlogReplicas":"0"}
Live Nodes: [127.0.0.1:34069_solr, 127.0.0.1:45367_solr]
Last available state: DocCollection(collection1//collections/collection1/state.json/6)={
  "pullReplicas":"0",
  "replicationFactor":"2",
  "shards":{"shard1":{
      "range":"80000000-7fffffff",
      "state":"active",
      "replicas":{
        "core_node3":{
          "core":"collection1_shard1_replica_n1",
          "base_url":"http://127.0.0.1:45367/solr",
          "node_name":"127.0.0.1:45367_solr",
          "state":"active",
          "type":"NRT",
          "force_set_state":"false"},
        "core_node4":{
          "core":"collection1_shard1_replica_n2",
          "base_url":"http://127.0.0.1:34069/solr",
          "node_name":"127.0.0.1:34069_solr",
          "state":"active",
          "type":"NRT",
          "force_set_state":"false",
          "leader":"true"}}}},
  "router":{"name":"compositeId"},
  "maxShardsPerNode":"1",
  "autoAddReplicas":"false",
  "nrtReplicas":"2",
  "tlogReplicas":"0"}
        at __randomizedtesting.SeedInfo.seed([33346B883441DD03:BB6054529ABDB0FB]:0)
        at org.junit.Assert.fail(Assert.java:88)
        at org.apache.solr.cloud.SolrCloudTestCase.waitForState(SolrCloudTestCase.java:289)
        at org.apache.solr.cloud.SolrCloudTestCase.waitForState(SolrCloudTestCase.java:267)
        at org.apache.solr.cloud.LeaderTragicEventTest.test(LeaderTragicEventTest.java:84)
        at java.base/jdk.internal.reflect.NativeMethodAccessorImpl.invoke0(Native Method)
        at java.base/jdk.internal.reflect.NativeMethodAccessorImpl.invoke(NativeMethodAccessorImpl.java:62)
        at java.base/jdk.internal.reflect.DelegatingMethodAccessorImpl.invoke(DelegatingMethodAccessorImpl.java:43)
        at java.base/java.lang.reflect.Method.invoke(Method.java:567)
        at com.carrotsearch.randomizedtesting.RandomizedRunner.invoke(RandomizedRunner.java:1750)
        at com.carrotsearch.randomizedtesting.RandomizedRunner$8.evaluate(RandomizedRunner.java:938)
        at com.carrotsearch.randomizedtesting.RandomizedRunner$9.evaluate(RandomizedRunner.java:974)
        at com.carrotsearch.randomizedtesting.RandomizedRunner$10.evaluate(RandomizedRunner.java:988)
        at com.carrotsearch.randomizedtesting.rules.SystemPropertiesRestoreRule$1.evaluate(SystemPropertiesRestoreRule.java:57)
        at org.apache.lucene.util.TestRuleSetupTeardownChained$1.evaluate(TestRuleSetupTeardownChained.java:49)
        at org.apache.lucene.util.AbstractBeforeAfterRule$1.evaluate(AbstractBeforeAfterRule.java:45)
        at org.apache.lucene.util.TestRuleThreadAndTestName$1.evaluate(TestRuleThreadAndTestName.java:48)
        at org.apache.lucene.util.TestRuleIgnoreAfterMaxFailures$1.evaluate(TestRuleIgnoreAfterMaxFailures.java:64)
        at org.apache.lucene.util.TestRuleMarkFailure$1.evaluate(TestRuleMarkFailure.java:47)
        at com.carrotsearch.randomizedtesting.rules.StatementAdapter.evaluate(StatementAdapter.java:36)
        at com.carrotsearch.randomizedtesting.ThreadLeakControl$StatementRunner.run(ThreadLeakControl.java:368)
        at com.carrotsearch.randomizedtesting.ThreadLeakControl.forkTimeoutingTask(ThreadLeakControl.java:817)
        at com.carrotsearch.randomizedtesting.ThreadLeakControl$3.evaluate(ThreadLeakControl.java:468)
        at com.carrotsearch.randomizedtesting.RandomizedRunner.runSingleTest(RandomizedRunner.java:947)
        at com.carrotsearch.randomizedtesting.RandomizedRunner$5.evaluate(RandomizedRunner.java:832)
        at com.carrotsearch.randomizedtesting.RandomizedRunner$6.evaluate(RandomizedRunner.java:883)
        at com.carrotsearch.randomizedtesting.RandomizedRunner$7.evaluate(RandomizedRunner.java:894)
        at com.carrotsearch.randomizedtesting.rules.StatementAdapter.evaluate(StatementAdapter.java:36)
        at com.carrotsearch.randomizedtesting.rules.SystemPropertiesRestoreRule$1.evaluate(SystemPropertiesRestoreRule.java:57)
        at org.apache.lucene.util.AbstractBeforeAfterRule$1.evaluate(AbstractBeforeAfterRule.java:45)
        at com.carrotsearch.randomizedtesting.rules.StatementAdapter.evaluate(StatementAdapter.java:36)
        at org.apache.lucene.util.TestRuleStoreClassName$1.evaluate(TestRuleStoreClassName.java:41)
        at com.carrotsearch.randomizedtesting.rules.NoShadowingOrOverridesOnMethodsRule$1.evaluate(NoShadowingOrOverridesOnMethodsRule.java:40)
        at com.carrotsearch.randomizedtesting.rules.NoShadowingOrOverridesOnMethodsRule$1.evaluate(NoShadowingOrOverridesOnMethodsRule.java:40)
        at com.carrotsearch.randomizedtesting.rules.StatementAdapter.evaluate(StatementAdapter.java:36)
        at com.carrotsearch.randomizedtesting.rules.StatementAdapter.evaluate(StatementAdapter.java:36)
        at org.apache.lucene.util.TestRuleAssertionsRequired$1.evaluate(TestRuleAssertionsRequired.java:53)
        at org.apache.lucene.util.TestRuleMarkFailure$1.evaluate(TestRuleMarkFailure.java:47)
        at org.apache.lucene.util.TestRuleIgnoreAfterMaxFailures$1.evaluate(TestRuleIgnoreAfterMaxFailures.java:64)
        at org.apache.lucene.util.TestRuleIgnoreTestSuites$1.evaluate(TestRuleIgnoreTestSuites.java:54)
        at com.carrotsearch.randomizedtesting.rules.StatementAdapter.evaluate(StatementAdapter.java:36)
        at com.carrotsearch.randomizedtesting.ThreadLeakControl$StatementRunner.run(ThreadLeakControl.java:368)
        at java.base/java.lang.Thread.run(Thread.java:835)


FAILED:  org.apache.solr.cloud.LeaderTragicEventTest.test

Error Message:
Timeout waiting for new replica become leader Timeout waiting to see state for collection=collection1 :DocCollection(collection1//collections/collection1/state.json/5)={   "pullReplicas":"0",   "replicationFactor":"2",   "shards":{"shard1":{       "range":"80000000-7fffffff",       "state":"active",       "replicas":{         "core_node3":{           "core":"collection1_shard1_replica_n1",           "base_url":"http://127.0.0.1:42823/solr",           "node_name":"127.0.0.1:42823_solr",           "state":"active",           "type":"NRT",           "force_set_state":"false"},         "core_node4":{           "core":"collection1_shard1_replica_n2",           "base_url":"http://127.0.0.1:39935/solr",           "node_name":"127.0.0.1:39935_solr",           "state":"active",           "type":"NRT",           "force_set_state":"false",           "leader":"true"}}}},   "router":{"name":"compositeId"},   "maxShardsPerNode":"1",   "autoAddReplicas":"false",   "nrtReplicas":"2",   "tlogReplicas":"0"} Live Nodes: [127.0.0.1:39935_solr, 127.0.0.1:42823_solr] Last available state: DocCollection(collection1//collections/collection1/state.json/5)={   "pullReplicas":"0",   "replicationFactor":"2",   "shards":{"shard1":{       "range":"80000000-7fffffff",       "state":"active",       "replicas":{         "core_node3":{           "core":"collection1_shard1_replica_n1",           "base_url":"http://127.0.0.1:42823/solr",           "node_name":"127.0.0.1:42823_solr",           "state":"active",           "type":"NRT",           "force_set_state":"false"},         "core_node4":{           "core":"collection1_shard1_replica_n2",           "base_url":"http://127.0.0.1:39935/solr",           "node_name":"127.0.0.1:39935_solr",           "state":"active",           "type":"NRT",           "force_set_state":"false",           "leader":"true"}}}},   "router":{"name":"compositeId"},   "maxShardsPerNode":"1",   "autoAddReplicas":"false",   "nrtReplicas":"2",   "tlogReplicas":"0"}

Stack Trace:
java.lang.AssertionError: Timeout waiting for new replica become leader
Timeout waiting to see state for collection=collection1 :DocCollection(collection1//collections/collection1/state.json/5)={
  "pullReplicas":"0",
  "replicationFactor":"2",
  "shards":{"shard1":{
      "range":"80000000-7fffffff",
      "state":"active",
      "replicas":{
        "core_node3":{
          "core":"collection1_shard1_replica_n1",
          "base_url":"http://127.0.0.1:42823/solr",
          "node_name":"127.0.0.1:42823_solr",
          "state":"active",
          "type":"NRT",
          "force_set_state":"false"},
        "core_node4":{
          "core":"collection1_shard1_replica_n2",
          "base_url":"http://127.0.0.1:39935/solr",
          "node_name":"127.0.0.1:39935_solr",
          "state":"active",
          "type":"NRT",
          "force_set_state":"false",
          "leader":"true"}}}},
  "router":{"name":"compositeId"},
  "maxShardsPerNode":"1",
  "autoAddReplicas":"false",
  "nrtReplicas":"2",
  "tlogReplicas":"0"}
Live Nodes: [127.0.0.1:39935_solr, 127.0.0.1:42823_solr]
Last available state: DocCollection(collection1//collections/collection1/state.json/5)={
  "pullReplicas":"0",
  "replicationFactor":"2",
  "shards":{"shard1":{
      "range":"80000000-7fffffff",
      "state":"active",
      "replicas":{
        "core_node3":{
          "core":"collection1_shard1_replica_n1",
          "base_url":"http://127.0.0.1:42823/solr",
          "node_name":"127.0.0.1:42823_solr",
          "state":"active",
          "type":"NRT",
          "force_set_state":"false"},
        "core_node4":{
          "core":"collection1_shard1_replica_n2",
          "base_url":"http://127.0.0.1:39935/solr",
          "node_name":"127.0.0.1:39935_solr",
          "state":"active",
          "type":"NRT",
          "force_set_state":"false",
          "leader":"true"}}}},
  "router":{"name":"compositeId"},
  "maxShardsPerNode":"1",
  "autoAddReplicas":"false",
  "nrtReplicas":"2",
  "tlogReplicas":"0"}
        at __randomizedtesting.SeedInfo.seed([33346B883441DD03:BB6054529ABDB0FB]:0)
        at org.junit.Assert.fail(Assert.java:88)
        at org.apache.solr.cloud.SolrCloudTestCase.waitForState(SolrCloudTestCase.java:289)
        at org.apache.solr.cloud.SolrCloudTestCase.waitForState(SolrCloudTestCase.java:267)
        at org.apache.solr.cloud.LeaderTragicEventTest.test(LeaderTragicEventTest.java:84)
        at java.base/jdk.internal.reflect.NativeMethodAccessorImpl.invoke0(Native Method)
        at java.base/jdk.internal.reflect.NativeMethodAccessorImpl.invoke(NativeMethodAccessorImpl.java:62)
        at java.base/jdk.internal.reflect.DelegatingMethodAccessorImpl.invoke(DelegatingMethodAccessorImpl.java:43)
        at java.base/java.lang.reflect.Method.invoke(Method.java:567)
        at com.carrotsearch.randomizedtesting.RandomizedRunner.invoke(RandomizedRunner.java:1750)
        at com.carrotsearch.randomizedtesting.RandomizedRunner$8.evaluate(RandomizedRunner.java:938)
        at com.carrotsearch.randomizedtesting.RandomizedRunner$9.evaluate(RandomizedRunner.java:974)
        at com.carrotsearch.randomizedtesting.RandomizedRunner$10.evaluate(RandomizedRunner.java:988)
        at com.carrotsearch.randomizedtesting.rules.SystemPropertiesRestoreRule$1.evaluate(SystemPropertiesRestoreRule.java:57)
        at org.apache.lucene.util.TestRuleSetupTeardownChained$1.evaluate(TestRuleSetupTeardownChained.java:49)
        at org.apache.lucene.util.AbstractBeforeAfterRule$1.evaluate(AbstractBeforeAfterRule.java:45)
        at org.apache.lucene.util.TestRuleThreadAndTestName$1.evaluate(TestRuleThreadAndTestName.java:48)
        at org.apache.lucene.util.TestRuleIgnoreAfterMaxFailures$1.evaluate(TestRuleIgnoreAfterMaxFailures.java:64)
        at org.apache.lucene.util.TestRuleMarkFailure$1.evaluate(TestRuleMarkFailure.java:47)
        at com.carrotsearch.randomizedtesting.rules.StatementAdapter.evaluate(StatementAdapter.java:36)
        at com.carrotsearch.randomizedtesting.ThreadLeakControl$StatementRunner.run(ThreadLeakControl.java:368)
        at com.carrotsearch.randomizedtesting.ThreadLeakControl.forkTimeoutingTask(ThreadLeakControl.java:817)
        at com.carrotsearch.randomizedtesting.ThreadLeakControl$3.evaluate(ThreadLeakControl.java:468)
        at com.carrotsearch.randomizedtesting.RandomizedRunner.runSingleTest(RandomizedRunner.java:947)
        at com.carrotsearch.randomizedtesting.RandomizedRunner$5.evaluate(RandomizedRunner.java:832)
        at com.carrotsearch.randomizedtesting.RandomizedRunner$6.evaluate(RandomizedRunner.java:883)
        at com.carrotsearch.randomizedtesting.RandomizedRunner$7.evaluate(RandomizedRunner.java:894)
        at com.carrotsearch.randomizedtesting.rules.StatementAdapter.evaluate(StatementAdapter.java:36)
        at com.carrotsearch.randomizedtesting.rules.SystemPropertiesRestoreRule$1.evaluate(SystemPropertiesRestoreRule.java:57)
        at org.apache.lucene.util.AbstractBeforeAfterRule$1.evaluate(AbstractBeforeAfterRule.java:45)
        at com.carrotsearch.randomizedtesting.rules.StatementAdapter.evaluate(StatementAdapter.java:36)
        at org.apache.lucene.util.TestRuleStoreClassName$1.evaluate(TestRuleStoreClassName.java:41)
        at com.carrotsearch.randomizedtesting.rules.NoShadowingOrOverridesOnMethodsRule$1.evaluate(NoShadowingOrOverridesOnMethodsRule.java:40)
        at com.carrotsearch.randomizedtesting.rules.NoShadowingOrOverridesOnMethodsRule$1.evaluate(NoShadowingOrOverridesOnMethodsRule.java:40)
        at com.carrotsearch.randomizedtesting.rules.StatementAdapter.evaluate(StatementAdapter.java:36)
        at com.carrotsearch.randomizedtesting.rules.StatementAdapter.evaluate(StatementAdapter.java:36)
        at org.apache.lucene.util.TestRuleAssertionsRequired$1.evaluate(TestRuleAssertionsRequired.java:53)
        at org.apache.lucene.util.TestRuleMarkFailure$1.evaluate(TestRuleMarkFailure.java:47)
        at org.apache.lucene.util.TestRuleIgnoreAfterMaxFailures$1.evaluate(TestRuleIgnoreAfterMaxFailures.java:64)
        at org.apache.lucene.util.TestRuleIgnoreTestSuites$1.evaluate(TestRuleIgnoreTestSuites.java:54)
        at com.carrotsearch.randomizedtesting.rules.StatementAdapter.evaluate(StatementAdapter.java:36)
        at com.carrotsearch.randomizedtesting.ThreadLeakControl$StatementRunner.run(ThreadLeakControl.java:368)
        at java.base/java.lang.Thread.run(Thread.java:835)


FAILED:  org.apache.solr.cloud.LeaderTragicEventTest.test

Error Message:
Timeout waiting for new replica become leader Timeout waiting to see state for collection=collection1 :DocCollection(collection1//collections/collection1/state.json/6)={   "pullReplicas":"0",   "replicationFactor":"2",   "shards":{"shard1":{       "range":"80000000-7fffffff",       "state":"active",       "replicas":{         "core_node3":{           "core":"collection1_shard1_replica_n1",           "base_url":"http://127.0.0.1:45619/solr",           "node_name":"127.0.0.1:45619_solr",           "state":"active",           "type":"NRT",           "force_set_state":"false"},         "core_node4":{           "core":"collection1_shard1_replica_n2",           "base_url":"http://127.0.0.1:35081/solr",           "node_name":"127.0.0.1:35081_solr",           "state":"active",           "type":"NRT",           "force_set_state":"false",           "leader":"true"}}}},   "router":{"name":"compositeId"},   "maxShardsPerNode":"1",   "autoAddReplicas":"false",   "nrtReplicas":"2",   "tlogReplicas":"0"} Live Nodes: [127.0.0.1:35081_solr, 127.0.0.1:45619_solr] Last available state: DocCollection(collection1//collections/collection1/state.json/6)={   "pullReplicas":"0",   "replicationFactor":"2",   "shards":{"shard1":{       "range":"80000000-7fffffff",       "state":"active",       "replicas":{         "core_node3":{           "core":"collection1_shard1_replica_n1",           "base_url":"http://127.0.0.1:45619/solr",           "node_name":"127.0.0.1:45619_solr",           "state":"active",           "type":"NRT",           "force_set_state":"false"},         "core_node4":{           "core":"collection1_shard1_replica_n2",           "base_url":"http://127.0.0.1:35081/solr",           "node_name":"127.0.0.1:35081_solr",           "state":"active",           "type":"NRT",           "force_set_state":"false",           "leader":"true"}}}},   "router":{"name":"compositeId"},   "maxShardsPerNode":"1",   "autoAddReplicas":"false",   "nrtReplicas":"2",   "tlogReplicas":"0"}

Stack Trace:
java.lang.AssertionError: Timeout waiting for new replica become leader
Timeout waiting to see state for collection=collection1 :DocCollection(collection1//collections/collection1/state.json/6)={
  "pullReplicas":"0",
  "replicationFactor":"2",
  "shards":{"shard1":{
      "range":"80000000-7fffffff",
      "state":"active",
      "replicas":{
        "core_node3":{
          "core":"collection1_shard1_replica_n1",
          "base_url":"http://127.0.0.1:45619/solr",
          "node_name":"127.0.0.1:45619_solr",
          "state":"active",
          "type":"NRT",
          "force_set_state":"false"},
        "core_node4":{
          "core":"collection1_shard1_replica_n2",
          "base_url":"http://127.0.0.1:35081/solr",
          "node_name":"127.0.0.1:35081_solr",
          "state":"active",
          "type":"NRT",
          "force_set_state":"false",
          "leader":"true"}}}},
  "router":{"name":"compositeId"},
  "maxShardsPerNode":"1",
  "autoAddReplicas":"false",
  "nrtReplicas":"2",
  "tlogReplicas":"0"}
Live Nodes: [127.0.0.1:35081_solr, 127.0.0.1:45619_solr]
Last available state: DocCollection(collection1//collections/collection1/state.json/6)={
  "pullReplicas":"0",
  "replicationFactor":"2",
  "shards":{"shard1":{
      "range":"80000000-7fffffff",
      "state":"active",
      "replicas":{
        "core_node3":{
          "core":"collection1_shard1_replica_n1",
          "base_url":"http://127.0.0.1:45619/solr",
          "node_name":"127.0.0.1:45619_solr",
          "state":"active",
          "type":"NRT",
          "force_set_state":"false"},
        "core_node4":{
          "core":"collection1_shard1_replica_n2",
          "base_url":"http://127.0.0.1:35081/solr",
          "node_name":"127.0.0.1:35081_solr",
          "state":"active",
          "type":"NRT",
          "force_set_state":"false",
          "leader":"true"}}}},
  "router":{"name":"compositeId"},
  "maxShardsPerNode":"1",
  "autoAddReplicas":"false",
  "nrtReplicas":"2",
  "tlogReplicas":"0"}
        at __randomizedtesting.SeedInfo.seed([33346B883441DD03:BB6054529ABDB0FB]:0)
        at org.junit.Assert.fail(Assert.java:88)
        at org.apache.solr.cloud.SolrCloudTestCase.waitForState(SolrCloudTestCase.java:289)
        at org.apache.solr.cloud.SolrCloudTestCase.waitForState(SolrCloudTestCase.java:267)
        at org.apache.solr.cloud.LeaderTragicEventTest.test(LeaderTragicEventTest.java:84)
        at java.base/jdk.internal.reflect.NativeMethodAccessorImpl.invoke0(Native Method)
        at java.base/jdk.internal.reflect.NativeMethodAccessorImpl.invoke(NativeMethodAccessorImpl.java:62)
        at java.base/jdk.internal.reflect.DelegatingMethodAccessorImpl.invoke(DelegatingMethodAccessorImpl.java:43)
        at java.base/java.lang.reflect.Method.invoke(Method.java:567)
        at com.carrotsearch.randomizedtesting.RandomizedRunner.invoke(RandomizedRunner.java:1750)
        at com.carrotsearch.randomizedtesting.RandomizedRunner$8.evaluate(RandomizedRunner.java:938)
        at com.carrotsearch.randomizedtesting.RandomizedRunner$9.evaluate(RandomizedRunner.java:974)
        at com.carrotsearch.randomizedtesting.RandomizedRunner$10.evaluate(RandomizedRunner.java:988)
        at com.carrotsearch.randomizedtesting.rules.SystemPropertiesRestoreRule$1.evaluate(SystemPropertiesRestoreRule.java:57)
        at org.apache.lucene.util.TestRuleSetupTeardownChained$1.evaluate(TestRuleSetupTeardownChained.java:49)
        at org.apache.lucene.util.AbstractBeforeAfterRule$1.evaluate(AbstractBeforeAfterRule.java:45)
        at org.apache.lucene.util.TestRuleThreadAndTestName$1.evaluate(TestRuleThreadAndTestName.java:48)
        at org.apache.lucene.util.TestRuleIgnoreAfterMaxFailures$1.evaluate(TestRuleIgnoreAfterMaxFailures.java:64)
        at org.apache.lucene.util.TestRuleMarkFailure$1.evaluate(TestRuleMarkFailure.java:47)
        at com.carrotsearch.randomizedtesting.rules.StatementAdapter.evaluate(StatementAdapter.java:36)
        at com.carrotsearch.randomizedtesting.ThreadLeakControl$StatementRunner.run(ThreadLeakControl.java:368)
        at com.carrotsearch.randomizedtesting.ThreadLeakControl.forkTimeoutingTask(ThreadLeakControl.java:817)
        at com.carrotsearch.randomizedtesting.ThreadLeakControl$3.evaluate(ThreadLeakControl.java:468)
        at com.carrotsearch.randomizedtesting.RandomizedRunner.runSingleTest(RandomizedRunner.java:947)
        at com.carrotsearch.randomizedtesting.RandomizedRunner$5.evaluate(RandomizedRunner.java:832)
        at com.carrotsearch.randomizedtesting.RandomizedRunner$6.evaluate(RandomizedRunner.java:883)
        at com.carrotsearch.randomizedtesting.RandomizedRunner$7.evaluate(RandomizedRunner.java:894)
        at com.carrotsearch.randomizedtesting.rules.StatementAdapter.evaluate(StatementAdapter.java:36)
        at com.carrotsearch.randomizedtesting.rules.SystemPropertiesRestoreRule$1.evaluate(SystemPropertiesRestoreRule.java:57)
        at org.apache.lucene.util.AbstractBeforeAfterRule$1.evaluate(AbstractBeforeAfterRule.java:45)
        at com.carrotsearch.randomizedtesting.rules.StatementAdapter.evaluate(StatementAdapter.java:36)
        at org.apache.lucene.util.TestRuleStoreClassName$1.evaluate(TestRuleStoreClassName.java:41)
        at com.carrotsearch.randomizedtesting.rules.NoShadowingOrOverridesOnMethodsRule$1.evaluate(NoShadowingOrOverridesOnMethodsRule.java:40)
        at com.carrotsearch.randomizedtesting.rules.NoShadowingOrOverridesOnMethodsRule$1.evaluate(NoShadowingOrOverridesOnMethodsRule.java:40)
        at com.carrotsearch.randomizedtesting.rules.StatementAdapter.evaluate(StatementAdapter.java:36)
        at com.carrotsearch.randomizedtesting.rules.StatementAdapter.evaluate(StatementAdapter.java:36)
        at org.apache.lucene.util.TestRuleAssertionsRequired$1.evaluate(TestRuleAssertionsRequired.java:53)
        at org.apache.lucene.util.TestRuleMarkFailure$1.evaluate(TestRuleMarkFailure.java:47)
        at org.apache.lucene.util.TestRuleIgnoreAfterMaxFailures$1.evaluate(TestRuleIgnoreAfterMaxFailures.java:64)
        at org.apache.lucene.util.TestRuleIgnoreTestSuites$1.evaluate(TestRuleIgnoreTestSuites.java:54)
        at com.carrotsearch.randomizedtesting.rules.StatementAdapter.evaluate(StatementAdapter.java:36)
        at com.carrotsearch.randomizedtesting.ThreadLeakControl$StatementRunner.run(ThreadLeakControl.java:368)
        at java.base/java.lang.Thread.run(Thread.java:835)


FAILED:  org.apache.solr.cloud.LeaderTragicEventTest.test

Error Message:
Timeout waiting for new replica become leader Timeout waiting to see state for collection=collection1 :DocCollection(collection1//collections/collection1/state.json/6)={   "pullReplicas":"0",   "replicationFactor":"2",   "shards":{"shard1":{       "range":"80000000-7fffffff",       "state":"active",       "replicas":{         "core_node3":{           "core":"collection1_shard1_replica_n1",           "base_url":"http://127.0.0.1:41855/solr",           "node_name":"127.0.0.1:41855_solr",           "state":"active",           "type":"NRT",           "force_set_state":"false",           "leader":"true"},         "core_node4":{           "core":"collection1_shard1_replica_n2",           "base_url":"http://127.0.0.1:35363/solr",           "node_name":"127.0.0.1:35363_solr",           "state":"active",           "type":"NRT",           "force_set_state":"false"}}}},   "router":{"name":"compositeId"},   "maxShardsPerNode":"1",   "autoAddReplicas":"false",   "nrtReplicas":"2",   "tlogReplicas":"0"} Live Nodes: [127.0.0.1:35363_solr, 127.0.0.1:41855_solr] Last available state: DocCollection(collection1//collections/collection1/state.json/6)={   "pullReplicas":"0",   "replicationFactor":"2",   "shards":{"shard1":{       "range":"80000000-7fffffff",       "state":"active",       "replicas":{         "core_node3":{           "core":"collection1_shard1_replica_n1",           "base_url":"http://127.0.0.1:41855/solr",           "node_name":"127.0.0.1:41855_solr",           "state":"active",           "type":"NRT",           "force_set_state":"false",           "leader":"true"},         "core_node4":{           "core":"collection1_shard1_replica_n2",           "base_url":"http://127.0.0.1:35363/solr",           "node_name":"127.0.0.1:35363_solr",           "state":"active",           "type":"NRT",           "force_set_state":"false"}}}},   "router":{"name":"compositeId"},   "maxShardsPerNode":"1",   "autoAddReplicas":"false",   "nrtReplicas":"2",   "tlogReplicas":"0"}

Stack Trace:
java.lang.AssertionError: Timeout waiting for new replica become leader
Timeout waiting to see state for collection=collection1 :DocCollection(collection1//collections/collection1/state.json/6)={
  "pullReplicas":"0",
  "replicationFactor":"2",
  "shards":{"shard1":{
      "range":"80000000-7fffffff",
      "state":"active",
      "replicas":{
        "core_node3":{
          "core":"collection1_shard1_replica_n1",
          "base_url":"http://127.0.0.1:41855/solr",
          "node_name":"127.0.0.1:41855_solr",
          "state":"active",
          "type":"NRT",
          "force_set_state":"false",
          "leader":"true"},
        "core_node4":{
          "core":"collection1_shard1_replica_n2",
          "base_url":"http://127.0.0.1:35363/solr",
          "node_name":"127.0.0.1:35363_solr",
          "state":"active",
          "type":"NRT",
          "force_set_state":"false"}}}},
  "router":{"name":"compositeId"},
  "maxShardsPerNode":"1",
  "autoAddReplicas":"false",
  "nrtReplicas":"2",
  "tlogReplicas":"0"}
Live Nodes: [127.0.0.1:35363_solr, 127.0.0.1:41855_solr]
Last available state: DocCollection(collection1//collections/collection1/state.json/6)={
  "pullReplicas":"0",
  "replicationFactor":"2",
  "shards":{"shard1":{
      "range":"80000000-7fffffff",
      "state":"active",
      "replicas":{
        "core_node3":{
          "core":"collection1_shard1_replica_n1",
          "base_url":"http://127.0.0.1:41855/solr",
          "node_name":"127.0.0.1:41855_solr",
          "state":"active",
          "type":"NRT",
          "force_set_state":"false",
          "leader":"true"},
        "core_node4":{
          "core":"collection1_shard1_replica_n2",
          "base_url":"http://127.0.0.1:35363/solr",
          "node_name":"127.0.0.1:35363_solr",
          "state":"active",
          "type":"NRT",
          "force_set_state":"false"}}}},
  "router":{"name":"compositeId"},
  "maxShardsPerNode":"1",
  "autoAddReplicas":"false",
  "nrtReplicas":"2",
  "tlogReplicas":"0"}
        at __randomizedtesting.SeedInfo.seed([33346B883441DD03:BB6054529ABDB0FB]:0)
        at org.junit.Assert.fail(Assert.java:88)
        at org.apache.solr.cloud.SolrCloudTestCase.waitForState(SolrCloudTestCase.java:289)
        at org.apache.solr.cloud.SolrCloudTestCase.waitForState(SolrCloudTestCase.java:267)
        at org.apache.solr.cloud.LeaderTragicEventTest.test(LeaderTragicEventTest.java:84)
        at java.base/jdk.internal.reflect.NativeMethodAccessorImpl.invoke0(Native Method)
        at java.base/jdk.internal.reflect.NativeMethodAccessorImpl.invoke(NativeMethodAccessorImpl.java:62)
        at java.base/jdk.internal.reflect.DelegatingMethodAccessorImpl.invoke(DelegatingMethodAccessorImpl.java:43)
        at java.base/java.lang.reflect.Method.invoke(Method.java:567)
        at com.carrotsearch.randomizedtesting.RandomizedRunner.invoke(RandomizedRunner.java:1750)
        at com.carrotsearch.randomizedtesting.RandomizedRunner$8.evaluate(RandomizedRunner.java:938)
        at com.carrotsearch.randomizedtesting.RandomizedRunner$9.evaluate(RandomizedRunner.java:974)
        at com.carrotsearch.randomizedtesting.RandomizedRunner$10.evaluate(RandomizedRunner.java:988)
        at com.carrotsearch.randomizedtesting.rules.SystemPropertiesRestoreRule$1.evaluate(SystemPropertiesRestoreRule.java:57)
        at org.apache.lucene.util.TestRuleSetupTeardownChained$1.evaluate(TestRuleSetupTeardownChained.java:49)
        at org.apache.lucene.util.AbstractBeforeAfterRule$1.evaluate(AbstractBeforeAfterRule.java:45)
        at org.apache.lucene.util.TestRuleThreadAndTestName$1.evaluate(TestRuleThreadAndTestName.java:48)
        at org.apache.lucene.util.TestRuleIgnoreAfterMaxFailures$1.evaluate(TestRuleIgnoreAfterMaxFailures.java:64)
        at org.apache.lucene.util.TestRuleMarkFailure$1.evaluate(TestRuleMarkFailure.java:47)
        at com.carrotsearch.randomizedtesting.rules.StatementAdapter.evaluate(StatementAdapter.java:36)
        at com.carrotsearch.randomizedtesting.ThreadLeakControl$StatementRunner.run(ThreadLeakControl.java:368)
        at com.carrotsearch.randomizedtesting.ThreadLeakControl.forkTimeoutingTask(ThreadLeakControl.java:817)
        at com.carrotsearch.randomizedtesting.ThreadLeakControl$3.evaluate(ThreadLeakControl.java:468)
        at com.carrotsearch.randomizedtesting.RandomizedRunner.runSingleTest(RandomizedRunner.java:947)
        at com.carrotsearch.randomizedtesting.RandomizedRunner$5.evaluate(RandomizedRunner.java:832)
        at com.carrotsearch.randomizedtesting.RandomizedRunner$6.evaluate(RandomizedRunner.java:883)
        at com.carrotsearch.randomizedtesting.RandomizedRunner$7.evaluate(RandomizedRunner.java:894)
        at com.carrotsearch.randomizedtesting.rules.StatementAdapter.evaluate(StatementAdapter.java:36)
        at com.carrotsearch.randomizedtesting.rules.SystemPropertiesRestoreRule$1.evaluate(SystemPropertiesRestoreRule.java:57)
        at org.apache.lucene.util.AbstractBeforeAfterRule$1.evaluate(AbstractBeforeAfterRule.java:45)
        at com.carrotsearch.randomizedtesting.rules.StatementAdapter.evaluate(StatementAdapter.java:36)
        at org.apache.lucene.util.TestRuleStoreClassName$1.evaluate(TestRuleStoreClassName.java:41)
        at com.carrotsearch.randomizedtesting.rules.NoShadowingOrOverridesOnMethodsRule$1.evaluate(NoShadowingOrOverridesOnMethodsRule.java:40)
        at com.carrotsearch.randomizedtesting.rules.NoShadowingOrOverridesOnMethodsRule$1.evaluate(NoShadowingOrOverridesOnMethodsRule.java:40)
        at com.carrotsearch.randomizedtesting.rules.StatementAdapter.evaluate(StatementAdapter.java:36)
        at com.carrotsearch.randomizedtesting.rules.StatementAdapter.evaluate(StatementAdapter.java:36)
        at org.apache.lucene.util.TestRuleAssertionsRequired$1.evaluate(TestRuleAssertionsRequired.java:53)
        at org.apache.lucene.util.TestRuleMarkFailure$1.evaluate(TestRuleMarkFailure.java:47)
        at org.apache.lucene.util.TestRuleIgnoreAfterMaxFailures$1.evaluate(TestRuleIgnoreAfterMaxFailures.java:64)
        at org.apache.lucene.util.TestRuleIgnoreTestSuites$1.evaluate(TestRuleIgnoreTestSuites.java:54)
        at com.carrotsearch.randomizedtesting.rules.StatementAdapter.evaluate(StatementAdapter.java:36)
        at com.carrotsearch.randomizedtesting.ThreadLeakControl$StatementRunner.run(ThreadLeakControl.java:368)
        at java.base/java.lang.Thread.run(Thread.java:835)




Build Log:
[...truncated 14259 lines...]
   [junit4] Suite: org.apache.solr.cloud.LeaderTragicEventTest
   [junit4]   2> 1103707 INFO  (SUITE-LeaderTragicEventTest-seed#[33346B883441DD03]-worker) [    ] o.a.s.SolrTestCaseJ4 SecureRandom sanity checks: test.solr.allowed.securerandom=null & java.security.egd=file:/dev/./urandom
   [junit4]   2> Creating dataDir: /home/jenkins/workspace/Lucene-Solr-8.x-Linux/solr/build/solr-core/test/J2/temp/solr.cloud.LeaderTragicEventTest_33346B883441DD03-001/init-core-data-001
   [junit4]   2> 1103707 WARN  (SUITE-LeaderTragicEventTest-seed#[33346B883441DD03]-worker) [    ] o.a.s.SolrTestCaseJ4 startTrackingSearchers: numOpens=23 numCloses=23
   [junit4]   2> 1103707 INFO  (SUITE-LeaderTragicEventTest-seed#[33346B883441DD03]-worker) [    ] o.a.s.SolrTestCaseJ4 Using PointFields (NUMERIC_POINTS_SYSPROP=true) w/NUMERIC_DOCVALUES_SYSPROP=true
   [junit4]   2> 1103708 INFO  (SUITE-LeaderTragicEventTest-seed#[33346B883441DD03]-worker) [    ] o.a.s.SolrTestCaseJ4 Randomized ssl (false) and clientAuth (false) via: @org.apache.solr.util.RandomizeSSL(reason="", ssl=0.0/0.0, value=0.0/0.0, clientAuth=0.0/0.0)
   [junit4]   2> 1103708 INFO  (SUITE-LeaderTragicEventTest-seed#[33346B883441DD03]-worker) [    ] o.a.s.c.MiniSolrCloudCluster Starting cluster of 2 servers in /home/jenkins/workspace/Lucene-Solr-8.x-Linux/solr/build/solr-core/test/J2/temp/solr.cloud.LeaderTragicEventTest_33346B883441DD03-001/tempDir-001
   [junit4]   2> 1103708 INFO  (SUITE-LeaderTragicEventTest-seed#[33346B883441DD03]-worker) [    ] o.a.s.c.ZkTestServer STARTING ZK TEST SERVER
   [junit4]   2> 1103709 INFO  (ZkTestServer Run Thread) [    ] o.a.s.c.ZkTestServer client port:0.0.0.0/0.0.0.0:0
   [junit4]   2> 1103709 INFO  (ZkTestServer Run Thread) [    ] o.a.s.c.ZkTestServer Starting server
   [junit4]   2> 1103809 INFO  (SUITE-LeaderTragicEventTest-seed#[33346B883441DD03]-worker) [    ] o.a.s.c.ZkTestServer start zk server on port:43913
   [junit4]   2> 1103809 INFO  (SUITE-LeaderTragicEventTest-seed#[33346B883441DD03]-worker) [    ] o.a.s.c.ZkTestServer parse host and port list: 127.0.0.1:43913
   [junit4]   2> 1103809 INFO  (SUITE-LeaderTragicEventTest-seed#[33346B883441DD03]-worker) [    ] o.a.s.c.ZkTestServer connecting to 127.0.0.1 43913
   [junit4]   2> 1103811 INFO  (zkConnectionManagerCallback-6218-thread-1) [    ] o.a.s.c.c.ConnectionManager zkClient has connected
   [junit4]   2> 1103812 INFO  (zkConnectionManagerCallback-6220-thread-1) [    ] o.a.s.c.c.ConnectionManager zkClient has connected
   [junit4]   2> 1103813 INFO  (zkConnectionManagerCallback-6222-thread-1) [    ] o.a.s.c.c.ConnectionManager zkClient has connected
   [junit4]   2> 1103814 WARN  (jetty-launcher-6223-thread-1) [    ] o.e.j.s.AbstractConnector Ignoring deprecated socket close linger time
   [junit4]   2> 1103815 INFO  (jetty-launcher-6223-thread-1) [    ] o.a.s.c.s.e.JettySolrRunner Start Jetty (original configured port=0)
   [junit4]   2> 1103815 INFO  (jetty-launcher-6223-thread-1) [    ] o.a.s.c.s.e.JettySolrRunner Trying to start Jetty on port 0 try number 1 ...
   [junit4]   2> 1103815 INFO  (jetty-launcher-6223-thread-1) [    ] o.e.j.s.Server jetty-9.4.14.v20181114; built: 2018-11-14T21:20:31.478Z; git: c4550056e785fb5665914545889f21dc136ad9e6; jvm 12-ea+23
   [junit4]   2> 1103815 WARN  (jetty-launcher-6223-thread-2) [    ] o.e.j.s.AbstractConnector Ignoring deprecated socket close linger time
   [junit4]   2> 1103815 INFO  (jetty-launcher-6223-thread-1) [    ] o.e.j.s.session DefaultSessionIdManager workerName=node0
   [junit4]   2> 1103815 INFO  (jetty-launcher-6223-thread-1) [    ] o.e.j.s.session No SessionScavenger set, using defaults
   [junit4]   2> 1103815 INFO  (jetty-launcher-6223-thread-1) [    ] o.e.j.s.session node0 Scavenging every 600000ms
   [junit4]   2> 1103815 INFO  (jetty-launcher-6223-thread-2) [    ] o.a.s.c.s.e.JettySolrRunner Start Jetty (original configured port=0)
   [junit4]   2> 1103815 INFO  (jetty-launcher-6223-thread-2) [    ] o.a.s.c.s.e.JettySolrRunner Trying to start Jetty on port 0 try number 1 ...
   [junit4]   2> 1103815 INFO  (jetty-launcher-6223-thread-2) [    ] o.e.j.s.Server jetty-9.4.14.v20181114; built: 2018-11-14T21:20:31.478Z; git: c4550056e785fb5665914545889f21dc136ad9e6; jvm 12-ea+23
   [junit4]   2> 1103815 INFO  (jetty-launcher-6223-thread-1) [    ] o.e.j.s.h.ContextHandler Started o.e.j.s.ServletContextHandler@1442977a{/solr,null,AVAILABLE}
   [junit4]   2> 1103816 INFO  (jetty-launcher-6223-thread-2) [    ] o.e.j.s.session DefaultSessionIdManager workerName=node0
   [junit4]   2> 1103816 INFO  (jetty-launcher-6223-thread-2) [    ] o.e.j.s.session No SessionScavenger set, using defaults
   [junit4]   2> 1103816 INFO  (jetty-launcher-6223-thread-2) [    ] o.e.j.s.session node0 Scavenging every 660000ms
   [junit4]   2> 1103816 INFO  (jetty-launcher-6223-thread-2) [    ] o.e.j.s.h.ContextHandler Started o.e.j.s.ServletContextHandler@6526f988{/solr,null,AVAILABLE}
   [junit4]   2> 1103817 INFO  (jetty-launcher-6223-thread-1) [    ] o.e.j.s.AbstractConnector Started ServerConnector@2cfc4549{HTTP/1.1,[http/1.1, h2c]}{127.0.0.1:41855}
   [junit4]   2> 1103817 INFO  (jetty-launcher-6223-thread-2) [    ] o.e.j.s.AbstractConnector Started ServerConnector@4a6197d8{HTTP/1.1,[http/1.1, h2c]}{127.0.0.1:35363}
   [junit4]   2> 1103817 INFO  (jetty-launcher-6223-thread-1) [    ] o.e.j.s.Server Started @1103844ms
   [junit4]   2> 1103817 INFO  (jetty-launcher-6223-thread-2) [    ] o.e.j.s.Server Started @1103844ms
   [junit4]   2> 1103817 INFO  (jetty-launcher-6223-thread-1) [    ] o.a.s.c.s.e.JettySolrRunner Jetty properties: {hostContext=/solr, hostPort=41855}
   [junit4]   2> 1103817 INFO  (jetty-launcher-6223-thread-2) [    ] o.a.s.c.s.e.JettySolrRunner Jetty properties: {hostContext=/solr, hostPort=35363}
   [junit4]   2> 1103817 ERROR (jetty-launcher-6223-thread-2) [    ] o.a.s.u.StartupLoggingUtils Missing Java Option solr.log.dir. Logging may be missing or incomplete.
   [junit4]   2> 1103817 ERROR (jetty-launcher-6223-thread-1) [    ] o.a.s.u.StartupLoggingUtils Missing Java Option solr.log.dir. Logging may be missing or incomplete.
   [junit4]   2> 1103817 INFO  (jetty-launcher-6223-thread-2) [    ] o.a.s.s.SolrDispatchFilter Using logger factory org.apache.logging.slf4j.Log4jLoggerFactory
   [junit4]   2> 1103817 INFO  (jetty-launcher-6223-thread-1) [    ] o.a.s.s.SolrDispatchFilter Using logger factory org.apache.logging.slf4j.Log4jLoggerFactory
   [junit4]   2> 1103817 INFO  (jetty-launcher-6223-thread-1) [    ] o.a.s.s.SolrDispatchFilter  ___      _       Welcome to Apache Solr™ version 8.0.0
   [junit4]   2> 1103817 INFO  (jetty-launcher-6223-thread-2) [    ] o.a.s.s.SolrDispatchFilter  ___      _       Welcome to Apache Solr™ version 8.0.0
   [junit4]   2> 1103817 INFO  (jetty-launcher-6223-thread-1) [    ] o.a.s.s.SolrDispatchFilter / __| ___| |_ _   Starting in cloud mode on port null
   [junit4]   2> 1103817 INFO  (jetty-launcher-6223-thread-2) [    ] o.a.s.s.SolrDispatchFilter / __| ___| |_ _   Starting in cloud mode on port null
   [junit4]   2> 1103817 INFO  (jetty-launcher-6223-thread-1) [    ] o.a.s.s.SolrDispatchFilter \__ \/ _ \ | '_|  Install dir: null
   [junit4]   2> 1103817 INFO  (jetty-launcher-6223-thread-2) [    ] o.a.s.s.SolrDispatchFilter \__ \/ _ \ | '_|  Install dir: null
   [junit4]   2> 1103817 INFO  (jetty-launcher-6223-thread-1) [    ] o.a.s.s.SolrDispatchFilter |___/\___/_|_|    Start time: 2019-01-10T09:02:42.061834Z
   [junit4]   2> 1103817 INFO  (jetty-launcher-6223-thread-2) [    ] o.a.s.s.SolrDispatchFilter |___/\___/_|_|    Start time: 2019-01-10T09:02:42.061850Z
   [junit4]   2> 1103819 INFO  (zkConnectionManagerCallback-6226-thread-1) [    ] o.a.s.c.c.ConnectionManager zkClient has connected
   [junit4]   2> 1103819 INFO  (zkConnectionManagerCallback-6227-thread-1) [    ] o.a.s.c.c.ConnectionManager zkClient has connected
   [junit4]   2> 1103819 INFO  (jetty-launcher-6223-thread-1) [    ] o.a.s.s.SolrDispatchFilter solr.xml found in ZooKeeper. Loading...
   [junit4]   2> 1103819 INFO  (jetty-launcher-6223-thread-2) [    ] o.a.s.s.SolrDispatchFilter solr.xml found in ZooKeeper. Loading...
   [junit4]   2> 1103824 WARN  (NIOServerCxn.Factory:0.0.0.0/0.0.0.0:0) [    ] o.a.z.s.NIOServerCnxn Unable to read additional data from client sessionid 0x1007a15aaaa0003, likely client has closed socket
   [junit4]   2> 1103898 WARN  (jetty-launcher-6223-thread-2) [    ] o.e.j.u.s.S.config No Client EndPointIdentificationAlgorithm configured for SslContextFactory@7102ff6e[provider=null,keyStore=null,trustStore=null]
   [junit4]   2> 1103903 WARN  (jetty-launcher-6223-thread-2) [    ] o.e.j.u.s.S.config No Client EndPointIdentificationAlgorithm configured for SslContextFactory@18dc87b6[provider=null,keyStore=null,trustStore=null]
   [junit4]   2> 1103904 INFO  (jetty-launcher-6223-thread-2) [    ] o.a.s.c.ZkContainer Zookeeper client=127.0.0.1:43913/solr
   [junit4]   2> 1103905 INFO  (zkConnectionManagerCallback-6233-thread-1) [    ] o.a.s.c.c.ConnectionManager zkClient has connected
   [junit4]   2> 1103907 INFO  (zkConnectionManagerCallback-6235-thread-1) [    ] o.a.s.c.c.ConnectionManager zkClient has connected
   [junit4]   2> 1103908 WARN  (jetty-launcher-6223-thread-1) [    ] o.e.j.u.s.S.config No Client EndPointIdentificationAlgorithm configured for SslContextFactory@53dddc4b[provider=null,keyStore=null,trustStore=null]
   [junit4]   2> 1103911 WARN  (jetty-launcher-6223-thread-1) [    ] o.e.j.u.s.S.config No Client EndPointIdentificationAlgorithm configured for SslContextFactory@3de60d63[provider=null,keyStore=null,trustStore=null]
   [junit4]   2> 1103912 INFO  (jetty-launcher-6223-thread-1) [    ] o.a.s.c.ZkContainer Zookeeper client=127.0.0.1:43913/solr
   [junit4]   2> 1103913 INFO  (zkConnectionManagerCallback-6243-thread-1) [    ] o.a.s.c.c.ConnectionManager zkClient has connected
   [junit4]   2> 1103914 INFO  (zkConnectionManagerCallback-6245-thread-1) [    ] o.a.s.c.c.ConnectionManager zkClient has connected
   [junit4]   2> 1103918 INFO  (jetty-launcher-6223-thread-1) [n:127.0.0.1:41855_solr    ] o.a.s.c.OverseerElectionContext I am going to be the leader 127.0.0.1:41855_solr
   [junit4]   2> 1103918 INFO  (jetty-launcher-6223-thread-1) [n:127.0.0.1:41855_solr    ] o.a.s.c.Overseer Overseer (id=72191827514097672-127.0.0.1:41855_solr-n_0000000000) starting
   [junit4]   2> 1103921 INFO  (zkConnectionManagerCallback-6252-thread-1) [    ] o.a.s.c.c.ConnectionManager zkClient has connected
   [junit4]   2> 1103922 INFO  (jetty-launcher-6223-thread-1) [n:127.0.0.1:41855_solr    ] o.a.s.c.s.i.ZkClientClusterStateProvider Cluster at 127.0.0.1:43913/solr ready
   [junit4]   2> 1103923 INFO  (OverseerStateUpdate-72191827514097672-127.0.0.1:41855_solr-n_0000000000) [n:127.0.0.1:41855_solr    ] o.a.s.c.Overseer Starting to work on the main queue : 127.0.0.1:41855_solr
   [junit4]   2> 1103923 INFO  (jetty-launcher-6223-thread-1) [n:127.0.0.1:41855_solr    ] o.a.s.c.ZkController Register node as live in ZooKeeper:/live_nodes/127.0.0.1:41855_solr
   [junit4]   2> 1103924 INFO  (OverseerStateUpdate-72191827514097672-127.0.0.1:41855_solr-n_0000000000) [n:127.0.0.1:41855_solr    ] o.a.s.c.c.ZkStateReader Updated live nodes from ZooKeeper... (0) -> (1)
   [junit4]   2> 1103924 INFO  (zkCallback-6251-thread-1) [    ] o.a.s.c.c.ZkStateReader Updated live nodes from ZooKeeper... (0) -> (1)
   [junit4]   2> 1103939 INFO  (jetty-launcher-6223-thread-1) [n:127.0.0.1:41855_solr    ] o.a.s.h.a.MetricsHistoryHandler No .system collection, keeping metrics history in memory.
   [junit4]   2> 1103952 INFO  (jetty-launcher-6223-thread-2) [n:127.0.0.1:35363_solr    ] o.a.s.c.c.ZkStateReader Updated live nodes from ZooKeeper... (0) -> (1)
   [junit4]   2> 1103953 INFO  (jetty-launcher-6223-thread-2) [n:127.0.0.1:35363_solr    ] o.a.s.c.ZkController Publish node=127.0.0.1:35363_solr as DOWN
   [junit4]   2> 1103954 INFO  (jetty-launcher-6223-thread-2) [n:127.0.0.1:35363_solr    ] o.a.s.c.TransientSolrCoreCacheDefault Allocating transient cache for 2147483647 transient cores
   [junit4]   2> 1103954 INFO  (jetty-launcher-6223-thread-2) [n:127.0.0.1:35363_solr    ] o.a.s.c.ZkController Register node as live in ZooKeeper:/live_nodes/127.0.0.1:35363_solr
   [junit4]   2> 1103954 INFO  (zkCallback-6244-thread-1) [    ] o.a.s.c.c.ZkStateReader Updated live nodes from ZooKeeper... (1) -> (2)
   [junit4]   2> 1103954 INFO  (zkCallback-6251-thread-1) [    ] o.a.s.c.c.ZkStateReader Updated live nodes from ZooKeeper... (1) -> (2)
   [junit4]   2> 1103955 INFO  (zkCallback-6234-thread-1) [    ] o.a.s.c.c.ZkStateReader Updated live nodes from ZooKeeper... (1) -> (2)
   [junit4]   2> 1103965 INFO  (jetty-launcher-6223-thread-1) [n:127.0.0.1:41855_solr    ] o.a.s.m.r.SolrJmxReporter JMX monitoring for 'solr_41855.solr.node' (registry 'solr.node') enabled at server: com.sun.jmx.mbeanserver.JmxMBeanServer@26f0f4dd
   [junit4]   2> 1103972 INFO  (zkConnectionManagerCallback-6258-thread-1) [    ] o.a.s.c.c.ConnectionManager zkClient has connected
   [junit4]   2> 1103973 INFO  (jetty-launcher-6223-thread-2) [n:127.0.0.1:35363_solr    ] o.a.s.c.c.ZkStateReader Updated live nodes from ZooKeeper... (0) -> (2)
   [junit4]   2> 1103973 INFO  (jetty-launcher-6223-thread-2) [n:127.0.0.1:35363_solr    ] o.a.s.c.s.i.ZkClientClusterStateProvider Cluster at 127.0.0.1:43913/solr ready
   [junit4]   2> 1103974 INFO  (jetty-launcher-6223-thread-2) [n:127.0.0.1:35363_solr    ] o.a.s.h.a.MetricsHistoryHandler No .system collection, keeping metrics history in memory.
   [junit4]   2> 1103978 INFO  (jetty-launcher-6223-thread-1) [n:127.0.0.1:41855_solr    ] o.a.s.m.r.SolrJmxReporter JMX monitoring for 'solr_41855.solr.jvm' (registry 'solr.jvm') enabled at server: com.sun.jmx.mbeanserver.JmxMBeanServer@26f0f4dd
   [junit4]   2> 1103978 INFO  (jetty-launcher-6223-thread-1) [n:127.0.0.1:41855_solr    ] o.a.s.m.r.SolrJmxReporter JMX monitoring for 'solr_41855.solr.jetty' (registry 'solr.jetty') enabled at server: com.sun.jmx.mbeanserver.JmxMBeanServer@26f0f4dd
   [junit4]   2> 1103979 INFO  (jetty-launcher-6223-thread-1) [n:127.0.0.1:41855_solr    ] o.a.s.c.CorePropertiesLocator Found 0 core definitions underneath /home/jenkins/workspace/Lucene-Solr-8.x-Linux/solr/build/solr-core/test/J2/temp/solr.cloud.LeaderTragicEventTest_33346B883441DD03-001/tempDir-001/node1/.
   [junit4]   2> 1103996 INFO  (jetty-launcher-6223-thread-2) [n:127.0.0.1:35363_solr    ] o.a.s.m.r.SolrJmxReporter JMX monitoring for 'solr_35363.solr.node' (registry 'solr.node') enabled at server: com.sun.jmx.mbeanserver.JmxMBeanServer@26f0f4dd
   [junit4]   2> 1104008 INFO  (jetty-launcher-6223-thread-2) [n:127.0.0.1:35363_solr    ] o.a.s.m.r.SolrJmxReporter JMX monitoring for 'solr_35363.solr.jvm' (registry 'solr.jvm') enabled at server: com.sun.jmx.mbeanserver.JmxMBeanServer@26f0f4dd
   [junit4]   2> 1104008 INFO  (jetty-launcher-6223-thread-2) [n:127.0.0.1:35363_solr    ] o.a.s.m.r.SolrJmxReporter JMX monitoring for 'solr_35363.solr.jetty' (registry 'solr.jetty') enabled at server: com.sun.jmx.mbeanserver.JmxMBeanServer@26f0f4dd
   [junit4]   2> 1104009 INFO  (jetty-launcher-6223-thread-2) [n:127.0.0.1:35363_solr    ] o.a.s.c.CorePropertiesLocator Found 0 core definitions underneath /home/jenkins/workspace/Lucene-Solr-8.x-Linux/solr/build/solr-core/test/J2/temp/solr.cloud.LeaderTragicEventTest_33346B883441DD03-001/tempDir-001/node2/.
   [junit4]   2> 1104035 INFO  (zkConnectionManagerCallback-6264-thread-1) [    ] o.a.s.c.c.ConnectionManager zkClient has connected
   [junit4]   2> 1104036 INFO  (SUITE-LeaderTragicEventTest-seed#[33346B883441DD03]-worker) [    ] o.a.s.c.c.ZkStateReader Updated live nodes from ZooKeeper... (0) -> (2)
   [junit4]   2> 1104037 INFO  (SUITE-LeaderTragicEventTest-seed#[33346B883441DD03]-worker) [    ] o.a.s.c.s.i.ZkClientClusterStateProvider Cluster at 127.0.0.1:43913/solr ready
   [junit4]   2> 1104046 INFO  (TEST-LeaderTragicEventTest.testOtherReplicasAreNotActive-seed#[33346B883441DD03]) [    ] o.a.s.SolrTestCaseJ4 ###Starting testOtherReplicasAreNotActive
   [junit4]   2> 1104047 INFO  (qtp1670783713-20607) [n:127.0.0.1:35363_solr    ] o.a.s.h.a.CollectionsHandler Invoked Collection Action :create with params collection.configName=config&name=collection2&nrtReplicas=1&action=CREATE&numShards=1&wt=javabin&version=2 and sendToOCPQueue=true
   [junit4]   2> 1104049 INFO  (OverseerThreadFactory-8366-thread-1-processing-n:127.0.0.1:41855_solr) [n:127.0.0.1:41855_solr    ] o.a.s.c.a.c.CreateCollectionCmd Create collection collection2
   [junit4]   2> 1104153 INFO  (qtp1670783713-20606) [n:127.0.0.1:35363_solr    ] o.a.s.s.HttpSolrCall [admin] webapp=null path=/admin/metrics params={prefix=CONTAINER.fs.usableSpace,CONTAINER.fs.totalSpace,CORE.coreName&wt=javabin&version=2&group=solr.node,solr.core} status=0 QTime=0
   [junit4]   2> 1104154 INFO  (qtp1670783713-20608) [n:127.0.0.1:35363_solr    ] o.a.s.s.HttpSolrCall [admin] webapp=null path=/admin/metrics params={prefix=CONTAINER.fs.usableSpace,CONTAINER.fs.totalSpace,CORE.coreName&wt=javabin&version=2&group=solr.node,solr.core} status=0 QTime=0
   [junit4]   2> 1104154 INFO  (qtp1670783713-20606) [n:127.0.0.1:35363_solr    ] o.a.s.s.HttpSolrCall [admin] webapp=null path=/admin/metrics params={prefix=CONTAINER.fs.usableSpace,CONTAINER.fs.totalSpace,CORE.coreName&wt=javabin&version=2&group=solr.node,solr.core} status=0 QTime=0
   [junit4]   2> 1104155 INFO  (qtp1670783713-20608) [n:127.0.0.1:35363_solr    ] o.a.s.s.HttpSolrCall [admin] webapp=null path=/admin/metrics params={prefix=CONTAINER.fs.usableSpace,CONTAINER.fs.totalSpace,CORE.coreName&wt=javabin&version=2&group=solr.node,solr.core} status=0 QTime=0
   [junit4]   2> 1104156 INFO  (qtp1670783713-20606) [n:127.0.0.1:35363_solr    ] o.a.s.s.HttpSolrCall [admin] webapp=null path=/admin/metrics params={prefix=CONTAINER.fs.usableSpace,CONTAINER.fs.totalSpace,CORE.coreName&wt=javabin&version=2&group=solr.node,solr.core} status=0 QTime=0
   [junit4]   2> 1104158 INFO  (qtp299079743-20598) [n:127.0.0.1:41855_solr    ] o.a.s.s.HttpSolrCall [admin] webapp=null path=/admin/metrics params={prefix=CONTAINER.fs.usableSpace,CONTAINER.fs.totalSpace,CORE.coreName&wt=javabin&version=2&group=solr.node,solr.core} status=0 QTime=0
   [junit4]   2> 1104159 INFO  (qtp299079743-20599) [n:127.0.0.1:41855_solr    ] o.a.s.s.HttpSolrCall [admin] webapp=null path=/admin/metrics params={prefix=CONTAINER.fs.usableSpace,CONTAINER.fs.totalSpace,CORE.coreName&wt=javabin&version=2&group=solr.node,solr.core} status=0 QTime=0
   [junit4]   2> 1104159 INFO  (qtp299079743-20597) [n:127.0.0.1:41855_solr    ] o.a.s.s.HttpSolrCall [admin] webapp=null path=/admin/metrics params={prefix=CONTAINER.fs.usableSpace,CONTAINER.fs.totalSpace,CORE.coreName&wt=javabin&version=2&group=solr.node,solr.core} status=0 QTime=0
   [junit4]   2> 1104160 INFO  (qtp299079743-20598) [n:127.0.0.1:41855_solr    ] o.a.s.s.HttpSolrCall [admin] webapp=null path=/admin/metrics params={prefix=CONTAINER.fs.usableSpace,CONTAINER.fs.totalSpace,CORE.coreName&wt=javabin&version=2&group=solr.node,solr.core} status=0 QTime=0
   [junit4]   2> 1104161 INFO  (qtp299079743-20599) [n:127.0.0.1:41855_solr    ] o.a.s.s.HttpSolrCall [admin] webapp=null path=/admin/metrics params={prefix=CONTAINER.fs.usableSpace,CONTAINER.fs.totalSpace,CORE.coreName&wt=javabin&version=2&group=solr.node,solr.core} status=0 QTime=0
   [junit4]   2> 1104163 INFO  (OverseerStateUpdate-72191827514097672-127.0.0.1:41855_solr-n_0000000000) [n:127.0.0.1:41855_solr    ] o.a.s.c.o.SliceMutator createReplica() {
   [junit4]   2>   "operation":"ADDREPLICA",
   [junit4]   2>   "collection":"collection2",
   [junit4]   2>   "shard":"shard1",
   [junit4]   2>   "core":"collection2_shard1_replica_n1",
   [junit4]   2>   "state":"down",
   [junit4]   2>   "base_url":"http://127.0.0.1:41855/solr",
   [junit4]   2>   "type":"NRT",
   [junit4]   2>   "waitForFinalState":"false"}
   [junit4]   2> 1104364 INFO  (qtp299079743-20597) [n:127.0.0.1:41855_solr    x:collection2_shard1_replica_n1] o.a.s.h.a.CoreAdminOperation core create command qt=/admin/cores&coreNodeName=core_node2&collection.configName=config&newCollection=true&name=collection2_shard1_replica_n1&action=CREATE&numShards=1&collection=collection2&shard=shard1&wt=javabin&version=2&replicaType=NRT
   [junit4]   2> 1104365 INFO  (qtp299079743-20597) [n:127.0.0.1:41855_solr    x:collection2_shard1_replica_n1] o.a.s.c.TransientSolrCoreCacheDefault Allocating transient cache for 2147483647 transient cores
   [junit4]   2> 1105371 INFO  (qtp299079743-20597) [n:127.0.0.1:41855_solr c:collection2 s:shard1 r:core_node2 x:collection2_shard1_replica_n1] o.a.s.c.SolrConfig Using Lucene MatchVersion: 8.0.0
   [junit4]   2> 1105383 INFO  (qtp299079743-20597) [n:127.0.0.1:41855_solr c:collection2 s:shard1 r:core_node2 x:collection2_shard1_replica_n1] o.a.s.s.IndexSchema [collection2_shard1_replica_n1] Schema name=minimal
   [junit4]   2> 1105384 INFO  (qtp299079743-20597) [n:127.0.0.1:41855_solr c:collection2 s:shard1 r:core_node2 x:collection2_shard1_replica_n1] o.a.s.s.IndexSchema Loaded schema minimal/1.1 with uniqueid field id
   [junit4]   2> 1105384 INFO  (qtp299079743-20597) [n:127.0.0.1:41855_solr c:collection2 s:shard1 r:core_node2 x:collection2_shard1_replica_n1] o.a.s.c.CoreContainer Creating SolrCore 'collection2_shard1_replica_n1' using configuration from collection collection2, trusted=true
   [junit4]   2> 1105384 INFO  (qtp299079743-20597) [n:127.0.0.1:41855_solr c:collection2 s:shard1 r:core_node2 x:collection2_shard1_replica_n1] o.a.s.m.r.SolrJmxReporter JMX monitoring for 'solr_41855.solr.core.collection2.shard1.replica_n1' (registry 'solr.core.collection2.shard1.replica_n1') enabled at server: com.sun.jmx.mbeanserver.JmxMBeanServer@26f0f4dd
   [junit4]   2> 1105384 INFO  (qtp299079743-20597) [n:127.0.0.1:41855_solr c:collection2 s:shard1 r:core_node2 x:collection2_shard1_replica_n1] o.a.s.c.SolrCore [[collection2_shard1_replica_n1] ] Opening new SolrCore at [/home/jenkins/workspace/Lucene-Solr-8.x-Linux/solr/build/solr-core/test/J2/temp/solr.cloud.LeaderTragicEventTest_33346B883441DD03-001/tempDir-001/node1/collection2_shard1_replica_n1], dataDir=[/home/jenkins/workspace/Lucene-Solr-8.x-Linux/solr/build/solr-core/test/J2/temp/solr.cloud.LeaderTragicEventTest_33346B883441DD03-001/tempDir-001/node1/./collection2_shard1_replica_n1/data/]
   [junit4]   2> 1105450 INFO  (qtp299079743-20597) [n:127.0.0.1:41855_solr c:collection2 s:shard1 r:core_node2 x:collection2_shard1_replica_n1] o.a.s.u.UpdateHandler Using UpdateLog implementation: org.apache.solr.update.UpdateLog
   [junit4]   2> 1105450 INFO  (qtp299079743-20597) [n:127.0.0.1:41855_solr c:collection2 s:shard1 r:core_node2 x:collection2_shard1_replica_n1] o.a.s.u.UpdateLog Initializing UpdateLog: dataDir=null defaultSyncLevel=FLUSH numRecordsToKeep=100 maxNumLogsToKeep=10 numVersionBuckets=65536
   [junit4]   2> 1105452 INFO  (qtp299079743-20597) [n:127.0.0.1:41855_solr c:collection2 s:shard1 r:core_node2 x:collection2_shard1_replica_n1] o.a.s.u.CommitTracker Hard AutoCommit: disabled
   [junit4]   2> 1105452 INFO  (qtp299079743-20597) [n:127.0.0.1:41855_solr c:collection2 s:shard1 r:core_node2 x:collection2_shard1_replica_n1] o.a.s.u.CommitTracker Soft AutoCommit: disabled
   [junit4]   2> 1105454 INFO  (qtp299079743-20597) [n:127.0.0.1:41855_solr c:collection2 s:shard1 r:core_node2 x:collection2_shard1_replica_n1] o.a.s.s.SolrIndexSearcher Opening [Searcher@1514980a[collection2_shard1_replica_n1] main]
   [junit4]   2> 1105455 INFO  (qtp299079743-20597) [n:127.0.0.1:41855_solr c:collection2 s:shard1 r:core_node2 x:collection2_shard1_replica_n1] o.a.s.r.ManagedResourceStorage Configured ZooKeeperStorageIO with znodeBase: /configs/config
   [junit4]   2> 1105455 INFO  (qtp299079743-20597) [n:127.0.0.1:41855_solr c:collection2 s:shard1 r:core_node2 x:collection2_shard1_replica_n1] o.a.s.r.ManagedResourceStorage Loaded null at path _rest_managed.json using ZooKeeperStorageIO:path=/configs/config
   [junit4]   2> 1105456 INFO  (qtp299079743-20597) [n:127.0.0.1:41855_solr c:collection2 s:shard1 r:core_node2 x:collection2_shard1_replica_n1] o.a.s.h.ReplicationHandler Commits will be reserved for 10000ms.
   [junit4]   2> 1105456 INFO  (qtp299079743-20597) [n:127.0.0.1:41855_solr c:collection2 s:shard1 r:core_node2 x:collection2_shard1_replica_n1] o.a.s.u.UpdateLog Could not find max version in index or recent updates, using new clock 1622263425872691200
   [junit4]   2> 1105458 INFO  (searcherExecutor-8375-thread-1-processing-n:127.0.0.1:41855_solr x:collection2_shard1_replica_n1 c:collection2 s:shard1 r:core_node2) [n:127.0.0.1:41855_solr c:collection2 s:shard1 r:core_node2 x:collection2_shard1_replica_n1] o.a.s.c.SolrCore [collection2_shard1_replica_n1] Registered new searcher Searcher@1514980a[collection2_shard1_replica_n1] main{ExitableDirectoryReader(UninvertingDirectoryReader())}
   [junit4]   2> 1105459 INFO  (qtp299079743-20597) [n:127.0.0.1:41855_solr c:collection2 s:shard1 r:core_node2 x:collection2_shard1_replica_n1] o.a.s.c.ZkShardTerms Successful update of terms at /collections/collection2/terms/shard1 to Terms{values={core_node2=0}, version=0}
   [junit4]   2> 1105459 INFO  (qtp299079743-20597) [n:127.0.0.1:41855_solr c:collection2 s:shard1 r:core_node2 x:collection2_shard1_replica_n1] o.a.s.c.ShardLeaderElectionContextBase make sure parent is created /collections/collection2/leaders/shard1
   [junit4]   2> 1105461 INFO  (qtp299079743-20597) [n:127.0.0.1:41855_solr c:collection2 s:shard1 r:core_node2 x:collection2_shard1_replica_n1] o.a.s.c.ShardLeaderElectionContext Enough replicas found to continue.
   [junit4]   2> 1105461 INFO  (qtp299079743-20597) [n:127.0.0.1:41855_solr c:collection2 s:shard1 r:core_node2 x:collection2_shard1_replica_n1] o.a.s.c.ShardLeaderElectionContext I may be the new leader - try and sync
   [junit4]   2> 1105461 INFO  (qtp299079743-20597) [n:127.0.0.1:41855_solr c:collection2 s:shard1 r:core_node2 x:collection2_shard1_replica_n1] o.a.s.c.SyncStrategy Sync replicas to http://127.0.0.1:41855/solr/collection2_shard1_replica_n1/
   [junit4]   2> 1105461 INFO  (qtp299079743-20597) [n:127.0.0.1:41855_solr c:collection2 s:shard1 r:core_node2 x:collection2_shard1_replica_n1] o.a.s.c.SyncStrategy Sync Success - now sync replicas to me
   [junit4]   2> 1105461 INFO  (qtp299079743-20597) [n:127.0.0.1:41855_solr c:collection2 s:shard1 r:core_node2 x:collection2_shard1_replica_n1] o.a.s.c.SyncStrategy http://127.0.0.1:41855/solr/collection2_shard1_replica_n1/ has no replicas
   [junit4]   2> 1105461 INFO  (qtp299079743-20597) [n:127.0.0.1:41855_solr c:collection2 s:shard1 r:core_node2 x:collection2_shard1_replica_n1] o.a.s.c.ShardLeaderElectionContextBase Creating leader registration node /collections/collection2/leaders/shard1/leader after winning as /collections/collection2/leader_elect/shard1/election/72191827514097672-core_node2-n_0000000000
   [junit4]   2> 1105462 INFO  (qtp299079743-20597) [n:127.0.0.1:41855_solr c:collection2 s:shard1 r:core_node2 x:collection2_shard1_replica_n1] o.a.s.c.ShardLeaderElectionContext I am the new leader: http://127.0.0.1:41855/solr/collection2_shard1_replica_n1/ shard1
   [junit4]   2> 1105564 INFO  (zkCallback-6244-thread-1) [    ] o.a.s.c.c.ZkStateReader A cluster state change: [WatchedEvent state:SyncConnected type:NodeDataChanged path:/collections/collection2/state.json] for collection [collection2] has occurred - updating... (live nodes size: [2])
   [junit4]   2> 1105564 INFO  (zkCallback-6244-thread-2) [    ] o.a.s.c.c.ZkStateReader A cluster state change: [WatchedEvent state:SyncConnected type:NodeDataChanged path:/collections/collection2/state.json] for collection [collection2] has occurred - updating... (live nodes size: [2])
   [junit4]   2> 1105564 INFO  (qtp299079743-20597) [n:127.0.0.1:41855_solr c:collection2 s:shard1 r:core_node2 x:collection2_shard1_replica_n1] o.a.s.c.ZkController I am the leader, no recovery necessary
   [junit4]   2> 1105565 INFO  (qtp299079743-20597) [n:127.0.0.1:41855_solr c:collection2 s:shard1 r:core_node2 x:collection2_shard1_replica_n1] o.a.s.s.HttpSolrCall [admin] webapp=null path=/admin/cores params={qt=/admin/cores&coreNodeName=core_node2&collection.configName=config&newCollection=true&name=collection2_shard1_replica_n1&action=CREATE&numShards=1&collection=collection2&shard=shard1&wt=javabin&version=2&replicaType=NRT} status=0 QTime=1201
   [junit4]   2> 1105567 INFO  (qtp1670783713-20607) [n:127.0.0.1:35363_solr    ] o.a.s.h.a.CollectionsHandler Wait for new collection to be active for at most 45 seconds. Check all shard replicas
   [junit4]   2> 1105665 INFO  (zkCallback-6244-thread-2) [    ] o.a.s.c.c.ZkStateReader A cluster state change: [WatchedEvent state:SyncConnected type:NodeDataChanged path:/collections/collection2/state.json] for collection [collection2] has occurred - updating... (live nodes size: [2])
   [junit4]   2> 1105665 INFO  (zkCallback-6244-thread-1) [    ] o.a.s.c.c.ZkStateReader A cluster state change: [WatchedEvent state:SyncConnected type:NodeDataChanged path:/collections/collection2/state.json] for collection [collection2] has occurred - updating... (live nodes size: [2])
   [junit4]   2> 1105666 INFO  (zkCallback-6244-thread-3) [    ] o.a.s.c.c.ZkStateReader A cluster state change: [WatchedEvent state:SyncConnected type:NodeDataChanged path:/collections/collection2/state.json] for collection [collection2] has occurred - updating... (live nodes size: [2])
   [junit4]   2> 1105665 INFO  (zkCallback-6234-thread-1) [    ] o.a.s.c.c.ZkStateReader A cluster state change: [WatchedEvent state:SyncConnected type:NodeDataChanged path:/collections/collection2/state.json] for collection [collection2] has occurred - updating... (live nodes size: [2])
   [junit4]   2> 1105666 INFO  (qtp1670783713-20607) [n:127.0.0.1:35363_solr    ] o.a.s.s.HttpSolrCall [admin] webapp=null path=/admin/collections params={collection.configName=config&name=collection2&nrtReplicas=1&action=CREATE&numShards=1&wt=javabin&version=2} status=0 QTime=1618
   [junit4]   2> 1105667 INFO  (TEST-LeaderTragicEventTest.testOtherReplicasAreNotActive-seed#[33346B883441DD03]) [    ] o.a.s.c.LeaderTragicEventTest Corrupt leader : core_node2:{"core":"collection2_shard1_replica_n1","base_url":"http://127.0.0.1:41855/solr","node_name":"127.0.0.1:41855_solr","state":"active","type":"NRT","force_set_state":"false","leader":"true"}
   [junit4]   2> 1105671 INFO  (qtp299079743-20599) [n:127.0.0.1:41855_solr c:collection2 s:shard1 r:core_node2 x:collection2_shard1_replica_n1] o.a.s.c.ZkShardTerms Successful update of terms at /collections/collection2/terms/shard1 to Terms{values={core_node2=1}, version=1}
   [junit4]   2> 1105671 INFO  (qtp299079743-20599) [n:127.0.0.1:41855_solr c:collection2 s:shard1 r:core_node2 x:collection2_shard1_replica_n1] o.a.s.u.p.LogUpdateProcessorFactory [collection2_shard1_replica_n1]  webapp=/solr path=/update params={wt=javabin&version=2}{add=[0 (1622263426096037888)]} 0 1
   [junit4]   2> 1105672 INFO  (qtp299079743-20597) [n:127.0.0.1:41855_solr c:collection2 s:shard1 r:core_node2 x:collection2_shard1_replica_n1] o.a.s.u.DirectUpdateHandler2 start commit{_version_=1622263426099183616,optimize=false,openSearcher=true,waitSearcher=true,expungeDeletes=false,softCommit=false,prepareCommit=false}
   [junit4]   2> 1105672 INFO  (qtp299079743-20597) [n:127.0.0.1:41855_solr c:collection2 s:shard1 r:core_node2 x:collection2_shard1_replica_n1] o.a.s.u.SolrIndexWriter Calling setCommitData with IW:org.apache.solr.update.SolrIndexWriter@e84adb commitCommandVersion:1622263426099183616
   [junit4]   2> 1105683 INFO  (qtp299079743-20597) [n:127.0.0.1:41855_solr c:collection2 s:shard1 r:core_node2 x:collection2_shard1_replica_n1] o.a.s.s.SolrIndexSearcher Opening [Searcher@3b04867[collection2_shard1_replica_n1] main]
   [junit4]   2> 1105683 INFO  (qtp299079743-20597) [n:127.0.0.1:41855_solr c:collection2 s:shard1 r:core_node2 x:collection2_shard1_replica_n1] o.a.s.u.DirectUpdateHandler2 end_commit_flush
   [junit4]   2> 1105685 INFO  (searcherExecutor-8375-thread-1-processing-n:127.0.0.1:41855_solr x:collection2_shard1_replica_n1 c:collection2 s:shard1 r:core_node2) [n:127.0.0.1:41855_solr c:collection2 s:shard1 r:core_node2 x:collection2_shard1_replica_n1] o.a.s.c.SolrCore [collection2_shard1_replica_n1] Registered new searcher Searcher@3b04867[collection2_shard1_replica_n1] main{ExitableDirectoryReader(UninvertingDirectoryReader(Uninverting(_0(8.0.0):C1:[diagnostics={os=Linux, java.vendor=Oracle Corporation, java.version=12-ea, java.vm.version=12-ea+23, lucene.version=8.0.0, os.arch=amd64, java.runtime.version=12-ea+23, source=flush, os.version=4.15.0-42-generic, timestamp=1547110963919}])))}
   [junit4]   2> 1105685 INFO  (qtp299079743-20597) [n:127.0.0.1:41855_solr c:collection2 s:shard1 r:core_node2 x:collection2_shard1_replica_n1] o.a.s.u.p.LogUpdateProcessorFactory [collection2_shard1_replica_n1]  webapp=/solr path=/update params={waitSearcher=true&commit=true&softCommit=false&wt=javabin&version=2}{commit=} 0 13
   [junit4]   2> 1105688 INFO  (qtp299079743-20598) [n:127.0.0.1:41855_solr c:collection2 s:shard1 r:core_node2 x:collection2_shard1_replica_n1] o.a.s.u.p.LogUpdateProcessorFactory [collection2_shard1_replica_n1]  webapp=/solr path=/update params={wt=javabin&version=2}{add=[1 (1622263426114912256)]} 0 1
   [junit4]   2> 1105689 INFO  (qtp299079743-20599) [n:127.0.0.1:41855_solr c:collection2 s:shard1 r:core_node2 x:collection2_shard1_replica_n1] o.a.s.u.DirectUpdateHandler2 start commit{_version_=1622263426117009408,optimize=false,openSearcher=true,waitSearcher=true,expungeDeletes=false,softCommit=false,prepareCommit=false}
   [junit4]   2> 1105689 INFO  (qtp299079743-20599) [n:127.0.0.1:41855_solr c:collection2 s:shard1 r:core_node2 x:collection2_shard1_replica_n1] o.a.s.u.SolrIndexWriter Calling setCommitData with IW:org.apache.solr.update.SolrIndexWriter@e84adb commitCommandVersion:1622263426117009408
   [junit4]   2> 1105695 INFO  (qtp299079743-20599) [n:127.0.0.1:41855_solr c:collection2 s:shard1 r:core_node2 x:collection2_shard1_replica_n1] o.a.s.u.p.LogUpdateProcessorFactory [collection2_shard1_replica_n1]  webapp=/solr path=/update params={waitSearcher=true&commit=true&softCommit=false&wt=javabin&version=2}{} 0 6
   [junit4]   2> 1105696 ERROR (qtp299079743-20599) [n:127.0.0.1:41855_solr c:collection2 s:shard1 r:core_node2 x:collection2_shard1_replica_n1] o.a.s.h.RequestHandlerBase java.nio.file.NoSuchFileException: /home/jenkins/workspace/Lucene-Solr-8.x-Linux/solr/build/solr-core/test/J2/temp/solr.cloud.LeaderTragicEventTest_33346B883441DD03-001/index-SimpleFSDirectory-001/_0.fdx
   [junit4]   2> at java.base/sun.nio.fs.UnixException.translateToIOException(UnixException.java:92)
   [junit4]   2> at java.base/sun.nio.fs.UnixException.rethrowAsIOException(UnixException.java:111)
   [junit4]   2> at java.base/sun.nio.fs.UnixException.rethrowAsIOException(UnixException.java:116)
   [junit4]   2> at java.base/sun.nio.fs.UnixFileSystemProvider.newFileChannel(UnixFileSystemProvider.java:182)
   [junit4]   2> at org.apache.lucene.mockfile.FilterFileSystemProvider.newFileChannel(FilterFileSystemProvider.java:202)
   [junit4]   2> at org.apache.lucene.mockfile.DisableFsyncFS.newFileChannel(DisableFsyncFS.java:45)
   [junit4]   2> at org.apache.lucene.mockfile.FilterFileSystemProvider.newFileChannel(FilterFileSystemProvider.java:202)
   [junit4]   2> at org.apache.lucene.mockfile.HandleTrackingFS.newFileChannel(HandleTrackingFS.java:166)
   [junit4]   2> at org.apache.lucene.mockfile.HandleTrackingFS.newFileChannel(HandleTrackingFS.java:166)
   [junit4]   2> at java.base/java.nio.channels.FileChannel.open(FileChannel.java:292)
   [junit4]   2> at java.base/java.nio.channels.FileChannel.open(FileChannel.java:345)
   [junit4]   2> at org.apache.lucene.util.IOUtils.fsync(IOUtils.java:460)
   [junit4]   2> at org.apache.lucene.store.FSDirectory.fsync(FSDirectory.java:332)
   [junit4]   2> at org.apache.lucene.store.FSDirectory.sync(FSDirectory.java:287)
   [junit4]   2> at org.apache.lucene.store.MockDirectoryWrapper.sync(MockDirectoryWrapper.java:207)
   [junit4]   2> at org.apache.lucene.store.LockValidatingDirectoryWrapper.sync(LockValidatingDirectoryWrapper.java:68)
   [junit4]   2> at org.apache.lucene.index.IndexWriter.startCommit(IndexWriter.java:4801)
   [junit4]   2> at org.apache.lucene.index.IndexWriter.prepareCommitInternal(IndexWriter.java:3274)
   [junit4]   2> at org.apache.lucene.index.IndexWriter.commitInternal(IndexWriter.java:3442)
   [junit4]   2> at org.apache.lucene.index.IndexWriter.commit(IndexWriter.java:3407)
   [junit4]   2> at org.apache.solr.update.DirectUpdateHandler2.commit(DirectUpdateHandler2.java:677)
   [junit4]   2> at org.apache.solr.update.processor.RunUpdateProcessor.processCommit(RunUpdateProcessorFactory.java:102)
   [junit4]   2> at org.apache.solr.update.processor.UpdateRequestProcessor.processCommit(UpdateRequestProcessor.java:68)
   [junit4]   2> at org.apache.solr.update.processor.DistributedUpdateProcessor.doLocalCommit(DistributedUpdateProcessor.java:2034)
   [junit4]   2> at org.apache.solr.update.processor.DistributedUpdateProcessor.processCommit(DistributedUpdateProcessor.java:2018)
   [junit4]   2> at org.apache.solr.update.processor.LogUpdateProcessorFactory$LogUpdateProcessor.processCommit(LogUpdateProcessorFactory.java:160)
   [junit4]   2> at org.apache.solr.handler.RequestHandlerUtils.handleCommit(RequestHandlerUtils.java:69)
   [junit4]   2> at org.apache.solr.handler.ContentStreamHandlerBase.handleRequestBody(ContentStreamHandlerBase.java:62)
   [junit4]   2> at org.apache.solr.handler.RequestHandlerBase.handleRequest(RequestHandlerBase.java:199)
   [junit4]   2> at org.apache.solr.core.SolrCore.execute(SolrCore.java:2556)
   [junit4]   2> at org.apache.solr.servlet.HttpSolrCall.execute(HttpSolrCall.java:711)
   [junit4]   2> at org.apache.solr.servlet.HttpSolrCall.call(HttpSolrCall.java:516)
   [junit4]   2> at org.apache.solr.servlet.SolrDispatchFilter.doFilter(SolrDispatchFilter.java:394)
   [junit4]   2> at org.apache.solr.servlet.SolrDispatchFilter.doFilter(SolrDispatchFilter.java:340)
   [junit4]   2> at org.eclipse.jetty.servlet.ServletHandler$CachedChain.doFilter(ServletHandler.java:1610)
   [junit4]   2> at org.apache.solr.client.solrj.embedded.JettySolrRunner$DebugFilter.doFilter(JettySolrRunner.java:164)
   [junit4]   2> at org.eclipse.jetty.servlet.ServletHandler$CachedChain.doFilter(ServletHandler.java:1610)
   [junit4]   2> at org.eclipse.jetty.servlet.ServletHandler.doHandle(ServletHandler.java:540)
   [junit4]   2> at org.eclipse.jetty.server.handler.ScopedHandler.nextHandle(ScopedHandler.java:255)
   [junit4]   2> at org.eclipse.jetty.server.session.SessionHandler.doHandle(SessionHandler.java:1588)
   [junit4]   2> at org.eclipse.jetty.server.handler.ScopedHandler.nextHandle(ScopedHandler.java:255)
   [junit4]   2> at org.eclipse.jetty.server.handler.ContextHandler.doHandle(ContextHandler.java:1345)
   [junit4]   2> at org.eclipse.jetty.server.handler.ScopedHandler.nextScope(ScopedHandler.java:203)
   [junit4]   2> at org.eclipse.jetty.servlet.ServletHandler.doScope(ServletHandler.java:480)
   [junit4]   2> at org.eclipse.jetty.server.session.SessionHandler.doScope(SessionHandler.java:1557)
   [junit4]   2> at org.eclipse.jetty.server.handler.ScopedHandler.nextScope(ScopedHandler.java:201)
   [junit4]   2> at org.eclipse.jetty.server.handler.ContextHandler.doScope(ContextHandler.java:1247)
   [junit4]   2> at org.eclipse.jetty.server.handler.ScopedHandler.handle(ScopedHandler.java:144)
   [junit4]   2> at org.eclipse.jetty.server.handler.gzip.GzipHandler.handle(GzipHandler.java:703)
   [junit4]   2> at org.eclipse.jetty.server.handler.HandlerWrapper.handle(HandlerWrapper.java:132)
   [junit4]   2> at org.eclipse.jetty.server.Server.handle(Server.java:502)
   [junit4]   2> at org.eclipse.jetty.server.HttpChannel.handle(HttpChannel.java:364)
   [junit4]   2> at org.eclipse.jetty.server.HttpConnection.onFillable(HttpConnection.java:260)
   [junit4]   2> at org.eclipse.jetty.io.AbstractConnection$ReadCallback.succeeded(AbstractConnection.java:305)
   [junit4]   2> at org.eclipse.jetty.io.FillInterest.fillable(FillInterest.java:103)
   [junit4]   2> at org.eclipse.jetty.io.ChannelEndPoint$2.run(ChannelEndPoint.java:118)
   [junit4]   2> at org.eclipse.jetty.util.thread.QueuedThreadPool.runJob(QueuedThreadPool.java:765)
   [junit4]   2> at org.eclipse.jetty.util.thread.QueuedThreadPool$2.run(QueuedThreadPool.java:683)
   [junit4]   2> at java.base/java.lang.Thread.run(Thread.java:835)
   [junit4]   2>
   [junit4]   2> 1105696 ERROR (qtp299079743-20599) [n:127.0.0.1:41855_solr c:collection2 s:shard1 r:core_node2 x:collection2_shard1_replica_n1] o.a.s.s.HttpSolrCall null:java.nio.file.NoSuchFileException: /home/jenkins/workspace/Lucene-Solr-8.x-Linux/solr/build/solr-core/test/J2/temp/solr.cloud.LeaderTragicEventTest_33346B883441DD03-001/index-SimpleFSDirectory-001/_0.fdx
   [junit4]   2> at java.base/sun.nio.fs.UnixException.translateToIOException(UnixException.java:92)
   [junit4]   2> at java.base/sun.nio.fs.UnixException.rethrowAsIOException(UnixException.java:111)
   [junit4]   2> at java.base/sun.nio.fs.UnixException.rethrowAsIOException(UnixException.java:116)
   [junit4]   2> at java.base/sun.nio.fs.UnixFileSystemProvider.newFileChannel(UnixFileSystemProvider.java:182)
   [junit4]   2> at org.apache.lucene.mockfile.FilterFileSystemProvider.newFileChannel(FilterFileSystemProvider.java:202)
   [junit4]   2> at org.apache.lucene.mockfile.DisableFsyncFS.newFileChannel(DisableFsyncFS.java:45)
   [junit4]   2> at org.apache.lucene.mockfile.FilterFileSystemProvider.newFileChannel(FilterFileSystemProvider.java:202)
   [junit4]   2> at org.apache.lucene.mockfile.HandleTrackingFS.newFileChannel(HandleTrackingFS.java:166)
   [junit4]   2> at org.apache.lucene.mockfile.HandleTrackingFS.newFileChannel(HandleTrackingFS.java:166)
   [junit4]   2> at java.base/java.nio.channels.FileChannel.open(FileChannel.java:292)
   [junit4]   2> at java.base/java.nio.channels.FileChannel.open(FileChannel.java:345)
   [junit4]   2> at org.apache.lucene.util.IOUtils.fsync(IOUtils.java:460)
   [junit4]   2> at org.apache.lucene.store.FSDirectory.fsync(FSDirectory.java:332)
   [junit4]   2> at org.apache.lucene.store.FSDirectory.sync(FSDirectory.java:287)
   [junit4]   2> at org.apache.lucene.store.MockDirectoryWrapper.sync(MockDirectoryWrapper.java:207)
   [junit4]   2> at org.apache.lucene.store.LockValidatingDirectoryWrapper.sync(LockValidatingDirectoryWrapper.java:68)
   [junit4]   2> at org.apache.lucene.index.IndexWriter.startCommit(IndexWriter.java:4801)
   [junit4]   2> at org.apache.lucene.index.IndexWriter.prepareCommitInternal(IndexWriter.java:3274)
   [junit4]   2> at org.apache.lucene.index.IndexWriter.commitInternal(IndexWriter.java:3442)
   [junit4]   2> at org.apache.lucene.index.IndexWriter.commit(IndexWriter.java:3407)
   [junit4]   2> at org.apache.solr.update.DirectUpdateHandler2.commit(DirectUpdateHandler2.java:677)
   [junit4]   2> at org.apache.solr.update.processor.RunUpdateProcessor.processCommit(RunUpdateProcessorFactory.java:102)
   [junit4]   2> at org.apache.solr.update.processor.UpdateRequestProcessor.processCommit(UpdateRequestProcessor.java:68)
   [junit4]   2> at org.apache.solr.update.processor.DistributedUpdateProcessor.doLocalCommit(DistributedUpdateProcessor.java:2034)
   [junit4]   2> at org.apache.solr.update.processor.DistributedUpdateProcessor.processCommit(DistributedUpdateProcessor.java:2018)
   [junit4]   2> at org.apache.solr.update.processor.LogUpdateProcessorFactory$LogUpdateProcessor.processCommit(LogUpdateProcessorFactory.java:160)
   [junit4]   2> at org.apache.solr.handler.RequestHandlerUtils.handleCommit(RequestHandlerUtils.java:69)
   [junit4]   2> at org.apache.solr.handler.ContentStreamHandlerBase.handleRequestBody(ContentStreamHandlerBase.java:62)
   [junit4]   2> at org.apache.solr.handler.RequestHandlerBase.handleRequest(RequestHandlerBase.java:199)
   [junit4]   2> at org.apache.solr.core.SolrCore.execute(SolrCore.java:2556)
   [junit4]   2> at org.apache.solr.servlet.HttpSolrCall.execute(HttpSolrCall.java:711)
   [junit4]   2> at org.apache.solr.servlet.HttpSolrCall.call(HttpSolrCall.java:516)
   [junit4]   2> at org.apache.solr.servlet.SolrDispatchFilter.doFilter(SolrDispatchFilter.java:394)
   [junit4]   2> at org.apache.solr.servlet.SolrDispatchFilter.doFilter(SolrDispatchFilter.java:340)
   [junit4]   2> at org.eclipse.jetty.servlet.ServletHandler$CachedChain.doFilter(ServletHandler.java:1610)
   [junit4]   2> at org.apache.solr.client.solrj.embedded.JettySolrRunner$DebugFilter.doFilter(JettySolrRunner.java:164)
   [junit4]   2> at org.eclipse.jetty.servlet.ServletHandler$CachedChain.doFilter(ServletHandler.java:1610)
   [junit4]   2> at org.eclipse.jetty.servlet.ServletHandler.doHandle(ServletHandler.java:540)
   [junit4]   2> at org.eclipse.jetty.server.handler.ScopedHandler.nextHandle(ScopedHandler.java:255)
   [junit4]   2> at org.eclipse.jetty.server.session.SessionHandler.doHandle(SessionHandler.java:1588)
   [junit4]   2> at org.eclipse.jetty.server.handler.ScopedHandler.nextHandle(ScopedHandler.java:255)
   [junit4]   2> at org.eclipse.jetty.server.handler.ContextHandler.doHandle(ContextHandler.java:1345)
   [junit4]   2> at org.eclipse.jetty.server.handler.ScopedHandler.nextScope(ScopedHandler.java:203)
   [junit4]   2> at org.eclipse.jetty.servlet.ServletHandler.doScope(ServletHandler.java:480)
   [junit4]   2> at org.eclipse.jetty.server.session.SessionHandler.doScope(SessionHandler.java:1557)
   [junit4]   2> at org.eclipse.jetty.server.handler.ScopedHandler.nextScope(ScopedHandler.java:201)
   [junit4]   2> at org.eclipse.jetty.server.handler.ContextHandler.doScope(ContextHandler.java:1247)
   [junit4]   2> at org.eclipse.jetty.server.handler.ScopedHandler.handle(ScopedHandler.java:144)
   [junit4]   2> at org.eclipse.jetty.server.handler.gzip.GzipHandler.handle(GzipHandler.java:703)
   [junit4]   2> at org.eclipse.jetty.server.handler.HandlerWrapper.handle(HandlerWrapper.java:132)
   [junit4]   2> at org.eclipse.jetty.server.Server.handle(Server.java:502)
   [junit4]   2> at org.eclipse.jetty.server.HttpChannel.handle(HttpChannel.java:364)
   [junit4]   2> at org.eclipse.jetty.server.HttpConnection.onFillable(HttpConnection.java:260)
   [junit4]   2> at org.eclipse.jetty.io.AbstractConnection$ReadCallback.succeeded(AbstractConnection.java:305)
   [junit4]   2> at org.eclipse.jetty.io.FillInterest.fillable(FillInterest.java:103)
   [junit4]   2> at org.eclipse.jetty.io.ChannelEndPoint$2.run(ChannelEndPoint.java:118)
   [junit4]   2> at org.eclipse.jetty.util.thread.QueuedThreadPool.runJob(QueuedThreadPool.java:765)
   [junit4]   2> at org.eclipse.jetty.util.thread.QueuedThreadPool$2.run(QueuedThreadPool.java:683)
   [junit4]   2> at java.base/java.lang.Thread.run(Thread.java:835)
   [junit4]   2>
   [junit4]   2> 1105696 INFO  (TEST-LeaderTragicEventTest.testOtherReplicasAreNotActive-seed#[33346B883441DD03]) [    ] o.a.s.c.LeaderTragicEventTest Corrupt leader ex:
   [junit4]   2> org.apache.solr.client.solrj.impl.HttpSolrClient$RemoteSolrException: Error from server at http://127.0.0.1:41855/solr/collection2_shard1_replica_n1: /home/jenkins/workspace/Lucene-Solr-8.x-Linux/solr/build/solr-core/test/J2/temp/solr.cloud.LeaderTragicEventTest_33346B883441DD03-001/index-SimpleFSDirectory-001/_0.fdx
   [junit4]   2> at org.apache.solr.client.solrj.impl.HttpSolrClient.executeMethod(HttpSolrClient.java:650) ~[java/:?]
   [junit4]   2> at org.apache.solr.client.solrj.impl.HttpSolrClient.request(HttpSolrClient.java:256) ~[java/:?]
   [junit4]   2> at org.apache.solr.client.solrj.impl.HttpSolrClient.request(HttpSolrClient.java:245) ~[java/:?]
   [junit4]   2> at org.apache.solr.client.solrj.SolrRequest.process(SolrRequest.java:207) ~[java/:?]
   [junit4]   2> at org.apache.solr.client.solrj.SolrClient.commit(SolrClient.java:504) ~[java/:?]
   [junit4]   2> at org.apache.solr.client.solrj.SolrClient.commit(SolrClient.java:479) ~[java/:?]
   [junit4]   2> at org.apache.solr.cloud.LeaderTragicEventTest.corruptLeader(LeaderTragicEventTest.java:124) [test/:?]
   [junit4]   2> at org.apache.solr.cloud.LeaderTragicEventTest.testOtherReplicasAreNotActive(LeaderTragicEventTest.java:183) [test/:?]
   [junit4]   2> at jdk.internal.reflect.Na

[...truncated too long message...]

trics.reporters.SolrJmxReporter@5b3ee906: rootName = solr_45619, domain = solr.node, service url = null, agent id = null] for registry solr.node / com.codahale.metrics.MetricRegistry@7b4ec1a6
   [junit4]   2> 109699 INFO  (jetty-closer-106-thread-1) [    ] o.a.s.m.SolrMetricManager Closing metric reporters for registry=solr.jvm, tag=null
   [junit4]   2> 109700 INFO  (jetty-closer-106-thread-1) [    ] o.a.s.m.r.SolrJmxReporter Closing reporter [org.apache.solr.metrics.reporters.SolrJmxReporter@38942052: rootName = solr_35081, domain = solr.jvm, service url = null, agent id = null] for registry solr.jvm / com.codahale.metrics.MetricRegistry@621cce93
   [junit4]   2> 109702 INFO  (jetty-closer-106-thread-2) [    ] o.a.s.m.SolrMetricManager Closing metric reporters for registry=solr.jvm, tag=null
   [junit4]   2> 109703 INFO  (jetty-closer-106-thread-2) [    ] o.a.s.m.r.SolrJmxReporter Closing reporter [org.apache.solr.metrics.reporters.SolrJmxReporter@58c48822: rootName = solr_45619, domain = solr.jvm, service url = null, agent id = null] for registry solr.jvm / com.codahale.metrics.MetricRegistry@621cce93
   [junit4]   2> 109704 INFO  (jetty-closer-106-thread-1) [    ] o.a.s.m.SolrMetricManager Closing metric reporters for registry=solr.jetty, tag=null
   [junit4]   2> 109704 INFO  (jetty-closer-106-thread-1) [    ] o.a.s.m.r.SolrJmxReporter Closing reporter [org.apache.solr.metrics.reporters.SolrJmxReporter@1d287a3d: rootName = solr_35081, domain = solr.jetty, service url = null, agent id = null] for registry solr.jetty / com.codahale.metrics.MetricRegistry@2cbfb0f5
   [junit4]   2> 109704 INFO  (jetty-closer-106-thread-1) [    ] o.a.s.m.SolrMetricManager Closing metric reporters for registry=solr.cluster, tag=null
   [junit4]   2> 109705 INFO  (closeThreadPool-111-thread-1) [    ] o.a.s.c.Overseer Overseer (id=72191922873106438-127.0.0.1:35081_solr-n_0000000000) closing
   [junit4]   2> 109705 INFO  (OverseerStateUpdate-72191922873106438-127.0.0.1:35081_solr-n_0000000000) [n:127.0.0.1:35081_solr    ] o.a.s.c.Overseer Overseer Loop exiting : 127.0.0.1:35081_solr
   [junit4]   1> Done close org.apache.solr.common.util.ExecutorUtil$MDCAwareThreadPoolExecutor@720ca29e[Terminated, pool size = 0, active threads = 0, queued tasks = 0, completed tasks = 1]
   [junit4]   2> 109708 INFO  (OverseerAutoScalingTriggerThread-72191922873106438-127.0.0.1:35081_solr-n_0000000000) [    ] o.a.s.c.a.OverseerTriggerThread OverseerTriggerThread woken up but we are closed, exiting.
   [junit4]   2> 109708 WARN  (NIOServerCxn.Factory:0.0.0.0/0.0.0.0:0) [    ] o.a.z.s.NIOServerCnxn Unable to read additional data from client sessionid 0x1007a2bde810008, likely client has closed socket
   [junit4]   1> Done close org.apache.solr.common.util.ExecutorUtil$MDCAwareThreadPoolExecutor@5cf5d9f1[Terminated, pool size = 0, active threads = 0, queued tasks = 0, completed tasks = 4]
   [junit4]   2> 109709 INFO  (zkCallback-90-thread-3) [    ] o.a.s.c.OverseerElectionContext I am going to be the leader 127.0.0.1:45619_solr
   [junit4]   2> 109709 INFO  (zkCallback-90-thread-2) [    ] o.a.s.c.c.ZkStateReader Updated live nodes from ZooKeeper... (2) -> (1)
   [junit4]   2> 109711 INFO  (zkCallback-98-thread-1) [    ] o.a.s.c.c.ZkStateReader Updated live nodes from ZooKeeper... (2) -> (1)
   [junit4]   2> 109712 INFO  (jetty-closer-106-thread-1) [    ] o.a.s.c.Overseer Overseer (id=72191922873106438-127.0.0.1:35081_solr-n_0000000000) closing
   [junit4]   2> 109712 INFO  (closeThreadPool-111-thread-2) [    ] o.a.s.c.Overseer Overseer (id=72191922873106438-127.0.0.1:35081_solr-n_0000000000) closing
   [junit4]   2> 109712 INFO  (jetty-closer-106-thread-2) [    ] o.a.s.m.SolrMetricManager Closing metric reporters for registry=solr.jetty, tag=null
   [junit4]   2> 109712 INFO  (jetty-closer-106-thread-2) [    ] o.a.s.m.r.SolrJmxReporter Closing reporter [org.apache.solr.metrics.reporters.SolrJmxReporter@3c1dd495: rootName = solr_45619, domain = solr.jetty, service url = null, agent id = null] for registry solr.jetty / com.codahale.metrics.MetricRegistry@2cbfb0f5
   [junit4]   2> 109712 INFO  (jetty-closer-106-thread-2) [    ] o.a.s.m.SolrMetricManager Closing metric reporters for registry=solr.cluster, tag=null
   [junit4]   1> Done close org.apache.solr.common.util.ExecutorUtil$MDCAwareThreadPoolExecutor@5fea96ad[Terminated, pool size = 0, active threads = 0, queued tasks = 0, completed tasks = 1]
   [junit4]   1> Done close org.apache.solr.common.util.ExecutorUtil$MDCAwareThreadPoolExecutor@71eca011[Terminated, pool size = 0, active threads = 0, queued tasks = 0, completed tasks = 1]
   [junit4]   2> 109715 INFO  (jetty-closer-106-thread-1) [    ] o.e.j.s.AbstractConnector Stopped ServerConnector@4d6f0d74{HTTP/1.1,[http/1.1, h2c]}{127.0.0.1:0}
   [junit4]   2> 109715 INFO  (jetty-closer-106-thread-1) [    ] o.e.j.s.h.ContextHandler Stopped o.e.j.s.ServletContextHandler@3535ed14{/solr,null,UNAVAILABLE}
   [junit4]   2> 109718 INFO  (jetty-closer-106-thread-1) [    ] o.e.j.s.session node0 Stopped scavenging
   [junit4]   2> 109724 INFO  (jetty-closer-106-thread-2) [    ] o.e.j.s.AbstractConnector Stopped ServerConnector@3759f3e4{HTTP/1.1,[http/1.1, h2c]}{127.0.0.1:0}
   [junit4]   2> 109724 INFO  (jetty-closer-106-thread-2) [    ] o.e.j.s.h.ContextHandler Stopped o.e.j.s.ServletContextHandler@3c7f0792{/solr,null,UNAVAILABLE}
   [junit4]   2> 109724 INFO  (jetty-closer-106-thread-2) [    ] o.e.j.s.session node0 Stopped scavenging
   [junit4]   2> 109725 INFO  (SUITE-LeaderTragicEventTest-seed#[33346B883441DD03]-worker) [    ] o.a.s.c.ZkTestServer Shutting down ZkTestServer.
   [junit4]   2> 109726 WARN  (ZkTestServer Run Thread) [    ] o.a.s.c.ZkTestServer Watch limit violations:
   [junit4]   2> Maximum concurrent create/delete watches above limit:
   [junit4]   2>
   [junit4]   2> 10 /solr/collections/collection1/terms/shard1
   [junit4]   2> 5 /solr/clusterprops.json
   [junit4]   2> 5 /solr/aliases.json
   [junit4]   2> 4 /solr/collections/collection2/terms/shard1
   [junit4]   2> 3 /solr/configs/config
   [junit4]   2> 2 /solr/security.json
   [junit4]   2> 2 /solr/collections/collection2/state.json
   [junit4]   2>
   [junit4]   2> Maximum concurrent data watches above limit:
   [junit4]   2>
   [junit4]   2> 11 /solr/collections/collection1/state.json
   [junit4]   2> 9 /solr/collections/collection2/state.json
   [junit4]   2> 5 /solr/clusterstate.json
   [junit4]   2>
   [junit4]   2> Maximum concurrent children watches above limit:
   [junit4]   2>
   [junit4]   2> 5 /solr/live_nodes
   [junit4]   2> 5 /solr/collections
   [junit4]   2>
   [junit4]   2> 109727 INFO  (SUITE-LeaderTragicEventTest-seed#[33346B883441DD03]-worker) [    ] o.a.s.c.ZkTestServer parse host and port list: 127.0.0.1:33005
   [junit4]   2> 109727 INFO  (SUITE-LeaderTragicEventTest-seed#[33346B883441DD03]-worker) [    ] o.a.s.c.ZkTestServer connecting to 127.0.0.1 33005
   [junit4]   2> NOTE: leaving temporary files on disk at: /home/jenkins/workspace/Lucene-Solr-8.x-Linux/solr/build/solr-core/test/J0/temp/solr.cloud.LeaderTragicEventTest_33346B883441DD03-002
   [junit4]   2> Jan 10, 2019 9:27:47 AM com.carrotsearch.randomizedtesting.ThreadLeakControl checkThreadLeaks
   [junit4]   2> WARNING: Will linger awaiting termination of 8 leaked thread(s).
   [junit4]   2> NOTE: test params are: codec=DummyCompressingStoredFields(storedFieldsFormat=CompressingStoredFieldsFormat(compressionMode=DUMMY, chunkSize=17163, maxDocsPerChunk=3, blockSize=8), termVectorsFormat=CompressingTermVectorsFormat(compressionMode=DUMMY, chunkSize=17163, blockSize=8)), sim=Asserting(org.apache.lucene.search.similarities.AssertingSimilarity@1a6485f2), locale=ca-ES, timezone=Africa/Gaborone
   [junit4]   2> NOTE: Linux 4.15.0-42-generic amd64/Oracle Corporation 12-ea (64-bit)/cpus=8,threads=1,free=359904528,total=518979584
   [junit4]   2> NOTE: All tests run in this JVM: [LeaderTragicEventTest, LeaderTragicEventTest]
   [junit4] Completed [5/5 (4!)] on J0 in 50.80s, 2 tests, 1 failure <<< FAILURES!

[...truncated 14 lines...]
BUILD FAILED
/home/jenkins/workspace/Lucene-Solr-8.x-Linux/lucene/common-build.xml:1572: The following error occurred while executing this line:
/home/jenkins/workspace/Lucene-Solr-8.x-Linux/lucene/common-build.xml:1099: There were test failures: 5 suites, 10 tests, 4 failures [seed: 33346B883441DD03]

Total time: 1 minute 52 seconds

[repro] Setting last failure code to 256

[repro] Failures:
[repro]   4/5 failed: org.apache.solr.cloud.LeaderTragicEventTest
[repro] Exiting with code 256
+ mv lucene/build lucene/build.repro
+ mv solr/build solr/build.repro
+ mv lucene/build.orig lucene/build
+ mv solr/build.orig solr/build
Archiving artifacts
Setting ANT_1_8_2_HOME=/home/jenkins/tools/hudson.tasks.Ant_AntInstallation/ANT_1.8.2
[WARNINGS] Parsing warnings in console log with parser Java Compiler (javac)
Setting ANT_1_8_2_HOME=/home/jenkins/tools/hudson.tasks.Ant_AntInstallation/ANT_1.8.2
Setting ANT_1_8_2_HOME=/home/jenkins/tools/hudson.tasks.Ant_AntInstallation/ANT_1.8.2
<Git Blamer> Using GitBlamer to create author and commit information for all warnings.
<Git Blamer> GIT_COMMIT=e5c7bb4ddfa1344042b36ef5d5744e8fb6a0d0ab, workspace=/home/jenkins/workspace/Lucene-Solr-8.x-Linux
[WARNINGS] Computing warning deltas based on reference build #7
Recording test results
Setting ANT_1_8_2_HOME=/home/jenkins/tools/hudson.tasks.Ant_AntInstallation/ANT_1.8.2
Build step 'Publish JUnit test result report' changed build result to UNSTABLE
Email was triggered for: Unstable (Test Failures)
Sending email for trigger: Unstable (Test Failures)
Setting ANT_1_8_2_HOME=/home/jenkins/tools/hudson.tasks.Ant_AntInstallation/ANT_1.8.2
Setting ANT_1_8_2_HOME=/home/jenkins/tools/hudson.tasks.Ant_AntInstallation/ANT_1.8.2
Setting ANT_1_8_2_HOME=/home/jenkins/tools/hudson.tasks.Ant_AntInstallation/ANT_1.8.2
Setting ANT_1_8_2_HOME=/home/jenkins/tools/hudson.tasks.Ant_AntInstallation/ANT_1.8.2


---------------------------------------------------------------------
To unsubscribe, e-mail: [hidden email]
For additional commands, e-mail: [hidden email]