[JENKINS-EA] Lucene-Solr-8.x-Linux (64bit/jdk-13-ea+shipilev-fastdebug) - Build # 404 - Unstable!

classic Classic list List threaded Threaded
4 messages Options
Reply | Threaded
Open this post in threaded view
|

[JENKINS-EA] Lucene-Solr-8.x-Linux (64bit/jdk-13-ea+shipilev-fastdebug) - Build # 404 - Unstable!

Policeman Jenkins Server-2
Build: https://jenkins.thetaphi.de/job/Lucene-Solr-8.x-Linux/404/
Java: 64bit/jdk-13-ea+shipilev-fastdebug -XX:-UseCompressedOops -XX:+UseSerialGC

2 tests failed.
FAILED:  org.apache.solr.handler.TestReplicationHandlerBackup.doTestBackup

Error Message:
no segments* file found in SimpleFSDirectory@/home/jenkins/workspace/Lucene-Solr-8.x-Linux/solr/build/solr-core/test/J2/temp/solr.handler.TestReplicationHandlerBackup_9F22F33D10E15A31-001/solr-instance-002/collection1/data/snapshot.xksemlsfq lockFactory=org.apache.lucene.store.NativeFSLockFactory@60af951d: files: [_0.cfe]

Stack Trace:
org.apache.lucene.index.IndexNotFoundException: no segments* file found in SimpleFSDirectory@/home/jenkins/workspace/Lucene-Solr-8.x-Linux/solr/build/solr-core/test/J2/temp/solr.handler.TestReplicationHandlerBackup_9F22F33D10E15A31-001/solr-instance-002/collection1/data/snapshot.xksemlsfq lockFactory=org.apache.lucene.store.NativeFSLockFactory@60af951d: files: [_0.cfe]
        at __randomizedtesting.SeedInfo.seed([9F22F33D10E15A31:DEA9D358375FA97E]:0)
        at org.apache.lucene.index.SegmentInfos$FindSegmentsFile.run(SegmentInfos.java:675)
        at org.apache.lucene.index.StandardDirectoryReader.open(StandardDirectoryReader.java:81)
        at org.apache.lucene.index.DirectoryReader.open(DirectoryReader.java:63)
        at org.apache.solr.handler.TestReplicationHandlerBackup.verify(TestReplicationHandlerBackup.java:146)
        at org.apache.solr.handler.TestReplicationHandlerBackup.doTestBackup(TestReplicationHandlerBackup.java:210)
        at java.base/jdk.internal.reflect.NativeMethodAccessorImpl.invoke0(Native Method)
        at java.base/jdk.internal.reflect.NativeMethodAccessorImpl.invoke(NativeMethodAccessorImpl.java:62)
        at java.base/jdk.internal.reflect.DelegatingMethodAccessorImpl.invoke(DelegatingMethodAccessorImpl.java:43)
        at java.base/java.lang.reflect.Method.invoke(Method.java:567)
        at com.carrotsearch.randomizedtesting.RandomizedRunner.invoke(RandomizedRunner.java:1750)
        at com.carrotsearch.randomizedtesting.RandomizedRunner$8.evaluate(RandomizedRunner.java:938)
        at com.carrotsearch.randomizedtesting.RandomizedRunner$9.evaluate(RandomizedRunner.java:974)
        at com.carrotsearch.randomizedtesting.RandomizedRunner$10.evaluate(RandomizedRunner.java:988)
        at com.carrotsearch.randomizedtesting.rules.SystemPropertiesRestoreRule$1.evaluate(SystemPropertiesRestoreRule.java:57)
        at org.apache.lucene.util.TestRuleSetupTeardownChained$1.evaluate(TestRuleSetupTeardownChained.java:49)
        at org.apache.lucene.util.AbstractBeforeAfterRule$1.evaluate(AbstractBeforeAfterRule.java:45)
        at org.apache.lucene.util.TestRuleThreadAndTestName$1.evaluate(TestRuleThreadAndTestName.java:48)
        at org.apache.lucene.util.TestRuleIgnoreAfterMaxFailures$1.evaluate(TestRuleIgnoreAfterMaxFailures.java:64)
        at org.apache.lucene.util.TestRuleMarkFailure$1.evaluate(TestRuleMarkFailure.java:47)
        at com.carrotsearch.randomizedtesting.rules.StatementAdapter.evaluate(StatementAdapter.java:36)
        at com.carrotsearch.randomizedtesting.ThreadLeakControl$StatementRunner.run(ThreadLeakControl.java:368)
        at com.carrotsearch.randomizedtesting.ThreadLeakControl.forkTimeoutingTask(ThreadLeakControl.java:817)
        at com.carrotsearch.randomizedtesting.ThreadLeakControl$3.evaluate(ThreadLeakControl.java:468)
        at com.carrotsearch.randomizedtesting.RandomizedRunner.runSingleTest(RandomizedRunner.java:947)
        at com.carrotsearch.randomizedtesting.RandomizedRunner$5.evaluate(RandomizedRunner.java:832)
        at com.carrotsearch.randomizedtesting.RandomizedRunner$6.evaluate(RandomizedRunner.java:883)
        at com.carrotsearch.randomizedtesting.RandomizedRunner$7.evaluate(RandomizedRunner.java:894)
        at com.carrotsearch.randomizedtesting.rules.StatementAdapter.evaluate(StatementAdapter.java:36)
        at com.carrotsearch.randomizedtesting.rules.SystemPropertiesRestoreRule$1.evaluate(SystemPropertiesRestoreRule.java:57)
        at org.apache.lucene.util.AbstractBeforeAfterRule$1.evaluate(AbstractBeforeAfterRule.java:45)
        at com.carrotsearch.randomizedtesting.rules.StatementAdapter.evaluate(StatementAdapter.java:36)
        at org.apache.lucene.util.TestRuleStoreClassName$1.evaluate(TestRuleStoreClassName.java:41)
        at com.carrotsearch.randomizedtesting.rules.NoShadowingOrOverridesOnMethodsRule$1.evaluate(NoShadowingOrOverridesOnMethodsRule.java:40)
        at com.carrotsearch.randomizedtesting.rules.NoShadowingOrOverridesOnMethodsRule$1.evaluate(NoShadowingOrOverridesOnMethodsRule.java:40)
        at com.carrotsearch.randomizedtesting.rules.StatementAdapter.evaluate(StatementAdapter.java:36)
        at com.carrotsearch.randomizedtesting.rules.StatementAdapter.evaluate(StatementAdapter.java:36)
        at org.apache.lucene.util.TestRuleAssertionsRequired$1.evaluate(TestRuleAssertionsRequired.java:53)
        at org.apache.lucene.util.TestRuleMarkFailure$1.evaluate(TestRuleMarkFailure.java:47)
        at org.apache.lucene.util.TestRuleIgnoreAfterMaxFailures$1.evaluate(TestRuleIgnoreAfterMaxFailures.java:64)
        at org.apache.lucene.util.TestRuleIgnoreTestSuites$1.evaluate(TestRuleIgnoreTestSuites.java:54)
        at com.carrotsearch.randomizedtesting.rules.StatementAdapter.evaluate(StatementAdapter.java:36)
        at com.carrotsearch.randomizedtesting.ThreadLeakControl$StatementRunner.run(ThreadLeakControl.java:368)
        at java.base/java.lang.Thread.run(Thread.java:835)


FAILED:  org.apache.solr.metrics.rrd.SolrRrdBackendFactoryTest.testBasic

Error Message:
{} expected:<1> but was:<0>

Stack Trace:
java.lang.AssertionError: {} expected:<1> but was:<0>
        at __randomizedtesting.SeedInfo.seed([9F22F33D10E15A31:34D8EE28CF3DDC1F]:0)
        at org.junit.Assert.fail(Assert.java:88)
        at org.junit.Assert.failNotEquals(Assert.java:834)
        at org.junit.Assert.assertEquals(Assert.java:645)
        at org.apache.solr.metrics.rrd.SolrRrdBackendFactoryTest.testBasic(SolrRrdBackendFactoryTest.java:92)
        at java.base/jdk.internal.reflect.NativeMethodAccessorImpl.invoke0(Native Method)
        at java.base/jdk.internal.reflect.NativeMethodAccessorImpl.invoke(NativeMethodAccessorImpl.java:62)
        at java.base/jdk.internal.reflect.DelegatingMethodAccessorImpl.invoke(DelegatingMethodAccessorImpl.java:43)
        at java.base/java.lang.reflect.Method.invoke(Method.java:567)
        at com.carrotsearch.randomizedtesting.RandomizedRunner.invoke(RandomizedRunner.java:1750)
        at com.carrotsearch.randomizedtesting.RandomizedRunner$8.evaluate(RandomizedRunner.java:938)
        at com.carrotsearch.randomizedtesting.RandomizedRunner$9.evaluate(RandomizedRunner.java:974)
        at com.carrotsearch.randomizedtesting.RandomizedRunner$10.evaluate(RandomizedRunner.java:988)
        at com.carrotsearch.randomizedtesting.rules.SystemPropertiesRestoreRule$1.evaluate(SystemPropertiesRestoreRule.java:57)
        at org.apache.lucene.util.TestRuleSetupTeardownChained$1.evaluate(TestRuleSetupTeardownChained.java:49)
        at org.apache.lucene.util.AbstractBeforeAfterRule$1.evaluate(AbstractBeforeAfterRule.java:45)
        at org.apache.lucene.util.TestRuleThreadAndTestName$1.evaluate(TestRuleThreadAndTestName.java:48)
        at org.apache.lucene.util.TestRuleIgnoreAfterMaxFailures$1.evaluate(TestRuleIgnoreAfterMaxFailures.java:64)
        at org.apache.lucene.util.TestRuleMarkFailure$1.evaluate(TestRuleMarkFailure.java:47)
        at com.carrotsearch.randomizedtesting.rules.StatementAdapter.evaluate(StatementAdapter.java:36)
        at com.carrotsearch.randomizedtesting.ThreadLeakControl$StatementRunner.run(ThreadLeakControl.java:368)
        at com.carrotsearch.randomizedtesting.ThreadLeakControl.forkTimeoutingTask(ThreadLeakControl.java:817)
        at com.carrotsearch.randomizedtesting.ThreadLeakControl$3.evaluate(ThreadLeakControl.java:468)
        at com.carrotsearch.randomizedtesting.RandomizedRunner.runSingleTest(RandomizedRunner.java:947)
        at com.carrotsearch.randomizedtesting.RandomizedRunner$5.evaluate(RandomizedRunner.java:832)
        at com.carrotsearch.randomizedtesting.RandomizedRunner$6.evaluate(RandomizedRunner.java:883)
        at com.carrotsearch.randomizedtesting.RandomizedRunner$7.evaluate(RandomizedRunner.java:894)
        at com.carrotsearch.randomizedtesting.rules.StatementAdapter.evaluate(StatementAdapter.java:36)
        at com.carrotsearch.randomizedtesting.rules.SystemPropertiesRestoreRule$1.evaluate(SystemPropertiesRestoreRule.java:57)
        at org.apache.lucene.util.AbstractBeforeAfterRule$1.evaluate(AbstractBeforeAfterRule.java:45)
        at com.carrotsearch.randomizedtesting.rules.StatementAdapter.evaluate(StatementAdapter.java:36)
        at org.apache.lucene.util.TestRuleStoreClassName$1.evaluate(TestRuleStoreClassName.java:41)
        at com.carrotsearch.randomizedtesting.rules.NoShadowingOrOverridesOnMethodsRule$1.evaluate(NoShadowingOrOverridesOnMethodsRule.java:40)
        at com.carrotsearch.randomizedtesting.rules.NoShadowingOrOverridesOnMethodsRule$1.evaluate(NoShadowingOrOverridesOnMethodsRule.java:40)
        at com.carrotsearch.randomizedtesting.rules.StatementAdapter.evaluate(StatementAdapter.java:36)
        at com.carrotsearch.randomizedtesting.rules.StatementAdapter.evaluate(StatementAdapter.java:36)
        at org.apache.lucene.util.TestRuleAssertionsRequired$1.evaluate(TestRuleAssertionsRequired.java:53)
        at org.apache.lucene.util.TestRuleMarkFailure$1.evaluate(TestRuleMarkFailure.java:47)
        at org.apache.lucene.util.TestRuleIgnoreAfterMaxFailures$1.evaluate(TestRuleIgnoreAfterMaxFailures.java:64)
        at org.apache.lucene.util.TestRuleIgnoreTestSuites$1.evaluate(TestRuleIgnoreTestSuites.java:54)
        at com.carrotsearch.randomizedtesting.rules.StatementAdapter.evaluate(StatementAdapter.java:36)
        at com.carrotsearch.randomizedtesting.ThreadLeakControl$StatementRunner.run(ThreadLeakControl.java:368)
        at java.base/java.lang.Thread.run(Thread.java:835)




Build Log:
[...truncated 15117 lines...]
   [junit4] Suite: org.apache.solr.handler.TestReplicationHandlerBackup
   [junit4]   2> 2895615 INFO  (SUITE-TestReplicationHandlerBackup-seed#[9F22F33D10E15A31]-worker) [    ] o.a.s.SolrTestCaseJ4 SecureRandom sanity checks: test.solr.allowed.securerandom=null & java.security.egd=file:/dev/./urandom
   [junit4]   2> Creating dataDir: /home/jenkins/workspace/Lucene-Solr-8.x-Linux/solr/build/solr-core/test/J2/temp/solr.handler.TestReplicationHandlerBackup_9F22F33D10E15A31-001/init-core-data-001
   [junit4]   2> 2895616 WARN  (SUITE-TestReplicationHandlerBackup-seed#[9F22F33D10E15A31]-worker) [    ] o.a.s.SolrTestCaseJ4 startTrackingSearchers: numOpens=32 numCloses=32
   [junit4]   2> 2895616 INFO  (SUITE-TestReplicationHandlerBackup-seed#[9F22F33D10E15A31]-worker) [    ] o.a.s.SolrTestCaseJ4 Using PointFields (NUMERIC_POINTS_SYSPROP=true) w/NUMERIC_DOCVALUES_SYSPROP=false
   [junit4]   2> 2895617 INFO  (SUITE-TestReplicationHandlerBackup-seed#[9F22F33D10E15A31]-worker) [    ] o.a.s.SolrTestCaseJ4 Randomized ssl (false) and clientAuth (false) via: @org.apache.solr.SolrTestCaseJ4$SuppressSSL(bugUrl="None")
   [junit4]   2> 2895620 INFO  (TEST-TestReplicationHandlerBackup.testBackupOnCommit-seed#[9F22F33D10E15A31]) [    ] o.a.s.SolrTestCaseJ4 ###Starting testBackupOnCommit
   [junit4]   2> 2895620 INFO  (TEST-TestReplicationHandlerBackup.testBackupOnCommit-seed#[9F22F33D10E15A31]) [    ] o.a.s.SolrTestCaseJ4 Writing core.properties file to /home/jenkins/workspace/Lucene-Solr-8.x-Linux/solr/build/solr-core/test/J2/temp/solr.handler.TestReplicationHandlerBackup_9F22F33D10E15A31-001/solr-instance-001/collection1
   [junit4]   2> 2895623 WARN  (TEST-TestReplicationHandlerBackup.testBackupOnCommit-seed#[9F22F33D10E15A31]) [    ] o.e.j.s.AbstractConnector Ignoring deprecated socket close linger time
   [junit4]   2> 2895626 INFO  (TEST-TestReplicationHandlerBackup.testBackupOnCommit-seed#[9F22F33D10E15A31]) [    ] o.a.s.c.s.e.JettySolrRunner Start Jetty (original configured port=0)
   [junit4]   2> 2895626 INFO  (TEST-TestReplicationHandlerBackup.testBackupOnCommit-seed#[9F22F33D10E15A31]) [    ] o.a.s.c.s.e.JettySolrRunner Trying to start Jetty on port 0 try number 1 ...
   [junit4]   2> 2895627 INFO  (TEST-TestReplicationHandlerBackup.testBackupOnCommit-seed#[9F22F33D10E15A31]) [    ] o.e.j.s.Server jetty-9.4.14.v20181114; built: 2018-11-14T21:20:31.478Z; git: c4550056e785fb5665914545889f21dc136ad9e6; jvm 13-testing+0-builds.shipilev.net-openjdk-jdk-b769-20190316-jdk-1312
   [junit4]   2> 2895683 INFO  (TEST-TestReplicationHandlerBackup.testBackupOnCommit-seed#[9F22F33D10E15A31]) [    ] o.e.j.s.session DefaultSessionIdManager workerName=node0
   [junit4]   2> 2895683 INFO  (TEST-TestReplicationHandlerBackup.testBackupOnCommit-seed#[9F22F33D10E15A31]) [    ] o.e.j.s.session No SessionScavenger set, using defaults
   [junit4]   2> 2895683 INFO  (TEST-TestReplicationHandlerBackup.testBackupOnCommit-seed#[9F22F33D10E15A31]) [    ] o.e.j.s.session node0 Scavenging every 600000ms
   [junit4]   2> 2895685 INFO  (TEST-TestReplicationHandlerBackup.testBackupOnCommit-seed#[9F22F33D10E15A31]) [    ] o.e.j.s.h.ContextHandler Started o.e.j.s.ServletContextHandler@55b92f6e{/solr,null,AVAILABLE}
   [junit4]   2> 2895725 INFO  (TEST-TestReplicationHandlerBackup.testBackupOnCommit-seed#[9F22F33D10E15A31]) [    ] o.e.j.s.AbstractConnector Started ServerConnector@1c427fc8{HTTP/1.1,[http/1.1, h2c]}{127.0.0.1:?????}
   [junit4]   2> 2895725 INFO  (TEST-TestReplicationHandlerBackup.testBackupOnCommit-seed#[9F22F33D10E15A31]) [    ] o.e.j.s.Server Started @???????ms
   [junit4]   2> 2895725 INFO  (TEST-TestReplicationHandlerBackup.testBackupOnCommit-seed#[9F22F33D10E15A31]) [    ] o.a.s.c.s.e.JettySolrRunner Jetty properties: {hostContext=/solr, solr.data.dir=/home/jenkins/workspace/Lucene-Solr-8.x-Linux/solr/build/solr-core/test/J2/temp/solr.handler.TestReplicationHandlerBackup_9F22F33D10E15A31-001/solr-instance-001/collection1/data, hostPort=41439}
   [junit4]   2> 2895726 ERROR (TEST-TestReplicationHandlerBackup.testBackupOnCommit-seed#[9F22F33D10E15A31]) [    ] o.a.s.u.StartupLoggingUtils Missing Java Option solr.log.dir. Logging may be missing or incomplete.
   [junit4]   2> 2895726 INFO  (TEST-TestReplicationHandlerBackup.testBackupOnCommit-seed#[9F22F33D10E15A31]) [    ] o.a.s.s.SolrDispatchFilter Using logger factory org.apache.logging.slf4j.Log4jLoggerFactory
   [junit4]   2> 2895726 INFO  (TEST-TestReplicationHandlerBackup.testBackupOnCommit-seed#[9F22F33D10E15A31]) [    ] o.a.s.s.SolrDispatchFilter  ___      _       Welcome to Apache Solr? version 8.1.0
   [junit4]   2> 2895726 INFO  (TEST-TestReplicationHandlerBackup.testBackupOnCommit-seed#[9F22F33D10E15A31]) [    ] o.a.s.s.SolrDispatchFilter / __| ___| |_ _   Starting in standalone mode on port null
   [junit4]   2> 2895726 INFO  (TEST-TestReplicationHandlerBackup.testBackupOnCommit-seed#[9F22F33D10E15A31]) [    ] o.a.s.s.SolrDispatchFilter \__ \/ _ \ | '_|  Install dir: null
   [junit4]   2> 2895726 INFO  (TEST-TestReplicationHandlerBackup.testBackupOnCommit-seed#[9F22F33D10E15A31]) [    ] o.a.s.s.SolrDispatchFilter |___/\___/_|_|    Start time: 2019-04-15T07:13:01.354714Z
   [junit4]   2> 2895727 INFO  (TEST-TestReplicationHandlerBackup.testBackupOnCommit-seed#[9F22F33D10E15A31]) [    ] o.a.s.c.SolrXmlConfig Loading container configuration from /home/jenkins/workspace/Lucene-Solr-8.x-Linux/solr/build/solr-core/test/J2/temp/solr.handler.TestReplicationHandlerBackup_9F22F33D10E15A31-001/solr-instance-001/solr.xml
   [junit4]   2> 2895731 INFO  (TEST-TestReplicationHandlerBackup.testBackupOnCommit-seed#[9F22F33D10E15A31]) [    ] o.a.s.c.SolrXmlConfig Configuration parameter autoReplicaFailoverWorkLoopDelay is ignored
   [junit4]   2> 2895731 INFO  (TEST-TestReplicationHandlerBackup.testBackupOnCommit-seed#[9F22F33D10E15A31]) [    ] o.a.s.c.SolrXmlConfig Configuration parameter autoReplicaFailoverBadNodeExpiration is ignored
   [junit4]   2> 2895733 INFO  (TEST-TestReplicationHandlerBackup.testBackupOnCommit-seed#[9F22F33D10E15A31]) [    ] o.a.s.c.SolrXmlConfig MBean server found: com.sun.jmx.mbeanserver.JmxMBeanServer@63caf1f9, but no JMX reporters were configured - adding default JMX reporter.
   [junit4]   2> 2895850 INFO  (TEST-TestReplicationHandlerBackup.testBackupOnCommit-seed#[9F22F33D10E15A31]) [    ] o.a.s.h.c.HttpShardHandlerFactory Host whitelist initialized: WhitelistHostChecker [whitelistHosts=null, whitelistHostCheckingEnabled=true]
   [junit4]   2> 2895872 WARN  (TEST-TestReplicationHandlerBackup.testBackupOnCommit-seed#[9F22F33D10E15A31]) [    ] o.e.j.u.s.S.config No Client EndPointIdentificationAlgorithm configured for SslContextFactory@9df1d48[provider=null,keyStore=null,trustStore=null]
   [junit4]   2> 2895904 WARN  (TEST-TestReplicationHandlerBackup.testBackupOnCommit-seed#[9F22F33D10E15A31]) [    ] o.e.j.u.s.S.config No Client EndPointIdentificationAlgorithm configured for SslContextFactory@27b78471[provider=null,keyStore=null,trustStore=null]
   [junit4]   2> 2896104 INFO  (TEST-TestReplicationHandlerBackup.testBackupOnCommit-seed#[9F22F33D10E15A31]) [    ] o.a.s.c.TransientSolrCoreCacheDefault Allocating transient cache for 4 transient cores
   [junit4]   2> 2896105 INFO  (TEST-TestReplicationHandlerBackup.testBackupOnCommit-seed#[9F22F33D10E15A31]) [    ] o.a.s.h.a.MetricsHistoryHandler No .system collection, keeping metrics history in memory.
   [junit4]   2> 2896224 INFO  (TEST-TestReplicationHandlerBackup.testBackupOnCommit-seed#[9F22F33D10E15A31]) [    ] o.a.s.m.r.SolrJmxReporter JMX monitoring for 'solr.node' (registry 'solr.node') enabled at server: com.sun.jmx.mbeanserver.JmxMBeanServer@63caf1f9
   [junit4]   2> 2896261 INFO  (TEST-TestReplicationHandlerBackup.testBackupOnCommit-seed#[9F22F33D10E15A31]) [    ] o.a.s.m.r.SolrJmxReporter JMX monitoring for 'solr.jvm' (registry 'solr.jvm') enabled at server: com.sun.jmx.mbeanserver.JmxMBeanServer@63caf1f9
   [junit4]   2> 2896261 INFO  (TEST-TestReplicationHandlerBackup.testBackupOnCommit-seed#[9F22F33D10E15A31]) [    ] o.a.s.m.r.SolrJmxReporter JMX monitoring for 'solr.jetty' (registry 'solr.jetty') enabled at server: com.sun.jmx.mbeanserver.JmxMBeanServer@63caf1f9
   [junit4]   2> 2896264 INFO  (TEST-TestReplicationHandlerBackup.testBackupOnCommit-seed#[9F22F33D10E15A31]) [    ] o.a.s.c.CorePropertiesLocator Found 1 core definitions underneath /home/jenkins/workspace/Lucene-Solr-8.x-Linux/solr/build/solr-core/test/J2/temp/solr.handler.TestReplicationHandlerBackup_9F22F33D10E15A31-001/solr-instance-001/.
   [junit4]   2> 2896264 INFO  (TEST-TestReplicationHandlerBackup.testBackupOnCommit-seed#[9F22F33D10E15A31]) [    ] o.a.s.c.CorePropertiesLocator Cores are: [collection1]
   [junit4]   2> 2896414 INFO  (coreLoadExecutor-9754-thread-1) [    x:collection1] o.a.s.c.SolrConfig Using Lucene MatchVersion: 8.1.0
   [junit4]   2> 2896422 INFO  (coreLoadExecutor-9754-thread-1) [    x:collection1] o.a.s.s.IndexSchema [collection1] Schema name=test
   [junit4]   2> 2896423 INFO  (coreLoadExecutor-9754-thread-1) [    x:collection1] o.a.s.s.IndexSchema Loaded schema test/1.2 with uniqueid field id
   [junit4]   2> 2896423 INFO  (coreLoadExecutor-9754-thread-1) [    x:collection1] o.a.s.c.CoreContainer Creating SolrCore 'collection1' using configuration from instancedir /home/jenkins/workspace/Lucene-Solr-8.x-Linux/solr/build/solr-core/test/J2/temp/solr.handler.TestReplicationHandlerBackup_9F22F33D10E15A31-001/solr-instance-001/./collection1, trusted=true
   [junit4]   2> 2896424 INFO  (coreLoadExecutor-9754-thread-1) [    x:collection1] o.a.s.m.r.SolrJmxReporter JMX monitoring for 'solr.core.collection1' (registry 'solr.core.collection1') enabled at server: com.sun.jmx.mbeanserver.JmxMBeanServer@63caf1f9
   [junit4]   2> 2896424 INFO  (coreLoadExecutor-9754-thread-1) [    x:collection1] o.a.s.c.SolrCore [[collection1] ] Opening new SolrCore at [/home/jenkins/workspace/Lucene-Solr-8.x-Linux/solr/build/solr-core/test/J2/temp/solr.handler.TestReplicationHandlerBackup_9F22F33D10E15A31-001/solr-instance-001/collection1], dataDir=[/home/jenkins/workspace/Lucene-Solr-8.x-Linux/solr/build/solr-core/test/J2/temp/solr.handler.TestReplicationHandlerBackup_9F22F33D10E15A31-001/solr-instance-001/./collection1/data/]
   [junit4]   2> 2896428 INFO  (coreLoadExecutor-9754-thread-1) [    x:collection1] o.a.s.u.RandomMergePolicy RandomMergePolicy wrapping class org.apache.lucene.index.TieredMergePolicy: [TieredMergePolicy: maxMergeAtOnce=32, maxMergeAtOnceExplicit=29, maxMergedSegmentMB=80.517578125, floorSegmentMB=0.6708984375, forceMergeDeletesPctAllowed=10.285064620348045, segmentsPerTier=20.0, maxCFSSegmentSizeMB=8.796093022207999E12, noCFSRatio=0.6099042677909225, deletesPctAllowed=40.23045094776345
   [junit4]   2> 2896498 INFO  (coreLoadExecutor-9754-thread-1) [    x:collection1] o.a.s.u.CommitTracker Hard AutoCommit: disabled
   [junit4]   2> 2896498 INFO  (coreLoadExecutor-9754-thread-1) [    x:collection1] o.a.s.u.CommitTracker Soft AutoCommit: disabled
   [junit4]   2> 2896499 INFO  (coreLoadExecutor-9754-thread-1) [    x:collection1] o.a.s.u.RandomMergePolicy RandomMergePolicy wrapping class org.apache.lucene.index.LogByteSizeMergePolicy: [LogByteSizeMergePolicy: minMergeSize=1677721, mergeFactor=38, maxMergeSize=2147483648, maxMergeSizeForForcedMerge=9223372036854775807, calibrateSizeByDeletes=true, maxMergeDocs=2147483647, maxCFSSegmentSizeMB=8.796093022207999E12, noCFSRatio=1.0]
   [junit4]   2> 2896499 INFO  (coreLoadExecutor-9754-thread-1) [    x:collection1] o.a.s.s.SolrIndexSearcher Opening [Searcher@4717d954[collection1] main]
   [junit4]   2> 2896500 INFO  (coreLoadExecutor-9754-thread-1) [    x:collection1] o.a.s.r.ManagedResourceStorage File-based storage initialized to use dir: /home/jenkins/workspace/Lucene-Solr-8.x-Linux/solr/build/solr-core/test/J2/temp/solr.handler.TestReplicationHandlerBackup_9F22F33D10E15A31-001/solr-instance-001/collection1/conf
   [junit4]   2> 2896501 INFO  (coreLoadExecutor-9754-thread-1) [    x:collection1] o.a.s.h.ReplicationHandler Replication enabled for following config files: schema-replication2.xml:schema.xml
   [junit4]   2> 2896501 INFO  (coreLoadExecutor-9754-thread-1) [    x:collection1] o.a.s.h.ReplicationHandler Commits will be reserved for 10000ms.
   [junit4]   2> 2896501 INFO  (searcherExecutor-9755-thread-1-processing-x:collection1) [    x:collection1] o.a.s.c.SolrCore [collection1] Registered new searcher Searcher@4717d954[collection1] main{ExitableDirectoryReader(UninvertingDirectoryReader())}
   [junit4]   2> 2896534 INFO  (qtp578123243-28470) [    x:collection1] o.a.s.u.DirectUpdateHandler2 [collection1] REMOVING ALL DOCUMENTS FROM INDEX
   [junit4]   2> 2896534 INFO  (qtp578123243-28470) [    x:collection1] o.a.s.u.p.LogUpdateProcessorFactory [collection1]  webapp=/solr path=/update params={wt=javabin&version=2}{deleteByQuery=*:*} 0 0
   [junit4]   2> 2896534 INFO  (TEST-TestReplicationHandlerBackup.testBackupOnCommit-seed#[9F22F33D10E15A31]) [    ] o.a.s.h.BackupRestoreUtils Indexing 99 test docs
   [junit4]   2> 2896536 INFO  (qtp578123243-28471) [    x:collection1] o.a.s.u.p.LogUpdateProcessorFactory [collection1]  webapp=/solr path=/update params={wt=javabin&version=2}{add=[0, 1, 2, 3, 4, 5, 6, 7, 8, 9, ... (99 adds)]} 0 0
   [junit4]   2> 2896536 INFO  (qtp578123243-28469) [    x:collection1] o.a.s.u.DirectUpdateHandler2 start commit{,optimize=false,openSearcher=true,waitSearcher=true,expungeDeletes=false,softCommit=false,prepareCommit=false}
   [junit4]   2> 2896536 INFO  (qtp578123243-28469) [    x:collection1] o.a.s.u.SolrIndexWriter Calling setCommitData with IW:org.apache.solr.update.SolrIndexWriter@d2eda5b commitCommandVersion:0
   [junit4]   2> 2896541 INFO  (qtp578123243-28469) [    x:collection1] o.a.s.s.SolrIndexSearcher Opening [Searcher@237e16af[collection1] main]
   [junit4]   2> 2896542 INFO  (qtp578123243-28469) [    x:collection1] o.a.s.u.DirectUpdateHandler2 end_commit_flush
   [junit4]   2> 2896542 INFO  (Thread-4521) [    ] o.a.s.h.SnapShooter Creating backup snapshot <not named> at file:///home/jenkins/workspace/Lucene-Solr-8.x-Linux/solr/build/solr-core/test/J2/temp/solr.handler.TestReplicationHandlerBackup_9F22F33D10E15A31-001/solr-instance-001/./collection1/data/
   [junit4]   2> 2896544 INFO  (searcherExecutor-9755-thread-1-processing-x:collection1) [    x:collection1] o.a.s.c.SolrCore [collection1] Registered new searcher Searcher@237e16af[collection1] main{ExitableDirectoryReader(UninvertingDirectoryReader(Uninverting(_0(8.1.0):c99:[diagnostics={os=Linux, java.vendor=Aleksey Shipilev, java.version=13-testing, java.vm.version=13-testing+0-builds.shipilev.net-openjdk-jdk-b769-20190316-jdk-1312, lucene.version=8.1.0, os.arch=amd64, java.runtime.version=13-testing+0-builds.shipilev.net-openjdk-jdk-b769-20190316-jdk-1312, source=flush, os.version=4.18.0-17-generic, timestamp=1555312382166}]:[attributes={Lucene50StoredFieldsFormat.mode=BEST_SPEED}])))}
   [junit4]   2> 2896545 INFO  (qtp578123243-28469) [    x:collection1] o.a.s.u.p.LogUpdateProcessorFactory [collection1]  webapp=/solr path=/update params={waitSearcher=true&commit=true&softCommit=false&wt=javabin&version=2}{commit=} 0 8
   [junit4]   2> 2896548 INFO  (Thread-4521) [    ] o.a.s.h.SnapShooter Done creating backup snapshot: <not named> at file:///home/jenkins/workspace/Lucene-Solr-8.x-Linux/solr/build/solr-core/test/J2/temp/solr.handler.TestReplicationHandlerBackup_9F22F33D10E15A31-001/solr-instance-001/./collection1/data/
   [junit4]   2> 2896654 INFO  (qtp578123243-28471) [    x:collection1] o.a.s.c.S.Request [collection1]  webapp=/solr path=/replication params={wt=xml&command=details} status=0 QTime=0
   [junit4]   2> 2897659 INFO  (TEST-TestReplicationHandlerBackup.testBackupOnCommit-seed#[9F22F33D10E15A31]) [    ] o.a.s.SolrTestCaseJ4 ###Ending testBackupOnCommit
   [junit4]   2> 2897660 INFO  (TEST-TestReplicationHandlerBackup.testBackupOnCommit-seed#[9F22F33D10E15A31]) [    ] o.a.s.c.CoreContainer Shutting down CoreContainer instance=545788767
   [junit4]   2> 2897660 INFO  (coreCloseExecutor-9759-thread-1) [    x:collection1] o.a.s.c.SolrCore [collection1]  CLOSING SolrCore org.apache.solr.core.SolrCore@13d81afa
   [junit4]   2> 2897661 INFO  (coreCloseExecutor-9759-thread-1) [    x:collection1] o.a.s.m.SolrMetricManager Closing metric reporters for registry=solr.core.collection1, tag=13d81afa
   [junit4]   2> 2897661 INFO  (coreCloseExecutor-9759-thread-1) [    x:collection1] o.a.s.m.r.SolrJmxReporter Closing reporter [org.apache.solr.metrics.reporters.SolrJmxReporter@3021030b: rootName = null, domain = solr.core.collection1, service url = null, agent id = null] for registry solr.core.collection1 / com.codahale.metrics.MetricRegistry@62e0856e
   [junit4]   2> 2897680 INFO  (TEST-TestReplicationHandlerBackup.testBackupOnCommit-seed#[9F22F33D10E15A31]) [    ] o.a.s.m.SolrMetricManager Closing metric reporters for registry=solr.node, tag=null
   [junit4]   2> 2897680 INFO  (TEST-TestReplicationHandlerBackup.testBackupOnCommit-seed#[9F22F33D10E15A31]) [    ] o.a.s.m.r.SolrJmxReporter Closing reporter [org.apache.solr.metrics.reporters.SolrJmxReporter@29611ec6: rootName = null, domain = solr.node, service url = null, agent id = null] for registry solr.node / com.codahale.metrics.MetricRegistry@7fbce5c5
   [junit4]   2> 2897694 INFO  (TEST-TestReplicationHandlerBackup.testBackupOnCommit-seed#[9F22F33D10E15A31]) [    ] o.a.s.m.SolrMetricManager Closing metric reporters for registry=solr.jvm, tag=null
   [junit4]   2> 2897694 INFO  (TEST-TestReplicationHandlerBackup.testBackupOnCommit-seed#[9F22F33D10E15A31]) [    ] o.a.s.m.r.SolrJmxReporter Closing reporter [org.apache.solr.metrics.reporters.SolrJmxReporter@5aa9da9c: rootName = null, domain = solr.jvm, service url = null, agent id = null] for registry solr.jvm / com.codahale.metrics.MetricRegistry@780056aa
   [junit4]   2> 2897703 INFO  (TEST-TestReplicationHandlerBackup.testBackupOnCommit-seed#[9F22F33D10E15A31]) [    ] o.a.s.m.SolrMetricManager Closing metric reporters for registry=solr.jetty, tag=null
   [junit4]   2> 2897703 INFO  (TEST-TestReplicationHandlerBackup.testBackupOnCommit-seed#[9F22F33D10E15A31]) [    ] o.a.s.m.r.SolrJmxReporter Closing reporter [org.apache.solr.metrics.reporters.SolrJmxReporter@55291272: rootName = null, domain = solr.jetty, service url = null, agent id = null] for registry solr.jetty / com.codahale.metrics.MetricRegistry@20462f9a
   [junit4]   2> 2897707 INFO  (TEST-TestReplicationHandlerBackup.testBackupOnCommit-seed#[9F22F33D10E15A31]) [    ] o.e.j.s.AbstractConnector Stopped ServerConnector@1c427fc8{HTTP/1.1,[http/1.1, h2c]}{127.0.0.1:?}
   [junit4]   2> 2897707 INFO  (TEST-TestReplicationHandlerBackup.testBackupOnCommit-seed#[9F22F33D10E15A31]) [    ] o.e.j.s.h.ContextHandler Stopped o.e.j.s.ServletContextHandler@55b92f6e{/solr,null,UNAVAILABLE}
   [junit4]   2> 2897707 INFO  (TEST-TestReplicationHandlerBackup.testBackupOnCommit-seed#[9F22F33D10E15A31]) [    ] o.e.j.s.session node0 Stopped scavenging
   [junit4]   2> 2897714 INFO  (TEST-TestReplicationHandlerBackup.doTestBackup-seed#[9F22F33D10E15A31]) [    ] o.a.s.SolrTestCaseJ4 ###Starting doTestBackup
   [junit4]   2> 2897715 INFO  (TEST-TestReplicationHandlerBackup.doTestBackup-seed#[9F22F33D10E15A31]) [    ] o.a.s.SolrTestCaseJ4 Writing core.properties file to /home/jenkins/workspace/Lucene-Solr-8.x-Linux/solr/build/solr-core/test/J2/temp/solr.handler.TestReplicationHandlerBackup_9F22F33D10E15A31-001/solr-instance-002/collection1
   [junit4]   2> 2897721 WARN  (TEST-TestReplicationHandlerBackup.doTestBackup-seed#[9F22F33D10E15A31]) [    ] o.e.j.s.AbstractConnector Ignoring deprecated socket close linger time
   [junit4]   2> 2897725 INFO  (TEST-TestReplicationHandlerBackup.doTestBackup-seed#[9F22F33D10E15A31]) [    ] o.a.s.c.s.e.JettySolrRunner Start Jetty (original configured port=0)
   [junit4]   2> 2897725 INFO  (TEST-TestReplicationHandlerBackup.doTestBackup-seed#[9F22F33D10E15A31]) [    ] o.a.s.c.s.e.JettySolrRunner Trying to start Jetty on port 0 try number 1 ...
   [junit4]   2> 2897725 INFO  (TEST-TestReplicationHandlerBackup.doTestBackup-seed#[9F22F33D10E15A31]) [    ] o.e.j.s.Server jetty-9.4.14.v20181114; built: 2018-11-14T21:20:31.478Z; git: c4550056e785fb5665914545889f21dc136ad9e6; jvm 13-testing+0-builds.shipilev.net-openjdk-jdk-b769-20190316-jdk-1312
   [junit4]   2> 2897754 INFO  (TEST-TestReplicationHandlerBackup.doTestBackup-seed#[9F22F33D10E15A31]) [    ] o.e.j.s.session DefaultSessionIdManager workerName=node0
   [junit4]   2> 2897754 INFO  (TEST-TestReplicationHandlerBackup.doTestBackup-seed#[9F22F33D10E15A31]) [    ] o.e.j.s.session No SessionScavenger set, using defaults
   [junit4]   2> 2897754 INFO  (TEST-TestReplicationHandlerBackup.doTestBackup-seed#[9F22F33D10E15A31]) [    ] o.e.j.s.session node0 Scavenging every 660000ms
   [junit4]   2> 2897754 INFO  (TEST-TestReplicationHandlerBackup.doTestBackup-seed#[9F22F33D10E15A31]) [    ] o.e.j.s.h.ContextHandler Started o.e.j.s.ServletContextHandler@1c6e4b47{/solr,null,AVAILABLE}
   [junit4]   2> 2897754 INFO  (TEST-TestReplicationHandlerBackup.doTestBackup-seed#[9F22F33D10E15A31]) [    ] o.e.j.s.AbstractConnector Started ServerConnector@38b58e5c{HTTP/1.1,[http/1.1, h2c]}{127.0.0.1:?????}
   [junit4]   2> 2897755 INFO  (TEST-TestReplicationHandlerBackup.doTestBackup-seed#[9F22F33D10E15A31]) [    ] o.e.j.s.Server Started @???????ms
   [junit4]   2> 2897755 INFO  (TEST-TestReplicationHandlerBackup.doTestBackup-seed#[9F22F33D10E15A31]) [    ] o.a.s.c.s.e.JettySolrRunner Jetty properties: {hostContext=/solr, solr.data.dir=/home/jenkins/workspace/Lucene-Solr-8.x-Linux/solr/build/solr-core/test/J2/temp/solr.handler.TestReplicationHandlerBackup_9F22F33D10E15A31-001/solr-instance-002/collection1/data, hostPort=44295}
   [junit4]   2> 2897755 ERROR (TEST-TestReplicationHandlerBackup.doTestBackup-seed#[9F22F33D10E15A31]) [    ] o.a.s.u.StartupLoggingUtils Missing Java Option solr.log.dir. Logging may be missing or incomplete.
   [junit4]   2> 2897755 INFO  (TEST-TestReplicationHandlerBackup.doTestBackup-seed#[9F22F33D10E15A31]) [    ] o.a.s.s.SolrDispatchFilter Using logger factory org.apache.logging.slf4j.Log4jLoggerFactory
   [junit4]   2> 2897756 INFO  (TEST-TestReplicationHandlerBackup.doTestBackup-seed#[9F22F33D10E15A31]) [    ] o.a.s.s.SolrDispatchFilter  ___      _       Welcome to Apache Solr? version 8.1.0
   [junit4]   2> 2897756 INFO  (TEST-TestReplicationHandlerBackup.doTestBackup-seed#[9F22F33D10E15A31]) [    ] o.a.s.s.SolrDispatchFilter / __| ___| |_ _   Starting in standalone mode on port null
   [junit4]   2> 2897756 INFO  (TEST-TestReplicationHandlerBackup.doTestBackup-seed#[9F22F33D10E15A31]) [    ] o.a.s.s.SolrDispatchFilter \__ \/ _ \ | '_|  Install dir: null
   [junit4]   2> 2897756 INFO  (TEST-TestReplicationHandlerBackup.doTestBackup-seed#[9F22F33D10E15A31]) [    ] o.a.s.s.SolrDispatchFilter |___/\___/_|_|    Start time: 2019-04-15T07:13:03.384379Z
   [junit4]   2> 2897757 INFO  (TEST-TestReplicationHandlerBackup.doTestBackup-seed#[9F22F33D10E15A31]) [    ] o.a.s.c.SolrXmlConfig Loading container configuration from /home/jenkins/workspace/Lucene-Solr-8.x-Linux/solr/build/solr-core/test/J2/temp/solr.handler.TestReplicationHandlerBackup_9F22F33D10E15A31-001/solr-instance-002/solr.xml
   [junit4]   2> 2897761 INFO  (TEST-TestReplicationHandlerBackup.doTestBackup-seed#[9F22F33D10E15A31]) [    ] o.a.s.c.SolrXmlConfig Configuration parameter autoReplicaFailoverWorkLoopDelay is ignored
   [junit4]   2> 2897761 INFO  (TEST-TestReplicationHandlerBackup.doTestBackup-seed#[9F22F33D10E15A31]) [    ] o.a.s.c.SolrXmlConfig Configuration parameter autoReplicaFailoverBadNodeExpiration is ignored
   [junit4]   2> 2897763 INFO  (TEST-TestReplicationHandlerBackup.doTestBackup-seed#[9F22F33D10E15A31]) [    ] o.a.s.c.SolrXmlConfig MBean server found: com.sun.jmx.mbeanserver.JmxMBeanServer@63caf1f9, but no JMX reporters were configured - adding default JMX reporter.
   [junit4]   2> 2897999 INFO  (TEST-TestReplicationHandlerBackup.doTestBackup-seed#[9F22F33D10E15A31]) [    ] o.a.s.h.c.HttpShardHandlerFactory Host whitelist initialized: WhitelistHostChecker [whitelistHosts=null, whitelistHostCheckingEnabled=true]
   [junit4]   2> 2898000 WARN  (TEST-TestReplicationHandlerBackup.doTestBackup-seed#[9F22F33D10E15A31]) [    ] o.e.j.u.s.S.config No Client EndPointIdentificationAlgorithm configured for SslContextFactory@a3b69d3[provider=null,keyStore=null,trustStore=null]
   [junit4]   2> 2898003 WARN  (TEST-TestReplicationHandlerBackup.doTestBackup-seed#[9F22F33D10E15A31]) [    ] o.e.j.u.s.S.config No Client EndPointIdentificationAlgorithm configured for SslContextFactory@7094898a[provider=null,keyStore=null,trustStore=null]
   [junit4]   2> 2898026 INFO  (TEST-TestReplicationHandlerBackup.doTestBackup-seed#[9F22F33D10E15A31]) [    ] o.a.s.c.TransientSolrCoreCacheDefault Allocating transient cache for 4 transient cores
   [junit4]   2> 2898026 INFO  (TEST-TestReplicationHandlerBackup.doTestBackup-seed#[9F22F33D10E15A31]) [    ] o.a.s.h.a.MetricsHistoryHandler No .system collection, keeping metrics history in memory.
   [junit4]   2> 2898064 INFO  (TEST-TestReplicationHandlerBackup.doTestBackup-seed#[9F22F33D10E15A31]) [    ] o.a.s.m.r.SolrJmxReporter JMX monitoring for 'solr.node' (registry 'solr.node') enabled at server: com.sun.jmx.mbeanserver.JmxMBeanServer@63caf1f9
   [junit4]   2> 2898101 INFO  (TEST-TestReplicationHandlerBackup.doTestBackup-seed#[9F22F33D10E15A31]) [    ] o.a.s.m.r.SolrJmxReporter JMX monitoring for 'solr.jvm' (registry 'solr.jvm') enabled at server: com.sun.jmx.mbeanserver.JmxMBeanServer@63caf1f9
   [junit4]   2> 2898101 INFO  (TEST-TestReplicationHandlerBackup.doTestBackup-seed#[9F22F33D10E15A31]) [    ] o.a.s.m.r.SolrJmxReporter JMX monitoring for 'solr.jetty' (registry 'solr.jetty') enabled at server: com.sun.jmx.mbeanserver.JmxMBeanServer@63caf1f9
   [junit4]   2> 2898105 INFO  (TEST-TestReplicationHandlerBackup.doTestBackup-seed#[9F22F33D10E15A31]) [    ] o.a.s.c.CorePropertiesLocator Found 1 core definitions underneath /home/jenkins/workspace/Lucene-Solr-8.x-Linux/solr/build/solr-core/test/J2/temp/solr.handler.TestReplicationHandlerBackup_9F22F33D10E15A31-001/solr-instance-002/.
   [junit4]   2> 2898105 INFO  (TEST-TestReplicationHandlerBackup.doTestBackup-seed#[9F22F33D10E15A31]) [    ] o.a.s.c.CorePropertiesLocator Cores are: [collection1]
   [junit4]   2> 2898122 INFO  (coreLoadExecutor-9769-thread-1) [    x:collection1] o.a.s.c.SolrConfig Using Lucene MatchVersion: 8.1.0
   [junit4]   2> 2898131 INFO  (coreLoadExecutor-9769-thread-1) [    x:collection1] o.a.s.s.IndexSchema [collection1] Schema name=test
   [junit4]   2> 2898132 INFO  (coreLoadExecutor-9769-thread-1) [    x:collection1] o.a.s.s.IndexSchema Loaded schema test/1.2 with uniqueid field id
   [junit4]   2> 2898132 INFO  (coreLoadExecutor-9769-thread-1) [    x:collection1] o.a.s.c.CoreContainer Creating SolrCore 'collection1' using configuration from instancedir /home/jenkins/workspace/Lucene-Solr-8.x-Linux/solr/build/solr-core/test/J2/temp/solr.handler.TestReplicationHandlerBackup_9F22F33D10E15A31-001/solr-instance-002/./collection1, trusted=true
   [junit4]   2> 2898132 INFO  (coreLoadExecutor-9769-thread-1) [    x:collection1] o.a.s.m.r.SolrJmxReporter JMX monitoring for 'solr.core.collection1' (registry 'solr.core.collection1') enabled at server: com.sun.jmx.mbeanserver.JmxMBeanServer@63caf1f9
   [junit4]   2> 2898133 INFO  (coreLoadExecutor-9769-thread-1) [    x:collection1] o.a.s.c.SolrCore [[collection1] ] Opening new SolrCore at [/home/jenkins/workspace/Lucene-Solr-8.x-Linux/solr/build/solr-core/test/J2/temp/solr.handler.TestReplicationHandlerBackup_9F22F33D10E15A31-001/solr-instance-002/collection1], dataDir=[/home/jenkins/workspace/Lucene-Solr-8.x-Linux/solr/build/solr-core/test/J2/temp/solr.handler.TestReplicationHandlerBackup_9F22F33D10E15A31-001/solr-instance-002/./collection1/data/]
   [junit4]   2> 2898135 INFO  (coreLoadExecutor-9769-thread-1) [    x:collection1] o.a.s.u.RandomMergePolicy RandomMergePolicy wrapping class org.apache.lucene.index.TieredMergePolicy: [TieredMergePolicy: maxMergeAtOnce=32, maxMergeAtOnceExplicit=29, maxMergedSegmentMB=80.517578125, floorSegmentMB=0.6708984375, forceMergeDeletesPctAllowed=10.285064620348045, segmentsPerTier=20.0, maxCFSSegmentSizeMB=8.796093022207999E12, noCFSRatio=0.6099042677909225, deletesPctAllowed=40.23045094776345
   [junit4]   2> 2898192 INFO  (coreLoadExecutor-9769-thread-1) [    x:collection1] o.a.s.u.CommitTracker Hard AutoCommit: disabled
   [junit4]   2> 2898192 INFO  (coreLoadExecutor-9769-thread-1) [    x:collection1] o.a.s.u.CommitTracker Soft AutoCommit: disabled
   [junit4]   2> 2898194 INFO  (coreLoadExecutor-9769-thread-1) [    x:collection1] o.a.s.u.RandomMergePolicy RandomMergePolicy wrapping class org.apache.lucene.index.LogByteSizeMergePolicy: [LogByteSizeMergePolicy: minMergeSize=1677721, mergeFactor=38, maxMergeSize=2147483648, maxMergeSizeForForcedMerge=9223372036854775807, calibrateSizeByDeletes=true, maxMergeDocs=2147483647, maxCFSSegmentSizeMB=8.796093022207999E12, noCFSRatio=1.0]
   [junit4]   2> 2898194 INFO  (coreLoadExecutor-9769-thread-1) [    x:collection1] o.a.s.s.SolrIndexSearcher Opening [Searcher@23ac5365[collection1] main]
   [junit4]   2> 2898194 INFO  (coreLoadExecutor-9769-thread-1) [    x:collection1] o.a.s.r.ManagedResourceStorage File-based storage initialized to use dir: /home/jenkins/workspace/Lucene-Solr-8.x-Linux/solr/build/solr-core/test/J2/temp/solr.handler.TestReplicationHandlerBackup_9F22F33D10E15A31-001/solr-instance-002/collection1/conf
   [junit4]   2> 2898195 INFO  (coreLoadExecutor-9769-thread-1) [    x:collection1] o.a.s.h.ReplicationHandler Replication enabled for following config files: schema-replication2.xml:schema.xml
   [junit4]   2> 2898195 INFO  (coreLoadExecutor-9769-thread-1) [    x:collection1] o.a.s.h.ReplicationHandler Commits will be reserved for 10000ms.
   [junit4]   2> 2898197 INFO  (searcherExecutor-9770-thread-1-processing-x:collection1) [    x:collection1] o.a.s.c.SolrCore [collection1] Registered new searcher Searcher@23ac5365[collection1] main{ExitableDirectoryReader(UninvertingDirectoryReader())}
   [junit4]   2> 2898206 INFO  (qtp1671016692-28497) [    x:collection1] o.a.s.u.DirectUpdateHandler2 [collection1] REMOVING ALL DOCUMENTS FROM INDEX
   [junit4]   2> 2898206 INFO  (qtp1671016692-28497) [    x:collection1] o.a.s.u.p.LogUpdateProcessorFactory [collection1]  webapp=/solr path=/update params={wt=javabin&version=2}{deleteByQuery=*:*} 0 0
   [junit4]   2> 2898206 INFO  (TEST-TestReplicationHandlerBackup.doTestBackup-seed#[9F22F33D10E15A31]) [    ] o.a.s.h.BackupRestoreUtils Indexing 55 test docs
   [junit4]   2> 2898208 INFO  (qtp1671016692-28498) [    x:collection1] o.a.s.u.p.LogUpdateProcessorFactory [collection1]  webapp=/solr path=/update params={wt=javabin&version=2}{add=[0, 1, 2, 3, 4, 5, 6, 7, 8, 9, ... (55 adds)]} 0 0
   [junit4]   2> 2898209 INFO  (qtp1671016692-28496) [    x:collection1] o.a.s.u.DirectUpdateHandler2 start commit{,optimize=false,openSearcher=true,waitSearcher=true,expungeDeletes=false,softCommit=false,prepareCommit=false}
   [junit4]   2> 2898209 INFO  (qtp1671016692-28496) [    x:collection1] o.a.s.u.SolrIndexWriter Calling setCommitData with IW:org.apache.solr.update.SolrIndexWriter@2119e178 commitCommandVersion:0
   [junit4]   2> 2898214 INFO  (Thread-4531) [    ] o.a.s.h.SnapShooter Creating backup snapshot <not named> at file:///home/jenkins/workspace/Lucene-Solr-8.x-Linux/solr/build/solr-core/test/J2/temp/solr.handler.TestReplicationHandlerBackup_9F22F33D10E15A31-001/solr-instance-002/./collection1/data/
   [junit4]   2> 2898215 INFO  (qtp1671016692-28496) [    x:collection1] o.a.s.s.SolrIndexSearcher Opening [Searcher@1d47e4c3[collection1] main]
   [junit4]   2> 2898215 INFO  (Thread-4531) [    ] o.a.s.h.SnapShooter Done creating backup snapshot: <not named> at file:///home/jenkins/workspace/Lucene-Solr-8.x-Linux/solr/build/solr-core/test/J2/temp/solr.handler.TestReplicationHandlerBackup_9F22F33D10E15A31-001/solr-instance-002/./collection1/data/
   [junit4]   2> 2898216 INFO  (qtp1671016692-28496) [    x:collection1] o.a.s.u.DirectUpdateHandler2 end_commit_flush
   [junit4]   2> 2898218 INFO  (searcherExecutor-9770-thread-1-processing-x:collection1) [    x:collection1] o.a.s.c.SolrCore [collection1] Registered new searcher Searcher@1d47e4c3[collection1] main{ExitableDirectoryReader(UninvertingDirectoryReader(Uninverting(_0(8.1.0):c55:[diagnostics={os=Linux, java.vendor=Aleksey Shipilev, java.version=13-testing, java.vm.version=13-testing+0-builds.shipilev.net-openjdk-jdk-b769-20190316-jdk-1312, lucene.version=8.1.0, os.arch=amd64, java.runtime.version=13-testing+0-builds.shipilev.net-openjdk-jdk-b769-20190316-jdk-1312, source=flush, os.version=4.18.0-17-generic, timestamp=1555312383839}]:[attributes={Lucene50StoredFieldsFormat.mode=BEST_SPEED}])))}
   [junit4]   2> 2898218 INFO  (qtp1671016692-28496) [    x:collection1] o.a.s.u.p.LogUpdateProcessorFactory [collection1]  webapp=/solr path=/update params={waitSearcher=true&commit=true&softCommit=false&wt=javabin&version=2}{commit=} 0 10
   [junit4]   2> 2898219 INFO  (qtp1671016692-28498) [    x:collection1] o.a.s.c.S.Request [collection1]  webapp=/solr path=/replication params={wt=xml&command=details} status=0 QTime=0
   [junit4]   2> 2899257 INFO  (qtp1671016692-28497) [    x:collection1] o.a.s.c.S.Request [collection1]  webapp=/solr path=/replication params={name=zgo&wt=xml&command=backup} status=0 QTime=35
   [junit4]   2> 2899257 INFO  (Thread-4532) [    ] o.a.s.h.SnapShooter Creating backup snapshot zgo at file:///home/jenkins/workspace/Lucene-Solr-8.x-Linux/solr/build/solr-core/test/J2/temp/solr.handler.TestReplicationHandlerBackup_9F22F33D10E15A31-001/solr-instance-002/./collection1/data/
   [junit4]   2> 2899258 INFO  (qtp1671016692-28498) [    x:collection1] o.a.s.c.S.Request [collection1]  webapp=/solr path=/replication params={wt=xml&command=details} status=0 QTime=0
   [junit4]   2> 2899258 INFO  (Thread-4532) [    ] o.a.s.h.SnapShooter Done creating backup snapshot: zgo at file:///home/jenkins/workspace/Lucene-Solr-8.x-Linux/solr/build/solr-core/test/J2/temp/solr.handler.TestReplicationHandlerBackup_9F22F33D10E15A31-001/solr-instance-002/./collection1/data/
   [junit4]   2> 2900263 INFO  (qtp1671016692-28496) [    x:collection1] o.a.s.c.S.Request [collection1]  webapp=/solr path=/replication params={name=invbmuclskpj&wt=xml&command=backup} status=0 QTime=2
   [junit4]   2> 2900263 INFO  (Thread-4533) [    ] o.a.s.h.SnapShooter Creating backup snapshot invbmuclskpj at file:///home/jenkins/workspace/Lucene-Solr-8.x-Linux/solr/build/solr-core/test/J2/temp/solr.handler.TestReplicationHandlerBackup_9F22F33D10E15A31-001/solr-instance-002/./collection1/data/
   [junit4]   2> 2900264 INFO  (qtp1671016692-28497) [    x:collection1] o.a.s.c.S.Request [collection1]  webapp=/solr path=/replication params={wt=xml&command=details} status=0 QTime=0
   [junit4]   2> 2900265 INFO  (Thread-4533) [    ] o.a.s.h.SnapShooter Done creating backup snapshot: invbmuclskpj at file:///home/jenkins/workspace/Lucene-Solr-8.x-Linux/solr/build/solr-core/test/J2/temp/solr.handler.TestReplicationHandlerBackup_9F22F33D10E15A31-001/solr-instance-002/./collection1/data/
   [junit4]   2> 2901267 INFO  (qtp1671016692-28498) [    x:collection1] o.a.s.c.S.Request [collection1]  webapp=/solr path=/replication params={name=anmnlaoux&wt=xml&command=backup} status=0 QTime=0
   [junit4]   2> 2901268 INFO  (Thread-4534) [    ] o.a.s.h.SnapShooter Creating backup snapshot anmnlaoux at file:///home/jenkins/workspace/Lucene-Solr-8.x-Linux/solr/build/solr-core/test/J2/temp/solr.handler.TestReplicationHandlerBackup_9F22F33D10E15A31-001/solr-instance-002/./collection1/data/
   [junit4]   2> 2901269 INFO  (qtp1671016692-28496) [    x:collection1] o.a.s.c.S.Request [collection1]  webapp=/solr path=/replication params={wt=xml&command=details} status=0 QTime=0
   [junit4]   2> 2901269 INFO  (Thread-4534) [    ] o.a.s.h.SnapShooter Done creating backup snapshot: anmnlaoux at file:///home/jenkins/workspace/Lucene-Solr-8.x-Linux/solr/build/solr-core/test/J2/temp/solr.handler.TestReplicationHandlerBackup_9F22F33D10E15A31-001/solr-instance-002/./collection1/data/
   [junit4]   2> 2902271 INFO  (qtp1671016692-28497) [    x:collection1] o.a.s.c.S.Request [collection1]  webapp=/solr path=/replication params={name=xksemlsfq&wt=xml&command=backup} status=0 QTime=0
   [junit4]   2> 2902271 INFO  (Thread-4535) [    ] o.a.s.h.SnapShooter Creating backup snapshot xksemlsfq at file:///home/jenkins/workspace/Lucene-Solr-8.x-Linux/solr/build/solr-core/test/J2/temp/solr.handler.TestReplicationHandlerBackup_9F22F33D10E15A31-001/solr-instance-002/./collection1/data/
   [junit4]   2> 2902272 INFO  (qtp1671016692-28498) [    x:collection1] o.a.s.c.S.Request [collection1]  webapp=/solr path=/replication params={wt=xml&command=details} status=0 QTime=0
   [junit4]   2> 2903354 INFO  (TEST-TestReplicationHandlerBackup.doTestBackup-seed#[9F22F33D10E15A31]) [    ] o.a.s.SolrTestCaseJ4 ###Ending doTestBackup
   [junit4]   2> 2903354 INFO  (Thread-4535) [    ] o.a.s.h.SnapShooter Done creating backup snapshot: xksemlsfq at file:///home/jenkins/workspace/Lucene-Solr-8.x-Linux/solr/build/solr-core/test/J2/temp/solr.handler.TestReplicationHandlerBackup_9F22F33D10E15A31-001/solr-instance-002/./collection1/data/
   [junit4]   2> 2903355 INFO  (TEST-TestReplicationHandlerBackup.doTestBackup-seed#[9F22F33D10E15A31]) [    ] o.a.s.c.CoreContainer Shutting down CoreContainer instance=1289461327
   [junit4]   2> 2903356 INFO  (coreCloseExecutor-9774-thread-1) [    x:collection1] o.a.s.c.SolrCore [collection1]  CLOSING SolrCore org.apache.solr.core.SolrCore@8b965d9
   [junit4]   2> 2903356 INFO  (coreCloseExecutor-9774-thread-1) [    x:collection1] o.a.s.m.SolrMetricManager Closing metric reporters for registry=solr.core.collection1, tag=8b965d9
   [junit4]   2> 2903356 INFO  (coreCloseExecutor-9774-thread-1) [    x:collection1] o.a.s.m.r.SolrJmxReporter Closing reporter [org.apache.solr.metrics.reporters.SolrJmxReporter@3bd3f80f: rootName = null, domain = solr.core.collection1, service url = null, agent id = null] for registry solr.core.collection1 / com.codahale.metrics.MetricRegistry@3969f318
   [junit4]   2> 2903372 INFO  (TEST-TestReplicationHandlerBackup.doTestBackup-seed#[9F22F33D10E15A31]) [    ] o.a.s.m.SolrMetricManager Closing metric reporters for registry=solr.node, tag=null
   [junit4]   2> 2903372 INFO  (TEST-TestReplicationHandlerBackup.doTestBackup-seed#[9F22F33D10E15A31]) [    ] o.a.s.m.r.SolrJmxReporter Closing reporter [org.apache.solr.metrics.reporters.SolrJmxReporter@7f6a8f69: rootName = null, domain = solr.node, service url = null, agent id = null] for registry solr.node / com.codahale.metrics.MetricRegistry@187585f9
   [junit4]   2> 2903382 INFO  (TEST-TestReplicationHandlerBackup.doTestBackup-seed#[9F22F33D10E15A31]) [    ] o.a.s.m.SolrMetricManager Closing metric reporters for registry=solr.jvm, tag=null
   [junit4]   2> 2903382 INFO  (TEST-TestReplicationHandlerBackup.doTestBackup-seed#[9F22F33D10E15A31]) [    ] o.a.s.m.r.SolrJmxReporter Closing reporter [org.apache.solr.metrics.reporters.SolrJmxReporter@1068ee3e: rootName = null, domain = solr.jvm, service url = null, agent id = null] for registry solr.jvm / com.codahale.metrics.MetricRegistry@780056aa
   [junit4]   2> 2903388 INFO  (TEST-TestReplicationHandlerBackup.doTestBackup-seed#[9F22F33D10E15A31]) [    ] o.a.s.m.SolrMetricManager Closing metric reporters for registry=solr.jetty, tag=null
   [junit4]   2> 2903388 INFO  (TEST-TestReplicationHandlerBackup.doTestBackup-seed#[9F22F33D10E15A31]) [    ] o.a.s.m.r.SolrJmxReporter Closing reporter [org.apache.solr.metrics.reporters.SolrJmxReporter@5a360388: rootName = null, domain = solr.jetty, service url = null, agent id = null] for registry solr.jetty / com.codahale.metrics.MetricRegistry@20462f9a
   [junit4]   2> 2903390 INFO  (TEST-TestReplicationHandlerBackup.doTestBackup-seed#[9F22F33D10E15A31]) [    ] o.e.j.s.AbstractConnector Stopped ServerConnector@38b58e5c{HTTP/1.1,[http/1.1, h2c]}{127.0.0.1:?}
   [junit4]   2> 2903390 INFO  (TEST-TestReplicationHandlerBackup.doTestBackup-seed#[9F22F33D10E15A31]) [    ] o.e.j.s.h.ContextHandler Stopped o.e.j.s.ServletContextHandler@1c6e4b47{/solr,null,UNAVAILABLE}
   [junit4]   2> 2903390 INFO  (TEST-TestReplicationHandlerBackup.doTestBackup-seed#[9F22F33D10E15A31]) [    ] o.e.j.s.session node0 Stopped scavenging
   [junit4]   2> NOTE: reproduce with: ant test  -Dtestcase=TestReplicationHandlerBackup -Dtests.method=doTestBackup -Dtests.seed=9F22F33D10E15A31 -Dtests.multiplier=3 -Dtests.slow=true -Dtests.locale=bn-BD -Dtests.timezone=Europe/Luxembourg -Dtests.asserts=true -Dtests.file.encoding=US-ASCII
   [junit4] ERROR   5.71s J2 | TestReplicationHandlerBackup.doTestBackup <<<
   [junit4]    > Throwable #1: org.apache.lucene.index.IndexNotFoundException: no segments* file found in SimpleFSDirectory@/home/jenkins/workspace/Lucene-Solr-8.x-Linux/solr/build/solr-core/test/J2/temp/solr.handler.TestReplicationHandlerBackup_9F22F33D10E15A31-001/solr-instance-002/collection1/data/snapshot.xksemlsfq lockFactory=org.apache.lucene.store.NativeFSLockFactory@60af951d: files: [_0.cfe]
   [junit4]    > at __randomizedtesting.SeedInfo.seed([9F22F33D10E15A31:DEA9D358375FA97E]:0)
   [junit4]    > at org.apache.lucene.index.SegmentInfos$FindSegmentsFile.run(SegmentInfos.java:675)
   [junit4]    > at org.apache.lucene.index.StandardDirectoryReader.open(StandardDirectoryReader.java:81)
   [junit4]    > at org.apache.lucene.index.DirectoryReader.open(DirectoryReader.java:63)
   [junit4]    > at org.apache.solr.handler.TestReplicationHandlerBackup.verify(TestReplicationHandlerBackup.java:146)
   [junit4]    > at org.apache.solr.handler.TestReplicationHandlerBackup.doTestBackup(TestReplicationHandlerBackup.java:210)
   [junit4]    > at java.base/jdk.internal.reflect.NativeMethodAccessorImpl.invoke0(Native Method)
   [junit4]    > at java.base/jdk.internal.reflect.NativeMethodAccessorImpl.invoke(NativeMethodAccessorImpl.java:62)
   [junit4]    > at java.base/jdk.internal.reflect.DelegatingMethodAccessorImpl.invoke(DelegatingMethodAccessorImpl.java:43)
   [junit4]    > at java.base/java.lang.reflect.Method.invoke(Method.java:567)
   [junit4]    > at java.base/java.lang.Thread.run(Thread.java:835)
   [junit4]   2> NOTE: leaving temporary files on disk at: /home/jenkins/workspace/Lucene-Solr-8.x-Linux/solr/build/solr-core/test/J2/temp/solr.handler.TestReplicationHandlerBackup_9F22F33D10E15A31-001
   [junit4]   2> NOTE: test params are: codec=Asserting(Lucene80): {name=PostingsFormat(name=LuceneFixedGap), id=PostingsFormat(name=LuceneFixedGap)}, docValues:{}, maxPointsInLeafNode=1861, maxMBSortInHeap=6.9032059335219635, sim=Asserting(org.apache.lucene.search.similarities.AssertingSimilarity@adc901f), locale=bn-BD, timezone=Europe/Luxembourg
   [junit4]   2> NOTE: Linux 4.18.0-17-generic amd64/Aleksey Shipilev 13-testing (64-bit)/cpus=8,threads=1,free=230442480,total=518979584
   [junit4]   2> NOTE: All tests run in this JVM: [TestFunctionQuery, CoreSorterTest, CdcrBootstrapTest, TestCollapseQParserPlugin, TestSolrIndexConfig, TestAnalyzeInfixSuggestions, TestReplicationHandler, TestPerFieldSimilarityWithDefaultOverride, AutoScalingHandlerTest, PeerSyncWithBufferUpdatesTest, TestReloadDeadlock, ImplicitSnitchTest, DateMathParserTest, TestLuceneIndexBackCompat, DistributedQueryComponentCustomSortTest, SplitShardTest, BadIndexSchemaTest, TestQueryUtils, TestSuggestSpellingConverter, PrimitiveFieldTypeTest, HdfsRecoverLeaseTest, TestCharFilters, TestCoreAdminApis, TestFoldingMultitermQuery, SolrTestCaseJ4Test, TestLRUCache, TestSolrQueryResponse, TestHttpShardHandlerFactory, SpellCheckComponentTest, SolrShardReporterTest, JvmMetricsTest, TestNRTOpen, DeleteStatusTest, PingRequestHandlerTest, ByteBuffersDirectoryFactoryTest, TestBulkSchemaAPI, CloudMLTQParserTest, SolrMetricManagerTest, TestDeleteCollectionOnDownNodes, TestDynamicFieldResource, TestMacroExpander, TestFieldSortValues, SimplePostToolTest, DocumentBuilderTest, SolrCmdDistributorTest, CurrencyRangeFacetCloudTest, MoveReplicaHDFSTest, TestSafeXMLParsing, FacetPivotSmallTest, XmlUpdateRequestHandlerTest, TestFieldCache, TestConfigReload, TestUninvertingReader, TestSizeLimitedDistributedMap, TestNumericRangeQuery64, AuditLoggerPluginTest, DistributedDebugComponentTest, HttpPartitionTest, DistributedIntervalFacetingTest, AssignTest, QueryElevationComponentTest, SearchRateTriggerTest, FieldAnalysisRequestHandlerTest, HdfsChaosMonkeyNothingIsSafeTest, DistributedFacetPivotLargeTest, TestDistributedGrouping, SolrIndexSplitterTest, OutputWriterTest, ShowFileRequestHandlerTest, TestClusterStateMutator, ExplicitHLLTest, NodeAddedTriggerTest, ConvertedLegacyTest, TestJoin, ParsingFieldUpdateProcessorsTest, TestWithCollection, BinaryUpdateRequestHandlerTest, TestFieldTypeCollectionResource, IgnoreCommitOptimizeUpdateProcessorFactoryTest, TestLegacyField, HighlighterConfigTest, TaggingAttributeTest, TermsComponentTest, TestFieldCacheSortRandom, TriggerCooldownIntegrationTest, TestSerializedLuceneMatchVersion, RankQueryTest, BasicDistributedZkTest, NodeMarkersRegistrationTest, TestElisionMultitermQuery, TestDelegationWithHadoopAuth, SchemaVersionSpecificBehaviorTest, DistributedFacetPivotSmallTest, NotRequiredUniqueKeyTest, TestApiFramework, SearchHandlerTest, ReplicationFactorTest, TestSolrConfigHandler, TestCustomDocTransformer, DateRangeFieldTest, UUIDUpdateProcessorFallbackTest, TestStressInPlaceUpdates, TestIBSimilarityFactory, TestImplicitCoreProperties, TestTrie, ScheduledTriggerIntegrationTest, TestSimExtremeIndexing, CdcrUpdateLogTest, AuthToolTest, HdfsAutoAddReplicasIntegrationTest, UUIDFieldTest, CustomHighlightComponentTest, TestTolerantUpdateProcessorCloud, TestSubQueryTransformer, PeerSyncWithLeaderTest, SuggesterTSTTest, HdfsLockFactoryTest, ClassificationUpdateProcessorTest, TestJsonFacetsStatsParsing, TestExportWriter, OverseerModifyCollectionTest, InfoHandlerTest, TestInPlaceUpdatesStandalone, TestSolrJ, TestPKIAuthenticationPlugin, BigEndianAscendingWordDeserializerTest, TestReversedWildcardFilterFactory, TestRangeQuery, TriLevelCompositeIdRoutingTest, LeaderElectionIntegrationTest, HDFSCollectionsAPITest, TestSimTriggerIntegration, TestReloadAndDeleteDocs, OutOfBoxZkACLAndCredentialsProvidersTest, TestCoreDiscovery, JWTAuthPluginIntegrationTest, TestLegacyFieldCache, TestCloudPseudoReturnFields, CollectionStateFormat2Test, ConfigSetsAPITest, CreateCollectionCleanupTest, DeleteLastCustomShardedReplicaTest, DeleteNodeTest, DistribCursorPagingTest, DocValuesNotIndexedTest, LeaderElectionTest, MigrateRouteKeyTest, ReindexCollectionTest, TestConfigSetsAPIExclusivity, TestDownShardTolerantSearch, TestLeaderElectionWithEmptyReplica, TestPullReplica, TestRandomRequestDistribution, TestSolrCloudWithDelegationTokens, TestSolrCloudWithKerberosAlt, TestTlogReplica, TestTolerantUpdateProcessorRandomCloud, VMParamsZkACLAndCredentialsProvidersTest, ZkCLITest, CollectionsAPIAsyncDistributedZkTest, HdfsCollectionsAPIDistributedZkTest, ShardSplitTest, TestSolrDeletionPolicy2, DocumentAnalysisRequestHandlerTest, MoreLikeThisHandlerTest, TestCSVLoader, TestReplicationHandlerBackup]
   [junit4] Completed [598/854 (1!)] on J2 in 7.84s, 2 tests, 1 error <<< FAILURES!

[...truncated 192 lines...]
   [junit4] Suite: org.apache.solr.metrics.rrd.SolrRrdBackendFactoryTest
   [junit4]   2> 3135257 INFO  (SUITE-SolrRrdBackendFactoryTest-seed#[9F22F33D10E15A31]-worker) [    ] o.a.s.SolrTestCaseJ4 SecureRandom sanity checks: test.solr.allowed.securerandom=null & java.security.egd=file:/dev/./urandom
   [junit4]   2> Creating dataDir: /home/jenkins/workspace/Lucene-Solr-8.x-Linux/solr/build/solr-core/test/J2/temp/solr.metrics.rrd.SolrRrdBackendFactoryTest_9F22F33D10E15A31-001/init-core-data-001
   [junit4]   2> 3135257 WARN  (SUITE-SolrRrdBackendFactoryTest-seed#[9F22F33D10E15A31]-worker) [    ] o.a.s.SolrTestCaseJ4 startTrackingSearchers: numOpens=1 numCloses=1
   [junit4]   2> 3135257 INFO  (SUITE-SolrRrdBackendFactoryTest-seed#[9F22F33D10E15A31]-worker) [    ] o.a.s.SolrTestCaseJ4 Using PointFields (NUMERIC_POINTS_SYSPROP=true) w/NUMERIC_DOCVALUES_SYSPROP=false
   [junit4]   2> 3135258 INFO  (SUITE-SolrRrdBackendFactoryTest-seed#[9F22F33D10E15A31]-worker) [    ] o.a.s.SolrTestCaseJ4 Randomized ssl (false) and clientAuth (false) via: @org.apache.solr.util.RandomizeSSL(reason="", ssl=0.0/0.0, value=0.0/0.0, clientAuth=0.0/0.0)
   [junit4]   2> 3135262 INFO  (TEST-SolrRrdBackendFactoryTest.testBasic-seed#[9F22F33D10E15A31]) [    ] o.a.s.SolrTestCaseJ4 ###Starting testBasic
   [junit4]   2> 3135479 INFO  (TEST-SolrRrdBackendFactoryTest.testBasic-seed#[9F22F33D10E15A31]) [    ] o.a.s.SolrTestCaseJ4 ###Ending testBasic
   [junit4]   2> NOTE: reproduce with: ant test  -Dtestcase=SolrRrdBackendFactoryTest -Dtests.method=testBasic -Dtests.seed=9F22F33D10E15A31 -Dtests.multiplier=3 -Dtests.slow=true -Dtests.locale=qu-EC -Dtests.timezone=Etc/GMT+3 -Dtests.asserts=true -Dtests.file.encoding=US-ASCII
   [junit4] FAILURE 0.22s J2 | SolrRrdBackendFactoryTest.testBasic <<<
   [junit4]    > Throwable #1: java.lang.AssertionError: {} expected:<1> but was:<0>
   [junit4]    > at __randomizedtesting.SeedInfo.seed([9F22F33D10E15A31:34D8EE28CF3DDC1F]:0)
   [junit4]    > at org.apache.solr.metrics.rrd.SolrRrdBackendFactoryTest.testBasic(SolrRrdBackendFactoryTest.java:92)
   [junit4]    > at java.base/jdk.internal.reflect.NativeMethodAccessorImpl.invoke0(Native Method)
   [junit4]    > at java.base/jdk.internal.reflect.NativeMethodAccessorImpl.invoke(NativeMethodAccessorImpl.java:62)
   [junit4]    > at java.base/jdk.internal.reflect.DelegatingMethodAccessorImpl.invoke(DelegatingMethodAccessorImpl.java:43)
   [junit4]    > at java.base/java.lang.reflect.Method.invoke(Method.java:567)
   [junit4]    > at java.base/java.lang.Thread.run(Thread.java:835)
   [junit4]   2> NOTE: leaving temporary files on disk at: /home/jenkins/workspace/Lucene-Solr-8.x-Linux/solr/build/solr-core/test/J2/temp/solr.metrics.rrd.SolrRrdBackendFactoryTest_9F22F33D10E15A31-001
   [junit4]   2> NOTE: test params are: codec=CheapBastard, sim=Asserting(org.apache.lucene.search.similarities.AssertingSimilarity@1459063d), locale=qu-EC, timezone=Etc/GMT+3
   [junit4]   2> NOTE: Linux 4.18.0-17-generic amd64/Aleksey Shipilev 13-testing (64-bit)/cpus=8,threads=1,free=43656544,total=518979584
   [junit4]   2> NOTE: All tests run in this JVM: [TestFunctionQuery, CoreSorterTest, CdcrBootstrapTest, TestCollapseQParserPlugin, TestSolrIndexConfig, TestAnalyzeInfixSuggestions, TestReplicationHandler, TestPerFieldSimilarityWithDefaultOverride, AutoScalingHandlerTest, PeerSyncWithBufferUpdatesTest, TestReloadDeadlock, ImplicitSnitchTest, DateMathParserTest, TestLuceneIndexBackCompat, DistributedQueryComponentCustomSortTest, SplitShardTest, BadIndexSchemaTest, TestQueryUtils, TestSuggestSpellingConverter, PrimitiveFieldTypeTest, HdfsRecoverLeaseTest, TestCharFilters, TestCoreAdminApis, TestFoldingMultitermQuery, SolrTestCaseJ4Test, TestLRUCache, TestSolrQueryResponse, TestHttpShardHandlerFactory, SpellCheckComponentTest, SolrShardReporterTest, JvmMetricsTest, TestNRTOpen, DeleteStatusTest, PingRequestHandlerTest, ByteBuffersDirectoryFactoryTest, TestBulkSchemaAPI, CloudMLTQParserTest, SolrMetricManagerTest, TestDeleteCollectionOnDownNodes, TestDynamicFieldResource, TestMacroExpander, TestFieldSortValues, SimplePostToolTest, DocumentBuilderTest, SolrCmdDistributorTest, CurrencyRangeFacetCloudTest, MoveReplicaHDFSTest, TestSafeXMLParsing, FacetPivotSmallTest, XmlUpdateRequestHandlerTest, TestFieldCache, TestConfigReload, TestUninvertingReader, TestSizeLimitedDistributedMap, TestNumericRangeQuery64, AuditLoggerPluginTest, DistributedDebugComponentTest, HttpPartitionTest, DistributedIntervalFacetingTest, AssignTest, QueryElevationComponentTest, SearchRateTriggerTest, FieldAnalysisRequestHandlerTest, HdfsChaosMonkeyNothingIsSafeTest, DistributedFacetPivotLargeTest, TestDistributedGrouping, SolrIndexSplitterTest, OutputWriterTest, ShowFileRequestHandlerTest, TestClusterStateMutator, ExplicitHLLTest, NodeAddedTriggerTest, ConvertedLegacyTest, TestJoin, ParsingFieldUpdateProcessorsTest, TestWithCollection, BinaryUpdateRequestHandlerTest, TestFieldTypeCollectionResource, IgnoreCommitOptimizeUpdateProcessorFactoryTest, TestLegacyField, HighlighterConfigTest, TaggingAttributeTest, TermsComponentTest, TestFieldCacheSortRandom, TriggerCooldownIntegrationTest, TestSerializedLuceneMatchVersion, RankQueryTest, BasicDistributedZkTest, NodeMarkersRegistrationTest, TestElisionMultitermQuery, TestDelegationWithHadoopAuth, SchemaVersionSpecificBehaviorTest, DistributedFacetPivotSmallTest, NotRequiredUniqueKeyTest, TestApiFramework, SearchHandlerTest, ReplicationFactorTest, TestSolrConfigHandler, TestCustomDocTransformer, DateRangeFieldTest, UUIDUpdateProcessorFallbackTest, TestStressInPlaceUpdates, TestIBSimilarityFactory, TestImplicitCoreProperties, TestTrie, ScheduledTriggerIntegrationTest, TestSimExtremeIndexing, CdcrUpdateLogTest, AuthToolTest, HdfsAutoAddReplicasIntegrationTest, UUIDFieldTest, CustomHighlightComponentTest, TestTolerantUpdateProcessorCloud, TestSubQueryTransformer, PeerSyncWithLeaderTest, SuggesterTSTTest, HdfsLockFactoryTest, ClassificationUpdateProcessorTest, TestJsonFacetsStatsParsing, TestExportWriter, OverseerModifyCollectionTest, InfoHandlerTest, TestInPlaceUpdatesStandalone, TestSolrJ, TestPKIAuthenticationPlugin, BigEndianAscendingWordDeserializerTest, TestReversedWildcardFilterFactory, TestRangeQuery, TriLevelCompositeIdRoutingTest, LeaderElectionIntegrationTest, HDFSCollectionsAPITest, TestSimTriggerIntegration, TestReloadAndDeleteDocs, OutOfBoxZkACLAndCredentialsProvidersTest, TestCoreDiscovery, JWTAuthPluginIntegrationTest, TestLegacyFieldCache, TestCloudPseudoReturnFields, CollectionStateFormat2Test, ConfigSetsAPITest, CreateCollectionCleanupTest, DeleteLastCustomShardedReplicaTest, DeleteNodeTest, DistribCursorPagingTest, DocValuesNotIndexedTest, LeaderElectionTest, MigrateRouteKeyTest, ReindexCollectionTest, TestConfigSetsAPIExclusivity, TestDownShardTolerantSearch, TestLeaderElectionWithEmptyReplica, TestPullReplica, TestRandomRequestDistribution, TestSolrCloudWithDelegationTokens, TestSolrCloudWithKerberosAlt, TestTlogReplica, TestTolerantUpdateProcessorRandomCloud, VMParamsZkACLAndCredentialsProvidersTest, ZkCLITest, CollectionsAPIAsyncDistributedZkTest, HdfsCollectionsAPIDistributedZkTest, ShardSplitTest, TestSolrDeletionPolicy2, DocumentAnalysisRequestHandlerTest, MoreLikeThisHandlerTest, TestCSVLoader, TestReplicationHandlerBackup, TestReplicationHandlerDiskOverFlow, TestRestoreCore, TestSolrConfigHandlerConcurrent, TestSystemCollAutoCreate, V2ApiIntegrationTest, V2StandaloneTest, AutoscalingHistoryHandlerTest, PropertiesRequestHandlerTest, SecurityConfHandlerTest, SegmentsInfoRequestHandlerTest, StatsReloadRaceTest, BadComponentTest, DistributedSpellCheckComponentTest, ShufflingReplicaListTransformerTest, StatsComponentTest, TermVectorComponentTest, TestDistributedStatsComponentCardinality, TestExpandComponent, RandomizedTaggerTest, TaggerTest, HighlighterTest, TestNumericTokenStream, MetricsConfigTest, SolrGangliaReporterTest, SolrGraphiteReporterTest, SolrSlf4jReporterTest, SolrRrdBackendFactoryTest]
   [junit4] Completed [660/854 (2!)] on J2 in 0.26s, 1 test, 1 failure <<< FAILURES!

[...truncated 43773 lines...]
[repro] Jenkins log URL: https://jenkins.thetaphi.de/job/Lucene-Solr-8.x-Linux/404/consoleText

[repro] Revision: d7e3953ada4884e75763c7c550360ffe9a4e1d61

[repro] Ant options: "-Dargs=-XX:-UseCompressedOops -XX:+UseSerialGC"
[repro] Repro line:  ant test  -Dtestcase=TestReplicationHandlerBackup -Dtests.method=doTestBackup -Dtests.seed=9F22F33D10E15A31 -Dtests.multiplier=3 -Dtests.slow=true -Dtests.locale=bn-BD -Dtests.timezone=Europe/Luxembourg -Dtests.asserts=true -Dtests.file.encoding=US-ASCII

[repro] Repro line:  ant test  -Dtestcase=SolrRrdBackendFactoryTest -Dtests.method=testBasic -Dtests.seed=9F22F33D10E15A31 -Dtests.multiplier=3 -Dtests.slow=true -Dtests.locale=qu-EC -Dtests.timezone=Etc/GMT+3 -Dtests.asserts=true -Dtests.file.encoding=US-ASCII

[repro] ant clean

[...truncated 6 lines...]
[repro] Test suites by module:
[repro]    solr/core
[repro]       SolrRrdBackendFactoryTest
[repro]       TestReplicationHandlerBackup
[repro] ant compile-test

[...truncated 3581 lines...]
[repro] ant test-nocompile -Dtests.dups=5 -Dtests.maxfailures=10 -Dtests.class="*.SolrRrdBackendFactoryTest|*.TestReplicationHandlerBackup" -Dtests.showOutput=onerror "-Dargs=-XX:-UseCompressedOops -XX:+UseSerialGC" -Dtests.seed=9F22F33D10E15A31 -Dtests.multiplier=3 -Dtests.slow=true -Dtests.locale=qu-EC -Dtests.timezone=Etc/GMT+3 -Dtests.asserts=true -Dtests.file.encoding=US-ASCII

[...truncated 100 lines...]
[repro] Failures:
[repro]   0/5 failed: org.apache.solr.handler.TestReplicationHandlerBackup
[repro]   0/5 failed: org.apache.solr.metrics.rrd.SolrRrdBackendFactoryTest
[repro] Exiting with code 0

[...truncated 43 lines...]


---------------------------------------------------------------------
To unsubscribe, e-mail: [hidden email]
For additional commands, e-mail: [hidden email]
Reply | Threaded
Open this post in threaded view
|

[JENKINS-EA] Lucene-Solr-8.x-Linux (64bit/jdk-13-ea+shipilev-fastdebug) - Build # 407 - Failure!

Policeman Jenkins Server-2
Build: https://jenkins.thetaphi.de/job/Lucene-Solr-8.x-Linux/407/
Java: 64bit/jdk-13-ea+shipilev-fastdebug -XX:+UseCompressedOops -XX:+UseParallelGC

All tests passed

Build Log:
[...truncated 9272 lines...]
   [junit4] JVM J0: stdout was not empty, see: /home/jenkins/workspace/Lucene-Solr-8.x-Linux/lucene/build/misc/test/temp/junit4-J0-20190415_194444_1223609483554621919813.sysout
   [junit4] >>> JVM J0 emitted unexpected output (verbatim) ----
   [junit4] # To suppress the following error report, specify this argument
   [junit4] # after -XX: or in .hotspotrc:  SuppressErrorAt=/loopPredicate.cpp:315
   [junit4] #
   [junit4] # A fatal error has been detected by the Java Runtime Environment:
   [junit4] #
   [junit4] #  Internal Error (/home/buildbot/worker/jdkX-linux/build/src/hotspot/share/opto/loopPredicate.cpp:315), pid=21735, tid=21762
   [junit4] #  assert(dom_r->unique_ctrl_out()->is_Call()) failed: unc expected
   [junit4] #
   [junit4] # JRE version: OpenJDK Runtime Environment (13.0) (fastdebug build 13-testing+0-builds.shipilev.net-openjdk-jdk-b769-20190316-jdk-1312)
   [junit4] # Java VM: OpenJDK 64-Bit Server VM (fastdebug 13-testing+0-builds.shipilev.net-openjdk-jdk-b769-20190316-jdk-1312, mixed mode, sharing, tiered, compressed oops, parallel gc, linux-amd64)
   [junit4] # Problematic frame:
   [junit4] # V  [libjvm.so+0x113097d]  PhaseIdealLoop::clone_loop_predicates_fix_mem(ProjNode*, ProjNode*, PhaseIdealLoop*, PhaseIterGVN*)+0x12d
   [junit4] #
   [junit4] # No core dump will be written. Core dumps have been disabled. To enable core dumping, try "ulimit -c unlimited" before starting Java again
   [junit4] #
   [junit4] # An error report file with more information is saved as:
   [junit4] # /home/jenkins/workspace/Lucene-Solr-8.x-Linux/lucene/build/misc/test/J0/hs_err_pid21735.log
   [junit4] [thread 21859 also had an error]
   [junit4]
   [junit4] [timeout occurred during error reporting in step ""] after 30 s.
   [junit4] #
   [junit4] # If you would like to submit a bug report, please visit:
   [junit4] #   http://bugreport.java.com/bugreport/crash.jsp
   [junit4] #
   [junit4] Current thread is 21762
   [junit4] Dumping core ...
   [junit4] <<< JVM J0: EOF ----

   [junit4] JVM J0: stderr was not empty, see: /home/jenkins/workspace/Lucene-Solr-8.x-Linux/lucene/build/misc/test/temp/junit4-J0-20190415_194444_1225635664151085843366.syserr
   [junit4] >>> JVM J0 emitted unexpected output (verbatim) ----
   [junit4] OpenJDK 64-Bit Server VM warning: increase O_BUFLEN in ostream.hpp -- output truncated
   [junit4] <<< JVM J0: EOF ----

[...truncated 15 lines...]
   [junit4] ERROR: JVM J0 ended with an exception, command line: /home/jenkins/tools/java/64bit/jdk-13-ea+shipilev-fastdebug/bin/java -XX:+UseCompressedOops -XX:+UseParallelGC -XX:+HeapDumpOnOutOfMemoryError -XX:HeapDumpPath=/home/jenkins/workspace/Lucene-Solr-8.x-Linux/heapdumps -ea -esa --illegal-access=deny -Dtests.prefix=tests -Dtests.seed=B714B0D7EA05EFF5 -Xmx512M -Dtests.iters= -Dtests.verbose=false -Dtests.infostream=false -Dtests.codec=random -Dtests.postingsformat=random -Dtests.docvaluesformat=random -Dtests.locale=random -Dtests.timezone=random -Dtests.directory=random -Dtests.linedocsfile=europarl.lines.txt.gz -Dtests.luceneMatchVersion=8.1.0 -Dtests.cleanthreads=perMethod -Djava.util.logging.config.file=/home/jenkins/workspace/Lucene-Solr-8.x-Linux/lucene/tools/junit4/logging.properties -Dtests.nightly=false -Dtests.weekly=false -Dtests.monster=false -Dtests.slow=true -Dtests.asserts=true -Dtests.multiplier=3 -DtempDir=./temp -Djava.io.tmpdir=./temp -Dcommon.dir=/home/jenkins/workspace/Lucene-Solr-8.x-Linux/lucene -Dclover.db.dir=/home/jenkins/workspace/Lucene-Solr-8.x-Linux/lucene/build/clover/db -Djava.security.policy=/home/jenkins/workspace/Lucene-Solr-8.x-Linux/lucene/tools/junit4/tests.policy -Dtests.LUCENE_VERSION=8.1.0 -Djetty.testMode=1 -Djetty.insecurerandom=1 -Dsolr.directoryFactory=org.apache.solr.core.MockDirectoryFactory -Djava.awt.headless=true -Djdk.map.althashing.threshold=0 -Dtests.src.home=/home/jenkins/workspace/Lucene-Solr-8.x-Linux -Djava.security.egd=file:/dev/./urandom -Djunit4.childvm.cwd=/home/jenkins/workspace/Lucene-Solr-8.x-Linux/lucene/build/misc/test/J0 -Djunit4.tempDir=/home/jenkins/workspace/Lucene-Solr-8.x-Linux/lucene/build/misc/test/temp -Djunit4.childvm.id=0 -Djunit4.childvm.count=3 -Dfile.encoding=UTF-8 -Djava.security.manager=org.apache.lucene.util.TestSecurityManager -Dtests.filterstacks=true -Dtests.leaveTemporary=false -Dtests.badapples=false -classpath /home/jenkins/workspace/Lucene-Solr-8.x-Linux/lucene/build/misc/classes/test:/home/jenkins/workspace/Lucene-Solr-8.x-Linux/lucene/build/test-framework/classes/java:/home/jenkins/workspace/Lucene-Solr-8.x-Linux/lucene/build/codecs/classes/java:/home/jenkins/workspace/Lucene-Solr-8.x-Linux/lucene/build/core/classes/java:/home/jenkins/workspace/Lucene-Solr-8.x-Linux/lucene/test-framework/lib/hamcrest-core-1.3.jar:/home/jenkins/workspace/Lucene-Solr-8.x-Linux/lucene/test-framework/lib/junit-4.12.jar:/home/jenkins/workspace/Lucene-Solr-8.x-Linux/lucene/test-framework/lib/randomizedtesting-runner-2.7.2.jar:/home/jenkins/workspace/Lucene-Solr-8.x-Linux/lucene/build/misc/classes/java9:/home/jenkins/workspace/Lucene-Solr-8.x-Linux/lucene/build/misc/classes/java:/home/jenkins/tools/hudson.tasks.Ant_AntInstallation/ANT_1.8.2/lib/ant-launcher.jar:/home/jenkins/.ant/lib/ivy-2.4.0.jar:/home/jenkins/tools/hudson.tasks.Ant_AntInstallation/ANT_1.8.2/lib/ant-netrexx.jar:/home/jenkins/tools/hudson.tasks.Ant_AntInstallation/ANT_1.8.2/lib/ant-apache-xalan2.jar:/home/jenkins/tools/hudson.tasks.Ant_AntInstallation/ANT_1.8.2/lib/ant.jar:/home/jenkins/tools/hudson.tasks.Ant_AntInstallation/ANT_1.8.2/lib/ant-javamail.jar:/home/jenkins/tools/hudson.tasks.Ant_AntInstallation/ANT_1.8.2/lib/ant-commons-net.jar:/home/jenkins/tools/hudson.tasks.Ant_AntInstallation/ANT_1.8.2/lib/ant-apache-regexp.jar:/home/jenkins/tools/hudson.tasks.Ant_AntInstallation/ANT_1.8.2/lib/ant-apache-oro.jar:/home/jenkins/tools/hudson.tasks.Ant_AntInstallation/ANT_1.8.2/lib/ant-jmf.jar:/home/jenkins/tools/hudson.tasks.Ant_AntInstallation/ANT_1.8.2/lib/ant-apache-log4j.jar:/home/jenkins/tools/hudson.tasks.Ant_AntInstallation/ANT_1.8.2/lib/ant-jsch.jar:/home/jenkins/tools/hudson.tasks.Ant_AntInstallation/ANT_1.8.2/lib/ant-jai.jar:/home/jenkins/tools/hudson.tasks.Ant_AntInstallation/ANT_1.8.2/lib/ant-apache-bsf.jar:/home/jenkins/tools/hudson.tasks.Ant_AntInstallation/ANT_1.8.2/lib/ant-junit4.jar:/home/jenkins/tools/hudson.tasks.Ant_AntInstallation/ANT_1.8.2/lib/ant-apache-resolver.jar:/home/jenkins/tools/hudson.tasks.Ant_AntInstallation/ANT_1.8.2/lib/ant-apache-bcel.jar:/home/jenkins/tools/hudson.tasks.Ant_AntInstallation/ANT_1.8.2/lib/ant-junit.jar:/home/jenkins/tools/hudson.tasks.Ant_AntInstallation/ANT_1.8.2/lib/ant-jdepend.jar:/home/jenkins/tools/hudson.tasks.Ant_AntInstallation/ANT_1.8.2/lib/ant-testutil.jar:/home/jenkins/tools/hudson.tasks.Ant_AntInstallation/ANT_1.8.2/lib/ant-antlr.jar:/home/jenkins/tools/hudson.tasks.Ant_AntInstallation/ANT_1.8.2/lib/ant-swing.jar:/home/jenkins/tools/hudson.tasks.Ant_AntInstallation/ANT_1.8.2/lib/ant-commons-logging.jar:/home/jenkins/.ivy2/cache/com.carrotsearch.randomizedtesting/junit4-ant/jars/junit4-ant-2.7.2.jar com.carrotsearch.ant.tasks.junit4.slave.SlaveMainSafe -eventsfile /home/jenkins/workspace/Lucene-Solr-8.x-Linux/lucene/build/misc/test/temp/junit4-J0-20190415_194444_12210888551550996576254.events @/home/jenkins/workspace/Lucene-Solr-8.x-Linux/lucene/build/misc/test/temp/junit4-J0-20190415_194444_1224364222363086214409.suites -stdin
   [junit4] ERROR: JVM J0 ended with an exception: Forked process returned with error code: 134. Very likely a JVM crash.  See process stdout at: /home/jenkins/workspace/Lucene-Solr-8.x-Linux/lucene/build/misc/test/temp/junit4-J0-20190415_194444_1223609483554621919813.sysout See process stderr at: /home/jenkins/workspace/Lucene-Solr-8.x-Linux/lucene/build/misc/test/temp/junit4-J0-20190415_194444_1225635664151085843366.syserr
   [junit4] at com.carrotsearch.ant.tasks.junit4.JUnit4.executeSlave(JUnit4.java:1542)
   [junit4] at com.carrotsearch.ant.tasks.junit4.JUnit4.access$000(JUnit4.java:123)
   [junit4] at com.carrotsearch.ant.tasks.junit4.JUnit4$2.call(JUnit4.java:997)
   [junit4] at com.carrotsearch.ant.tasks.junit4.JUnit4$2.call(JUnit4.java:994)
   [junit4] at java.base/java.util.concurrent.FutureTask.run(FutureTask.java:264)
   [junit4] at java.base/java.util.concurrent.ThreadPoolExecutor.runWorker(ThreadPoolExecutor.java:1128)
   [junit4] at java.base/java.util.concurrent.ThreadPoolExecutor$Worker.run(ThreadPoolExecutor.java:628)
   [junit4] at java.base/java.lang.Thread.run(Thread.java:835)

BUILD FAILED
/home/jenkins/workspace/Lucene-Solr-8.x-Linux/build.xml:633: The following error occurred while executing this line:
/home/jenkins/workspace/Lucene-Solr-8.x-Linux/build.xml:577: The following error occurred while executing this line:
/home/jenkins/workspace/Lucene-Solr-8.x-Linux/build.xml:59: The following error occurred while executing this line:
/home/jenkins/workspace/Lucene-Solr-8.x-Linux/lucene/build.xml:481: The following error occurred while executing this line:
/home/jenkins/workspace/Lucene-Solr-8.x-Linux/lucene/common-build.xml:2269: The following error occurred while executing this line:
/home/jenkins/workspace/Lucene-Solr-8.x-Linux/lucene/module-build.xml:67: The following error occurred while executing this line:
/home/jenkins/workspace/Lucene-Solr-8.x-Linux/lucene/common-build.xml:1573: The following error occurred while executing this line:
/home/jenkins/workspace/Lucene-Solr-8.x-Linux/lucene/common-build.xml:1100: At least one slave process threw an exception, first: Forked process returned with error code: 134. Very likely a JVM crash.  See process stdout at: /home/jenkins/workspace/Lucene-Solr-8.x-Linux/lucene/build/misc/test/temp/junit4-J0-20190415_194444_1223609483554621919813.sysout See process stderr at: /home/jenkins/workspace/Lucene-Solr-8.x-Linux/lucene/build/misc/test/temp/junit4-J0-20190415_194444_1225635664151085843366.syserr

Total time: 51 minutes 34 seconds
Build step 'Invoke Ant' marked build as failure
Archiving artifacts
Setting ANT_1_8_2_HOME=/home/jenkins/tools/hudson.tasks.Ant_AntInstallation/ANT_1.8.2
[WARNINGS] Skipping publisher since build result is FAILURE
Recording test results
Setting ANT_1_8_2_HOME=/home/jenkins/tools/hudson.tasks.Ant_AntInstallation/ANT_1.8.2
Email was triggered for: Failure - Any
Sending email for trigger: Failure - Any
Setting ANT_1_8_2_HOME=/home/jenkins/tools/hudson.tasks.Ant_AntInstallation/ANT_1.8.2
Setting ANT_1_8_2_HOME=/home/jenkins/tools/hudson.tasks.Ant_AntInstallation/ANT_1.8.2
Setting ANT_1_8_2_HOME=/home/jenkins/tools/hudson.tasks.Ant_AntInstallation/ANT_1.8.2
Setting ANT_1_8_2_HOME=/home/jenkins/tools/hudson.tasks.Ant_AntInstallation/ANT_1.8.2
Setting ANT_1_8_2_HOME=/home/jenkins/tools/hudson.tasks.Ant_AntInstallation/ANT_1.8.2
Setting ANT_1_8_2_HOME=/home/jenkins/tools/hudson.tasks.Ant_AntInstallation/ANT_1.8.2


---------------------------------------------------------------------
To unsubscribe, e-mail: [hidden email]
For additional commands, e-mail: [hidden email]
Reply | Threaded
Open this post in threaded view
|

[JENKINS] Lucene-Solr-8.x-Linux (32bit/jdk1.8.0_201) - Build # 408 - Still Failing!

Policeman Jenkins Server-2
Build: https://jenkins.thetaphi.de/job/Lucene-Solr-8.x-Linux/408/
Java: 32bit/jdk1.8.0_201 -client -XX:+UseConcMarkSweepGC

1 tests failed.
FAILED:  org.apache.lucene.index.TestConcurrentMergeScheduler.testFlushExceptions

Error Message:


Stack Trace:
java.lang.AssertionError
        at __randomizedtesting.SeedInfo.seed([E443A8CB652F9DE1:5029FB116CCF0BD5]:0)
        at org.junit.Assert.fail(Assert.java:86)
        at org.junit.Assert.assertTrue(Assert.java:41)
        at org.junit.Assert.assertTrue(Assert.java:52)
        at org.apache.lucene.index.TestConcurrentMergeScheduler.testFlushExceptions(TestConcurrentMergeScheduler.java:128)
        at sun.reflect.NativeMethodAccessorImpl.invoke0(Native Method)
        at sun.reflect.NativeMethodAccessorImpl.invoke(NativeMethodAccessorImpl.java:62)
        at sun.reflect.DelegatingMethodAccessorImpl.invoke(DelegatingMethodAccessorImpl.java:43)
        at java.lang.reflect.Method.invoke(Method.java:498)
        at com.carrotsearch.randomizedtesting.RandomizedRunner.invoke(RandomizedRunner.java:1750)
        at com.carrotsearch.randomizedtesting.RandomizedRunner$8.evaluate(RandomizedRunner.java:938)
        at com.carrotsearch.randomizedtesting.RandomizedRunner$9.evaluate(RandomizedRunner.java:974)
        at com.carrotsearch.randomizedtesting.RandomizedRunner$10.evaluate(RandomizedRunner.java:988)
        at org.apache.lucene.util.TestRuleSetupTeardownChained$1.evaluate(TestRuleSetupTeardownChained.java:49)
        at org.apache.lucene.util.AbstractBeforeAfterRule$1.evaluate(AbstractBeforeAfterRule.java:45)
        at org.apache.lucene.util.TestRuleThreadAndTestName$1.evaluate(TestRuleThreadAndTestName.java:48)
        at org.apache.lucene.util.TestRuleIgnoreAfterMaxFailures$1.evaluate(TestRuleIgnoreAfterMaxFailures.java:64)
        at org.apache.lucene.util.TestRuleMarkFailure$1.evaluate(TestRuleMarkFailure.java:47)
        at com.carrotsearch.randomizedtesting.rules.StatementAdapter.evaluate(StatementAdapter.java:36)
        at com.carrotsearch.randomizedtesting.ThreadLeakControl$StatementRunner.run(ThreadLeakControl.java:368)
        at com.carrotsearch.randomizedtesting.ThreadLeakControl.forkTimeoutingTask(ThreadLeakControl.java:817)
        at com.carrotsearch.randomizedtesting.ThreadLeakControl$3.evaluate(ThreadLeakControl.java:468)
        at com.carrotsearch.randomizedtesting.RandomizedRunner.runSingleTest(RandomizedRunner.java:947)
        at com.carrotsearch.randomizedtesting.RandomizedRunner$5.evaluate(RandomizedRunner.java:832)
        at com.carrotsearch.randomizedtesting.RandomizedRunner$6.evaluate(RandomizedRunner.java:883)
        at com.carrotsearch.randomizedtesting.RandomizedRunner$7.evaluate(RandomizedRunner.java:894)
        at org.apache.lucene.util.AbstractBeforeAfterRule$1.evaluate(AbstractBeforeAfterRule.java:45)
        at com.carrotsearch.randomizedtesting.rules.StatementAdapter.evaluate(StatementAdapter.java:36)
        at org.apache.lucene.util.TestRuleStoreClassName$1.evaluate(TestRuleStoreClassName.java:41)
        at com.carrotsearch.randomizedtesting.rules.NoShadowingOrOverridesOnMethodsRule$1.evaluate(NoShadowingOrOverridesOnMethodsRule.java:40)
        at com.carrotsearch.randomizedtesting.rules.NoShadowingOrOverridesOnMethodsRule$1.evaluate(NoShadowingOrOverridesOnMethodsRule.java:40)
        at com.carrotsearch.randomizedtesting.rules.StatementAdapter.evaluate(StatementAdapter.java:36)
        at com.carrotsearch.randomizedtesting.rules.StatementAdapter.evaluate(StatementAdapter.java:36)
        at com.carrotsearch.randomizedtesting.rules.StatementAdapter.evaluate(StatementAdapter.java:36)
        at org.apache.lucene.util.TestRuleAssertionsRequired$1.evaluate(TestRuleAssertionsRequired.java:53)
        at org.apache.lucene.util.TestRuleMarkFailure$1.evaluate(TestRuleMarkFailure.java:47)
        at org.apache.lucene.util.TestRuleIgnoreAfterMaxFailures$1.evaluate(TestRuleIgnoreAfterMaxFailures.java:64)
        at org.apache.lucene.util.TestRuleIgnoreTestSuites$1.evaluate(TestRuleIgnoreTestSuites.java:54)
        at com.carrotsearch.randomizedtesting.rules.StatementAdapter.evaluate(StatementAdapter.java:36)
        at com.carrotsearch.randomizedtesting.ThreadLeakControl$StatementRunner.run(ThreadLeakControl.java:368)
        at java.lang.Thread.run(Thread.java:748)




Build Log:
[...truncated 483 lines...]
   [junit4] Suite: org.apache.lucene.index.TestConcurrentMergeScheduler
   [junit4]   2> NOTE: reproduce with: ant test  -Dtestcase=TestConcurrentMergeScheduler -Dtests.method=testFlushExceptions -Dtests.seed=E443A8CB652F9DE1 -Dtests.multiplier=3 -Dtests.slow=true -Dtests.locale=ko -Dtests.timezone=Africa/Luanda -Dtests.asserts=true -Dtests.file.encoding=UTF-8
   [junit4] FAILURE 0.02s J1 | TestConcurrentMergeScheduler.testFlushExceptions <<<
   [junit4]    > Throwable #1: java.lang.AssertionError
   [junit4]    > at __randomizedtesting.SeedInfo.seed([E443A8CB652F9DE1:5029FB116CCF0BD5]:0)
   [junit4]    > at org.apache.lucene.index.TestConcurrentMergeScheduler.testFlushExceptions(TestConcurrentMergeScheduler.java:128)
   [junit4]    > at java.lang.Thread.run(Thread.java:748)
   [junit4]   2> NOTE: test params are: codec=Asserting(Lucene80): {field=PostingsFormat(name=LuceneFixedGap), id=Lucene50(blocksize=128), content=PostingsFormat(name=LuceneVarGapFixedInterval)}, docValues:{}, maxPointsInLeafNode=866, maxMBSortInHeap=7.520883378501226, sim=Asserting(org.apache.lucene.search.similarities.AssertingSimilarity@13b86c3), locale=ko, timezone=Africa/Luanda
   [junit4]   2> NOTE: Linux 4.18.0-17-generic i386/Oracle Corporation 1.8.0_201 (32-bit)/cpus=8,threads=1,free=21749752,total=56729600
   [junit4]   2> NOTE: All tests run in this JVM: [TestInfoStream, TestFieldMaskingSpanQuery, Test4GBStoredFields, TestDocumentsWriterStallControl, TestSumDocFreq, TestCachingTokenFilter, TestIndexWriterLockRelease, TestTieredMergePolicy, TestPerFieldPostingsFormat2, TestLRUQueryCache, TestRollback, TestFilterLeafReader, TestPolygon, TestDeterminism, TestPackedTokenAttributeImpl, TestCharsRef, TestNRTThreads, TestPerSegmentDeletes, TestConcurrentMergeScheduler]
   [junit4] Completed [39/519 (1!)] on J1 in 7.84s, 16 tests, 1 failure <<< FAILURES!

[...truncated 36451 lines...]
check-licenses:
     [echo] License check under: /home/jenkins/workspace/Lucene-Solr-8.x-Linux/solr
 [licenses] MISSING sha1 checksum file for: /home/jenkins/workspace/Lucene-Solr-8.x-Linux/solr/core/lib/jose4j-0.6.5.jar
 [licenses] EXPECTED sha1 checksum file : /home/jenkins/workspace/Lucene-Solr-8.x-Linux/solr/licenses/jose4j-0.6.5.jar.sha1

[...truncated 1 lines...]
BUILD FAILED
/home/jenkins/workspace/Lucene-Solr-8.x-Linux/build.xml:633: The following error occurred while executing this line:
/home/jenkins/workspace/Lucene-Solr-8.x-Linux/build.xml:117: The following error occurred while executing this line:
/home/jenkins/workspace/Lucene-Solr-8.x-Linux/solr/build.xml:364: The following error occurred while executing this line:
/home/jenkins/workspace/Lucene-Solr-8.x-Linux/lucene/tools/custom-tasks.xml:62: License check failed. Check the logs.
If you recently modified ivy-versions.properties or any module's ivy.xml,
make sure you run "ant clean-jars jar-checksums" before running precommit.

Total time: 129 minutes 22 seconds
Build step 'Invoke Ant' marked build as failure
Archiving artifacts
Setting ANT_1_8_2_HOME=/home/jenkins/tools/hudson.tasks.Ant_AntInstallation/ANT_1.8.2
[WARNINGS] Skipping publisher since build result is FAILURE
Recording test results
Setting ANT_1_8_2_HOME=/home/jenkins/tools/hudson.tasks.Ant_AntInstallation/ANT_1.8.2
Email was triggered for: Failure - Any
Sending email for trigger: Failure - Any
Setting ANT_1_8_2_HOME=/home/jenkins/tools/hudson.tasks.Ant_AntInstallation/ANT_1.8.2
Setting ANT_1_8_2_HOME=/home/jenkins/tools/hudson.tasks.Ant_AntInstallation/ANT_1.8.2
Setting ANT_1_8_2_HOME=/home/jenkins/tools/hudson.tasks.Ant_AntInstallation/ANT_1.8.2
Setting ANT_1_8_2_HOME=/home/jenkins/tools/hudson.tasks.Ant_AntInstallation/ANT_1.8.2
Setting ANT_1_8_2_HOME=/home/jenkins/tools/hudson.tasks.Ant_AntInstallation/ANT_1.8.2
Setting ANT_1_8_2_HOME=/home/jenkins/tools/hudson.tasks.Ant_AntInstallation/ANT_1.8.2


---------------------------------------------------------------------
To unsubscribe, e-mail: [hidden email]
For additional commands, e-mail: [hidden email]
Reply | Threaded
Open this post in threaded view
|

[JENKINS] Lucene-Solr-8.x-Linux (32bit/jdk1.8.0_201) - Build # 409 - Still Failing!

Policeman Jenkins Server-2
Build: https://jenkins.thetaphi.de/job/Lucene-Solr-8.x-Linux/409/
Java: 32bit/jdk1.8.0_201 -server -XX:+UseG1GC

All tests passed

Build Log:
[...truncated 36919 lines...]
check-licenses:
     [echo] License check under: /home/jenkins/workspace/Lucene-Solr-8.x-Linux/solr
 [licenses] MISSING sha1 checksum file for: /home/jenkins/workspace/Lucene-Solr-8.x-Linux/solr/core/lib/jose4j-0.6.5.jar
 [licenses] EXPECTED sha1 checksum file : /home/jenkins/workspace/Lucene-Solr-8.x-Linux/solr/licenses/jose4j-0.6.5.jar.sha1

[...truncated 1 lines...]
BUILD FAILED
/home/jenkins/workspace/Lucene-Solr-8.x-Linux/build.xml:633: The following error occurred while executing this line:
/home/jenkins/workspace/Lucene-Solr-8.x-Linux/build.xml:117: The following error occurred while executing this line:
/home/jenkins/workspace/Lucene-Solr-8.x-Linux/solr/build.xml:364: The following error occurred while executing this line:
/home/jenkins/workspace/Lucene-Solr-8.x-Linux/lucene/tools/custom-tasks.xml:62: License check failed. Check the logs.
If you recently modified ivy-versions.properties or any module's ivy.xml,
make sure you run "ant clean-jars jar-checksums" before running precommit.

Total time: 84 minutes 24 seconds
Build step 'Invoke Ant' marked build as failure
Archiving artifacts
Setting ANT_1_8_2_HOME=/home/jenkins/tools/hudson.tasks.Ant_AntInstallation/ANT_1.8.2
[WARNINGS] Skipping publisher since build result is FAILURE
Recording test results
Setting ANT_1_8_2_HOME=/home/jenkins/tools/hudson.tasks.Ant_AntInstallation/ANT_1.8.2
Email was triggered for: Failure - Any
Sending email for trigger: Failure - Any
Setting ANT_1_8_2_HOME=/home/jenkins/tools/hudson.tasks.Ant_AntInstallation/ANT_1.8.2
Setting ANT_1_8_2_HOME=/home/jenkins/tools/hudson.tasks.Ant_AntInstallation/ANT_1.8.2
Setting ANT_1_8_2_HOME=/home/jenkins/tools/hudson.tasks.Ant_AntInstallation/ANT_1.8.2
Setting ANT_1_8_2_HOME=/home/jenkins/tools/hudson.tasks.Ant_AntInstallation/ANT_1.8.2
Setting ANT_1_8_2_HOME=/home/jenkins/tools/hudson.tasks.Ant_AntInstallation/ANT_1.8.2
Setting ANT_1_8_2_HOME=/home/jenkins/tools/hudson.tasks.Ant_AntInstallation/ANT_1.8.2


---------------------------------------------------------------------
To unsubscribe, e-mail: [hidden email]
For additional commands, e-mail: [hidden email]