[JENKINS-EA] Lucene-Solr-master-Linux (32bit/jdk-9-ea+175) - Build # 20132 - Unstable!

Previous Topic Next Topic
 
classic Classic list List threaded Threaded
1 message Options
Reply | Threaded
Open this post in threaded view
|  
Report Content as Inappropriate

[JENKINS-EA] Lucene-Solr-master-Linux (32bit/jdk-9-ea+175) - Build # 20132 - Unstable!

Policeman Jenkins Server-2
Build: https://jenkins.thetaphi.de/job/Lucene-Solr-master-Linux/20132/
Java: 32bit/jdk-9-ea+175 -client -XX:+UseParallelGC --illegal-access=deny

1 tests failed.
FAILED:  org.apache.solr.handler.admin.MetricsHandlerTest.testPropertyFilter

Error Message:


Stack Trace:
java.lang.AssertionError
        at __randomizedtesting.SeedInfo.seed([1B1A8CE57FABF412:797772A4B025942C]:0)
        at org.junit.Assert.fail(Assert.java:92)
        at org.junit.Assert.assertTrue(Assert.java:43)
        at org.junit.Assert.assertNotNull(Assert.java:526)
        at org.junit.Assert.assertNotNull(Assert.java:537)
        at org.apache.solr.handler.admin.MetricsHandlerTest.testPropertyFilter(MetricsHandlerTest.java:201)
        at java.base/jdk.internal.reflect.NativeMethodAccessorImpl.invoke0(Native Method)
        at java.base/jdk.internal.reflect.NativeMethodAccessorImpl.invoke(NativeMethodAccessorImpl.java:62)
        at java.base/jdk.internal.reflect.DelegatingMethodAccessorImpl.invoke(DelegatingMethodAccessorImpl.java:43)
        at java.base/java.lang.reflect.Method.invoke(Method.java:564)
        at com.carrotsearch.randomizedtesting.RandomizedRunner.invoke(RandomizedRunner.java:1713)
        at com.carrotsearch.randomizedtesting.RandomizedRunner$8.evaluate(RandomizedRunner.java:907)
        at com.carrotsearch.randomizedtesting.RandomizedRunner$9.evaluate(RandomizedRunner.java:943)
        at com.carrotsearch.randomizedtesting.RandomizedRunner$10.evaluate(RandomizedRunner.java:957)
        at com.carrotsearch.randomizedtesting.rules.SystemPropertiesRestoreRule$1.evaluate(SystemPropertiesRestoreRule.java:57)
        at org.apache.lucene.util.TestRuleSetupTeardownChained$1.evaluate(TestRuleSetupTeardownChained.java:49)
        at org.apache.lucene.util.AbstractBeforeAfterRule$1.evaluate(AbstractBeforeAfterRule.java:45)
        at org.apache.lucene.util.TestRuleThreadAndTestName$1.evaluate(TestRuleThreadAndTestName.java:48)
        at org.apache.lucene.util.TestRuleIgnoreAfterMaxFailures$1.evaluate(TestRuleIgnoreAfterMaxFailures.java:64)
        at org.apache.lucene.util.TestRuleMarkFailure$1.evaluate(TestRuleMarkFailure.java:47)
        at com.carrotsearch.randomizedtesting.rules.StatementAdapter.evaluate(StatementAdapter.java:36)
        at com.carrotsearch.randomizedtesting.ThreadLeakControl$StatementRunner.run(ThreadLeakControl.java:368)
        at com.carrotsearch.randomizedtesting.ThreadLeakControl.forkTimeoutingTask(ThreadLeakControl.java:817)
        at com.carrotsearch.randomizedtesting.ThreadLeakControl$3.evaluate(ThreadLeakControl.java:468)
        at com.carrotsearch.randomizedtesting.RandomizedRunner.runSingleTest(RandomizedRunner.java:916)
        at com.carrotsearch.randomizedtesting.RandomizedRunner$5.evaluate(RandomizedRunner.java:802)
        at com.carrotsearch.randomizedtesting.RandomizedRunner$6.evaluate(RandomizedRunner.java:852)
        at com.carrotsearch.randomizedtesting.RandomizedRunner$7.evaluate(RandomizedRunner.java:863)
        at com.carrotsearch.randomizedtesting.rules.StatementAdapter.evaluate(StatementAdapter.java:36)
        at com.carrotsearch.randomizedtesting.rules.SystemPropertiesRestoreRule$1.evaluate(SystemPropertiesRestoreRule.java:57)
        at org.apache.lucene.util.AbstractBeforeAfterRule$1.evaluate(AbstractBeforeAfterRule.java:45)
        at com.carrotsearch.randomizedtesting.rules.StatementAdapter.evaluate(StatementAdapter.java:36)
        at org.apache.lucene.util.TestRuleStoreClassName$1.evaluate(TestRuleStoreClassName.java:41)
        at com.carrotsearch.randomizedtesting.rules.NoShadowingOrOverridesOnMethodsRule$1.evaluate(NoShadowingOrOverridesOnMethodsRule.java:40)
        at com.carrotsearch.randomizedtesting.rules.NoShadowingOrOverridesOnMethodsRule$1.evaluate(NoShadowingOrOverridesOnMethodsRule.java:40)
        at com.carrotsearch.randomizedtesting.rules.StatementAdapter.evaluate(StatementAdapter.java:36)
        at com.carrotsearch.randomizedtesting.rules.StatementAdapter.evaluate(StatementAdapter.java:36)
        at org.apache.lucene.util.TestRuleAssertionsRequired$1.evaluate(TestRuleAssertionsRequired.java:53)
        at org.apache.lucene.util.TestRuleMarkFailure$1.evaluate(TestRuleMarkFailure.java:47)
        at org.apache.lucene.util.TestRuleIgnoreAfterMaxFailures$1.evaluate(TestRuleIgnoreAfterMaxFailures.java:64)
        at org.apache.lucene.util.TestRuleIgnoreTestSuites$1.evaluate(TestRuleIgnoreTestSuites.java:54)
        at com.carrotsearch.randomizedtesting.rules.StatementAdapter.evaluate(StatementAdapter.java:36)
        at com.carrotsearch.randomizedtesting.ThreadLeakControl$StatementRunner.run(ThreadLeakControl.java:368)
        at java.base/java.lang.Thread.run(Thread.java:844)




Build Log:
[...truncated 11941 lines...]
   [junit4] Suite: org.apache.solr.handler.admin.MetricsHandlerTest
   [junit4]   2> Creating dataDir: /home/jenkins/workspace/Lucene-Solr-master-Linux/solr/build/solr-core/test/J2/temp/solr.handler.admin.MetricsHandlerTest_1B1A8CE57FABF412-001/init-core-data-001
   [junit4]   2> 1284410 WARN  (SUITE-MetricsHandlerTest-seed#[1B1A8CE57FABF412]-worker) [    ] o.a.s.SolrTestCaseJ4 startTrackingSearchers: numOpens=14 numCloses=14
   [junit4]   2> 1284410 INFO  (SUITE-MetricsHandlerTest-seed#[1B1A8CE57FABF412]-worker) [    ] o.a.s.SolrTestCaseJ4 Using TrieFields (NUMERIC_POINTS_SYSPROP=false) w/NUMERIC_DOCVALUES_SYSPROP=true
   [junit4]   2> 1284410 INFO  (SUITE-MetricsHandlerTest-seed#[1B1A8CE57FABF412]-worker) [    ] o.a.s.SolrTestCaseJ4 Randomized ssl (false) and clientAuth (true) via: @org.apache.solr.util.RandomizeSSL(reason="", ssl=0.0/0.0, value=0.0/0.0, clientAuth=0.0/0.0)
   [junit4]   2> 1284410 INFO  (SUITE-MetricsHandlerTest-seed#[1B1A8CE57FABF412]-worker) [    ] o.a.s.SolrTestCaseJ4 ####initCore
   [junit4]   2> 1284411 INFO  (SUITE-MetricsHandlerTest-seed#[1B1A8CE57FABF412]-worker) [    ] o.a.s.c.SolrResourceLoader [null] Added 2 libs to classloader, from paths: [/home/jenkins/workspace/Lucene-Solr-master-Linux/solr/core/src/test-files/solr/collection1/lib, /home/jenkins/workspace/Lucene-Solr-master-Linux/solr/core/src/test-files/solr/collection1/lib/classes]
   [junit4]   2> 1284426 INFO  (SUITE-MetricsHandlerTest-seed#[1B1A8CE57FABF412]-worker) [    ] o.a.s.c.SolrConfig Using Lucene MatchVersion: 8.0.0
   [junit4]   2> 1284439 INFO  (SUITE-MetricsHandlerTest-seed#[1B1A8CE57FABF412]-worker) [    ] o.a.s.s.IndexSchema [null] Schema name=test
   [junit4]   2> 1284514 INFO  (SUITE-MetricsHandlerTest-seed#[1B1A8CE57FABF412]-worker) [    ] o.a.s.s.IndexSchema Loaded schema test/1.0 with uniqueid field id
   [junit4]   2> 1284543 INFO  (SUITE-MetricsHandlerTest-seed#[1B1A8CE57FABF412]-worker) [    ] o.a.s.m.r.SolrJmxReporter JMX monitoring for 'solr.node' (registry 'solr.node') enabled at server: com.sun.jmx.mbeanserver.JmxMBeanServer@7a979
   [junit4]   2> 1284547 INFO  (SUITE-MetricsHandlerTest-seed#[1B1A8CE57FABF412]-worker) [    ] o.a.s.m.r.SolrJmxReporter JMX monitoring for 'solr.jvm' (registry 'solr.jvm') enabled at server: com.sun.jmx.mbeanserver.JmxMBeanServer@7a979
   [junit4]   2> 1284547 INFO  (SUITE-MetricsHandlerTest-seed#[1B1A8CE57FABF412]-worker) [    ] o.a.s.m.r.SolrJmxReporter JMX monitoring for 'solr.jetty' (registry 'solr.jetty') enabled at server: com.sun.jmx.mbeanserver.JmxMBeanServer@7a979
   [junit4]   2> 1284548 INFO  (coreLoadExecutor-4371-thread-1) [    ] o.a.s.c.SolrResourceLoader [null] Added 2 libs to classloader, from paths: [/home/jenkins/workspace/Lucene-Solr-master-Linux/solr/core/src/test-files/solr/collection1/lib, /home/jenkins/workspace/Lucene-Solr-master-Linux/solr/core/src/test-files/solr/collection1/lib/classes]
   [junit4]   2> 1284572 INFO  (coreLoadExecutor-4371-thread-1) [    ] o.a.s.c.SolrConfig Using Lucene MatchVersion: 8.0.0
   [junit4]   2> 1284592 INFO  (coreLoadExecutor-4371-thread-1) [    ] o.a.s.s.IndexSchema [collection1] Schema name=test
   [junit4]   2> 1284694 INFO  (coreLoadExecutor-4371-thread-1) [    ] o.a.s.s.IndexSchema Loaded schema test/1.0 with uniqueid field id
   [junit4]   2> 1284701 INFO  (coreLoadExecutor-4371-thread-1) [    ] o.a.s.c.CoreContainer Creating SolrCore 'collection1' using configuration from instancedir /home/jenkins/workspace/Lucene-Solr-master-Linux/solr/core/src/test-files/solr/collection1, trusted=true
   [junit4]   2> 1284701 INFO  (coreLoadExecutor-4371-thread-1) [    ] o.a.s.m.r.SolrJmxReporter JMX monitoring for 'solr.core.collection1' (registry 'solr.core.collection1') enabled at server: com.sun.jmx.mbeanserver.JmxMBeanServer@7a979
   [junit4]   2> 1284701 INFO  (coreLoadExecutor-4371-thread-1) [    ] o.a.s.c.SolrCore solr.RecoveryStrategy.Builder
   [junit4]   2> 1284701 INFO  (coreLoadExecutor-4371-thread-1) [    ] o.a.s.c.SolrCore [[collection1] ] Opening new SolrCore at [/home/jenkins/workspace/Lucene-Solr-master-Linux/solr/core/src/test-files/solr/collection1], dataDir=[/home/jenkins/workspace/Lucene-Solr-master-Linux/solr/build/solr-core/test/J2/temp/solr.handler.admin.MetricsHandlerTest_1B1A8CE57FABF412-001/init-core-data-001/]
   [junit4]   2> 1284703 INFO  (coreLoadExecutor-4371-thread-1) [    ] o.a.s.u.RandomMergePolicy RandomMergePolicy wrapping class org.apache.lucene.index.LogDocMergePolicy: [LogDocMergePolicy: minMergeSize=1000, mergeFactor=16, maxMergeSize=9223372036854775807, maxMergeSizeForForcedMerge=9223372036854775807, calibrateSizeByDeletes=false, maxMergeDocs=2147483647, maxCFSSegmentSizeMB=8.796093022207999E12, noCFSRatio=0.30659499375708377]
   [junit4]   2> 1284747 INFO  (coreLoadExecutor-4371-thread-1) [    ] o.a.s.u.UpdateHandler Using UpdateLog implementation: org.apache.solr.update.UpdateLog
   [junit4]   2> 1284747 INFO  (coreLoadExecutor-4371-thread-1) [    ] o.a.s.u.UpdateLog Initializing UpdateLog: dataDir= defaultSyncLevel=FLUSH numRecordsToKeep=100 maxNumLogsToKeep=10 numVersionBuckets=65536
   [junit4]   2> 1284748 INFO  (coreLoadExecutor-4371-thread-1) [    ] o.a.s.u.CommitTracker Hard AutoCommit: disabled
   [junit4]   2> 1284748 INFO  (coreLoadExecutor-4371-thread-1) [    ] o.a.s.u.CommitTracker Soft AutoCommit: disabled
   [junit4]   2> 1284749 INFO  (coreLoadExecutor-4371-thread-1) [    ] o.a.s.u.RandomMergePolicy RandomMergePolicy wrapping class org.apache.lucene.index.TieredMergePolicy: [TieredMergePolicy: maxMergeAtOnce=31, maxMergeAtOnceExplicit=24, maxMergedSegmentMB=44.779296875, floorSegmentMB=1.8330078125, forceMergeDeletesPctAllowed=6.559860571483817, segmentsPerTier=46.0, maxCFSSegmentSizeMB=8.796093022207999E12, noCFSRatio=1.0
   [junit4]   2> 1284749 INFO  (coreLoadExecutor-4371-thread-1) [    ] o.a.s.s.SolrIndexSearcher Opening [Searcher@1c4fb25[collection1] main]
   [junit4]   2> 1284749 INFO  (coreLoadExecutor-4371-thread-1) [    ] o.a.s.h.c.SpellCheckComponent Initializing spell checkers
   [junit4]   2> 1284767 INFO  (coreLoadExecutor-4371-thread-1) [    ] o.a.s.s.DirectSolrSpellChecker init: {name=direct,classname=DirectSolrSpellChecker,field=lowerfilt,minQueryLength=3}
   [junit4]   2> 1284839 INFO  (coreLoadExecutor-4371-thread-1) [    ] o.a.s.h.ReplicationHandler Commits will be reserved for  10000
   [junit4]   2> 1284839 INFO  (coreLoadExecutor-4371-thread-1) [    ] o.a.s.u.UpdateLog Could not find max version in index or recent updates, using new clock 1572952885500575744
   [junit4]   2> 1284840 INFO  (searcherExecutor-4372-thread-1) [    ] o.a.s.h.c.SpellCheckComponent Loading spell index for spellchecker: default
   [junit4]   2> 1284840 INFO  (searcherExecutor-4372-thread-1) [    ] o.a.s.h.c.SpellCheckComponent Loading spell index for spellchecker: direct
   [junit4]   2> 1284841 INFO  (searcherExecutor-4372-thread-1) [    ] o.a.s.h.c.SpellCheckComponent Loading spell index for spellchecker: wordbreak
   [junit4]   2> 1284841 INFO  (searcherExecutor-4372-thread-1) [    ] o.a.s.h.c.SpellCheckComponent Loading spell index for spellchecker: multipleFields
   [junit4]   2> 1284841 INFO  (searcherExecutor-4372-thread-1) [    ] o.a.s.h.c.SpellCheckComponent Loading spell index for spellchecker: jarowinkler
   [junit4]   2> 1284841 INFO  (SUITE-MetricsHandlerTest-seed#[1B1A8CE57FABF412]-worker) [    ] o.a.s.SolrTestCaseJ4 ####initCore end
   [junit4]   2> 1284845 INFO  (TEST-MetricsHandlerTest.testPropertyFilter-seed#[1B1A8CE57FABF412]) [    ] o.a.s.SolrTestCaseJ4 ###Starting testPropertyFilter
   [junit4]   2> 1284846 INFO  (TEST-MetricsHandlerTest.testPropertyFilter-seed#[1B1A8CE57FABF412]) [    ] o.a.s.SolrTestCaseJ4 ###Ending testPropertyFilter
   [junit4]   2> NOTE: reproduce with: ant test  -Dtestcase=MetricsHandlerTest -Dtests.method=testPropertyFilter -Dtests.seed=1B1A8CE57FABF412 -Dtests.multiplier=3 -Dtests.slow=true -Dtests.locale=sr-Cyrl-RS -Dtests.timezone=SystemV/EST5EDT -Dtests.asserts=true -Dtests.file.encoding=UTF-8
   [junit4] FAILURE 0.01s J2 | MetricsHandlerTest.testPropertyFilter <<<
   [junit4]    > Throwable #1: java.lang.AssertionError
   [junit4]    > at __randomizedtesting.SeedInfo.seed([1B1A8CE57FABF412:797772A4B025942C]:0)
   [junit4]    > at org.apache.solr.handler.admin.MetricsHandlerTest.testPropertyFilter(MetricsHandlerTest.java:201)
   [junit4]    > at java.base/jdk.internal.reflect.NativeMethodAccessorImpl.invoke0(Native Method)
   [junit4]    > at java.base/jdk.internal.reflect.NativeMethodAccessorImpl.invoke(NativeMethodAccessorImpl.java:62)
   [junit4]    > at java.base/jdk.internal.reflect.DelegatingMethodAccessorImpl.invoke(DelegatingMethodAccessorImpl.java:43)
   [junit4]    > at java.base/java.lang.reflect.Method.invoke(Method.java:564)
   [junit4]    > at java.base/java.lang.Thread.run(Thread.java:844)
   [junit4]   2> 1284849 INFO  (TEST-MetricsHandlerTest.test-seed#[1B1A8CE57FABF412]) [    ] o.a.s.SolrTestCaseJ4 ###Starting test
   [junit4]   2> 1284853 INFO  (searcherExecutor-4372-thread-1) [    ] o.a.s.h.c.SpellCheckComponent Loading spell index for spellchecker: external
   [junit4]   2> 1284853 INFO  (searcherExecutor-4372-thread-1) [    ] o.a.s.h.c.SpellCheckComponent Loading spell index for spellchecker: freq
   [junit4]   2> 1284853 INFO  (searcherExecutor-4372-thread-1) [    ] o.a.s.h.c.SpellCheckComponent Loading spell index for spellchecker: fqcn
   [junit4]   2> 1284853 INFO  (searcherExecutor-4372-thread-1) [    ] o.a.s.h.c.SpellCheckComponent Loading spell index for spellchecker: perDict
   [junit4]   2> 1284867 INFO  (searcherExecutor-4372-thread-1) [    ] o.a.s.c.SolrCore [collection1] Registered new searcher Searcher@1c4fb25[collection1] main{ExitableDirectoryReader(UninvertingDirectoryReader())}
   [junit4]   2> 1284868 INFO  (TEST-MetricsHandlerTest.test-seed#[1B1A8CE57FABF412]) [    ] o.a.s.c.TransientSolrCoreCacheDefault Allocating transient cache for 2147483647 transient cores
   [junit4]   2> 1284901 INFO  (TEST-MetricsHandlerTest.test-seed#[1B1A8CE57FABF412]) [    ] o.a.s.SolrTestCaseJ4 ###Ending test
   [junit4]   2> 1284904 INFO  (TEST-MetricsHandlerTest.testCompact-seed#[1B1A8CE57FABF412]) [    ] o.a.s.SolrTestCaseJ4 ###Starting testCompact
   [junit4]   2> 1284909 INFO  (TEST-MetricsHandlerTest.testCompact-seed#[1B1A8CE57FABF412]) [    ] o.a.s.SolrTestCaseJ4 ###Ending testCompact
   [junit4]   2> 1284909 INFO  (SUITE-MetricsHandlerTest-seed#[1B1A8CE57FABF412]-worker) [    ] o.a.s.SolrTestCaseJ4 ###deleteCore
   [junit4]   2> 1284909 INFO  (SUITE-MetricsHandlerTest-seed#[1B1A8CE57FABF412]-worker) [    ] o.a.s.c.CoreContainer Shutting down CoreContainer instance=10804047
   [junit4]   2> 1284910 INFO  (SUITE-MetricsHandlerTest-seed#[1B1A8CE57FABF412]-worker) [    ] o.a.s.m.SolrMetricManager Closing metric reporters for registry=solr.node, tag=null
   [junit4]   2> 1284911 INFO  (SUITE-MetricsHandlerTest-seed#[1B1A8CE57FABF412]-worker) [    ] o.a.s.m.SolrMetricManager Closing metric reporters for registry=solr.jvm, tag=null
   [junit4]   2> 1284912 INFO  (SUITE-MetricsHandlerTest-seed#[1B1A8CE57FABF412]-worker) [    ] o.a.s.m.SolrMetricManager Closing metric reporters for registry=solr.jetty, tag=null
   [junit4]   2> 1284912 INFO  (coreCloseExecutor-4377-thread-1) [    ] o.a.s.c.SolrCore [collection1]  CLOSING SolrCore org.apache.solr.core.SolrCore@8a8c12
   [junit4]   2> 1284913 INFO  (coreCloseExecutor-4377-thread-1) [    ] o.a.s.m.SolrMetricManager Closing metric reporters for registry=solr.core.collection1, tag=9079826
   [junit4]   2> NOTE: leaving temporary files on disk at: /home/jenkins/workspace/Lucene-Solr-master-Linux/solr/build/solr-core/test/J2/temp/solr.handler.admin.MetricsHandlerTest_1B1A8CE57FABF412-001
   [junit4]   2> NOTE: test params are: codec=Asserting(Lucene70), sim=RandomSimilarity(queryNorm=true): {}, locale=sr-Cyrl-RS, timezone=SystemV/EST5EDT
   [junit4]   2> NOTE: Linux 4.10.0-26-generic i386/Oracle Corporation 9 (32-bit)/cpus=8,threads=1,free=214968472,total=497287168
   [junit4]   2> NOTE: All tests run in this JVM: [ChaosMonkeyNothingIsSafeWithPullReplicasTest, TestOverriddenPrefixQueryForCustomFieldType, SimplePostToolTest, SegmentsInfoRequestHandlerTest, TestCorePropertiesReload, TestCloudPseudoReturnFields, UpdateLogTest, TestHdfsCloudBackupRestore, TriLevelCompositeIdRoutingTest, MultiThreadedOCPTest, TestOnReconnectListenerSupport, TestAnalyzedSuggestions, TestPKIAuthenticationPlugin, TestCopyFieldCollectionResource, TestFilteredDocIdSet, SolrXmlInZkTest, TestPolicyCloud, SolrIndexMetricsTest, TestRawResponseWriter, TestConfigSetImmutable, ReturnFieldsTest, TestCustomDocTransformer, RollingRestartTest, TestStressReorder, TestRequestStatusCollectionAPI, BigEndianAscendingWordSerializerTest, LeaderElectionTest, TestReversedWildcardFilterFactory, TestJettySolrRunner, RequiredFieldsTest, ForceLeaderTest, V2ApiIntegrationTest, TestLMJelinekMercerSimilarityFactory, RecoveryZkTest, InfixSuggestersTest, TestChildDocTransformer, TestZkChroot, ChangedSchemaMergeTest, RulesTest, BadIndexSchemaTest, HdfsTlogReplayBufferedWhileIndexingTest, AliasIntegrationTest, TestSurroundQueryParser, TestSolrCoreProperties, LeaderInitiatedRecoveryOnShardRestartTest, TestFieldCollectionResource, TestFileDictionaryLookup, StressHdfsTest, SimpleMLTQParserTest, SubstringBytesRefFilterTest, DocValuesMissingTest, TestTrie, LeaderFailoverAfterPartitionTest, FullSolrCloudDistribCmdsTest, SignatureUpdateProcessorFactoryTest, SpellCheckCollatorWithCollapseTest, JSONWriterTest, HardAutoCommitTest, TestDistributedMissingSort, TestImplicitCoreProperties, SolrSlf4jReporterTest, TestStreamBody, TestManagedSynonymGraphFilterFactory, TestCodecSupport, MergeStrategyTest, SolrMetricManagerTest, TestQueryWrapperFilter, TestDistribDocBasedVersion, TestHdfsUpdateLog, DateFieldTest, TestGraphMLResponseWriter, TimeZoneUtilsTest, TestSubQueryTransformerDistrib, TestRestManager, QueryEqualityTest, TestLegacyTerms, HdfsDirectoryTest, TestGroupingSearch, ShardSplitTest, TestSortByMinMaxFunction, MinimalSchemaTest, TestRTimerTree, DistributedFacetPivotSmallTest, SortByFunctionTest, UninvertDocValuesMergePolicyTest, TestJsonFacets, TestSuggestSpellingConverter, TestJmxIntegration, HdfsChaosMonkeyNothingIsSafeTest, TestDistributedStatsComponentCardinality, SolrInfoBeanTest, TestRestoreCore, AtomicUpdateProcessorFactoryTest, SearchHandlerTest, CollectionsAPISolrJTest, TestQuerySenderListener, SimpleFacetsTest, TestInitQParser, TestUniqueKeyFieldResource, TermVectorComponentDistributedTest, TestCollectionAPI, SolrCoreCheckLockOnStartupTest, SuggesterFSTTest, SpellPossibilityIteratorTest, SearchHandlerTest, DirectUpdateHandlerTest, TestNRTOpen, BaseCdcrDistributedZkTest, MetricsHandlerTest]
   [junit4] Completed [358/728 (1!)] on J2 in 0.52s, 3 tests, 1 failure <<< FAILURES!

[...truncated 37753 lines...]


---------------------------------------------------------------------
To unsubscribe, e-mail: [hidden email]
For additional commands, e-mail: [hidden email]
Loading...