[JENKINS-EA] Lucene-Solr-master-Linux (32bit/jdk-9-ea+178) - Build # 20147 - Unstable!

Previous Topic Next Topic
 
classic Classic list List threaded Threaded
1 message Options
Reply | Threaded
Open this post in threaded view
|  
Report Content as Inappropriate

[JENKINS-EA] Lucene-Solr-master-Linux (32bit/jdk-9-ea+178) - Build # 20147 - Unstable!

Policeman Jenkins Server-2
Build: https://jenkins.thetaphi.de/job/Lucene-Solr-master-Linux/20147/
Java: 32bit/jdk-9-ea+178 -client -XX:+UseParallelGC --illegal-access=deny

3 tests failed.
FAILED:  junit.framework.TestSuite.org.apache.solr.cloud.ChaosMonkeyNothingIsSafeTest

Error Message:
9 threads leaked from SUITE scope at org.apache.solr.cloud.ChaosMonkeyNothingIsSafeTest:     1) Thread[id=12957, name=zkCallback-3440-thread-1, state=TIMED_WAITING, group=TGRP-ChaosMonkeyNothingIsSafeTest]         at java.base@9/jdk.internal.misc.Unsafe.park(Native Method)         at java.base@9/java.util.concurrent.locks.LockSupport.parkNanos(LockSupport.java:234)         at java.base@9/java.util.concurrent.SynchronousQueue$TransferStack.awaitFulfill(SynchronousQueue.java:462)         at java.base@9/java.util.concurrent.SynchronousQueue$TransferStack.transfer(SynchronousQueue.java:361)         at java.base@9/java.util.concurrent.SynchronousQueue.poll(SynchronousQueue.java:937)         at java.base@9/java.util.concurrent.ThreadPoolExecutor.getTask(ThreadPoolExecutor.java:1085)         at java.base@9/java.util.concurrent.ThreadPoolExecutor.runWorker(ThreadPoolExecutor.java:1146)         at java.base@9/java.util.concurrent.ThreadPoolExecutor$Worker.run(ThreadPoolExecutor.java:635)         at java.base@9/java.lang.Thread.run(Thread.java:844)    2) Thread[id=13117, name=zkCallback-3440-thread-3, state=TIMED_WAITING, group=TGRP-ChaosMonkeyNothingIsSafeTest]         at java.base@9/jdk.internal.misc.Unsafe.park(Native Method)         at java.base@9/java.util.concurrent.locks.LockSupport.parkNanos(LockSupport.java:234)         at java.base@9/java.util.concurrent.SynchronousQueue$TransferStack.awaitFulfill(SynchronousQueue.java:462)         at java.base@9/java.util.concurrent.SynchronousQueue$TransferStack.transfer(SynchronousQueue.java:361)         at java.base@9/java.util.concurrent.SynchronousQueue.poll(SynchronousQueue.java:937)         at java.base@9/java.util.concurrent.ThreadPoolExecutor.getTask(ThreadPoolExecutor.java:1085)         at java.base@9/java.util.concurrent.ThreadPoolExecutor.runWorker(ThreadPoolExecutor.java:1146)         at java.base@9/java.util.concurrent.ThreadPoolExecutor$Worker.run(ThreadPoolExecutor.java:635)         at java.base@9/java.lang.Thread.run(Thread.java:844)    3) Thread[id=13211, name=zkCallback-3440-thread-6, state=TIMED_WAITING, group=TGRP-ChaosMonkeyNothingIsSafeTest]         at java.base@9/jdk.internal.misc.Unsafe.park(Native Method)         at java.base@9/java.util.concurrent.locks.LockSupport.parkNanos(LockSupport.java:234)         at java.base@9/java.util.concurrent.SynchronousQueue$TransferStack.awaitFulfill(SynchronousQueue.java:462)         at java.base@9/java.util.concurrent.SynchronousQueue$TransferStack.transfer(SynchronousQueue.java:361)         at java.base@9/java.util.concurrent.SynchronousQueue.poll(SynchronousQueue.java:937)         at java.base@9/java.util.concurrent.ThreadPoolExecutor.getTask(ThreadPoolExecutor.java:1085)         at java.base@9/java.util.concurrent.ThreadPoolExecutor.runWorker(ThreadPoolExecutor.java:1146)         at java.base@9/java.util.concurrent.ThreadPoolExecutor$Worker.run(ThreadPoolExecutor.java:635)         at java.base@9/java.lang.Thread.run(Thread.java:844)    4) Thread[id=12955, name=TEST-ChaosMonkeyNothingIsSafeTest.test-seed#[D3D69541442EA1D3]-SendThread(127.0.0.1:45839), state=TIMED_WAITING, group=TGRP-ChaosMonkeyNothingIsSafeTest]         at java.base@9/java.lang.Thread.sleep(Native Method)         at app//org.apache.zookeeper.client.StaticHostProvider.next(StaticHostProvider.java:101)         at app//org.apache.zookeeper.ClientCnxn$SendThread.startConnect(ClientCnxn.java:997)         at app//org.apache.zookeeper.ClientCnxn$SendThread.run(ClientCnxn.java:1060)    5) Thread[id=13153, name=zkCallback-3440-thread-5, state=TIMED_WAITING, group=TGRP-ChaosMonkeyNothingIsSafeTest]         at java.base@9/jdk.internal.misc.Unsafe.park(Native Method)         at java.base@9/java.util.concurrent.locks.LockSupport.parkNanos(LockSupport.java:234)         at java.base@9/java.util.concurrent.SynchronousQueue$TransferStack.awaitFulfill(SynchronousQueue.java:462)         at java.base@9/java.util.concurrent.SynchronousQueue$TransferStack.transfer(SynchronousQueue.java:361)         at java.base@9/java.util.concurrent.SynchronousQueue.poll(SynchronousQueue.java:937)         at java.base@9/java.util.concurrent.ThreadPoolExecutor.getTask(ThreadPoolExecutor.java:1085)         at java.base@9/java.util.concurrent.ThreadPoolExecutor.runWorker(ThreadPoolExecutor.java:1146)         at java.base@9/java.util.concurrent.ThreadPoolExecutor$Worker.run(ThreadPoolExecutor.java:635)         at java.base@9/java.lang.Thread.run(Thread.java:844)    6) Thread[id=12956, name=TEST-ChaosMonkeyNothingIsSafeTest.test-seed#[D3D69541442EA1D3]-EventThread, state=WAITING, group=TGRP-ChaosMonkeyNothingIsSafeTest]         at java.base@9/jdk.internal.misc.Unsafe.park(Native Method)         at java.base@9/java.util.concurrent.locks.LockSupport.park(LockSupport.java:194)         at java.base@9/java.util.concurrent.locks.AbstractQueuedSynchronizer$ConditionObject.await(AbstractQueuedSynchronizer.java:2062)         at java.base@9/java.util.concurrent.LinkedBlockingQueue.take(LinkedBlockingQueue.java:435)         at app//org.apache.zookeeper.ClientCnxn$EventThread.run(ClientCnxn.java:501)    7) Thread[id=12954, name=Connection evictor, state=TIMED_WAITING, group=TGRP-ChaosMonkeyNothingIsSafeTest]         at java.base@9/java.lang.Thread.sleep(Native Method)         at app//org.apache.http.impl.client.IdleConnectionEvictor$1.run(IdleConnectionEvictor.java:66)         at java.base@9/java.lang.Thread.run(Thread.java:844)    8) Thread[id=13116, name=zkCallback-3440-thread-2, state=TIMED_WAITING, group=TGRP-ChaosMonkeyNothingIsSafeTest]         at java.base@9/jdk.internal.misc.Unsafe.park(Native Method)         at java.base@9/java.util.concurrent.locks.LockSupport.parkNanos(LockSupport.java:234)         at java.base@9/java.util.concurrent.SynchronousQueue$TransferStack.awaitFulfill(SynchronousQueue.java:462)         at java.base@9/java.util.concurrent.SynchronousQueue$TransferStack.transfer(SynchronousQueue.java:361)         at java.base@9/java.util.concurrent.SynchronousQueue.poll(SynchronousQueue.java:937)         at java.base@9/java.util.concurrent.ThreadPoolExecutor.getTask(ThreadPoolExecutor.java:1085)         at java.base@9/java.util.concurrent.ThreadPoolExecutor.runWorker(ThreadPoolExecutor.java:1146)         at java.base@9/java.util.concurrent.ThreadPoolExecutor$Worker.run(ThreadPoolExecutor.java:635)         at java.base@9/java.lang.Thread.run(Thread.java:844)    9) Thread[id=13118, name=zkCallback-3440-thread-4, state=TIMED_WAITING, group=TGRP-ChaosMonkeyNothingIsSafeTest]         at java.base@9/jdk.internal.misc.Unsafe.park(Native Method)         at java.base@9/java.util.concurrent.locks.LockSupport.parkNanos(LockSupport.java:234)         at java.base@9/java.util.concurrent.SynchronousQueue$TransferStack.awaitFulfill(SynchronousQueue.java:462)         at java.base@9/java.util.concurrent.SynchronousQueue$TransferStack.transfer(SynchronousQueue.java:361)         at java.base@9/java.util.concurrent.SynchronousQueue.poll(SynchronousQueue.java:937)         at java.base@9/java.util.concurrent.ThreadPoolExecutor.getTask(ThreadPoolExecutor.java:1085)         at java.base@9/java.util.concurrent.ThreadPoolExecutor.runWorker(ThreadPoolExecutor.java:1146)         at java.base@9/java.util.concurrent.ThreadPoolExecutor$Worker.run(ThreadPoolExecutor.java:635)         at java.base@9/java.lang.Thread.run(Thread.java:844)

Stack Trace:
com.carrotsearch.randomizedtesting.ThreadLeakError: 9 threads leaked from SUITE scope at org.apache.solr.cloud.ChaosMonkeyNothingIsSafeTest:
   1) Thread[id=12957, name=zkCallback-3440-thread-1, state=TIMED_WAITING, group=TGRP-ChaosMonkeyNothingIsSafeTest]
        at java.base@9/jdk.internal.misc.Unsafe.park(Native Method)
        at java.base@9/java.util.concurrent.locks.LockSupport.parkNanos(LockSupport.java:234)
        at java.base@9/java.util.concurrent.SynchronousQueue$TransferStack.awaitFulfill(SynchronousQueue.java:462)
        at java.base@9/java.util.concurrent.SynchronousQueue$TransferStack.transfer(SynchronousQueue.java:361)
        at java.base@9/java.util.concurrent.SynchronousQueue.poll(SynchronousQueue.java:937)
        at java.base@9/java.util.concurrent.ThreadPoolExecutor.getTask(ThreadPoolExecutor.java:1085)
        at java.base@9/java.util.concurrent.ThreadPoolExecutor.runWorker(ThreadPoolExecutor.java:1146)
        at java.base@9/java.util.concurrent.ThreadPoolExecutor$Worker.run(ThreadPoolExecutor.java:635)
        at java.base@9/java.lang.Thread.run(Thread.java:844)
   2) Thread[id=13117, name=zkCallback-3440-thread-3, state=TIMED_WAITING, group=TGRP-ChaosMonkeyNothingIsSafeTest]
        at java.base@9/jdk.internal.misc.Unsafe.park(Native Method)
        at java.base@9/java.util.concurrent.locks.LockSupport.parkNanos(LockSupport.java:234)
        at java.base@9/java.util.concurrent.SynchronousQueue$TransferStack.awaitFulfill(SynchronousQueue.java:462)
        at java.base@9/java.util.concurrent.SynchronousQueue$TransferStack.transfer(SynchronousQueue.java:361)
        at java.base@9/java.util.concurrent.SynchronousQueue.poll(SynchronousQueue.java:937)
        at java.base@9/java.util.concurrent.ThreadPoolExecutor.getTask(ThreadPoolExecutor.java:1085)
        at java.base@9/java.util.concurrent.ThreadPoolExecutor.runWorker(ThreadPoolExecutor.java:1146)
        at java.base@9/java.util.concurrent.ThreadPoolExecutor$Worker.run(ThreadPoolExecutor.java:635)
        at java.base@9/java.lang.Thread.run(Thread.java:844)
   3) Thread[id=13211, name=zkCallback-3440-thread-6, state=TIMED_WAITING, group=TGRP-ChaosMonkeyNothingIsSafeTest]
        at java.base@9/jdk.internal.misc.Unsafe.park(Native Method)
        at java.base@9/java.util.concurrent.locks.LockSupport.parkNanos(LockSupport.java:234)
        at java.base@9/java.util.concurrent.SynchronousQueue$TransferStack.awaitFulfill(SynchronousQueue.java:462)
        at java.base@9/java.util.concurrent.SynchronousQueue$TransferStack.transfer(SynchronousQueue.java:361)
        at java.base@9/java.util.concurrent.SynchronousQueue.poll(SynchronousQueue.java:937)
        at java.base@9/java.util.concurrent.ThreadPoolExecutor.getTask(ThreadPoolExecutor.java:1085)
        at java.base@9/java.util.concurrent.ThreadPoolExecutor.runWorker(ThreadPoolExecutor.java:1146)
        at java.base@9/java.util.concurrent.ThreadPoolExecutor$Worker.run(ThreadPoolExecutor.java:635)
        at java.base@9/java.lang.Thread.run(Thread.java:844)
   4) Thread[id=12955, name=TEST-ChaosMonkeyNothingIsSafeTest.test-seed#[D3D69541442EA1D3]-SendThread(127.0.0.1:45839), state=TIMED_WAITING, group=TGRP-ChaosMonkeyNothingIsSafeTest]
        at java.base@9/java.lang.Thread.sleep(Native Method)
        at app//org.apache.zookeeper.client.StaticHostProvider.next(StaticHostProvider.java:101)
        at app//org.apache.zookeeper.ClientCnxn$SendThread.startConnect(ClientCnxn.java:997)
        at app//org.apache.zookeeper.ClientCnxn$SendThread.run(ClientCnxn.java:1060)
   5) Thread[id=13153, name=zkCallback-3440-thread-5, state=TIMED_WAITING, group=TGRP-ChaosMonkeyNothingIsSafeTest]
        at java.base@9/jdk.internal.misc.Unsafe.park(Native Method)
        at java.base@9/java.util.concurrent.locks.LockSupport.parkNanos(LockSupport.java:234)
        at java.base@9/java.util.concurrent.SynchronousQueue$TransferStack.awaitFulfill(SynchronousQueue.java:462)
        at java.base@9/java.util.concurrent.SynchronousQueue$TransferStack.transfer(SynchronousQueue.java:361)
        at java.base@9/java.util.concurrent.SynchronousQueue.poll(SynchronousQueue.java:937)
        at java.base@9/java.util.concurrent.ThreadPoolExecutor.getTask(ThreadPoolExecutor.java:1085)
        at java.base@9/java.util.concurrent.ThreadPoolExecutor.runWorker(ThreadPoolExecutor.java:1146)
        at java.base@9/java.util.concurrent.ThreadPoolExecutor$Worker.run(ThreadPoolExecutor.java:635)
        at java.base@9/java.lang.Thread.run(Thread.java:844)
   6) Thread[id=12956, name=TEST-ChaosMonkeyNothingIsSafeTest.test-seed#[D3D69541442EA1D3]-EventThread, state=WAITING, group=TGRP-ChaosMonkeyNothingIsSafeTest]
        at java.base@9/jdk.internal.misc.Unsafe.park(Native Method)
        at java.base@9/java.util.concurrent.locks.LockSupport.park(LockSupport.java:194)
        at java.base@9/java.util.concurrent.locks.AbstractQueuedSynchronizer$ConditionObject.await(AbstractQueuedSynchronizer.java:2062)
        at java.base@9/java.util.concurrent.LinkedBlockingQueue.take(LinkedBlockingQueue.java:435)
        at app//org.apache.zookeeper.ClientCnxn$EventThread.run(ClientCnxn.java:501)
   7) Thread[id=12954, name=Connection evictor, state=TIMED_WAITING, group=TGRP-ChaosMonkeyNothingIsSafeTest]
        at java.base@9/java.lang.Thread.sleep(Native Method)
        at app//org.apache.http.impl.client.IdleConnectionEvictor$1.run(IdleConnectionEvictor.java:66)
        at java.base@9/java.lang.Thread.run(Thread.java:844)
   8) Thread[id=13116, name=zkCallback-3440-thread-2, state=TIMED_WAITING, group=TGRP-ChaosMonkeyNothingIsSafeTest]
        at java.base@9/jdk.internal.misc.Unsafe.park(Native Method)
        at java.base@9/java.util.concurrent.locks.LockSupport.parkNanos(LockSupport.java:234)
        at java.base@9/java.util.concurrent.SynchronousQueue$TransferStack.awaitFulfill(SynchronousQueue.java:462)
        at java.base@9/java.util.concurrent.SynchronousQueue$TransferStack.transfer(SynchronousQueue.java:361)
        at java.base@9/java.util.concurrent.SynchronousQueue.poll(SynchronousQueue.java:937)
        at java.base@9/java.util.concurrent.ThreadPoolExecutor.getTask(ThreadPoolExecutor.java:1085)
        at java.base@9/java.util.concurrent.ThreadPoolExecutor.runWorker(ThreadPoolExecutor.java:1146)
        at java.base@9/java.util.concurrent.ThreadPoolExecutor$Worker.run(ThreadPoolExecutor.java:635)
        at java.base@9/java.lang.Thread.run(Thread.java:844)
   9) Thread[id=13118, name=zkCallback-3440-thread-4, state=TIMED_WAITING, group=TGRP-ChaosMonkeyNothingIsSafeTest]
        at java.base@9/jdk.internal.misc.Unsafe.park(Native Method)
        at java.base@9/java.util.concurrent.locks.LockSupport.parkNanos(LockSupport.java:234)
        at java.base@9/java.util.concurrent.SynchronousQueue$TransferStack.awaitFulfill(SynchronousQueue.java:462)
        at java.base@9/java.util.concurrent.SynchronousQueue$TransferStack.transfer(SynchronousQueue.java:361)
        at java.base@9/java.util.concurrent.SynchronousQueue.poll(SynchronousQueue.java:937)
        at java.base@9/java.util.concurrent.ThreadPoolExecutor.getTask(ThreadPoolExecutor.java:1085)
        at java.base@9/java.util.concurrent.ThreadPoolExecutor.runWorker(ThreadPoolExecutor.java:1146)
        at java.base@9/java.util.concurrent.ThreadPoolExecutor$Worker.run(ThreadPoolExecutor.java:635)
        at java.base@9/java.lang.Thread.run(Thread.java:844)
        at __randomizedtesting.SeedInfo.seed([D3D69541442EA1D3]:0)


FAILED:  junit.framework.TestSuite.org.apache.solr.cloud.ChaosMonkeyNothingIsSafeTest

Error Message:
There are still zombie threads that couldn't be terminated:    1) Thread[id=12957, name=zkCallback-3440-thread-1, state=TIMED_WAITING, group=TGRP-ChaosMonkeyNothingIsSafeTest]         at java.base@9/jdk.internal.misc.Unsafe.park(Native Method)         at java.base@9/java.util.concurrent.locks.LockSupport.parkNanos(LockSupport.java:234)         at java.base@9/java.util.concurrent.SynchronousQueue$TransferStack.awaitFulfill(SynchronousQueue.java:462)         at java.base@9/java.util.concurrent.SynchronousQueue$TransferStack.transfer(SynchronousQueue.java:361)         at java.base@9/java.util.concurrent.SynchronousQueue.poll(SynchronousQueue.java:937)         at java.base@9/java.util.concurrent.ThreadPoolExecutor.getTask(ThreadPoolExecutor.java:1085)         at java.base@9/java.util.concurrent.ThreadPoolExecutor.runWorker(ThreadPoolExecutor.java:1146)         at java.base@9/java.util.concurrent.ThreadPoolExecutor$Worker.run(ThreadPoolExecutor.java:635)         at java.base@9/java.lang.Thread.run(Thread.java:844)    2) Thread[id=13117, name=zkCallback-3440-thread-3, state=TIMED_WAITING, group=TGRP-ChaosMonkeyNothingIsSafeTest]         at java.base@9/jdk.internal.misc.Unsafe.park(Native Method)         at java.base@9/java.util.concurrent.locks.LockSupport.parkNanos(LockSupport.java:234)         at java.base@9/java.util.concurrent.SynchronousQueue$TransferStack.awaitFulfill(SynchronousQueue.java:462)         at java.base@9/java.util.concurrent.SynchronousQueue$TransferStack.transfer(SynchronousQueue.java:361)         at java.base@9/java.util.concurrent.SynchronousQueue.poll(SynchronousQueue.java:937)         at java.base@9/java.util.concurrent.ThreadPoolExecutor.getTask(ThreadPoolExecutor.java:1085)         at java.base@9/java.util.concurrent.ThreadPoolExecutor.runWorker(ThreadPoolExecutor.java:1146)         at java.base@9/java.util.concurrent.ThreadPoolExecutor$Worker.run(ThreadPoolExecutor.java:635)         at java.base@9/java.lang.Thread.run(Thread.java:844)    3) Thread[id=13211, name=zkCallback-3440-thread-6, state=TIMED_WAITING, group=TGRP-ChaosMonkeyNothingIsSafeTest]         at java.base@9/jdk.internal.misc.Unsafe.park(Native Method)         at java.base@9/java.util.concurrent.locks.LockSupport.parkNanos(LockSupport.java:234)         at java.base@9/java.util.concurrent.SynchronousQueue$TransferStack.awaitFulfill(SynchronousQueue.java:462)         at java.base@9/java.util.concurrent.SynchronousQueue$TransferStack.transfer(SynchronousQueue.java:361)         at java.base@9/java.util.concurrent.SynchronousQueue.poll(SynchronousQueue.java:937)         at java.base@9/java.util.concurrent.ThreadPoolExecutor.getTask(ThreadPoolExecutor.java:1085)         at java.base@9/java.util.concurrent.ThreadPoolExecutor.runWorker(ThreadPoolExecutor.java:1146)         at java.base@9/java.util.concurrent.ThreadPoolExecutor$Worker.run(ThreadPoolExecutor.java:635)         at java.base@9/java.lang.Thread.run(Thread.java:844)    4) Thread[id=12955, name=TEST-ChaosMonkeyNothingIsSafeTest.test-seed#[D3D69541442EA1D3]-SendThread(127.0.0.1:45839), state=TIMED_WAITING, group=TGRP-ChaosMonkeyNothingIsSafeTest]         at java.base@9/java.lang.Thread.sleep(Native Method)         at app//org.apache.zookeeper.client.StaticHostProvider.next(StaticHostProvider.java:101)         at app//org.apache.zookeeper.ClientCnxn$SendThread.startConnect(ClientCnxn.java:997)         at app//org.apache.zookeeper.ClientCnxn$SendThread.run(ClientCnxn.java:1060)    5) Thread[id=13153, name=zkCallback-3440-thread-5, state=TIMED_WAITING, group=TGRP-ChaosMonkeyNothingIsSafeTest]         at java.base@9/jdk.internal.misc.Unsafe.park(Native Method)         at java.base@9/java.util.concurrent.locks.LockSupport.parkNanos(LockSupport.java:234)         at java.base@9/java.util.concurrent.SynchronousQueue$TransferStack.awaitFulfill(SynchronousQueue.java:462)         at java.base@9/java.util.concurrent.SynchronousQueue$TransferStack.transfer(SynchronousQueue.java:361)         at java.base@9/java.util.concurrent.SynchronousQueue.poll(SynchronousQueue.java:937)         at java.base@9/java.util.concurrent.ThreadPoolExecutor.getTask(ThreadPoolExecutor.java:1085)         at java.base@9/java.util.concurrent.ThreadPoolExecutor.runWorker(ThreadPoolExecutor.java:1146)         at java.base@9/java.util.concurrent.ThreadPoolExecutor$Worker.run(ThreadPoolExecutor.java:635)         at java.base@9/java.lang.Thread.run(Thread.java:844)    6) Thread[id=13116, name=zkCallback-3440-thread-2, state=TIMED_WAITING, group=TGRP-ChaosMonkeyNothingIsSafeTest]         at java.base@9/jdk.internal.misc.Unsafe.park(Native Method)         at java.base@9/java.util.concurrent.locks.LockSupport.parkNanos(LockSupport.java:234)         at java.base@9/java.util.concurrent.SynchronousQueue$TransferStack.awaitFulfill(SynchronousQueue.java:462)         at java.base@9/java.util.concurrent.SynchronousQueue$TransferStack.transfer(SynchronousQueue.java:361)         at java.base@9/java.util.concurrent.SynchronousQueue.poll(SynchronousQueue.java:937)         at java.base@9/java.util.concurrent.ThreadPoolExecutor.getTask(ThreadPoolExecutor.java:1085)         at java.base@9/java.util.concurrent.ThreadPoolExecutor.runWorker(ThreadPoolExecutor.java:1146)         at java.base@9/java.util.concurrent.ThreadPoolExecutor$Worker.run(ThreadPoolExecutor.java:635)         at java.base@9/java.lang.Thread.run(Thread.java:844)    7) Thread[id=13118, name=zkCallback-3440-thread-4, state=TIMED_WAITING, group=TGRP-ChaosMonkeyNothingIsSafeTest]         at java.base@9/jdk.internal.misc.Unsafe.park(Native Method)         at java.base@9/java.util.concurrent.locks.LockSupport.parkNanos(LockSupport.java:234)         at java.base@9/java.util.concurrent.SynchronousQueue$TransferStack.awaitFulfill(SynchronousQueue.java:462)         at java.base@9/java.util.concurrent.SynchronousQueue$TransferStack.transfer(SynchronousQueue.java:361)         at java.base@9/java.util.concurrent.SynchronousQueue.poll(SynchronousQueue.java:937)         at java.base@9/java.util.concurrent.ThreadPoolExecutor.getTask(ThreadPoolExecutor.java:1085)         at java.base@9/java.util.concurrent.ThreadPoolExecutor.runWorker(ThreadPoolExecutor.java:1146)         at java.base@9/java.util.concurrent.ThreadPoolExecutor$Worker.run(ThreadPoolExecutor.java:635)         at java.base@9/java.lang.Thread.run(Thread.java:844)

Stack Trace:
com.carrotsearch.randomizedtesting.ThreadLeakError: There are still zombie threads that couldn't be terminated:
   1) Thread[id=12957, name=zkCallback-3440-thread-1, state=TIMED_WAITING, group=TGRP-ChaosMonkeyNothingIsSafeTest]
        at java.base@9/jdk.internal.misc.Unsafe.park(Native Method)
        at java.base@9/java.util.concurrent.locks.LockSupport.parkNanos(LockSupport.java:234)
        at java.base@9/java.util.concurrent.SynchronousQueue$TransferStack.awaitFulfill(SynchronousQueue.java:462)
        at java.base@9/java.util.concurrent.SynchronousQueue$TransferStack.transfer(SynchronousQueue.java:361)
        at java.base@9/java.util.concurrent.SynchronousQueue.poll(SynchronousQueue.java:937)
        at java.base@9/java.util.concurrent.ThreadPoolExecutor.getTask(ThreadPoolExecutor.java:1085)
        at java.base@9/java.util.concurrent.ThreadPoolExecutor.runWorker(ThreadPoolExecutor.java:1146)
        at java.base@9/java.util.concurrent.ThreadPoolExecutor$Worker.run(ThreadPoolExecutor.java:635)
        at java.base@9/java.lang.Thread.run(Thread.java:844)
   2) Thread[id=13117, name=zkCallback-3440-thread-3, state=TIMED_WAITING, group=TGRP-ChaosMonkeyNothingIsSafeTest]
        at java.base@9/jdk.internal.misc.Unsafe.park(Native Method)
        at java.base@9/java.util.concurrent.locks.LockSupport.parkNanos(LockSupport.java:234)
        at java.base@9/java.util.concurrent.SynchronousQueue$TransferStack.awaitFulfill(SynchronousQueue.java:462)
        at java.base@9/java.util.concurrent.SynchronousQueue$TransferStack.transfer(SynchronousQueue.java:361)
        at java.base@9/java.util.concurrent.SynchronousQueue.poll(SynchronousQueue.java:937)
        at java.base@9/java.util.concurrent.ThreadPoolExecutor.getTask(ThreadPoolExecutor.java:1085)
        at java.base@9/java.util.concurrent.ThreadPoolExecutor.runWorker(ThreadPoolExecutor.java:1146)
        at java.base@9/java.util.concurrent.ThreadPoolExecutor$Worker.run(ThreadPoolExecutor.java:635)
        at java.base@9/java.lang.Thread.run(Thread.java:844)
   3) Thread[id=13211, name=zkCallback-3440-thread-6, state=TIMED_WAITING, group=TGRP-ChaosMonkeyNothingIsSafeTest]
        at java.base@9/jdk.internal.misc.Unsafe.park(Native Method)
        at java.base@9/java.util.concurrent.locks.LockSupport.parkNanos(LockSupport.java:234)
        at java.base@9/java.util.concurrent.SynchronousQueue$TransferStack.awaitFulfill(SynchronousQueue.java:462)
        at java.base@9/java.util.concurrent.SynchronousQueue$TransferStack.transfer(SynchronousQueue.java:361)
        at java.base@9/java.util.concurrent.SynchronousQueue.poll(SynchronousQueue.java:937)
        at java.base@9/java.util.concurrent.ThreadPoolExecutor.getTask(ThreadPoolExecutor.java:1085)
        at java.base@9/java.util.concurrent.ThreadPoolExecutor.runWorker(ThreadPoolExecutor.java:1146)
        at java.base@9/java.util.concurrent.ThreadPoolExecutor$Worker.run(ThreadPoolExecutor.java:635)
        at java.base@9/java.lang.Thread.run(Thread.java:844)
   4) Thread[id=12955, name=TEST-ChaosMonkeyNothingIsSafeTest.test-seed#[D3D69541442EA1D3]-SendThread(127.0.0.1:45839), state=TIMED_WAITING, group=TGRP-ChaosMonkeyNothingIsSafeTest]
        at java.base@9/java.lang.Thread.sleep(Native Method)
        at app//org.apache.zookeeper.client.StaticHostProvider.next(StaticHostProvider.java:101)
        at app//org.apache.zookeeper.ClientCnxn$SendThread.startConnect(ClientCnxn.java:997)
        at app//org.apache.zookeeper.ClientCnxn$SendThread.run(ClientCnxn.java:1060)
   5) Thread[id=13153, name=zkCallback-3440-thread-5, state=TIMED_WAITING, group=TGRP-ChaosMonkeyNothingIsSafeTest]
        at java.base@9/jdk.internal.misc.Unsafe.park(Native Method)
        at java.base@9/java.util.concurrent.locks.LockSupport.parkNanos(LockSupport.java:234)
        at java.base@9/java.util.concurrent.SynchronousQueue$TransferStack.awaitFulfill(SynchronousQueue.java:462)
        at java.base@9/java.util.concurrent.SynchronousQueue$TransferStack.transfer(SynchronousQueue.java:361)
        at java.base@9/java.util.concurrent.SynchronousQueue.poll(SynchronousQueue.java:937)
        at java.base@9/java.util.concurrent.ThreadPoolExecutor.getTask(ThreadPoolExecutor.java:1085)
        at java.base@9/java.util.concurrent.ThreadPoolExecutor.runWorker(ThreadPoolExecutor.java:1146)
        at java.base@9/java.util.concurrent.ThreadPoolExecutor$Worker.run(ThreadPoolExecutor.java:635)
        at java.base@9/java.lang.Thread.run(Thread.java:844)
   6) Thread[id=13116, name=zkCallback-3440-thread-2, state=TIMED_WAITING, group=TGRP-ChaosMonkeyNothingIsSafeTest]
        at java.base@9/jdk.internal.misc.Unsafe.park(Native Method)
        at java.base@9/java.util.concurrent.locks.LockSupport.parkNanos(LockSupport.java:234)
        at java.base@9/java.util.concurrent.SynchronousQueue$TransferStack.awaitFulfill(SynchronousQueue.java:462)
        at java.base@9/java.util.concurrent.SynchronousQueue$TransferStack.transfer(SynchronousQueue.java:361)
        at java.base@9/java.util.concurrent.SynchronousQueue.poll(SynchronousQueue.java:937)
        at java.base@9/java.util.concurrent.ThreadPoolExecutor.getTask(ThreadPoolExecutor.java:1085)
        at java.base@9/java.util.concurrent.ThreadPoolExecutor.runWorker(ThreadPoolExecutor.java:1146)
        at java.base@9/java.util.concurrent.ThreadPoolExecutor$Worker.run(ThreadPoolExecutor.java:635)
        at java.base@9/java.lang.Thread.run(Thread.java:844)
   7) Thread[id=13118, name=zkCallback-3440-thread-4, state=TIMED_WAITING, group=TGRP-ChaosMonkeyNothingIsSafeTest]
        at java.base@9/jdk.internal.misc.Unsafe.park(Native Method)
        at java.base@9/java.util.concurrent.locks.LockSupport.parkNanos(LockSupport.java:234)
        at java.base@9/java.util.concurrent.SynchronousQueue$TransferStack.awaitFulfill(SynchronousQueue.java:462)
        at java.base@9/java.util.concurrent.SynchronousQueue$TransferStack.transfer(SynchronousQueue.java:361)
        at java.base@9/java.util.concurrent.SynchronousQueue.poll(SynchronousQueue.java:937)
        at java.base@9/java.util.concurrent.ThreadPoolExecutor.getTask(ThreadPoolExecutor.java:1085)
        at java.base@9/java.util.concurrent.ThreadPoolExecutor.runWorker(ThreadPoolExecutor.java:1146)
        at java.base@9/java.util.concurrent.ThreadPoolExecutor$Worker.run(ThreadPoolExecutor.java:635)
        at java.base@9/java.lang.Thread.run(Thread.java:844)
        at __randomizedtesting.SeedInfo.seed([D3D69541442EA1D3]:0)


FAILED:  org.apache.solr.cloud.ChaosMonkeyNothingIsSafeTest.test

Error Message:
Timeout occured while waiting response from server at: http://127.0.0.1:39721/collection1

Stack Trace:
org.apache.solr.client.solrj.SolrServerException: Timeout occured while waiting response from server at: http://127.0.0.1:39721/collection1
        at __randomizedtesting.SeedInfo.seed([D3D69541442EA1D3:5B82AA9BEAD2CC2B]:0)
        at org.apache.solr.client.solrj.impl.HttpSolrClient.executeMethod(HttpSolrClient.java:637)
        at org.apache.solr.client.solrj.impl.HttpSolrClient.request(HttpSolrClient.java:252)
        at org.apache.solr.client.solrj.impl.HttpSolrClient.request(HttpSolrClient.java:241)
        at org.apache.solr.client.solrj.impl.LBHttpSolrClient.doRequest(LBHttpSolrClient.java:483)
        at org.apache.solr.client.solrj.impl.LBHttpSolrClient.request(LBHttpSolrClient.java:413)
        at org.apache.solr.client.solrj.impl.CloudSolrClient.sendRequest(CloudSolrClient.java:1121)
        at org.apache.solr.client.solrj.impl.CloudSolrClient.requestWithRetryOnStaleState(CloudSolrClient.java:862)
        at org.apache.solr.client.solrj.impl.CloudSolrClient.request(CloudSolrClient.java:793)
        at org.apache.solr.client.solrj.SolrRequest.process(SolrRequest.java:178)
        at org.apache.solr.client.solrj.SolrClient.commit(SolrClient.java:484)
        at org.apache.solr.client.solrj.SolrClient.commit(SolrClient.java:463)
        at org.apache.solr.cloud.AbstractFullDistribZkTestBase.commit(AbstractFullDistribZkTestBase.java:1581)
        at org.apache.solr.cloud.ChaosMonkeyNothingIsSafeTest.test(ChaosMonkeyNothingIsSafeTest.java:213)
        at java.base/jdk.internal.reflect.NativeMethodAccessorImpl.invoke0(Native Method)
        at java.base/jdk.internal.reflect.NativeMethodAccessorImpl.invoke(NativeMethodAccessorImpl.java:62)
        at java.base/jdk.internal.reflect.DelegatingMethodAccessorImpl.invoke(DelegatingMethodAccessorImpl.java:43)
        at java.base/java.lang.reflect.Method.invoke(Method.java:564)
        at com.carrotsearch.randomizedtesting.RandomizedRunner.invoke(RandomizedRunner.java:1713)
        at com.carrotsearch.randomizedtesting.RandomizedRunner$8.evaluate(RandomizedRunner.java:907)
        at com.carrotsearch.randomizedtesting.RandomizedRunner$9.evaluate(RandomizedRunner.java:943)
        at com.carrotsearch.randomizedtesting.RandomizedRunner$10.evaluate(RandomizedRunner.java:957)
        at org.apache.solr.BaseDistributedSearchTestCase$ShardsRepeatRule$ShardsFixedStatement.callStatement(BaseDistributedSearchTestCase.java:985)
        at org.apache.solr.BaseDistributedSearchTestCase$ShardsRepeatRule$ShardsStatement.evaluate(BaseDistributedSearchTestCase.java:960)
        at com.carrotsearch.randomizedtesting.rules.SystemPropertiesRestoreRule$1.evaluate(SystemPropertiesRestoreRule.java:57)
        at org.apache.lucene.util.TestRuleSetupTeardownChained$1.evaluate(TestRuleSetupTeardownChained.java:49)
        at org.apache.lucene.util.AbstractBeforeAfterRule$1.evaluate(AbstractBeforeAfterRule.java:45)
        at org.apache.lucene.util.TestRuleThreadAndTestName$1.evaluate(TestRuleThreadAndTestName.java:48)
        at org.apache.lucene.util.TestRuleIgnoreAfterMaxFailures$1.evaluate(TestRuleIgnoreAfterMaxFailures.java:64)
        at org.apache.lucene.util.TestRuleMarkFailure$1.evaluate(TestRuleMarkFailure.java:47)
        at com.carrotsearch.randomizedtesting.rules.StatementAdapter.evaluate(StatementAdapter.java:36)
        at com.carrotsearch.randomizedtesting.ThreadLeakControl$StatementRunner.run(ThreadLeakControl.java:368)
        at com.carrotsearch.randomizedtesting.ThreadLeakControl.forkTimeoutingTask(ThreadLeakControl.java:817)
        at com.carrotsearch.randomizedtesting.ThreadLeakControl$3.evaluate(ThreadLeakControl.java:468)
        at com.carrotsearch.randomizedtesting.RandomizedRunner.runSingleTest(RandomizedRunner.java:916)
        at com.carrotsearch.randomizedtesting.RandomizedRunner$5.evaluate(RandomizedRunner.java:802)
        at com.carrotsearch.randomizedtesting.RandomizedRunner$6.evaluate(RandomizedRunner.java:852)
        at com.carrotsearch.randomizedtesting.RandomizedRunner$7.evaluate(RandomizedRunner.java:863)
        at com.carrotsearch.randomizedtesting.rules.StatementAdapter.evaluate(StatementAdapter.java:36)
        at com.carrotsearch.randomizedtesting.rules.SystemPropertiesRestoreRule$1.evaluate(SystemPropertiesRestoreRule.java:57)
        at org.apache.lucene.util.AbstractBeforeAfterRule$1.evaluate(AbstractBeforeAfterRule.java:45)
        at com.carrotsearch.randomizedtesting.rules.StatementAdapter.evaluate(StatementAdapter.java:36)
        at org.apache.lucene.util.TestRuleStoreClassName$1.evaluate(TestRuleStoreClassName.java:41)
        at com.carrotsearch.randomizedtesting.rules.NoShadowingOrOverridesOnMethodsRule$1.evaluate(NoShadowingOrOverridesOnMethodsRule.java:40)
        at com.carrotsearch.randomizedtesting.rules.NoShadowingOrOverridesOnMethodsRule$1.evaluate(NoShadowingOrOverridesOnMethodsRule.java:40)
        at com.carrotsearch.randomizedtesting.rules.StatementAdapter.evaluate(StatementAdapter.java:36)
        at com.carrotsearch.randomizedtesting.rules.StatementAdapter.evaluate(StatementAdapter.java:36)
        at org.apache.lucene.util.TestRuleAssertionsRequired$1.evaluate(TestRuleAssertionsRequired.java:53)
        at org.apache.lucene.util.TestRuleMarkFailure$1.evaluate(TestRuleMarkFailure.java:47)
        at org.apache.lucene.util.TestRuleIgnoreAfterMaxFailures$1.evaluate(TestRuleIgnoreAfterMaxFailures.java:64)
        at org.apache.lucene.util.TestRuleIgnoreTestSuites$1.evaluate(TestRuleIgnoreTestSuites.java:54)
        at com.carrotsearch.randomizedtesting.rules.StatementAdapter.evaluate(StatementAdapter.java:36)
        at com.carrotsearch.randomizedtesting.ThreadLeakControl$StatementRunner.run(ThreadLeakControl.java:368)
        at java.base/java.lang.Thread.run(Thread.java:844)
Caused by: java.net.SocketTimeoutException: Read timed out
        at java.base/java.net.SocketInputStream.socketRead0(Native Method)
        at java.base/java.net.SocketInputStream.socketRead(SocketInputStream.java:116)
        at java.base/java.net.SocketInputStream.read(SocketInputStream.java:171)
        at java.base/java.net.SocketInputStream.read(SocketInputStream.java:141)
        at org.apache.http.impl.io.SessionInputBufferImpl.streamRead(SessionInputBufferImpl.java:139)
        at org.apache.http.impl.io.SessionInputBufferImpl.fillBuffer(SessionInputBufferImpl.java:155)
        at org.apache.http.impl.io.SessionInputBufferImpl.readLine(SessionInputBufferImpl.java:284)
        at org.apache.http.impl.conn.DefaultHttpResponseParser.parseHead(DefaultHttpResponseParser.java:140)
        at org.apache.http.impl.conn.DefaultHttpResponseParser.parseHead(DefaultHttpResponseParser.java:57)
        at org.apache.http.impl.io.AbstractMessageParser.parse(AbstractMessageParser.java:261)
        at org.apache.http.impl.DefaultBHttpClientConnection.receiveResponseHeader(DefaultBHttpClientConnection.java:165)
        at org.apache.http.impl.conn.CPoolProxy.receiveResponseHeader(CPoolProxy.java:167)
        at org.apache.http.protocol.HttpRequestExecutor.doReceiveResponse(HttpRequestExecutor.java:272)
        at org.apache.http.protocol.HttpRequestExecutor.execute(HttpRequestExecutor.java:124)
        at org.apache.http.impl.execchain.MainClientExec.execute(MainClientExec.java:271)
        at org.apache.http.impl.execchain.ProtocolExec.execute(ProtocolExec.java:184)
        at org.apache.http.impl.execchain.RetryExec.execute(RetryExec.java:88)
        at org.apache.http.impl.execchain.RedirectExec.execute(RedirectExec.java:110)
        at org.apache.http.impl.client.InternalHttpClient.doExecute(InternalHttpClient.java:184)
        at org.apache.http.impl.client.CloseableHttpClient.execute(CloseableHttpClient.java:82)
        at org.apache.http.impl.client.CloseableHttpClient.execute(CloseableHttpClient.java:55)
        at org.apache.solr.client.solrj.impl.HttpSolrClient.executeMethod(HttpSolrClient.java:523)
        ... 52 more




Build Log:
[...truncated 11528 lines...]
   [junit4] Suite: org.apache.solr.cloud.ChaosMonkeyNothingIsSafeTest
   [junit4]   2> Creating dataDir: /home/jenkins/workspace/Lucene-Solr-master-Linux/solr/build/solr-core/test/J0/temp/solr.cloud.ChaosMonkeyNothingIsSafeTest_D3D69541442EA1D3-001/init-core-data-001
   [junit4]   2> 551053 WARN  (SUITE-ChaosMonkeyNothingIsSafeTest-seed#[D3D69541442EA1D3]-worker) [    ] o.a.s.SolrTestCaseJ4 startTrackingSearchers: numOpens=5 numCloses=5
   [junit4]   2> 551053 INFO  (SUITE-ChaosMonkeyNothingIsSafeTest-seed#[D3D69541442EA1D3]-worker) [    ] o.a.s.SolrTestCaseJ4 Using PointFields (NUMERIC_POINTS_SYSPROP=true) w/NUMERIC_DOCVALUES_SYSPROP=true
   [junit4]   2> 551053 INFO  (SUITE-ChaosMonkeyNothingIsSafeTest-seed#[D3D69541442EA1D3]-worker) [    ] o.a.s.SolrTestCaseJ4 Randomized ssl (false) and clientAuth (false) via: @org.apache.solr.SolrTestCaseJ4$SuppressSSL(bugUrl="https://issues.apache.org/jira/browse/SOLR-5776")
   [junit4]   2> 551053 INFO  (SUITE-ChaosMonkeyNothingIsSafeTest-seed#[D3D69541442EA1D3]-worker) [    ] o.a.s.BaseDistributedSearchTestCase Setting hostContext system property: /
   [junit4]   2> 551055 INFO  (TEST-ChaosMonkeyNothingIsSafeTest.test-seed#[D3D69541442EA1D3]) [    ] o.a.s.c.ZkTestServer STARTING ZK TEST SERVER
   [junit4]   2> 551064 INFO  (Thread-1006) [    ] o.a.s.c.ZkTestServer client port:0.0.0.0/0.0.0.0:0
   [junit4]   2> 551064 INFO  (Thread-1006) [    ] o.a.s.c.ZkTestServer Starting server
   [junit4]   2> 551065 ERROR (Thread-1006) [    ] o.a.z.s.ZooKeeperServer ZKShutdownHandler is not registered, so ZooKeeper server won't take any action on ERROR or SHUTDOWN server state changes
   [junit4]   2> 551164 INFO  (TEST-ChaosMonkeyNothingIsSafeTest.test-seed#[D3D69541442EA1D3]) [    ] o.a.s.c.ZkTestServer start zk server on port:45839
   [junit4]   2> 551170 INFO  (TEST-ChaosMonkeyNothingIsSafeTest.test-seed#[D3D69541442EA1D3]) [    ] o.a.s.c.AbstractZkTestCase put /home/jenkins/workspace/Lucene-Solr-master-Linux/solr/core/src/test-files/solr/collection1/conf/solrconfig-tlog.xml to /configs/conf1/solrconfig.xml
   [junit4]   2> 551170 INFO  (TEST-ChaosMonkeyNothingIsSafeTest.test-seed#[D3D69541442EA1D3]) [    ] o.a.s.c.AbstractZkTestCase put /home/jenkins/workspace/Lucene-Solr-master-Linux/solr/core/src/test-files/solr/collection1/conf/schema15.xml to /configs/conf1/schema.xml
   [junit4]   2> 551171 INFO  (TEST-ChaosMonkeyNothingIsSafeTest.test-seed#[D3D69541442EA1D3]) [    ] o.a.s.c.AbstractZkTestCase put /home/jenkins/workspace/Lucene-Solr-master-Linux/solr/core/src/test-files/solr/collection1/conf/solrconfig.snippet.randomindexconfig.xml to /configs/conf1/solrconfig.snippet.randomindexconfig.xml
   [junit4]   2> 551171 INFO  (TEST-ChaosMonkeyNothingIsSafeTest.test-seed#[D3D69541442EA1D3]) [    ] o.a.s.c.AbstractZkTestCase put /home/jenkins/workspace/Lucene-Solr-master-Linux/solr/core/src/test-files/solr/collection1/conf/stopwords.txt to /configs/conf1/stopwords.txt
   [junit4]   2> 551172 INFO  (TEST-ChaosMonkeyNothingIsSafeTest.test-seed#[D3D69541442EA1D3]) [    ] o.a.s.c.AbstractZkTestCase put /home/jenkins/workspace/Lucene-Solr-master-Linux/solr/core/src/test-files/solr/collection1/conf/protwords.txt to /configs/conf1/protwords.txt
   [junit4]   2> 551172 INFO  (TEST-ChaosMonkeyNothingIsSafeTest.test-seed#[D3D69541442EA1D3]) [    ] o.a.s.c.AbstractZkTestCase put /home/jenkins/workspace/Lucene-Solr-master-Linux/solr/core/src/test-files/solr/collection1/conf/currency.xml to /configs/conf1/currency.xml
   [junit4]   2> 551173 INFO  (TEST-ChaosMonkeyNothingIsSafeTest.test-seed#[D3D69541442EA1D3]) [    ] o.a.s.c.AbstractZkTestCase put /home/jenkins/workspace/Lucene-Solr-master-Linux/solr/core/src/test-files/solr/collection1/conf/enumsConfig.xml to /configs/conf1/enumsConfig.xml
   [junit4]   2> 551173 INFO  (TEST-ChaosMonkeyNothingIsSafeTest.test-seed#[D3D69541442EA1D3]) [    ] o.a.s.c.AbstractZkTestCase put /home/jenkins/workspace/Lucene-Solr-master-Linux/solr/core/src/test-files/solr/collection1/conf/open-exchange-rates.json to /configs/conf1/open-exchange-rates.json
   [junit4]   2> 551174 INFO  (TEST-ChaosMonkeyNothingIsSafeTest.test-seed#[D3D69541442EA1D3]) [    ] o.a.s.c.AbstractZkTestCase put /home/jenkins/workspace/Lucene-Solr-master-Linux/solr/core/src/test-files/solr/collection1/conf/mapping-ISOLatin1Accent.txt to /configs/conf1/mapping-ISOLatin1Accent.txt
   [junit4]   2> 551174 INFO  (TEST-ChaosMonkeyNothingIsSafeTest.test-seed#[D3D69541442EA1D3]) [    ] o.a.s.c.AbstractZkTestCase put /home/jenkins/workspace/Lucene-Solr-master-Linux/solr/core/src/test-files/solr/collection1/conf/old_synonyms.txt to /configs/conf1/old_synonyms.txt
   [junit4]   2> 551175 INFO  (TEST-ChaosMonkeyNothingIsSafeTest.test-seed#[D3D69541442EA1D3]) [    ] o.a.s.c.AbstractZkTestCase put /home/jenkins/workspace/Lucene-Solr-master-Linux/solr/core/src/test-files/solr/collection1/conf/synonyms.txt to /configs/conf1/synonyms.txt
   [junit4]   2> 551175 INFO  (TEST-ChaosMonkeyNothingIsSafeTest.test-seed#[D3D69541442EA1D3]) [    ] o.a.s.c.AbstractFullDistribZkTestBase Will use TLOG replicas unless explicitly asked otherwise
   [junit4]   2> 551291 INFO  (TEST-ChaosMonkeyNothingIsSafeTest.test-seed#[D3D69541442EA1D3]) [    ] o.e.j.s.Server jetty-9.3.14.v20161028
   [junit4]   2> 551292 INFO  (TEST-ChaosMonkeyNothingIsSafeTest.test-seed#[D3D69541442EA1D3]) [    ] o.e.j.s.h.ContextHandler Started o.e.j.s.ServletContextHandler@ac4d3d{/,null,AVAILABLE}
   [junit4]   2> 551297 INFO  (TEST-ChaosMonkeyNothingIsSafeTest.test-seed#[D3D69541442EA1D3]) [    ] o.e.j.s.AbstractConnector Started ServerConnector@6457f5{HTTP/1.1,[http/1.1]}{127.0.0.1:40497}
   [junit4]   2> 551297 INFO  (TEST-ChaosMonkeyNothingIsSafeTest.test-seed#[D3D69541442EA1D3]) [    ] o.e.j.s.Server Started @553033ms
   [junit4]   2> 551297 INFO  (TEST-ChaosMonkeyNothingIsSafeTest.test-seed#[D3D69541442EA1D3]) [    ] o.a.s.c.s.e.JettySolrRunner Jetty properties: {hostContext=/, solr.data.dir=/home/jenkins/workspace/Lucene-Solr-master-Linux/solr/build/solr-core/test/J0/temp/solr.cloud.ChaosMonkeyNothingIsSafeTest_D3D69541442EA1D3-001/tempDir-001/control/data, hostPort=40497, coreRootDirectory=/home/jenkins/workspace/Lucene-Solr-master-Linux/solr/build/solr-core/test/J0/../../../../../../../../../home/jenkins/workspace/Lucene-Solr-master-Linux/solr/build/solr-core/test/J0/temp/solr.cloud.ChaosMonkeyNothingIsSafeTest_D3D69541442EA1D3-001/control-001/cores}
   [junit4]   2> 551297 ERROR (TEST-ChaosMonkeyNothingIsSafeTest.test-seed#[D3D69541442EA1D3]) [    ] o.a.s.s.StartupLoggingUtils Missing Java Option solr.log.dir. Logging may be missing or incomplete.
   [junit4]   2> 551297 INFO  (TEST-ChaosMonkeyNothingIsSafeTest.test-seed#[D3D69541442EA1D3]) [    ] o.a.s.s.SolrDispatchFilter  ___      _       Welcome to Apache Solr? version 8.0.0
   [junit4]   2> 551297 INFO  (TEST-ChaosMonkeyNothingIsSafeTest.test-seed#[D3D69541442EA1D3]) [    ] o.a.s.s.SolrDispatchFilter / __| ___| |_ _   Starting in cloud mode on port null
   [junit4]   2> 551297 INFO  (TEST-ChaosMonkeyNothingIsSafeTest.test-seed#[D3D69541442EA1D3]) [    ] o.a.s.s.SolrDispatchFilter \__ \/ _ \ | '_|  Install dir: null, Default config dir: null
   [junit4]   2> 551297 INFO  (TEST-ChaosMonkeyNothingIsSafeTest.test-seed#[D3D69541442EA1D3]) [    ] o.a.s.s.SolrDispatchFilter |___/\___/_|_|    Start time: 2017-07-17T13:02:14.315559Z
   [junit4]   2> 551344 INFO  (TEST-ChaosMonkeyNothingIsSafeTest.test-seed#[D3D69541442EA1D3]) [    ] o.a.s.s.SolrDispatchFilter Loading solr.xml from SolrHome (not found in ZooKeeper)
   [junit4]   2> 551344 INFO  (TEST-ChaosMonkeyNothingIsSafeTest.test-seed#[D3D69541442EA1D3]) [    ] o.a.s.c.SolrXmlConfig Loading container configuration from /home/jenkins/workspace/Lucene-Solr-master-Linux/solr/build/solr-core/test/J0/temp/solr.cloud.ChaosMonkeyNothingIsSafeTest_D3D69541442EA1D3-001/control-001/solr.xml
   [junit4]   2> 551347 INFO  (TEST-ChaosMonkeyNothingIsSafeTest.test-seed#[D3D69541442EA1D3]) [    ] o.a.s.c.SolrXmlConfig MBean server found: com.sun.jmx.mbeanserver.JmxMBeanServer@ccf13b, but no JMX reporters were configured - adding default JMX reporter.
   [junit4]   2> 551353 INFO  (TEST-ChaosMonkeyNothingIsSafeTest.test-seed#[D3D69541442EA1D3]) [    ] o.a.s.c.ZkContainer Zookeeper client=127.0.0.1:45839/solr
   [junit4]   2> 551530 INFO  (TEST-ChaosMonkeyNothingIsSafeTest.test-seed#[D3D69541442EA1D3]) [    ] o.a.s.c.Overseer Overseer (id=null) closing
   [junit4]   2> 551530 INFO  (TEST-ChaosMonkeyNothingIsSafeTest.test-seed#[D3D69541442EA1D3]) [    ] o.a.s.c.OverseerElectionContext I am going to be the leader 127.0.0.1:40497_
   [junit4]   2> 551531 INFO  (TEST-ChaosMonkeyNothingIsSafeTest.test-seed#[D3D69541442EA1D3]) [    ] o.a.s.c.Overseer Overseer (id=98323433657663492-127.0.0.1:40497_-n_0000000000) starting
   [junit4]   2> 551553 INFO  (TEST-ChaosMonkeyNothingIsSafeTest.test-seed#[D3D69541442EA1D3]) [    ] o.a.s.c.ZkController Register node as live in ZooKeeper:/live_nodes/127.0.0.1:40497_
   [junit4]   2> 551554 INFO  (zkCallback-3433-thread-1) [    ] o.a.s.c.c.ZkStateReader Updated live nodes from ZooKeeper... (0) -> (1)
   [junit4]   2> 551625 INFO  (TEST-ChaosMonkeyNothingIsSafeTest.test-seed#[D3D69541442EA1D3]) [    ] o.a.s.m.r.SolrJmxReporter JMX monitoring for 'solr.node' (registry 'solr.node') enabled at server: com.sun.jmx.mbeanserver.JmxMBeanServer@ccf13b
   [junit4]   2> 551630 INFO  (TEST-ChaosMonkeyNothingIsSafeTest.test-seed#[D3D69541442EA1D3]) [    ] o.a.s.m.r.SolrJmxReporter JMX monitoring for 'solr.jvm' (registry 'solr.jvm') enabled at server: com.sun.jmx.mbeanserver.JmxMBeanServer@ccf13b
   [junit4]   2> 551630 INFO  (TEST-ChaosMonkeyNothingIsSafeTest.test-seed#[D3D69541442EA1D3]) [    ] o.a.s.m.r.SolrJmxReporter JMX monitoring for 'solr.jetty' (registry 'solr.jetty') enabled at server: com.sun.jmx.mbeanserver.JmxMBeanServer@ccf13b
   [junit4]   2> 551631 INFO  (TEST-ChaosMonkeyNothingIsSafeTest.test-seed#[D3D69541442EA1D3]) [    ] o.a.s.c.CorePropertiesLocator Found 0 core definitions underneath /home/jenkins/workspace/Lucene-Solr-master-Linux/solr/build/solr-core/test/J0/../../../../../../../../../home/jenkins/workspace/Lucene-Solr-master-Linux/solr/build/solr-core/test/J0/temp/solr.cloud.ChaosMonkeyNothingIsSafeTest_D3D69541442EA1D3-001/control-001/cores
   [junit4]   2> 551661 INFO  (TEST-ChaosMonkeyNothingIsSafeTest.test-seed#[D3D69541442EA1D3]) [    ] o.a.s.c.c.ZkStateReader Updated live nodes from ZooKeeper... (0) -> (1)
   [junit4]   2> 551661 INFO  (TEST-ChaosMonkeyNothingIsSafeTest.test-seed#[D3D69541442EA1D3]) [    ] o.a.s.c.s.i.ZkClientClusterStateProvider Cluster at 127.0.0.1:45839/solr ready
   [junit4]   2> 551667 INFO  (qtp10399755-12923) [    ] o.a.s.h.a.CollectionsHandler Invoked Collection Action :create with params replicationFactor=1&collection.configName=conf1&name=control_collection&nrtReplicas=1&action=CREATE&numShards=1&createNodeSet=127.0.0.1:40497_&wt=javabin&version=2 and sendToOCPQueue=true
   [junit4]   2> 551684 INFO  (OverseerThreadFactory-1823-thread-1) [    ] o.a.s.c.CreateCollectionCmd Create collection control_collection
   [junit4]   2> 551821 INFO  (qtp10399755-12919) [    ] o.a.s.h.a.CoreAdminOperation core create command qt=/admin/cores&collection.configName=conf1&newCollection=true&name=control_collection_shard1_replica_n1&action=CREATE&numShards=1&collection=control_collection&shard=shard1&wt=javabin&version=2&replicaType=NRT
   [junit4]   2> 551821 INFO  (qtp10399755-12919) [    ] o.a.s.c.TransientSolrCoreCacheDefault Allocating transient cache for 4 transient cores
   [junit4]   2> 551931 INFO  (zkCallback-3433-thread-1) [    ] o.a.s.c.c.ZkStateReader A cluster state change: [WatchedEvent state:SyncConnected type:NodeDataChanged path:/collections/control_collection/state.json] for collection [control_collection] has occurred - updating... (live nodes size: [1])
   [junit4]   2> 552869 INFO  (qtp10399755-12919) [    ] o.a.s.c.SolrConfig Using Lucene MatchVersion: 8.0.0
   [junit4]   2> 552882 INFO  (qtp10399755-12919) [    ] o.a.s.s.IndexSchema [control_collection_shard1_replica_n1] Schema name=test
   [junit4]   2> 552986 INFO  (qtp10399755-12919) [    ] o.a.s.s.IndexSchema Loaded schema test/1.6 with uniqueid field id
   [junit4]   2> 553006 INFO  (qtp10399755-12919) [    ] o.a.s.c.CoreContainer Creating SolrCore 'control_collection_shard1_replica_n1' using configuration from collection control_collection, trusted=true
   [junit4]   2> 553006 INFO  (qtp10399755-12919) [    ] o.a.s.m.r.SolrJmxReporter JMX monitoring for 'solr.core.control_collection.shard1.replica_n1' (registry 'solr.core.control_collection.shard1.replica_n1') enabled at server: com.sun.jmx.mbeanserver.JmxMBeanServer@ccf13b
   [junit4]   2> 553006 INFO  (qtp10399755-12919) [    ] o.a.s.c.SolrCore solr.RecoveryStrategy.Builder
   [junit4]   2> 553006 INFO  (qtp10399755-12919) [    ] o.a.s.c.SolrCore [[control_collection_shard1_replica_n1] ] Opening new SolrCore at [/home/jenkins/workspace/Lucene-Solr-master-Linux/solr/build/solr-core/test/J0/temp/solr.cloud.ChaosMonkeyNothingIsSafeTest_D3D69541442EA1D3-001/control-001/cores/control_collection_shard1_replica_n1], dataDir=[/home/jenkins/workspace/Lucene-Solr-master-Linux/solr/build/solr-core/test/J0/../../../../../../../../../home/jenkins/workspace/Lucene-Solr-master-Linux/solr/build/solr-core/test/J0/temp/solr.cloud.ChaosMonkeyNothingIsSafeTest_D3D69541442EA1D3-001/control-001/cores/control_collection_shard1_replica_n1/data/]
   [junit4]   2> 553011 INFO  (qtp10399755-12919) [    ] o.a.s.u.RandomMergePolicy RandomMergePolicy wrapping class org.apache.lucene.index.TieredMergePolicy: [TieredMergePolicy: maxMergeAtOnce=18, maxMergeAtOnceExplicit=19, maxMergedSegmentMB=43.166015625, floorSegmentMB=1.4736328125, forceMergeDeletesPctAllowed=0.48907739238854386, segmentsPerTier=12.0, maxCFSSegmentSizeMB=8.796093022207999E12, noCFSRatio=0.6721688052003063
   [junit4]   2> 553043 WARN  (qtp10399755-12919) [    ] o.a.s.c.RequestHandlers INVALID paramSet a in requestHandler {type = requestHandler,name = /dump,class = DumpRequestHandler,attributes = {initParams=a, name=/dump, class=DumpRequestHandler},args = {defaults={a=A,b=B}}}
   [junit4]   2> 553140 INFO  (qtp10399755-12919) [    ] o.a.s.u.UpdateHandler Using UpdateLog implementation: org.apache.solr.update.UpdateLog
   [junit4]   2> 553140 INFO  (qtp10399755-12919) [    ] o.a.s.u.UpdateLog Initializing UpdateLog: dataDir= defaultSyncLevel=FLUSH numRecordsToKeep=100 maxNumLogsToKeep=10 numVersionBuckets=65536
   [junit4]   2> 553141 INFO  (qtp10399755-12919) [    ] o.a.s.u.CommitTracker Hard AutoCommit: if uncommited for 15000ms;
   [junit4]   2> 553141 INFO  (qtp10399755-12919) [    ] o.a.s.u.CommitTracker Soft AutoCommit: disabled
   [junit4]   2> 553143 INFO  (qtp10399755-12919) [    ] o.a.s.u.RandomMergePolicy RandomMergePolicy wrapping class org.apache.lucene.index.MockRandomMergePolicy: org.apache.lucene.index.MockRandomMergePolicy@1871261
   [junit4]   2> 553143 INFO  (qtp10399755-12919) [    ] o.a.s.s.SolrIndexSearcher Opening [Searcher@633dc1[control_collection_shard1_replica_n1] main]
   [junit4]   2> 553154 INFO  (qtp10399755-12919) [    ] o.a.s.r.ManagedResourceStorage Configured ZooKeeperStorageIO with znodeBase: /configs/conf1
   [junit4]   2> 553154 INFO  (qtp10399755-12919) [    ] o.a.s.r.ManagedResourceStorage Loaded null at path _rest_managed.json using ZooKeeperStorageIO:path=/configs/conf1
   [junit4]   2> 553155 INFO  (qtp10399755-12919) [    ] o.a.s.h.ReplicationHandler Commits will be reserved for  10000
   [junit4]   2> 553156 INFO  (searcherExecutor-1826-thread-1) [    ] o.a.s.c.SolrCore [control_collection_shard1_replica_n1] Registered new searcher Searcher@633dc1[control_collection_shard1_replica_n1] main{ExitableDirectoryReader(UninvertingDirectoryReader())}
   [junit4]   2> 553157 INFO  (qtp10399755-12919) [    ] o.a.s.u.UpdateLog Could not find max version in index or recent updates, using new clock 1573174940716236800
   [junit4]   2> 553162 INFO  (qtp10399755-12919) [    ] o.a.s.c.ShardLeaderElectionContext Enough replicas found to continue.
   [junit4]   2> 553162 INFO  (qtp10399755-12919) [    ] o.a.s.c.ShardLeaderElectionContext I may be the new leader - try and sync
   [junit4]   2> 553162 INFO  (qtp10399755-12919) [    ] o.a.s.c.SyncStrategy Sync replicas to http://127.0.0.1:40497/control_collection_shard1_replica_n1/
   [junit4]   2> 553162 INFO  (qtp10399755-12919) [    ] o.a.s.c.SyncStrategy Sync Success - now sync replicas to me
   [junit4]   2> 553162 INFO  (qtp10399755-12919) [    ] o.a.s.c.SyncStrategy http://127.0.0.1:40497/control_collection_shard1_replica_n1/ has no replicas
   [junit4]   2> 553162 INFO  (qtp10399755-12919) [    ] o.a.s.c.ShardLeaderElectionContext Found all replicas participating in election, clear LIR
   [junit4]   2> 553165 INFO  (qtp10399755-12919) [    ] o.a.s.c.ShardLeaderElectionContext I am the new leader: http://127.0.0.1:40497/control_collection_shard1_replica_n1/ shard1
   [junit4]   2> 553265 INFO  (zkCallback-3433-thread-1) [    ] o.a.s.c.c.ZkStateReader A cluster state change: [WatchedEvent state:SyncConnected type:NodeDataChanged path:/collections/control_collection/state.json] for collection [control_collection] has occurred - updating... (live nodes size: [1])
   [junit4]   2> 553274 INFO  (qtp10399755-12919) [    ] o.a.s.c.ZkController I am the leader, no recovery necessary
   [junit4]   2> 553275 INFO  (qtp10399755-12919) [    ] o.a.s.s.HttpSolrCall [admin] webapp=null path=/admin/cores params={qt=/admin/cores&collection.configName=conf1&newCollection=true&name=control_collection_shard1_replica_n1&action=CREATE&numShards=1&collection=control_collection&shard=shard1&wt=javabin&version=2&replicaType=NRT} status=0 QTime=1454
   [junit4]   2> 553278 INFO  (qtp10399755-12923) [    ] o.a.s.h.a.CollectionsHandler Wait for new collection to be active for at most 30 seconds. Check all shard replicas
   [junit4]   2> 553376 INFO  (zkCallback-3433-thread-1) [    ] o.a.s.c.c.ZkStateReader A cluster state change: [WatchedEvent state:SyncConnected type:NodeDataChanged path:/collections/control_collection/state.json] for collection [control_collection] has occurred - updating... (live nodes size: [1])
   [junit4]   2> 553693 INFO  (OverseerCollectionConfigSetProcessor-98323433657663492-127.0.0.1:40497_-n_0000000000) [    ] o.a.s.c.OverseerTaskQueue Response ZK path: /overseer/collection-queue-work/qnr-0000000000 doesn't exist.  Requestor may have disconnected from ZooKeeper
   [junit4]   2> 554278 INFO  (qtp10399755-12923) [    ] o.a.s.s.HttpSolrCall [admin] webapp=null path=/admin/collections params={replicationFactor=1&collection.configName=conf1&name=control_collection&nrtReplicas=1&action=CREATE&numShards=1&createNodeSet=127.0.0.1:40497_&wt=javabin&version=2} status=0 QTime=2611
   [junit4]   2> 554294 INFO  (TEST-ChaosMonkeyNothingIsSafeTest.test-seed#[D3D69541442EA1D3]) [    ] o.a.s.c.c.ZkStateReader Updated live nodes from ZooKeeper... (0) -> (1)
   [junit4]   2> 554294 INFO  (TEST-ChaosMonkeyNothingIsSafeTest.test-seed#[D3D69541442EA1D3]) [    ] o.a.s.c.s.i.ZkClientClusterStateProvider Cluster at 127.0.0.1:45839/solr ready
   [junit4]   2> 554294 INFO  (TEST-ChaosMonkeyNothingIsSafeTest.test-seed#[D3D69541442EA1D3]) [    ] o.a.s.c.ChaosMonkey monkey: init - expire sessions:false cause connection loss:false
   [junit4]   2> 554300 INFO  (qtp10399755-12919) [    ] o.a.s.h.a.CollectionsHandler Invoked Collection Action :create with params replicationFactor=1&collection.configName=conf1&name=collection1&nrtReplicas=1&action=CREATE&numShards=3&createNodeSet=&stateFormat=1&wt=javabin&version=2 and sendToOCPQueue=true
   [junit4]   2> 554316 INFO  (OverseerThreadFactory-1823-thread-2) [    ] o.a.s.c.CreateCollectionCmd Create collection collection1
   [junit4]   2> 554330 WARN  (OverseerThreadFactory-1823-thread-2) [    ] o.a.s.c.CreateCollectionCmd It is unusual to create a collection (collection1) without cores.
   [junit4]   2> 554537 INFO  (qtp10399755-12919) [    ] o.a.s.h.a.CollectionsHandler Wait for new collection to be active for at most 30 seconds. Check all shard replicas
   [junit4]   2> 554537 INFO  (qtp10399755-12919) [    ] o.a.s.s.HttpSolrCall [admin] webapp=null path=/admin/collections params={replicationFactor=1&collection.configName=conf1&name=collection1&nrtReplicas=1&action=CREATE&numShards=3&createNodeSet=&stateFormat=1&wt=javabin&version=2} status=0 QTime=236
   [junit4]   2> 554637 INFO  (TEST-ChaosMonkeyNothingIsSafeTest.test-seed#[D3D69541442EA1D3]) [    ] o.a.s.c.AbstractFullDistribZkTestBase create jetty 1 in directory /home/jenkins/workspace/Lucene-Solr-master-Linux/solr/build/solr-core/test/J0/temp/solr.cloud.ChaosMonkeyNothingIsSafeTest_D3D69541442EA1D3-001/shard-1-001 of type TLOG
   [junit4]   2> 554638 INFO  (TEST-ChaosMonkeyNothingIsSafeTest.test-seed#[D3D69541442EA1D3]) [    ] o.e.j.s.Server jetty-9.3.14.v20161028
   [junit4]   2> 554640 INFO  (TEST-ChaosMonkeyNothingIsSafeTest.test-seed#[D3D69541442EA1D3]) [    ] o.e.j.s.h.ContextHandler Started o.e.j.s.ServletContextHandler@46b07e{/,null,AVAILABLE}
   [junit4]   2> 554640 INFO  (TEST-ChaosMonkeyNothingIsSafeTest.test-seed#[D3D69541442EA1D3]) [    ] o.e.j.s.AbstractConnector Started ServerConnector@1bd2e87{HTTP/1.1,[http/1.1]}{127.0.0.1:39427}
   [junit4]   2> 554640 INFO  (TEST-ChaosMonkeyNothingIsSafeTest.test-seed#[D3D69541442EA1D3]) [    ] o.e.j.s.Server Started @556376ms
   [junit4]   2> 554640 INFO  (TEST-ChaosMonkeyNothingIsSafeTest.test-seed#[D3D69541442EA1D3]) [    ] o.a.s.c.s.e.JettySolrRunner Jetty properties: {hostContext=/, solrconfig=solrconfig.xml, solr.data.dir=/home/jenkins/workspace/Lucene-Solr-master-Linux/solr/build/solr-core/test/J0/temp/solr.cloud.ChaosMonkeyNothingIsSafeTest_D3D69541442EA1D3-001/tempDir-001/jetty1, hostPort=39427, coreRootDirectory=/home/jenkins/workspace/Lucene-Solr-master-Linux/solr/build/solr-core/test/J0/../../../../../../../../../home/jenkins/workspace/Lucene-Solr-master-Linux/solr/build/solr-core/test/J0/temp/solr.cloud.ChaosMonkeyNothingIsSafeTest_D3D69541442EA1D3-001/shard-1-001/cores, replicaType=TLOG}
   [junit4]   2> 554640 ERROR (TEST-ChaosMonkeyNothingIsSafeTest.test-seed#[D3D69541442EA1D3]) [    ] o.a.s.s.StartupLoggingUtils Missing Java Option solr.log.dir. Logging may be missing or incomplete.
   [junit4]   2> 554640 INFO  (TEST-ChaosMonkeyNothingIsSafeTest.test-seed#[D3D69541442EA1D3]) [    ] o.a.s.s.SolrDispatchFilter  ___      _       Welcome to Apache Solr? version 8.0.0
   [junit4]   2> 554640 INFO  (TEST-ChaosMonkeyNothingIsSafeTest.test-seed#[D3D69541442EA1D3]) [    ] o.a.s.s.SolrDispatchFilter / __| ___| |_ _   Starting in cloud mode on port null
   [junit4]   2> 554640 INFO  (TEST-ChaosMonkeyNothingIsSafeTest.test-seed#[D3D69541442EA1D3]) [    ] o.a.s.s.SolrDispatchFilter \__ \/ _ \ | '_|  Install dir: null, Default config dir: null
   [junit4]   2> 554640 INFO  (TEST-ChaosMonkeyNothingIsSafeTest.test-seed#[D3D69541442EA1D3]) [    ] o.a.s.s.SolrDispatchFilter |___/\___/_|_|    Start time: 2017-07-17T13:02:17.658959Z
   [junit4]   2> 554707 INFO  (TEST-ChaosMonkeyNothingIsSafeTest.test-seed#[D3D69541442EA1D3]) [    ] o.a.s.s.SolrDispatchFilter Loading solr.xml from SolrHome (not found in ZooKeeper)
   [junit4]   2> 554707 INFO  (TEST-ChaosMonkeyNothingIsSafeTest.test-seed#[D3D69541442EA1D3]) [    ] o.a.s.c.SolrXmlConfig Loading container configuration from /home/jenkins/workspace/Lucene-Solr-master-Linux/solr/build/solr-core/test/J0/temp/solr.cloud.ChaosMonkeyNothingIsSafeTest_D3D69541442EA1D3-001/shard-1-001/solr.xml
   [junit4]   2> 554710 INFO  (TEST-ChaosMonkeyNothingIsSafeTest.test-seed#[D3D69541442EA1D3]) [    ] o.a.s.c.SolrXmlConfig MBean server found: com.sun.jmx.mbeanserver.JmxMBeanServer@ccf13b, but no JMX reporters were configured - adding default JMX reporter.
   [junit4]   2> 554715 INFO  (TEST-ChaosMonkeyNothingIsSafeTest.test-seed#[D3D69541442EA1D3]) [    ] o.a.s.c.ZkContainer Zookeeper client=127.0.0.1:45839/solr
   [junit4]   2> 554772 INFO  (TEST-ChaosMonkeyNothingIsSafeTest.test-seed#[D3D69541442EA1D3]) [    ] o.a.s.c.c.ZkStateReader Updated live nodes from ZooKeeper... (0) -> (1)
   [junit4]   2> 554775 INFO  (TEST-ChaosMonkeyNothingIsSafeTest.test-seed#[D3D69541442EA1D3]) [    ] o.a.s.c.Overseer Overseer (id=null) closing
   [junit4]   2> 554776 INFO  (TEST-ChaosMonkeyNothingIsSafeTest.test-seed#[D3D69541442EA1D3]) [    ] o.a.s.c.ZkController Register node as live in ZooKeeper:/live_nodes/127.0.0.1:39427_
   [junit4]   2> 554777 INFO  (zkCallback-3440-thread-1) [    ] o.a.s.c.c.ZkStateReader Updated live nodes from ZooKeeper... (1) -> (2)
   [junit4]   2> 554778 INFO  (zkCallback-3445-thread-1) [    ] o.a.s.c.c.ZkStateReader Updated live nodes from ZooKeeper... (1) -> (2)
   [junit4]   2> 554784 INFO  (zkCallback-3433-thread-1) [    ] o.a.s.c.c.ZkStateReader Updated live nodes from ZooKeeper... (1) -> (2)
   [junit4]   2> 554871 INFO  (TEST-ChaosMonkeyNothingIsSafeTest.test-seed#[D3D69541442EA1D3]) [    ] o.a.s.m.r.SolrJmxReporter JMX monitoring for 'solr.node' (registry 'solr.node') enabled at server: com.sun.jmx.mbeanserver.JmxMBeanServer@ccf13b
   [junit4]   2> 554876 INFO  (TEST-ChaosMonkeyNothingIsSafeTest.test-seed#[D3D69541442EA1D3]) [    ] o.a.s.m.r.SolrJmxReporter JMX monitoring for 'solr.jvm' (registry 'solr.jvm') enabled at server: com.sun.jmx.mbeanserver.JmxMBeanServer@ccf13b
   [junit4]   2> 554876 INFO  (TEST-ChaosMonkeyNothingIsSafeTest.test-seed#[D3D69541442EA1D3]) [    ] o.a.s.m.r.SolrJmxReporter JMX monitoring for 'solr.jetty' (registry 'solr.jetty') enabled at server: com.sun.jmx.mbeanserver.JmxMBeanServer@ccf13b
   [junit4]   2> 554878 INFO  (TEST-ChaosMonkeyNothingIsSafeTest.test-seed#[D3D69541442EA1D3]) [    ] o.a.s.c.CorePropertiesLocator Found 0 core definitions underneath /home/jenkins/workspace/Lucene-Solr-master-Linux/solr/build/solr-core/test/J0/../../../../../../../../../home/jenkins/workspace/Lucene-Solr-master-Linux/solr/build/solr-core/test/J0/temp/solr.cloud.ChaosMonkeyNothingIsSafeTest_D3D69541442EA1D3-001/shard-1-001/cores
   [junit4]   2> 554904 INFO  (qtp14456587-12965) [    ] o.a.s.h.a.CollectionsHandler Invoked Collection Action :addreplica with params node=127.0.0.1:39427_&action=ADDREPLICA&collection=collection1&shard=shard2&type=TLOG&wt=javabin&version=2 and sendToOCPQueue=true
   [junit4]   2> 554908 INFO  (OverseerCollectionConfigSetProcessor-98323433657663492-127.0.0.1:40497_-n_0000000000) [    ] o.a.s.c.OverseerTaskQueue Response ZK path: /overseer/collection-queue-work/qnr-0000000002 doesn't exist.  Requestor may have disconnected from ZooKeeper
   [junit4]   2> 554908 INFO  (OverseerThreadFactory-1823-thread-3) [    ] o.a.s.c.AddReplicaCmd Node Identified 127.0.0.1:39427_ for creating new replica
   [junit4]   2> 554910 INFO  (qtp14456587-12967) [    ] o.a.s.h.a.CoreAdminOperation core create command qt=/admin/cores&collection.configName=conf1&name=collection1_shard2_replica_t0&action=CREATE&collection=collection1&shard=shard2&wt=javabin&version=2&replicaType=TLOG
   [junit4]   2> 554910 INFO  (qtp14456587-12967) [    ] o.a.s.c.TransientSolrCoreCacheDefault Allocating transient cache for 4 transient cores
   [junit4]   2> 555922 INFO  (qtp14456587-12967) [    ] o.a.s.c.SolrConfig Using Lucene MatchVersion: 8.0.0
   [junit4]   2> 555935 INFO  (qtp14456587-12967) [    ] o.a.s.s.IndexSchema [collection1_shard2_replica_t0] Schema name=test
   [junit4]   2> 556031 INFO  (qtp14456587-12967) [    ] o.a.s.s.IndexSchema Loaded schema test/1.6 with uniqueid field id
   [junit4]   2> 556041 INFO  (qtp14456587-12967) [    ] o.a.s.c.CoreContainer Creating SolrCore 'collection1_shard2_replica_t0' using configuration from collection collection1, trusted=true
   [junit4]   2> 556041 INFO  (qtp14456587-12967) [    ] o.a.s.m.r.SolrJmxReporter JMX monitoring for 'solr.core.collection1.shard2.replica_t0' (registry 'solr.core.collection1.shard2.replica_t0') enabled at server: com.sun.jmx.mbeanserver.JmxMBeanServer@ccf13b
   [junit4]   2> 556041 INFO  (qtp14456587-12967) [    ] o.a.s.c.SolrCore solr.RecoveryStrategy.Builder
   [junit4]   2> 556042 INFO  (qtp14456587-12967) [    ] o.a.s.c.SolrCore [[collection1_shard2_replica_t0] ] Opening new SolrCore at [/home/jenkins/workspace/Lucene-Solr-master-Linux/solr/build/solr-core/test/J0/temp/solr.cloud.ChaosMonkeyNothingIsSafeTest_D3D69541442EA1D3-001/shard-1-001/cores/collection1_shard2_replica_t0], dataDir=[/home/jenkins/workspace/Lucene-Solr-master-Linux/solr/build/solr-core/test/J0/../../../../../../../../../home/jenkins/workspace/Lucene-Solr-master-Linux/solr/build/solr-core/test/J0/temp/solr.cloud.ChaosMonkeyNothingIsSafeTest_D3D69541442EA1D3-001/shard-1-001/cores/collection1_shard2_replica_t0/data/]
   [junit4]   2> 556045 INFO  (qtp14456587-12967) [    ] o.a.s.u.RandomMergePolicy RandomMergePolicy wrapping class org.apache.lucene.index.TieredMergePolicy: [TieredMergePolicy: maxMergeAtOnce=18, maxMergeAtOnceExplicit=19, maxMergedSegmentMB=43.166015625, floorSegmentMB=1.4736328125, forceMergeDeletesPctAllowed=0.48907739238854386, segmentsPerTier=12.0, maxCFSSegmentSizeMB=8.796093022207999E12, noCFSRatio=0.6721688052003063
   [junit4]   2> 556073 WARN  (qtp14456587-12967) [    ] o.a.s.c.RequestHandlers INVALID paramSet a in requestHandler {type = requestHandler,name = /dump,class = DumpRequestHandler,attributes = {initParams=a, name=/dump, class=DumpRequestHandler},args = {defaults={a=A,b=B}}}
   [junit4]   2> 556124 INFO  (qtp14456587-12967) [    ] o.a.s.u.UpdateHandler Using UpdateLog implementation: org.apache.solr.update.UpdateLog
   [junit4]   2> 556124 INFO  (qtp14456587-12967) [    ] o.a.s.u.UpdateLog Initializing UpdateLog: dataDir= defaultSyncLevel=FLUSH numRecordsToKeep=100 maxNumLogsToKeep=10 numVersionBuckets=65536
   [junit4]   2> 556125 INFO  (qtp14456587-12967) [    ] o.a.s.u.CommitTracker Hard AutoCommit: if uncommited for 15000ms;
   [junit4]   2> 556125 INFO  (qtp14456587-12967) [    ] o.a.s.u.CommitTracker Soft AutoCommit: disabled
   [junit4]   2> 556126 INFO  (qtp14456587-12967) [    ] o.a.s.u.RandomMergePolicy RandomMergePolicy wrapping class org.apache.lucene.index.MockRandomMergePolicy: org.apache.lucene.index.MockRandomMergePolicy@10e493
   [junit4]   2> 556126 INFO  (qtp14456587-12967) [    ] o.a.s.s.SolrIndexSearcher Opening [Searcher@19c71af[collection1_shard2_replica_t0] main]
   [junit4]   2> 556127 INFO  (qtp14456587-12967) [    ] o.a.s.r.ManagedResourceStorage Configured ZooKeeperStorageIO with znodeBase: /configs/conf1
   [junit4]   2> 556127 INFO  (qtp14456587-12967) [    ] o.a.s.r.ManagedResourceStorage Loaded null at path _rest_managed.json using ZooKeeperStorageIO:path=/configs/conf1
   [junit4]   2> 556128 INFO  (qtp14456587-12967) [    ] o.a.s.h.ReplicationHandler Commits will be reserved for  10000
   [junit4]   2> 556129 INFO  (searcherExecutor-1837-thread-1) [    ] o.a.s.c.SolrCore [collection1_shard2_replica_t0] Registered new searcher Searcher@19c71af[collection1_shard2_replica_t0] main{ExitableDirectoryReader(UninvertingDirectoryReader())}
   [junit4]   2> 556129 INFO  (qtp14456587-12967) [    ] o.a.s.u.UpdateLog Could not find max version in index or recent updates, using new clock 1573174943832604672
   [junit4]   2> 556134 INFO  (qtp14456587-12967) [    ] o.a.s.c.ShardLeaderElectionContext Enough replicas found to continue.
   [junit4]   2> 556134 INFO  (qtp14456587-12967) [    ] o.a.s.c.ShardLeaderElectionContext I may be the new leader - try and sync
   [junit4]   2> 556134 INFO  (qtp14456587-12967) [    ] o.a.s.c.SyncStrategy Sync replicas to http://127.0.0.1:39427/collection1_shard2_replica_t0/
   [junit4]   2> 556134 INFO  (qtp14456587-12967) [    ] o.a.s.c.SyncStrategy Sync Success - now sync replicas to me
   [junit4]   2> 556134 INFO  (qtp14456587-12967) [    ] o.a.s.c.SyncStrategy http://127.0.0.1:39427/collection1_shard2_replica_t0/ has no replicas
   [junit4]   2> 556134 INFO  (qtp14456587-12967) [    ] o.a.s.c.ShardLeaderElectionContext Found all replicas participating in election, clear LIR
   [junit4]   2> 556135 INFO  (qtp14456587-12967) [    ] o.a.s.c.ZkController collection1_shard2_replica_t0 stopping background replication from leader
   [junit4]   2> 556136 INFO  (qtp14456587-12967) [    ] o.a.s.c.ShardLeaderElectionContext I am the new leader: http://127.0.0.1:39427/collection1_shard2_replica_t0/ shard2
   [junit4]   2> 556290 INFO  (qtp14456587-12967) [    ] o.a.s.c.ZkController I am the leader, no recovery necessary
   [junit4]   2> 556292 INFO  (qtp14456587-12967) [    ] o.a.s.s.HttpSolrCall [admin] webapp=null path=/admin/cores params={qt=/admin/cores&collection.configName=conf1&name=collection1_shard2_replica_t0&action=CREATE&collection=collection1&shard=shard2&wt=javabin&version=2&replicaType=TLOG} status=0 QTime=1382
   [junit4]   2> 556294 INFO  (qtp14456587-12965) [    ] o.a.s.s.HttpSolrCall [admin] webapp=null path=/admin/collections params={node=127.0.0.1:39427_&action=ADDREPLICA&collection=collection1&shard=shard2&type=TLOG&wt=javabin&version=2} status=0 QTime=1389
   [junit4]   2> 556305 INFO  (OverseerCollectionConfigSetProcessor-98323433657663492-127.0.0.1:40497_-n_0000000000) [    ] o.a.s.c.OverseerTaskQueue Response ZK path: /overseer/collection-queue-work/qnr-0000000004 doesn't exist.  Requestor may have disconnected from ZooKeeper
   [junit4]   2> 556452 INFO  (TEST-ChaosMonkeyNothingIsSafeTest.test-seed#[D3D69541442EA1D3]) [    ] o.a.s.c.AbstractFullDistribZkTestBase create jetty 2 in directory /home/jenkins/workspace/Lucene-Solr-master-Linux/solr/build/solr-core/test/J0/temp/solr.cloud.ChaosMonkeyNothingIsSafeTest_D3D69541442EA1D3-001/shard-2-001 of type TLOG
   [junit4]   2> 556452 INFO  (TEST-ChaosMonkeyNothingIsSafeTest.test-seed#[D3D69541442EA1D3]) [    ] o.e.j.s.Server jetty-9.3.14.v20161028
   [junit4]   2> 556515 INFO  (TEST-ChaosMonkeyNothingIsSafeTest.test-seed#[D3D69541442EA1D3]) [    ] o.e.j.s.h.ContextHandler Started o.e.j.s.ServletContextHandler@4906e9{/,null,AVAILABLE}
   [junit4]   2> 556515 INFO  (TEST-ChaosMonkeyNothingIsSafeTest.test-seed#[D3D69541442EA1D3]) [    ] o.e.j.s.AbstractConnector Started ServerConnector@144035e{HTTP/1.1,[http/1.1]}{127.0.0.1:39721}
   [junit4]   2> 556515 INFO  (TEST-ChaosMonkeyNothingIsSafeTest.test-seed#[D3D69541442EA1D3]) [    ] o.e.j.s.Server Started @558251ms
   [junit4]   2> 556515 INFO  (TEST-ChaosMonkeyNothingIsSafeTest.test-seed#[D3D69541442EA1D3]) [    ] o.a.s.c.s.e.JettySolrRunner Jetty properties: {hostContext=/, solrconfig=solrconfig.xml, solr.data.dir=/home/jenkins/workspace/Lucene-Solr-master-Linux/solr/build/solr-core/test/J0/temp/solr.cloud.ChaosMonkeyNothingIsSafeTest_D3D69541442EA1D3-001/tempDir-001/jetty2, hostPort=39721, coreRootDirectory=/home/jenkins/workspace/Lucene-Solr-master-Linux/solr/build/solr-core/test/J0/temp/solr.cloud.ChaosMonkeyNothingIsSafeTest_D3D69541442EA1D3-001/shard-2-001/cores, replicaType=TLOG}
   [junit4]   2> 556515 ERROR (TEST-ChaosMonkeyNothingIsSafeTest.test-seed#[D3D69541442EA1D3]) [    ] o.a.s.s.StartupLoggingUtils Missing Java Option solr.log.dir. Logging may be missing or incomplete.
   [junit4]   2> 556519 INFO  (TEST-ChaosMonkeyNothingIsSafeTest.test-seed#[D3D69541442EA1D3]) [    ] o.a.s.s.SolrDispatchFilter  ___      _       Welcome to Apache Solr? version 8.0.0
   [junit4]   2> 556519 INFO  (TEST-ChaosMonkeyNothingIsSafeTest.test-seed#[D3D69541442EA1D3]) [    ] o.a.s.s.SolrDispatchFilter / __| ___| |_ _   Starting in cloud mode on port null
   [junit4]   2> 556519 INFO  (TEST-ChaosMonkeyNothingIsSafeTest.test-seed#[D3D69541442EA1D3]) [    ] o.a.s.s.SolrDispatchFilter \__ \/ _ \ | '_|  Install dir: null, Default config dir: null
   [junit4]   2> 556519 INFO  (TEST-ChaosMonkeyNothingIsSafeTest.test-seed#[D3D69541442EA1D3]) [    ] o.a.s.s.SolrDispatchFilter |___/\___/_|_|    Start time: 2017-07-17T13:02:19.537635Z
   [junit4]   2> 556561 INFO  (TEST-ChaosMonkeyNothingIsSafeTest.test-seed#[D3D69541442EA1D3]) [    ] o.a.s.s.SolrDispatchFilter Loading solr.xml from SolrHome (not found in ZooKeeper)
   [junit4]   2> 556561 INFO  (TEST-ChaosMonkeyNothingIsSafeTest.test-seed#[D3D69541442EA1D3]) [    ] o.a.s.c.SolrXmlConfig Loading container configuration from /home/jenkins/workspace/Lucene-Solr-master-Linux/solr/build/solr-core/test/J0/temp/solr.cloud.ChaosMonkeyNothingIsSafeTest_D3D69541442EA1D3-001/shard-2-001/solr.xml
   [junit4]   2> 556563 INFO  (TEST-ChaosMonkeyNothingIsSafeTest.test-seed#[D3D69541442EA1D3]) [    ] o.a.s.c.SolrXmlConfig MBean server found: com.sun.jmx.mbeanserver.JmxMBeanServer@ccf13b, but no JMX reporters were configured - adding default JMX reporter.
   [junit4]   2> 556577 INFO  (TEST-ChaosMonkeyNothingIsSafeTest.test-seed#[D3D69541442EA1D3]) [    ] o.a.s.c.ZkContainer Zookeeper client=127.0.0.1:45839/solr
   [junit4]   2> 556616 INFO  (TEST-ChaosMonkeyNothingIsSafeTest.test-seed#[D3D69541442EA1D3]) [    ] o.a.s.c.c.ZkStateReader Updated live nodes from ZooKeeper... (0) -> (2)
   [junit4]   2> 556617 INFO  (TEST-ChaosMonkeyNothingIsSafeTest.test-seed#[D3D69541442EA1D3]) [    ] o.a.s.c.Overseer Overseer (id=null) closing
   [junit4]   2> 556618 INFO  (TEST-ChaosMonkeyNothingIsSafeTest.test-seed#[D3D69541442EA1D3]) [    ] o.a.s.c.ZkController Register node as live in ZooKeeper:/live_nodes/127.0.0.1:39721_
   [junit4]   2> 556622 INFO  (zkCallback-3445-thread-1) [    ] o.a.s.c.c.ZkStateReader Updated live nodes from ZooKeeper... (2) -> (3)
   [junit4]   2> 556628 INFO  (zkCallback-3433-thread-2) [    ] o.a.s.c.c.ZkStateReader Updated live nodes from ZooKeeper... (2) -> (3)
   [junit4]   2> 556628 INFO  (zkCallback-3440-thread-1) [    ] o.a.s.c.c.ZkStateReader Updated live nodes from ZooKeeper... (2) -> (3)
   [junit4]   2> 556635 INFO  (zkCallback-3451-thread-1) [    ] o.a.s.c.c.ZkStateReader Updated live nodes from ZooKeeper... (2) -> (3)
   [junit4]   2> 556710 INFO  (TEST-ChaosMonkeyNothingIsSafeTest.test-seed#[D3D69541442EA1D3]) [    ] o.a.s.m.r.SolrJmxReporter JMX monitoring for 'solr.node' (registry 'solr.node') enabled at server: com.sun.jmx.mbeanserver.JmxMBeanServer@ccf13b
   [junit4]   2> 556714 INFO  (TEST-ChaosMonkeyNothingIsSafeTest.test-seed#[D3D69541442EA1D3]) [    ] o.a.s.m.r.SolrJmxReporter JMX monitoring for 'solr.jvm' (registry 'solr.jvm') enabled at server: com.sun.jmx.mbeanserver.JmxMBeanServer@ccf13b
   [junit4]   2> 556714 INFO  (TEST-ChaosMonkeyNothingIsSafeTest.test-seed#[D3D69541442EA1D3]) [    ] o.a.s.m.r.SolrJmxReporter JMX monitoring for 'solr.jetty' (registry 'solr.jetty') enabled at server: com.sun.jmx.mbeanserver.JmxMBeanServer@ccf13b
   [junit4]   2> 556715 INFO  (TEST-ChaosMonkeyNothingIsSafeTest.test-seed#[D3D69541442EA1D3]) [    ] o.a.s.c.CorePropertiesLocator Found 0 core definitions underneath /home/jenkins/workspace/Lucene-Solr-master-Linux/solr/build/solr-core/test/J0/temp/solr.cloud.ChaosMonkeyNothingIsSafeTest_D3D69541442EA1D3-001/shard-2-001/cores
   [junit4]   2> 556753 INFO  (qtp19495984-12994) [    ] o.a.s.h.a.CollectionsHandler Invoked Collection Action :addreplica with params node=127.0.0.1:39721_&action=ADDREPLICA&collection=collection1&shard=shard3&type=TLOG&wt=javabin&version=2 and sendToOCPQueue=true
   [junit4]   2> 556760 INFO  (OverseerThreadFactory-1823-thread-4) [    ] o.a.s.c.AddReplicaCmd Node Identified 127.0.0.1:39721_ for creating new replica
   [junit4]   2> 556762 INFO  (qtp19495984-12996) [    ] o.a.s.h.a.CoreAdminOperation core create command qt=/admin/cores&collection.configName=conf1&name=collection1_shard3_replica_t0&action=CREATE&collection=collection1&shard=shard3&wt=javabin&version=2&replicaType=TLOG
   [junit4]   2> 556762 INFO  (qtp19495984-12996) [    ] o.a.s.c.TransientSolrCoreCacheDefault Allocating transient cache for 4 transient cores
   [junit4]   2> 557795 INFO  (qtp19495984-12996) [    ] o.a.s.c.SolrConfig Using Lucene MatchVersion: 8.0.0
   [junit4]   2> 557808 INFO  (qtp19495984-12996) [    ] o.a.s.s.IndexSchema [collection1_shard3_replica_t0] Schema name=test
   [junit4]   2> 557894 INFO  (qtp19495984-12996) [    ] o.a.s.s.IndexSchema Loaded schema test/1.6 with uniqueid field id
   [junit4]   2> 557921 INFO  (qtp19495984-12996) [    ] o.a.s.c.CoreContainer Creating SolrCore 'collection1_shard3_replica_t0' using configuration from collection collection1, trusted=true
   [junit4]   2> 557921 INFO  (qtp19495984-12996) [    ] o.a.s.m.r.SolrJmxReporter JMX monitoring for 'solr.core.collection1.shard3.replica_t0' (registry 'solr.core.collection1.shard3.replica_t0') enabled at server: com.sun.jmx.mbeanserver.JmxMBeanServer@ccf13b
   [junit4]   2> 557922 INFO  (qtp19495984-12996) [    ] o.a.s.c.SolrCore solr.RecoveryStrategy.Builder
   [junit4]   2> 557922 INFO  (qtp19495984-12996) [    ] o.a.s.c.SolrCore [[collection1_shard3_replica_t0] ] Opening new SolrCore at [/home/jenkins/workspace/Lucene-Solr-master-Linux/solr/build/solr-core/test/J0/temp/solr.cloud.ChaosMonkeyNothingIsSafeTest_D3D69541442EA1D3-001/shard-2-001/cores/collection1_shard3_replica_t0], dataDir=[/home/jenkins/workspace/Lucene-Solr-master-Linux/solr/build/solr-core/test/J0/temp/solr.cloud.ChaosMonkeyNothingIsSafeTest_D3D69541442EA1D3-001/shard-2-001/cores/collection1_shard3_replica_t0/data/]
   [junit4]   2> 557926 INFO  (qtp19495984-12996) [    ] o.a.s.u.RandomMergePolicy RandomMergePolicy wrapping class org.apache.lucene.index.TieredMergePolicy: [TieredMergePolicy: maxMergeAtOnce=18, maxMergeAtOnceExplicit=19, maxMergedSegmentMB=43.166015625, floorSegmentMB=1.4736328125, forceMergeDeletesPctAllowed=0.48907739238854386, segmentsPerTier=12.0, maxCFSSegmentSizeMB=8.796093022207999E12, noCFSRatio=0.6721688052003063
   [junit4]   2> 557961 WARN  (qtp19495984-12996) [    ] o.a.s.c.RequestHandlers INVALID paramSet a in requestHandler {type = requestHandler,name = /dump,class = DumpRequestHandler,attributes = {initParams=a, name=/dump, class=DumpRequestHandler},args = {defaults={a=A,b=B}}}
   [junit4]   2> 558023 INFO  (qtp19495984-12996) [    ] o.a.s.u.UpdateHandler Using UpdateLog implementation: org.apache.solr.update.UpdateLog
   [junit4]   2> 558023 INFO  (qtp19495984-12996) [    ] o.a.s.u.UpdateLog Initializing UpdateLog: dataDir= defaultSyncLevel=FLUSH numRecordsToKeep=100 maxNumLogsToKeep=10 numVersionBuckets=65536
   [junit4]   2> 558024 INFO  (qtp19495984-12996) [    ] o.a.s.u.CommitTracker Hard AutoCommit: if uncommited for 15000ms;
   [junit4]   2> 558024 INFO  (qtp19495984-12996) [    ] o.a.s.u.CommitTracker Soft AutoCommit: disabled
   [junit4]   2> 558025 INFO  (qtp19495984-12996) [    ] o.a.s.u.RandomMergePolicy RandomMergePolicy wrapping class org.apache.lucene.index.MockRandomMergePolicy: org.apache.lucene.index.MockRandomMergePolicy@13d6cb
   [junit4]   2> 558026 INFO  (qtp19495984-12996) [    ] o.a.s.s.SolrIndexSearcher Opening [Searcher@1683906[collection1_shard3_replica_t0] main]
   [junit4]   2> 558026 INFO  (qtp19495984-12996) [    ] o.a.s.r.ManagedResourceStorage Configured ZooKeeperStorageIO with znodeBase: /configs/conf1
   [junit4]   2> 558027 INFO  (qtp19495984-12996) [    ] o.a.s.r.ManagedResourceStorage Loaded null at path _rest_managed.json using ZooKeeperStorageIO:path=/configs/conf1
   [junit4]   2> 558027 INFO  (qtp19495984-12996) [    ] o.a.s.h.ReplicationHandler Commits will be reserved for  10000
   [junit4]   2> 558028 INFO  (qtp19495984-12996) [    ] o.a.s.u.UpdateLog Could not find max version in index or recent updates, using new clock 1573174945823850496
   [junit4]   2> 558032 INFO  (qtp19495984-12996) [    ] o.a.s.c.ShardLeaderElectionContext Enough replicas found to continue.
   [junit4]   2> 558032 INFO  (qtp19495984-12996) [    ] o.a.s.c.ShardLeaderElectionContext I may be the new leader - try and sync
   [junit4]   2> 558032 INFO  (qtp19495984-12996) [    ] o.a.s.c.SyncStrategy Sync replicas to http://127.0.0.1:39721/collection1_shard3_replica_t0/
   [junit4]   2> 558032 INFO  (qtp19495984-12996) [    ] o.a.s.c.SyncStrategy Sync Success - now sync replicas to me
   [junit4]   2> 558032 INFO  (qtp19495984-12996) [    ] o.a.s.c.SyncStrategy http://127.0.0.1:39721/collection1_shard3_replica_t0/ has no replicas
   [junit4]   2> 558032 INFO  (qtp19495984-12996) [    ] o.a.s.c.ShardLeaderElectionContext Found all replicas participating in election, clear LIR
   [junit4]   2> 558032 INFO  (qtp19495984-12996) [    ] o.a.s.c.ZkController collection1_shard3_replica_t0 stopping background replication from leader
   [junit4]   2> 558033 INFO  (searcherExecutor-1848-thread-1) [    ] o.a.s.c.SolrCore [collection1_shard3_replica_t0] Registered new searcher Searcher@1683906[collection1_shard3_replica_t0] main{ExitableDirectoryReader(UninvertingDirectoryReader())}
   [junit4]   2> 558033 INFO  (qtp19495984-12996) [    ] o.a.s.c.ShardLeaderElectionContext I am the new leader: http://127.0.0.1:39721/collection1_shard3_replica_t0/ shard3
   [junit4]   2> 558186 INFO  (qtp19495984-12996) [    ] o.a.s.c.ZkController I am the leader, no recovery necessary
   [junit4]   2> 558187 INFO  (qtp19495984-12996) [    ] o.a.s.s.HttpSolrCall [admin] webapp=null path=/admin/cores params={qt=/admin/cores&collection.configName=conf1&name=collection1_shard3_replica_t0&action=CREATE&collection=collection1&shard=shard3&wt=javabin&version=2&replicaType=TLOG} status=0 QTime=1425
   [junit4]   2> 558188 INFO  (qtp19495984-12994) [    ] o.a.s.s.HttpSolrCall [admin] webapp=null path=/admin/collections params={node=127.0.0.1:39721_&action=ADDREPLICA&collection=collection1&shard=shard3&type=TLOG&wt=javabin&version=2} status=0 QTime=1434
   [junit4]   2> 558322 INFO  (TEST-ChaosMonkeyNothingIsSafeTest.test-seed#[D3D69541442EA1D3]) [    ] o.a.s.c.AbstractFullDistribZkTestBase create jetty 3 in directory /home/jenkins/workspace/Lucene-Solr-master-Linux/solr/build/solr-core/test/J0/temp/solr.cloud.ChaosMonkeyNothingIsSafeTest_D3D69541442EA1D3-001/shard-3-001 of type TLOG
   [junit4]   2> 558323 INFO  (TEST-ChaosMonkeyNothingIsSafeTest.test-seed#[D3D69541442EA1D3]) [    ] o.e.j.s.Server jetty-9.3.14.v20161028
   [junit4]   2> 558361 INFO  (TEST-ChaosMonkeyNothingIsSafeTest.test-seed#[D3D69541442EA1D3]) [    ] o.e.j.s.h.ContextHandler Started o.e.j.s.ServletContextHandler@13d18a9{/,null,AVAILABLE}
   [junit4]   2> 558361 INFO  (TEST-ChaosMonkeyNothingIsSafeTest.test-seed#[D3D69541442EA1D3]) [    ] o.e.j.s.AbstractConnector Started ServerConnector@117dad7{HTTP/1.1,[http/1.1]}{127.0.0.1:41201}
   [junit4]   2> 558361 INFO  (TEST-ChaosMonkeyNothingIsSafeTest.test-seed#[D3D69541442EA1D3]) [    ] o.e.j.s.Server Started @560098ms
   [junit4]   2> 558361 INFO  (TEST-ChaosMonkeyNothingIsSafeTest.test-seed#[D3D69541442EA1D3]) [    ] o.a.s.c.s.e.JettySolrRunner Jetty properties: {hostContext=/, solrconfig=solrconfig.xml, solr.data.dir=/home/jenkins/workspace/Lucene-Solr-master-Linux/solr/build/solr-core/test/J0/temp/solr.cloud.ChaosMonkeyNothingIsSafeTest_D3D69541442EA1D3-001/tempDir-001/jetty3, hostPort=41201, coreRootDirectory=/home/jenkins/workspace/Lucene-Solr-master-Linux/solr/build/solr-core/test/J0/temp/solr.cloud.ChaosMonkeyNothingIsSafeTest_D3D69541442EA1D3-001/shard-3-001/cores, replicaType=TLOG}
   [junit4]   2> 558362 ERROR (TEST-ChaosMonkeyNothingIsSafeTest.test-seed#[D3D69541442EA1D3]) [    ] o.a.s.s.StartupLoggingUtils Missing Java Option solr.log.dir. Logging may be missing or incomplete.
   [junit4]   2> 558363 INFO  (TEST-ChaosMonkeyNothingIsSafeTest.test-seed#[D3D69541442EA1D3]) [    ] o.a.s.s.SolrDispatchFilter  ___      _       Welcome to Apache Solr? version 8.0.0
   [junit4]   2> 558363 INFO  (TEST-ChaosMonkeyNothingIsSafeTest.test-seed#[D3D69541442EA1D3]) [    ] o.a.s.s.SolrDispatchFilter / __| ___| |_ _   Starting in cloud mode on port null
   [junit4]   2> 558363 INFO  (TEST-ChaosMonkeyNothingIsSafeTest.test-seed#[D3D69541442EA1D3]) [    ] o.a.s.s.SolrDispatchFilter \__ \/ _ \ | '_|  Install dir: null, Default config dir: null
   [junit4]   2> 558363 INFO  (TEST-ChaosMonkeyNothingIsSafeTest.test-seed#[D3D69541442EA1D3]) [    ] o.a.s.s.SolrDispatchFilter |___/\___/_|_|    Start time: 2017-07-17T13:02:21.381548Z
   [junit4]   2> 558373 INFO  (TEST-ChaosMonkeyNothingIsSafeTest.test-seed#[D3D69541442EA1D3]) [    ] o.a.s.s.SolrDispatchFilter Loading solr.xml from SolrHome (not found in ZooKeeper)
   [junit4]   2> 558373 INFO  (TEST-ChaosMonkeyNothingIsSafeTest.test-seed#[D3D69541442EA1D3]) [    ] o.a.s.c.SolrXmlConfig Loading container configuration from /home/jenkins/workspace/Lucene-Solr-master-Linux/solr/build/solr-core/test/J0/temp/solr.cloud.ChaosMonkeyNothingIsSafeTest_D3D69541442EA1D3-001/shard-3-001/solr.xml
   [junit4]   2> 558376 INFO  (TEST-ChaosMonkeyNothingIsSafeTest.test-seed#[D3D69541442EA1D3]) [    ] o.a.s.c.SolrXmlConfig MBean server found: com.sun.jmx.mbeanserver.JmxMBeanServer@ccf13b, but no JMX reporters were configured - adding default JMX reporter.
   [junit4]   2> 558385 INFO  (TEST-ChaosMonkeyNothingIsSafeTest.test-seed#[D3D69541442EA1D3]) [    ] o.a.s.c.ZkContainer Zookeeper client=127.0.0.1:45839/solr
   [junit4]   2> 558442 INFO  (TEST-ChaosMonkeyNothingIsSafeTest.test-seed#[D3D69541442EA1D3]) [    ] o.a.s.c.c.ZkStateReader Updated live nodes from ZooKeeper... (0) -> (3)
   [junit4]   2> 558444 INFO  (TEST-ChaosMonkeyNothingIsSafeTest.test-seed#[D3D69541442EA1D3]) [    ] o.a.s.c.Overseer Overseer (id=null) closing
   [junit4]   2> 558445 INFO  (TEST-ChaosMonkeyNothingIsSafeTest.test-seed#[D3D69541442EA1D3]) [    ] o.a.s.c.ZkController Register node as live in ZooKeeper:/live_nodes/127.0.0.1:41201_
   [junit4]   2> 558448 INFO  (zkCallback-3440-thread-1) [    ] o.a.s.c.c.ZkStateReader Updated live nodes from ZooKeeper... (3) -> (4)
   [junit4]   2> 558448 INFO  (zkCallback-3433-thread-2) [    ] o.a.s.c.c.ZkStateReader Updated live nodes from ZooKeeper... (3) -> (4)
   [junit4]   2> 558448 INFO  (zkCallback-3445-thread-1) [    ] o.a.s.c.c.ZkStateReader Updated live nodes from ZooKeeper... (3) -> (4)
   [junit4]   2> 558448 INFO  (zkCallback-3451-thread-1) [    ] o.a.s.c.c.ZkStateReader Updated live nodes from ZooKeeper... (3) -> (4)
   [junit4]   2> 558464 INFO  (zkCallback-3457-thread-1) [    ] o.a.s.c.c.ZkStateReader Updated live nodes from ZooKeeper... (3) -> (4)
   [junit4]   2> 558645 INFO  (TEST-ChaosMonkeyNothingIsSafeTest.test-seed#[D3D69541442EA1D3]) [    ] o.a.s.m.r.SolrJmxReporter JMX monitoring for 'solr.node' (registry 'solr.node') enabled at server: com.sun.jmx.mbeanserver.JmxMBeanServer@ccf13b
   [junit4]   2> 558652 INFO  (TEST-ChaosMonkeyNothingIsSafeTest.test-seed#[D3D69541442EA1D3]) [    ] o.a.s.m.r.SolrJmxReporter JMX monitoring for 'solr.jvm' (registry 'solr.jvm') enabled at server: com.sun.jmx.mbeanserver.JmxMBeanServer@ccf13b
   [junit4]   2> 558653 INFO  (TEST-ChaosMonkeyNothingIsSafeTest.test-seed#[D3D69541442EA1D3]) [    ] o.a.s.m.r.SolrJmxReporter JMX monitoring for 'solr.jetty' (registry 'solr.jetty') enabled at server: com.sun.jmx.mbeanserver.JmxMBeanServer@ccf13b
   [junit4]   2> 558656 INFO  (TEST-ChaosMonkeyNothingIsSafeTest.test-seed#[D3D69541442EA1D3]) [    ] o.a.s.c.CorePropertiesLocator Found 0 core definitions underneath /home/jenkins/workspace/Lucene-Solr-master-Linux/solr/build/solr-core/test/J0/temp/solr.cloud.ChaosMonkeyNothingIsSafeTest_D3D69541442EA1D3-001/shard-3-001/cores
   [junit4]   2> 558724 INFO  (qtp19495984-12995) [    ] o.a.s.h.a.CollectionsHandler Invoked Collection Action :addreplica with params node=127.0.0.1:41201_&action=ADDREPLICA&collection=collection1&shard=shard1&type=TLOG&wt=javabin&version=2 and sendToOCPQueue=true
   [junit4]   2> 558746 INFO  (OverseerThreadFactory-1823-thread-5) [    ] o.a.s.c.AddReplicaCmd Node Identified 127.0.0.1:41201_ for creating new replica
   [junit4]   2> 558746 INFO  (OverseerCollectionConfigSetProcessor-98323433657663492-127.0.0.1:40497_-n_0000000000) [    ] o.a.s.c.OverseerTaskQueue Response ZK path: /overseer/collection-queue-work/qnr-0000000006 doesn't exist.  Requestor may have disconnected from ZooKeeper
   [junit4]   2> 558792 INFO  (qtp9154102-13023) [    ] o.a.s.h.a.CoreAdminOperation core create command qt=/admin/cores&collection.configName=conf1&name=collection1_shard1_replica_t0&action=CREATE&collection=collection1&shard=shard1&wt=javabin&version=2&replicaType=TLOG
   [junit4]   2> 558792 INFO  (qtp9154102-13023) [    ] o.a.s.c.TransientSolrCoreCacheDefault Allocating transient cache for 4 transient cores
   [junit4]   2> 559815 INFO  (qtp9154102-13023) [    ] o.a.s.c.SolrConfig Using Lucene MatchVersion: 8.0.0
   [junit4]   2> 559861 INFO  (qtp9154102-13023) [    ] o.a.s.s.IndexSchema [collection1_shard1_replica_t0] Schema name=test
   [junit4]   2> 559928 INFO  (qtp9154102-13023) [    ] o.a.s.s.IndexSchema Loaded schema test/1.6 with uniqueid field id
   [junit4]   2> 559942 INFO  (qtp9154102-13023) [    ] o.a.s.c.CoreContainer Creating SolrCore 'collection1_shard1_replica_t0' using configuration from collection collection1, trusted=true
   [junit4]   2> 559943 INFO  (qtp9154102-13023) [    ] o.a.s.m.r.SolrJmxReporter JMX monitoring for 'solr.core.collection1.shard1.replica_t0' (registry 'solr.core.collection1.shard1.replica_t0') enabled at server: com.sun.jmx.mbeanserver.JmxMBeanServer@ccf13b
   [junit4]   2> 559943 INFO  (qtp9154102-13023) [    ] o.a.s.c.SolrCore solr.RecoveryStrategy.Builder
   [junit4]   2> 559943 INFO  (qtp9154102-13023) [    ] o.a.s.c.SolrCore [[collection1_shard1_replica_t0] ] Opening new SolrCore at [/home/jenkins/workspace/Lucene-Solr-master-Linux/solr/build/solr-core/test/J0/temp/solr.cloud.ChaosMonkeyNothingIsSafeTest_D3D69541442EA1D3-001/shard-3-001/cores/collection1_shard1_replica_t0], dataDir=[/home/jenkins/workspace/Lucene-Solr-master-Linux/solr/build/solr-core/test/J0/temp/solr.cloud.ChaosMonkeyNothingIsSafeTest_D3D69541442EA1D3-001/shard-3-001/cores/collection1_shard1_replica_t0/data/]
   [junit4]   2> 559947 INFO  (qtp9154102-13023) [    ] o.a.s.u.RandomMergePolicy RandomMergePolicy wrapping class org.apache.lucene.index.TieredMergePolicy: [TieredMergePolicy: maxMergeAtOnce=18, maxMergeAtOnceExplicit=19, maxMergedSegmentMB=43.166015625, floorSegmentMB=1.4736328125, forceMergeDeletesPctAllowed=0.4890773923885438

[...truncated too long message...]

TIMED_WAITING, group=TGRP-ChaosMonkeyNothingIsSafeTest]
   [junit4]    >         at java.base@9/jdk.internal.misc.Unsafe.park(Native Method)
   [junit4]    >         at java.base@9/java.util.concurrent.locks.LockSupport.parkNanos(LockSupport.java:234)
   [junit4]    >         at java.base@9/java.util.concurrent.SynchronousQueue$TransferStack.awaitFulfill(SynchronousQueue.java:462)
   [junit4]    >         at java.base@9/java.util.concurrent.SynchronousQueue$TransferStack.transfer(SynchronousQueue.java:361)
   [junit4]    >         at java.base@9/java.util.concurrent.SynchronousQueue.poll(SynchronousQueue.java:937)
   [junit4]    >         at java.base@9/java.util.concurrent.ThreadPoolExecutor.getTask(ThreadPoolExecutor.java:1085)
   [junit4]    >         at java.base@9/java.util.concurrent.ThreadPoolExecutor.runWorker(ThreadPoolExecutor.java:1146)
   [junit4]    >         at java.base@9/java.util.concurrent.ThreadPoolExecutor$Worker.run(ThreadPoolExecutor.java:635)
   [junit4]    >         at java.base@9/java.lang.Thread.run(Thread.java:844)
   [junit4]    >    9) Thread[id=13118, name=zkCallback-3440-thread-4, state=TIMED_WAITING, group=TGRP-ChaosMonkeyNothingIsSafeTest]
   [junit4]    >         at java.base@9/jdk.internal.misc.Unsafe.park(Native Method)
   [junit4]    >         at java.base@9/java.util.concurrent.locks.LockSupport.parkNanos(LockSupport.java:234)
   [junit4]    >         at java.base@9/java.util.concurrent.SynchronousQueue$TransferStack.awaitFulfill(SynchronousQueue.java:462)
   [junit4]    >         at java.base@9/java.util.concurrent.SynchronousQueue$TransferStack.transfer(SynchronousQueue.java:361)
   [junit4]    >         at java.base@9/java.util.concurrent.SynchronousQueue.poll(SynchronousQueue.java:937)
   [junit4]    >         at java.base@9/java.util.concurrent.ThreadPoolExecutor.getTask(ThreadPoolExecutor.java:1085)
   [junit4]    >         at java.base@9/java.util.concurrent.ThreadPoolExecutor.runWorker(ThreadPoolExecutor.java:1146)
   [junit4]    >         at java.base@9/java.util.concurrent.ThreadPoolExecutor$Worker.run(ThreadPoolExecutor.java:635)
   [junit4]    >         at java.base@9/java.lang.Thread.run(Thread.java:844)
   [junit4]    > at __randomizedtesting.SeedInfo.seed([D3D69541442EA1D3]:0)Throwable #2: com.carrotsearch.randomizedtesting.ThreadLeakError: There are still zombie threads that couldn't be terminated:
   [junit4]    >    1) Thread[id=12957, name=zkCallback-3440-thread-1, state=TIMED_WAITING, group=TGRP-ChaosMonkeyNothingIsSafeTest]
   [junit4]    >         at java.base@9/jdk.internal.misc.Unsafe.park(Native Method)
   [junit4]    >         at java.base@9/java.util.concurrent.locks.LockSupport.parkNanos(LockSupport.java:234)
   [junit4]    >         at java.base@9/java.util.concurrent.SynchronousQueue$TransferStack.awaitFulfill(SynchronousQueue.java:462)
   [junit4]    >         at java.base@9/java.util.concurrent.SynchronousQueue$TransferStack.transfer(SynchronousQueue.java:361)
   [junit4]    >         at java.base@9/java.util.concurrent.SynchronousQueue.poll(SynchronousQueue.java:937)
   [junit4]    >         at java.base@9/java.util.concurrent.ThreadPoolExecutor.getTask(ThreadPoolExecutor.java:1085)
   [junit4]    >         at java.base@9/java.util.concurrent.ThreadPoolExecutor.runWorker(ThreadPoolExecutor.java:1146)
   [junit4]    >         at java.base@9/java.util.concurrent.ThreadPoolExecutor$Worker.run(ThreadPoolExecutor.java:635)
   [junit4]    >         at java.base@9/java.lang.Thread.run(Thread.java:844)
   [junit4]    >    2) Thread[id=13117, name=zkCallback-3440-thread-3, state=TIMED_WAITING, group=TGRP-ChaosMonkeyNothingIsSafeTest]
   [junit4]    >         at java.base@9/jdk.internal.misc.Unsafe.park(Native Method)
   [junit4]    >         at java.base@9/java.util.concurrent.locks.LockSupport.parkNanos(LockSupport.java:234)
   [junit4]    >         at java.base@9/java.util.concurrent.SynchronousQueue$TransferStack.awaitFulfill(SynchronousQueue.java:462)
   [junit4]    >         at java.base@9/java.util.concurrent.SynchronousQueue$TransferStack.transfer(SynchronousQueue.java:361)
   [junit4]    >         at java.base@9/java.util.concurrent.SynchronousQueue.poll(SynchronousQueue.java:937)
   [junit4]    >         at java.base@9/java.util.concurrent.ThreadPoolExecutor.getTask(ThreadPoolExecutor.java:1085)
   [junit4]    >         at java.base@9/java.util.concurrent.ThreadPoolExecutor.runWorker(ThreadPoolExecutor.java:1146)
   [junit4]    >         at java.base@9/java.util.concurrent.ThreadPoolExecutor$Worker.run(ThreadPoolExecutor.java:635)
   [junit4]    >         at java.base@9/java.lang.Thread.run(Thread.java:844)
   [junit4]    >    3) Thread[id=13211, name=zkCallback-3440-thread-6, state=TIMED_WAITING, group=TGRP-ChaosMonkeyNothingIsSafeTest]
   [junit4]    >         at java.base@9/jdk.internal.misc.Unsafe.park(Native Method)
   [junit4]    >         at java.base@9/java.util.concurrent.locks.LockSupport.parkNanos(LockSupport.java:234)
   [junit4]    >         at java.base@9/java.util.concurrent.SynchronousQueue$TransferStack.awaitFulfill(SynchronousQueue.java:462)
   [junit4]    >         at java.base@9/java.util.concurrent.SynchronousQueue$TransferStack.transfer(SynchronousQueue.java:361)
   [junit4]    >         at java.base@9/java.util.concurrent.SynchronousQueue.poll(SynchronousQueue.java:937)
   [junit4]    >         at java.base@9/java.util.concurrent.ThreadPoolExecutor.getTask(ThreadPoolExecutor.java:1085)
   [junit4]    >         at java.base@9/java.util.concurrent.ThreadPoolExecutor.runWorker(ThreadPoolExecutor.java:1146)
   [junit4]    >         at java.base@9/java.util.concurrent.ThreadPoolExecutor$Worker.run(ThreadPoolExecutor.java:635)
   [junit4]    >         at java.base@9/java.lang.Thread.run(Thread.java:844)
   [junit4]    >    4) Thread[id=12955, name=TEST-ChaosMonkeyNothingIsSafeTest.test-seed#[D3D69541442EA1D3]-SendThread(127.0.0.1:45839), state=TIMED_WAITING, group=TGRP-ChaosMonkeyNothingIsSafeTest]
   [junit4]    >         at java.base@9/java.lang.Thread.sleep(Native Method)
   [junit4]    >         at app//org.apache.zookeeper.client.StaticHostProvider.next(StaticHostProvider.java:101)
   [junit4]    >         at app//org.apache.zookeeper.ClientCnxn$SendThread.startConnect(ClientCnxn.java:997)
   [junit4]    >         at app//org.apache.zookeeper.ClientCnxn$SendThread.run(ClientCnxn.java:1060)
   [junit4]    >    5) Thread[id=13153, name=zkCallback-3440-thread-5, state=TIMED_WAITING, group=TGRP-ChaosMonkeyNothingIsSafeTest]
   [junit4]    >         at java.base@9/jdk.internal.misc.Unsafe.park(Native Method)
   [junit4]    >         at java.base@9/java.util.concurrent.locks.LockSupport.parkNanos(LockSupport.java:234)
   [junit4]    >         at java.base@9/java.util.concurrent.SynchronousQueue$TransferStack.awaitFulfill(SynchronousQueue.java:462)
   [junit4]    >         at java.base@9/java.util.concurrent.SynchronousQueue$TransferStack.transfer(SynchronousQueue.java:361)
   [junit4]    >         at java.base@9/java.util.concurrent.SynchronousQueue.poll(SynchronousQueue.java:937)
   [junit4]    >         at java.base@9/java.util.concurrent.ThreadPoolExecutor.getTask(ThreadPoolExecutor.java:1085)
   [junit4]    >         at java.base@9/java.util.concurrent.ThreadPoolExecutor.runWorker(ThreadPoolExecutor.java:1146)
   [junit4]    >         at java.base@9/java.util.concurrent.ThreadPoolExecutor$Worker.run(ThreadPoolExecutor.java:635)
   [junit4]    >         at java.base@9/java.lang.Thread.run(Thread.java:844)
   [junit4]    >    6) Thread[id=13116, name=zkCallback-3440-thread-2, state=TIMED_WAITING, group=TGRP-ChaosMonkeyNothingIsSafeTest]
   [junit4]    >         at java.base@9/jdk.internal.misc.Unsafe.park(Native Method)
   [junit4]    >         at java.base@9/java.util.concurrent.locks.LockSupport.parkNanos(LockSupport.java:234)
   [junit4]    >         at java.base@9/java.util.concurrent.SynchronousQueue$TransferStack.awaitFulfill(SynchronousQueue.java:462)
   [junit4]    >         at java.base@9/java.util.concurrent.SynchronousQueue$TransferStack.transfer(SynchronousQueue.java:361)
   [junit4]    >         at java.base@9/java.util.concurrent.SynchronousQueue.poll(SynchronousQueue.java:937)
   [junit4]    >         at java.base@9/java.util.concurrent.ThreadPoolExecutor.getTask(ThreadPoolExecutor.java:1085)
   [junit4]    >         at java.base@9/java.util.concurrent.ThreadPoolExecutor.runWorker(ThreadPoolExecutor.java:1146)
   [junit4]    >         at java.base@9/java.util.concurrent.ThreadPoolExecutor$Worker.run(ThreadPoolExecutor.java:635)
   [junit4]    >         at java.base@9/java.lang.Thread.run(Thread.java:844)
   [junit4]    >    7) Thread[id=13118, name=zkCallback-3440-thread-4, state=TIMED_WAITING, group=TGRP-ChaosMonkeyNothingIsSafeTest]
   [junit4]    >         at java.base@9/jdk.internal.misc.Unsafe.park(Native Method)
   [junit4]    >         at java.base@9/java.util.concurrent.locks.LockSupport.parkNanos(LockSupport.java:234)
   [junit4]    >         at java.base@9/java.util.concurrent.SynchronousQueue$TransferStack.awaitFulfill(SynchronousQueue.java:462)
   [junit4]    >         at java.base@9/java.util.concurrent.SynchronousQueue$TransferStack.transfer(SynchronousQueue.java:361)
   [junit4]    >         at java.base@9/java.util.concurrent.SynchronousQueue.poll(SynchronousQueue.java:937)
   [junit4]    >         at java.base@9/java.util.concurrent.ThreadPoolExecutor.getTask(ThreadPoolExecutor.java:1085)
   [junit4]    >         at java.base@9/java.util.concurrent.ThreadPoolExecutor.runWorker(ThreadPoolExecutor.java:1146)
   [junit4]    >         at java.base@9/java.util.concurrent.ThreadPoolExecutor$Worker.run(ThreadPoolExecutor.java:635)
   [junit4]    >         at java.base@9/java.lang.Thread.run(Thread.java:844)
   [junit4]    > at __randomizedtesting.SeedInfo.seed([D3D69541442EA1D3]:0)
   [junit4] Completed [215/728 (1!)] on J0 in 74.14s, 1 test, 3 errors <<< FAILURES!

[...truncated 38107 lines...]


---------------------------------------------------------------------
To unsubscribe, e-mail: [hidden email]
For additional commands, e-mail: [hidden email]
Loading...