[JENKINS-EA] Lucene-Solr-master-Linux (64bit/jdk-9-ea+181) - Build # 20301 - Unstable!

Previous Topic Next Topic
 
classic Classic list List threaded Threaded
1 message Options
Reply | Threaded
Open this post in threaded view
|  
Report Content as Inappropriate

[JENKINS-EA] Lucene-Solr-master-Linux (64bit/jdk-9-ea+181) - Build # 20301 - Unstable!

Policeman Jenkins Server-2
Build: https://jenkins.thetaphi.de/job/Lucene-Solr-master-Linux/20301/
Java: 64bit/jdk-9-ea+181 -XX:-UseCompressedOops -XX:+UseSerialGC --illegal-access=deny

2 tests failed.
FAILED:  org.apache.solr.cloud.ForceLeaderTest.testReplicasInLIRNoLeader

Error Message:
Doc with id=1 not found in http://127.0.0.1:35425/forceleader_test_collection due to: Path not found: /id; rsp={doc=null}

Stack Trace:
java.lang.AssertionError: Doc with id=1 not found in http://127.0.0.1:35425/forceleader_test_collection due to: Path not found: /id; rsp={doc=null}
        at __randomizedtesting.SeedInfo.seed([58D72A5183124D9F:BE401E91BA90B4FE]:0)
        at org.junit.Assert.fail(Assert.java:93)
        at org.junit.Assert.assertTrue(Assert.java:43)
        at org.apache.solr.cloud.HttpPartitionTest.assertDocExists(HttpPartitionTest.java:603)
        at org.apache.solr.cloud.HttpPartitionTest.assertDocsExistInAllReplicas(HttpPartitionTest.java:556)
        at org.apache.solr.cloud.ForceLeaderTest.testReplicasInLIRNoLeader(ForceLeaderTest.java:142)
        at java.base/jdk.internal.reflect.NativeMethodAccessorImpl.invoke0(Native Method)
        at java.base/jdk.internal.reflect.NativeMethodAccessorImpl.invoke(NativeMethodAccessorImpl.java:62)
        at java.base/jdk.internal.reflect.DelegatingMethodAccessorImpl.invoke(DelegatingMethodAccessorImpl.java:43)
        at java.base/java.lang.reflect.Method.invoke(Method.java:564)
        at com.carrotsearch.randomizedtesting.RandomizedRunner.invoke(RandomizedRunner.java:1713)
        at com.carrotsearch.randomizedtesting.RandomizedRunner$8.evaluate(RandomizedRunner.java:907)
        at com.carrotsearch.randomizedtesting.RandomizedRunner$9.evaluate(RandomizedRunner.java:943)
        at com.carrotsearch.randomizedtesting.RandomizedRunner$10.evaluate(RandomizedRunner.java:957)
        at org.apache.solr.BaseDistributedSearchTestCase$ShardsRepeatRule$ShardsFixedStatement.callStatement(BaseDistributedSearchTestCase.java:993)
        at org.apache.solr.BaseDistributedSearchTestCase$ShardsRepeatRule$ShardsStatement.evaluate(BaseDistributedSearchTestCase.java:968)
        at com.carrotsearch.randomizedtesting.rules.SystemPropertiesRestoreRule$1.evaluate(SystemPropertiesRestoreRule.java:57)
        at org.apache.lucene.util.TestRuleSetupTeardownChained$1.evaluate(TestRuleSetupTeardownChained.java:49)
        at org.apache.lucene.util.AbstractBeforeAfterRule$1.evaluate(AbstractBeforeAfterRule.java:45)
        at org.apache.lucene.util.TestRuleThreadAndTestName$1.evaluate(TestRuleThreadAndTestName.java:48)
        at org.apache.lucene.util.TestRuleIgnoreAfterMaxFailures$1.evaluate(TestRuleIgnoreAfterMaxFailures.java:64)
        at org.apache.lucene.util.TestRuleMarkFailure$1.evaluate(TestRuleMarkFailure.java:47)
        at com.carrotsearch.randomizedtesting.rules.StatementAdapter.evaluate(StatementAdapter.java:36)
        at com.carrotsearch.randomizedtesting.ThreadLeakControl$StatementRunner.run(ThreadLeakControl.java:368)
        at com.carrotsearch.randomizedtesting.ThreadLeakControl.forkTimeoutingTask(ThreadLeakControl.java:817)
        at com.carrotsearch.randomizedtesting.ThreadLeakControl$3.evaluate(ThreadLeakControl.java:468)
        at com.carrotsearch.randomizedtesting.RandomizedRunner.runSingleTest(RandomizedRunner.java:916)
        at com.carrotsearch.randomizedtesting.RandomizedRunner$5.evaluate(RandomizedRunner.java:802)
        at com.carrotsearch.randomizedtesting.RandomizedRunner$6.evaluate(RandomizedRunner.java:852)
        at com.carrotsearch.randomizedtesting.RandomizedRunner$7.evaluate(RandomizedRunner.java:863)
        at com.carrotsearch.randomizedtesting.rules.StatementAdapter.evaluate(StatementAdapter.java:36)
        at com.carrotsearch.randomizedtesting.rules.SystemPropertiesRestoreRule$1.evaluate(SystemPropertiesRestoreRule.java:57)
        at org.apache.lucene.util.AbstractBeforeAfterRule$1.evaluate(AbstractBeforeAfterRule.java:45)
        at com.carrotsearch.randomizedtesting.rules.StatementAdapter.evaluate(StatementAdapter.java:36)
        at org.apache.lucene.util.TestRuleStoreClassName$1.evaluate(TestRuleStoreClassName.java:41)
        at com.carrotsearch.randomizedtesting.rules.NoShadowingOrOverridesOnMethodsRule$1.evaluate(NoShadowingOrOverridesOnMethodsRule.java:40)
        at com.carrotsearch.randomizedtesting.rules.NoShadowingOrOverridesOnMethodsRule$1.evaluate(NoShadowingOrOverridesOnMethodsRule.java:40)
        at com.carrotsearch.randomizedtesting.rules.StatementAdapter.evaluate(StatementAdapter.java:36)
        at com.carrotsearch.randomizedtesting.rules.StatementAdapter.evaluate(StatementAdapter.java:36)
        at org.apache.lucene.util.TestRuleAssertionsRequired$1.evaluate(TestRuleAssertionsRequired.java:53)
        at org.apache.lucene.util.TestRuleMarkFailure$1.evaluate(TestRuleMarkFailure.java:47)
        at org.apache.lucene.util.TestRuleIgnoreAfterMaxFailures$1.evaluate(TestRuleIgnoreAfterMaxFailures.java:64)
        at org.apache.lucene.util.TestRuleIgnoreTestSuites$1.evaluate(TestRuleIgnoreTestSuites.java:54)
        at com.carrotsearch.randomizedtesting.rules.StatementAdapter.evaluate(StatementAdapter.java:36)
        at com.carrotsearch.randomizedtesting.ThreadLeakControl$StatementRunner.run(ThreadLeakControl.java:368)
        at java.base/java.lang.Thread.run(Thread.java:844)


FAILED:  org.apache.solr.update.HardAutoCommitTest.testCommitWithin

Error Message:
Exception during query

Stack Trace:
java.lang.RuntimeException: Exception during query
        at __randomizedtesting.SeedInfo.seed([58D72A5183124D9F:E2054529003CA38A]:0)
        at org.apache.solr.SolrTestCaseJ4.assertQ(SolrTestCaseJ4.java:886)
        at org.apache.solr.update.HardAutoCommitTest.testCommitWithin(HardAutoCommitTest.java:100)
        at java.base/jdk.internal.reflect.NativeMethodAccessorImpl.invoke0(Native Method)
        at java.base/jdk.internal.reflect.NativeMethodAccessorImpl.invoke(NativeMethodAccessorImpl.java:62)
        at java.base/jdk.internal.reflect.DelegatingMethodAccessorImpl.invoke(DelegatingMethodAccessorImpl.java:43)
        at java.base/java.lang.reflect.Method.invoke(Method.java:564)
        at com.carrotsearch.randomizedtesting.RandomizedRunner.invoke(RandomizedRunner.java:1713)
        at com.carrotsearch.randomizedtesting.RandomizedRunner$8.evaluate(RandomizedRunner.java:907)
        at com.carrotsearch.randomizedtesting.RandomizedRunner$9.evaluate(RandomizedRunner.java:943)
        at com.carrotsearch.randomizedtesting.RandomizedRunner$10.evaluate(RandomizedRunner.java:957)
        at com.carrotsearch.randomizedtesting.rules.SystemPropertiesRestoreRule$1.evaluate(SystemPropertiesRestoreRule.java:57)
        at org.apache.lucene.util.TestRuleSetupTeardownChained$1.evaluate(TestRuleSetupTeardownChained.java:49)
        at org.apache.lucene.util.AbstractBeforeAfterRule$1.evaluate(AbstractBeforeAfterRule.java:45)
        at org.apache.lucene.util.TestRuleThreadAndTestName$1.evaluate(TestRuleThreadAndTestName.java:48)
        at org.apache.lucene.util.TestRuleIgnoreAfterMaxFailures$1.evaluate(TestRuleIgnoreAfterMaxFailures.java:64)
        at org.apache.lucene.util.TestRuleMarkFailure$1.evaluate(TestRuleMarkFailure.java:47)
        at com.carrotsearch.randomizedtesting.rules.StatementAdapter.evaluate(StatementAdapter.java:36)
        at com.carrotsearch.randomizedtesting.ThreadLeakControl$StatementRunner.run(ThreadLeakControl.java:368)
        at com.carrotsearch.randomizedtesting.ThreadLeakControl.forkTimeoutingTask(ThreadLeakControl.java:817)
        at com.carrotsearch.randomizedtesting.ThreadLeakControl$3.evaluate(ThreadLeakControl.java:468)
        at com.carrotsearch.randomizedtesting.RandomizedRunner.runSingleTest(RandomizedRunner.java:916)
        at com.carrotsearch.randomizedtesting.RandomizedRunner$5.evaluate(RandomizedRunner.java:802)
        at com.carrotsearch.randomizedtesting.RandomizedRunner$6.evaluate(RandomizedRunner.java:852)
        at com.carrotsearch.randomizedtesting.RandomizedRunner$7.evaluate(RandomizedRunner.java:863)
        at com.carrotsearch.randomizedtesting.rules.StatementAdapter.evaluate(StatementAdapter.java:36)
        at com.carrotsearch.randomizedtesting.rules.SystemPropertiesRestoreRule$1.evaluate(SystemPropertiesRestoreRule.java:57)
        at org.apache.lucene.util.AbstractBeforeAfterRule$1.evaluate(AbstractBeforeAfterRule.java:45)
        at com.carrotsearch.randomizedtesting.rules.StatementAdapter.evaluate(StatementAdapter.java:36)
        at org.apache.lucene.util.TestRuleStoreClassName$1.evaluate(TestRuleStoreClassName.java:41)
        at com.carrotsearch.randomizedtesting.rules.NoShadowingOrOverridesOnMethodsRule$1.evaluate(NoShadowingOrOverridesOnMethodsRule.java:40)
        at com.carrotsearch.randomizedtesting.rules.NoShadowingOrOverridesOnMethodsRule$1.evaluate(NoShadowingOrOverridesOnMethodsRule.java:40)
        at com.carrotsearch.randomizedtesting.rules.StatementAdapter.evaluate(StatementAdapter.java:36)
        at com.carrotsearch.randomizedtesting.rules.StatementAdapter.evaluate(StatementAdapter.java:36)
        at org.apache.lucene.util.TestRuleAssertionsRequired$1.evaluate(TestRuleAssertionsRequired.java:53)
        at org.apache.lucene.util.TestRuleMarkFailure$1.evaluate(TestRuleMarkFailure.java:47)
        at org.apache.lucene.util.TestRuleIgnoreAfterMaxFailures$1.evaluate(TestRuleIgnoreAfterMaxFailures.java:64)
        at org.apache.lucene.util.TestRuleIgnoreTestSuites$1.evaluate(TestRuleIgnoreTestSuites.java:54)
        at com.carrotsearch.randomizedtesting.rules.StatementAdapter.evaluate(StatementAdapter.java:36)
        at com.carrotsearch.randomizedtesting.ThreadLeakControl$StatementRunner.run(ThreadLeakControl.java:368)
        at java.base/java.lang.Thread.run(Thread.java:844)
Caused by: java.lang.RuntimeException: REQUEST FAILED: xpath=//result[@numFound=1]
        xml response was: <?xml version="1.0" encoding="UTF-8"?>
<response>
<lst name="responseHeader"><int name="status">0</int><int name="QTime">0</int></lst><result name="response" numFound="0" start="0"></result>
</response>

        request was:q=id:529&qt=&start=0&rows=20&version=2.2
        at org.apache.solr.SolrTestCaseJ4.assertQ(SolrTestCaseJ4.java:879)
        ... 39 more




Build Log:
[...truncated 11387 lines...]
   [junit4] Suite: org.apache.solr.cloud.ForceLeaderTest
   [junit4]   2> Creating dataDir: /home/jenkins/workspace/Lucene-Solr-master-Linux/solr/build/solr-core/test/J0/temp/solr.cloud.ForceLeaderTest_58D72A5183124D9F-001/init-core-data-001
   [junit4]   2> 605751 WARN  (SUITE-ForceLeaderTest-seed#[58D72A5183124D9F]-worker) [    ] o.a.s.SolrTestCaseJ4 startTrackingSearchers: numOpens=1 numCloses=1
   [junit4]   2> 605751 INFO  (SUITE-ForceLeaderTest-seed#[58D72A5183124D9F]-worker) [    ] o.a.s.SolrTestCaseJ4 Using PointFields (NUMERIC_POINTS_SYSPROP=true) w/NUMERIC_DOCVALUES_SYSPROP=true
   [junit4]   2> 605751 INFO  (SUITE-ForceLeaderTest-seed#[58D72A5183124D9F]-worker) [    ] o.a.s.SolrTestCaseJ4 Randomized ssl (false) and clientAuth (false) via: @org.apache.solr.SolrTestCaseJ4$SuppressSSL(bugUrl="https://issues.apache.org/jira/browse/SOLR-5776")
   [junit4]   2> 605751 INFO  (SUITE-ForceLeaderTest-seed#[58D72A5183124D9F]-worker) [    ] o.a.s.SolrTestCaseJ4 SecureRandom sanity checks: test.solr.allowed.securerandom=null & java.security.egd=file:/dev/./urandom
   [junit4]   2> 605751 INFO  (SUITE-ForceLeaderTest-seed#[58D72A5183124D9F]-worker) [    ] o.a.s.BaseDistributedSearchTestCase Setting hostContext system property: /
   [junit4]   2> 605752 INFO  (TEST-ForceLeaderTest.testLastPublishedStateIsActive-seed#[58D72A5183124D9F]) [    ] o.a.s.c.ZkTestServer STARTING ZK TEST SERVER
   [junit4]   2> 605753 INFO  (Thread-3820) [    ] o.a.s.c.ZkTestServer client port:0.0.0.0/0.0.0.0:0
   [junit4]   2> 605753 INFO  (Thread-3820) [    ] o.a.s.c.ZkTestServer Starting server
   [junit4]   2> 605754 ERROR (Thread-3820) [    ] o.a.z.s.ZooKeeperServer ZKShutdownHandler is not registered, so ZooKeeper server won't take any action on ERROR or SHUTDOWN server state changes
   [junit4]   2> 605853 INFO  (TEST-ForceLeaderTest.testLastPublishedStateIsActive-seed#[58D72A5183124D9F]) [    ] o.a.s.c.ZkTestServer start zk server on port:39065
   [junit4]   2> 605858 INFO  (TEST-ForceLeaderTest.testLastPublishedStateIsActive-seed#[58D72A5183124D9F]) [    ] o.a.s.c.AbstractZkTestCase put /home/jenkins/workspace/Lucene-Solr-master-Linux/solr/core/src/test-files/solr/collection1/conf/solrconfig-tlog.xml to /configs/conf1/solrconfig.xml
   [junit4]   2> 605858 INFO  (TEST-ForceLeaderTest.testLastPublishedStateIsActive-seed#[58D72A5183124D9F]) [    ] o.a.s.c.AbstractZkTestCase put /home/jenkins/workspace/Lucene-Solr-master-Linux/solr/core/src/test-files/solr/collection1/conf/schema.xml to /configs/conf1/schema.xml
   [junit4]   2> 605859 INFO  (TEST-ForceLeaderTest.testLastPublishedStateIsActive-seed#[58D72A5183124D9F]) [    ] o.a.s.c.AbstractZkTestCase put /home/jenkins/workspace/Lucene-Solr-master-Linux/solr/core/src/test-files/solr/collection1/conf/solrconfig.snippet.randomindexconfig.xml to /configs/conf1/solrconfig.snippet.randomindexconfig.xml
   [junit4]   2> 605860 INFO  (TEST-ForceLeaderTest.testLastPublishedStateIsActive-seed#[58D72A5183124D9F]) [    ] o.a.s.c.AbstractZkTestCase put /home/jenkins/workspace/Lucene-Solr-master-Linux/solr/core/src/test-files/solr/collection1/conf/stopwords.txt to /configs/conf1/stopwords.txt
   [junit4]   2> 605860 INFO  (TEST-ForceLeaderTest.testLastPublishedStateIsActive-seed#[58D72A5183124D9F]) [    ] o.a.s.c.AbstractZkTestCase put /home/jenkins/workspace/Lucene-Solr-master-Linux/solr/core/src/test-files/solr/collection1/conf/protwords.txt to /configs/conf1/protwords.txt
   [junit4]   2> 605860 INFO  (TEST-ForceLeaderTest.testLastPublishedStateIsActive-seed#[58D72A5183124D9F]) [    ] o.a.s.c.AbstractZkTestCase put /home/jenkins/workspace/Lucene-Solr-master-Linux/solr/core/src/test-files/solr/collection1/conf/currency.xml to /configs/conf1/currency.xml
   [junit4]   2> 605861 INFO  (TEST-ForceLeaderTest.testLastPublishedStateIsActive-seed#[58D72A5183124D9F]) [    ] o.a.s.c.AbstractZkTestCase put /home/jenkins/workspace/Lucene-Solr-master-Linux/solr/core/src/test-files/solr/collection1/conf/enumsConfig.xml to /configs/conf1/enumsConfig.xml
   [junit4]   2> 605861 INFO  (TEST-ForceLeaderTest.testLastPublishedStateIsActive-seed#[58D72A5183124D9F]) [    ] o.a.s.c.AbstractZkTestCase put /home/jenkins/workspace/Lucene-Solr-master-Linux/solr/core/src/test-files/solr/collection1/conf/open-exchange-rates.json to /configs/conf1/open-exchange-rates.json
   [junit4]   2> 605862 INFO  (TEST-ForceLeaderTest.testLastPublishedStateIsActive-seed#[58D72A5183124D9F]) [    ] o.a.s.c.AbstractZkTestCase put /home/jenkins/workspace/Lucene-Solr-master-Linux/solr/core/src/test-files/solr/collection1/conf/mapping-ISOLatin1Accent.txt to /configs/conf1/mapping-ISOLatin1Accent.txt
   [junit4]   2> 605862 INFO  (TEST-ForceLeaderTest.testLastPublishedStateIsActive-seed#[58D72A5183124D9F]) [    ] o.a.s.c.AbstractZkTestCase put /home/jenkins/workspace/Lucene-Solr-master-Linux/solr/core/src/test-files/solr/collection1/conf/old_synonyms.txt to /configs/conf1/old_synonyms.txt
   [junit4]   2> 605862 INFO  (TEST-ForceLeaderTest.testLastPublishedStateIsActive-seed#[58D72A5183124D9F]) [    ] o.a.s.c.AbstractZkTestCase put /home/jenkins/workspace/Lucene-Solr-master-Linux/solr/core/src/test-files/solr/collection1/conf/synonyms.txt to /configs/conf1/synonyms.txt
   [junit4]   2> 605863 INFO  (TEST-ForceLeaderTest.testLastPublishedStateIsActive-seed#[58D72A5183124D9F]) [    ] o.a.s.c.AbstractFullDistribZkTestBase Will use TLOG replicas unless explicitly asked otherwise
   [junit4]   2> 605932 INFO  (TEST-ForceLeaderTest.testLastPublishedStateIsActive-seed#[58D72A5183124D9F]) [    ] o.e.j.s.Server jetty-9.3.14.v20161028
   [junit4]   2> 605933 INFO  (TEST-ForceLeaderTest.testLastPublishedStateIsActive-seed#[58D72A5183124D9F]) [    ] o.e.j.s.h.ContextHandler Started o.e.j.s.ServletContextHandler@49e14183{/,null,AVAILABLE}
   [junit4]   2> 605934 INFO  (TEST-ForceLeaderTest.testLastPublishedStateIsActive-seed#[58D72A5183124D9F]) [    ] o.e.j.s.AbstractConnector Started ServerConnector@6a475608{HTTP/1.1,[http/1.1]}{127.0.0.1:33093}
   [junit4]   2> 605934 INFO  (TEST-ForceLeaderTest.testLastPublishedStateIsActive-seed#[58D72A5183124D9F]) [    ] o.e.j.s.Server Started @607069ms
   [junit4]   2> 605934 INFO  (TEST-ForceLeaderTest.testLastPublishedStateIsActive-seed#[58D72A5183124D9F]) [    ] o.a.s.c.s.e.JettySolrRunner Jetty properties: {hostContext=/, solr.data.dir=/home/jenkins/workspace/Lucene-Solr-master-Linux/solr/build/solr-core/test/J0/temp/solr.cloud.ForceLeaderTest_58D72A5183124D9F-001/tempDir-001/control/data, hostPort=38337, coreRootDirectory=/home/jenkins/workspace/Lucene-Solr-master-Linux/solr/build/solr-core/test/J0/temp/solr.cloud.ForceLeaderTest_58D72A5183124D9F-001/control-001/cores}
   [junit4]   2> 605934 ERROR (TEST-ForceLeaderTest.testLastPublishedStateIsActive-seed#[58D72A5183124D9F]) [    ] o.a.s.s.StartupLoggingUtils Missing Java Option solr.log.dir. Logging may be missing or incomplete.
   [junit4]   2> 605934 INFO  (TEST-ForceLeaderTest.testLastPublishedStateIsActive-seed#[58D72A5183124D9F]) [    ] o.a.s.s.SolrDispatchFilter  ___      _       Welcome to Apache Solr™ version 8.0.0
   [junit4]   2> 605934 INFO  (TEST-ForceLeaderTest.testLastPublishedStateIsActive-seed#[58D72A5183124D9F]) [    ] o.a.s.s.SolrDispatchFilter / __| ___| |_ _   Starting in cloud mode on port null
   [junit4]   2> 605934 INFO  (TEST-ForceLeaderTest.testLastPublishedStateIsActive-seed#[58D72A5183124D9F]) [    ] o.a.s.s.SolrDispatchFilter \__ \/ _ \ | '_|  Install dir: null, Default config dir: null
   [junit4]   2> 605934 INFO  (TEST-ForceLeaderTest.testLastPublishedStateIsActive-seed#[58D72A5183124D9F]) [    ] o.a.s.s.SolrDispatchFilter |___/\___/_|_|    Start time: 2017-08-12T00:59:27.358736Z
   [junit4]   2> 605936 INFO  (TEST-ForceLeaderTest.testLastPublishedStateIsActive-seed#[58D72A5183124D9F]) [    ] o.a.s.s.SolrDispatchFilter Loading solr.xml from SolrHome (not found in ZooKeeper)
   [junit4]   2> 605936 INFO  (TEST-ForceLeaderTest.testLastPublishedStateIsActive-seed#[58D72A5183124D9F]) [    ] o.a.s.c.SolrXmlConfig Loading container configuration from /home/jenkins/workspace/Lucene-Solr-master-Linux/solr/build/solr-core/test/J0/temp/solr.cloud.ForceLeaderTest_58D72A5183124D9F-001/control-001/solr.xml
   [junit4]   2> 605938 INFO  (TEST-ForceLeaderTest.testLastPublishedStateIsActive-seed#[58D72A5183124D9F]) [    ] o.a.s.c.SolrXmlConfig MBean server found: com.sun.jmx.mbeanserver.JmxMBeanServer@3c91eaad, but no JMX reporters were configured - adding default JMX reporter.
   [junit4]   2> 605940 INFO  (TEST-ForceLeaderTest.testLastPublishedStateIsActive-seed#[58D72A5183124D9F]) [    ] o.a.s.c.ZkContainer Zookeeper client=127.0.0.1:39065/solr
   [junit4]   2> 605984 INFO  (TEST-ForceLeaderTest.testLastPublishedStateIsActive-seed#[58D72A5183124D9F]) [    ] o.a.s.c.Overseer Overseer (id=null) closing
   [junit4]   2> 605984 INFO  (TEST-ForceLeaderTest.testLastPublishedStateIsActive-seed#[58D72A5183124D9F]) [    ] o.a.s.c.OverseerElectionContext I am going to be the leader 127.0.0.1:38337_
   [junit4]   2> 605985 INFO  (TEST-ForceLeaderTest.testLastPublishedStateIsActive-seed#[58D72A5183124D9F]) [    ] o.a.s.c.Overseer Overseer (id=98467811634511876-127.0.0.1:38337_-n_0000000000) starting
   [junit4]   2> 605989 INFO  (TEST-ForceLeaderTest.testLastPublishedStateIsActive-seed#[58D72A5183124D9F]) [    ] o.a.s.c.ZkController Register node as live in ZooKeeper:/live_nodes/127.0.0.1:38337_
   [junit4]   2> 605991 INFO  (zkCallback-662-thread-1) [    ] o.a.s.c.c.ZkStateReader Updated live nodes from ZooKeeper... (0) -> (1)
   [junit4]   2> 606020 INFO  (TEST-ForceLeaderTest.testLastPublishedStateIsActive-seed#[58D72A5183124D9F]) [    ] o.a.s.m.r.SolrJmxReporter JMX monitoring for 'solr.node' (registry 'solr.node') enabled at server: com.sun.jmx.mbeanserver.JmxMBeanServer@3c91eaad
   [junit4]   2> 606023 INFO  (TEST-ForceLeaderTest.testLastPublishedStateIsActive-seed#[58D72A5183124D9F]) [    ] o.a.s.m.r.SolrJmxReporter JMX monitoring for 'solr.jvm' (registry 'solr.jvm') enabled at server: com.sun.jmx.mbeanserver.JmxMBeanServer@3c91eaad
   [junit4]   2> 606023 INFO  (TEST-ForceLeaderTest.testLastPublishedStateIsActive-seed#[58D72A5183124D9F]) [    ] o.a.s.m.r.SolrJmxReporter JMX monitoring for 'solr.jetty' (registry 'solr.jetty') enabled at server: com.sun.jmx.mbeanserver.JmxMBeanServer@3c91eaad
   [junit4]   2> 606024 INFO  (TEST-ForceLeaderTest.testLastPublishedStateIsActive-seed#[58D72A5183124D9F]) [    ] o.a.s.c.CorePropertiesLocator Found 0 core definitions underneath /home/jenkins/workspace/Lucene-Solr-master-Linux/solr/build/solr-core/test/J0/temp/solr.cloud.ForceLeaderTest_58D72A5183124D9F-001/control-001/cores
   [junit4]   2> 606032 INFO  (TEST-ForceLeaderTest.testLastPublishedStateIsActive-seed#[58D72A5183124D9F]) [    ] o.a.s.c.c.ZkStateReader Updated live nodes from ZooKeeper... (0) -> (1)
   [junit4]   2> 606033 INFO  (TEST-ForceLeaderTest.testLastPublishedStateIsActive-seed#[58D72A5183124D9F]) [    ] o.a.s.c.s.i.ZkClientClusterStateProvider Cluster at 127.0.0.1:39065/solr ready
   [junit4]   2> 606033 INFO  (SocketProxy-Acceptor-38337) [    ] o.a.s.c.SocketProxy accepted Socket[addr=/127.0.0.1,port=41644,localport=38337], receiveBufferSize:531000
   [junit4]   2> 606033 INFO  (SocketProxy-Acceptor-38337) [    ] o.a.s.c.SocketProxy proxy connection Socket[addr=/127.0.0.1,port=33093,localport=37516], receiveBufferSize=530904
   [junit4]   2> 606035 INFO  (qtp462186617-7454) [    ] o.a.s.h.a.CollectionsHandler Invoked Collection Action :create with params replicationFactor=1&collection.configName=conf1&name=control_collection&nrtReplicas=1&action=CREATE&numShards=1&createNodeSet=127.0.0.1:38337_&wt=javabin&version=2 and sendToOCPQueue=true
   [junit4]   2> 606037 INFO  (OverseerThreadFactory-1978-thread-1) [    ] o.a.s.c.CreateCollectionCmd Create collection control_collection
   [junit4]   2> 606140 INFO  (SocketProxy-Acceptor-38337) [    ] o.a.s.c.SocketProxy accepted Socket[addr=/127.0.0.1,port=41648,localport=38337], receiveBufferSize:531000
   [junit4]   2> 606140 INFO  (SocketProxy-Acceptor-38337) [    ] o.a.s.c.SocketProxy proxy connection Socket[addr=/127.0.0.1,port=33093,localport=37520], receiveBufferSize=530904
   [junit4]   2> 606141 INFO  (qtp462186617-7456) [    ] o.a.s.h.a.CoreAdminOperation core create command qt=/admin/cores&collection.configName=conf1&newCollection=true&name=control_collection_shard1_replica_n1&action=CREATE&numShards=1&collection=control_collection&shard=shard1&wt=javabin&version=2&replicaType=NRT
   [junit4]   2> 606141 INFO  (qtp462186617-7456) [    ] o.a.s.c.TransientSolrCoreCacheDefault Allocating transient cache for 4 transient cores
   [junit4]   2> 606243 INFO  (zkCallback-662-thread-1) [    ] o.a.s.c.c.ZkStateReader A cluster state change: [WatchedEvent state:SyncConnected type:NodeDataChanged path:/collections/control_collection/state.json] for collection [control_collection] has occurred - updating... (live nodes size: [1])
   [junit4]   2> 607155 INFO  (qtp462186617-7456) [    ] o.a.s.c.SolrConfig Using Lucene MatchVersion: 8.0.0
   [junit4]   2> 607164 INFO  (qtp462186617-7456) [    ] o.a.s.s.IndexSchema [control_collection_shard1_replica_n1] Schema name=test
   [junit4]   2> 607230 INFO  (qtp462186617-7456) [    ] o.a.s.s.IndexSchema Loaded schema test/1.0 with uniqueid field id
   [junit4]   2> 607235 INFO  (qtp462186617-7456) [    ] o.a.s.c.CoreContainer Creating SolrCore 'control_collection_shard1_replica_n1' using configuration from collection control_collection, trusted=true
   [junit4]   2> 607236 INFO  (qtp462186617-7456) [    ] o.a.s.m.r.SolrJmxReporter JMX monitoring for 'solr.core.control_collection.shard1.replica_n1' (registry 'solr.core.control_collection.shard1.replica_n1') enabled at server: com.sun.jmx.mbeanserver.JmxMBeanServer@3c91eaad
   [junit4]   2> 607236 INFO  (qtp462186617-7456) [    ] o.a.s.c.SolrCore solr.RecoveryStrategy.Builder
   [junit4]   2> 607236 INFO  (qtp462186617-7456) [    ] o.a.s.c.SolrCore [[control_collection_shard1_replica_n1] ] Opening new SolrCore at [/home/jenkins/workspace/Lucene-Solr-master-Linux/solr/build/solr-core/test/J0/temp/solr.cloud.ForceLeaderTest_58D72A5183124D9F-001/control-001/cores/control_collection_shard1_replica_n1], dataDir=[/home/jenkins/workspace/Lucene-Solr-master-Linux/solr/build/solr-core/test/J0/temp/solr.cloud.ForceLeaderTest_58D72A5183124D9F-001/control-001/cores/control_collection_shard1_replica_n1/data/]
   [junit4]   2> 607237 INFO  (qtp462186617-7456) [    ] o.a.s.u.RandomMergePolicy RandomMergePolicy wrapping class org.apache.lucene.index.TieredMergePolicy: [TieredMergePolicy: maxMergeAtOnce=15, maxMergeAtOnceExplicit=34, maxMergedSegmentMB=33.2783203125, floorSegmentMB=1.6181640625, forceMergeDeletesPctAllowed=22.69249353926286, segmentsPerTier=37.0, maxCFSSegmentSizeMB=8.796093022207999E12, noCFSRatio=1.0
   [junit4]   2> 607239 WARN  (qtp462186617-7456) [    ] o.a.s.c.RequestHandlers INVALID paramSet a in requestHandler {type = requestHandler,name = /dump,class = DumpRequestHandler,attributes = {initParams=a, name=/dump, class=DumpRequestHandler},args = {defaults={a=A,b=B}}}
   [junit4]   2> 607264 INFO  (qtp462186617-7456) [    ] o.a.s.u.UpdateHandler Using UpdateLog implementation: org.apache.solr.update.UpdateLog
   [junit4]   2> 607264 INFO  (qtp462186617-7456) [    ] o.a.s.u.UpdateLog Initializing UpdateLog: dataDir= defaultSyncLevel=FLUSH numRecordsToKeep=100 maxNumLogsToKeep=10 numVersionBuckets=65536
   [junit4]   2> 607264 INFO  (qtp462186617-7456) [    ] o.a.s.u.CommitTracker Hard AutoCommit: disabled
   [junit4]   2> 607264 INFO  (qtp462186617-7456) [    ] o.a.s.u.CommitTracker Soft AutoCommit: disabled
   [junit4]   2> 607265 INFO  (qtp462186617-7456) [    ] o.a.s.u.RandomMergePolicy RandomMergePolicy wrapping class org.apache.lucene.index.TieredMergePolicy: [TieredMergePolicy: maxMergeAtOnce=35, maxMergeAtOnceExplicit=30, maxMergedSegmentMB=59.5478515625, floorSegmentMB=1.51171875, forceMergeDeletesPctAllowed=18.609701787529357, segmentsPerTier=49.0, maxCFSSegmentSizeMB=8.796093022207999E12, noCFSRatio=0.36929961101371533
   [junit4]   2> 607265 INFO  (qtp462186617-7456) [    ] o.a.s.s.SolrIndexSearcher Opening [Searcher@1814d5a4[control_collection_shard1_replica_n1] main]
   [junit4]   2> 607266 INFO  (qtp462186617-7456) [    ] o.a.s.r.ManagedResourceStorage Configured ZooKeeperStorageIO with znodeBase: /configs/conf1
   [junit4]   2> 607266 INFO  (qtp462186617-7456) [    ] o.a.s.r.ManagedResourceStorage Loaded null at path _rest_managed.json using ZooKeeperStorageIO:path=/configs/conf1
   [junit4]   2> 607267 INFO  (qtp462186617-7456) [    ] o.a.s.h.ReplicationHandler Commits will be reserved for  10000
   [junit4]   2> 607268 INFO  (searcherExecutor-1981-thread-1) [    ] o.a.s.c.SolrCore [control_collection_shard1_replica_n1] Registered new searcher Searcher@1814d5a4[control_collection_shard1_replica_n1] main{ExitableDirectoryReader(UninvertingDirectoryReader())}
   [junit4]   2> 607268 INFO  (qtp462186617-7456) [    ] o.a.s.u.UpdateLog Could not find max version in index or recent updates, using new clock 1575484987740782592
   [junit4]   2> 607271 INFO  (qtp462186617-7456) [    ] o.a.s.c.ShardLeaderElectionContext Enough replicas found to continue.
   [junit4]   2> 607271 INFO  (qtp462186617-7456) [    ] o.a.s.c.ShardLeaderElectionContext I may be the new leader - try and sync
   [junit4]   2> 607271 INFO  (qtp462186617-7456) [    ] o.a.s.c.SyncStrategy Sync replicas to http://127.0.0.1:38337/control_collection_shard1_replica_n1/
   [junit4]   2> 607271 INFO  (qtp462186617-7456) [    ] o.a.s.c.SyncStrategy Sync Success - now sync replicas to me
   [junit4]   2> 607271 INFO  (qtp462186617-7456) [    ] o.a.s.c.SyncStrategy http://127.0.0.1:38337/control_collection_shard1_replica_n1/ has no replicas
   [junit4]   2> 607271 INFO  (qtp462186617-7456) [    ] o.a.s.c.ShardLeaderElectionContext Found all replicas participating in election, clear LIR
   [junit4]   2> 607272 INFO  (qtp462186617-7456) [    ] o.a.s.c.ShardLeaderElectionContext I am the new leader: http://127.0.0.1:38337/control_collection_shard1_replica_n1/ shard1
   [junit4]   2> 607373 INFO  (zkCallback-662-thread-1) [    ] o.a.s.c.c.ZkStateReader A cluster state change: [WatchedEvent state:SyncConnected type:NodeDataChanged path:/collections/control_collection/state.json] for collection [control_collection] has occurred - updating... (live nodes size: [1])
   [junit4]   2> 607423 INFO  (qtp462186617-7456) [    ] o.a.s.c.ZkController I am the leader, no recovery necessary
   [junit4]   2> 607424 INFO  (qtp462186617-7456) [    ] o.a.s.s.HttpSolrCall [admin] webapp=null path=/admin/cores params={qt=/admin/cores&collection.configName=conf1&newCollection=true&name=control_collection_shard1_replica_n1&action=CREATE&numShards=1&collection=control_collection&shard=shard1&wt=javabin&version=2&replicaType=NRT} status=0 QTime=1283
   [junit4]   2> 607425 INFO  (qtp462186617-7454) [    ] o.a.s.h.a.CollectionsHandler Wait for new collection to be active for at most 30 seconds. Check all shard replicas
   [junit4]   2> 607525 INFO  (zkCallback-662-thread-1) [    ] o.a.s.c.c.ZkStateReader A cluster state change: [WatchedEvent state:SyncConnected type:NodeDataChanged path:/collections/control_collection/state.json] for collection [control_collection] has occurred - updating... (live nodes size: [1])
   [junit4]   2> 608038 INFO  (OverseerCollectionConfigSetProcessor-98467811634511876-127.0.0.1:38337_-n_0000000000) [    ] o.a.s.c.OverseerTaskQueue Response ZK path: /overseer/collection-queue-work/qnr-0000000000 doesn't exist.  Requestor may have disconnected from ZooKeeper
   [junit4]   2> 608425 INFO  (qtp462186617-7454) [    ] o.a.s.s.HttpSolrCall [admin] webapp=null path=/admin/collections params={replicationFactor=1&collection.configName=conf1&name=control_collection&nrtReplicas=1&action=CREATE&numShards=1&createNodeSet=127.0.0.1:38337_&wt=javabin&version=2} status=0 QTime=2390
   [junit4]   2> 608428 INFO  (TEST-ForceLeaderTest.testLastPublishedStateIsActive-seed#[58D72A5183124D9F]) [    ] o.a.s.c.c.ZkStateReader Updated live nodes from ZooKeeper... (0) -> (1)
   [junit4]   2> 608428 INFO  (TEST-ForceLeaderTest.testLastPublishedStateIsActive-seed#[58D72A5183124D9F]) [    ] o.a.s.c.s.i.ZkClientClusterStateProvider Cluster at 127.0.0.1:39065/solr ready
   [junit4]   2> 608428 INFO  (TEST-ForceLeaderTest.testLastPublishedStateIsActive-seed#[58D72A5183124D9F]) [    ] o.a.s.c.ChaosMonkey monkey: init - expire sessions:false cause connection loss:false
   [junit4]   2> 608429 INFO  (SocketProxy-Acceptor-38337) [    ] o.a.s.c.SocketProxy accepted Socket[addr=/127.0.0.1,port=41674,localport=38337], receiveBufferSize:531000
   [junit4]   2> 608429 INFO  (SocketProxy-Acceptor-38337) [    ] o.a.s.c.SocketProxy proxy connection Socket[addr=/127.0.0.1,port=33093,localport=37546], receiveBufferSize=530904
   [junit4]   2> 608429 INFO  (qtp462186617-7454) [    ] o.a.s.h.a.CollectionsHandler Invoked Collection Action :create with params replicationFactor=1&collection.configName=conf1&name=collection1&nrtReplicas=1&action=CREATE&numShards=2&createNodeSet=&stateFormat=2&wt=javabin&version=2 and sendToOCPQueue=true
   [junit4]   2> 608430 INFO  (OverseerThreadFactory-1978-thread-2) [    ] o.a.s.c.CreateCollectionCmd Create collection collection1
   [junit4]   2> 608430 WARN  (OverseerThreadFactory-1978-thread-2) [    ] o.a.s.c.CreateCollectionCmd It is unusual to create a collection (collection1) without cores.
   [junit4]   2> 608632 INFO  (qtp462186617-7454) [    ] o.a.s.h.a.CollectionsHandler Wait for new collection to be active for at most 30 seconds. Check all shard replicas
   [junit4]   2> 608632 INFO  (qtp462186617-7454) [    ] o.a.s.s.HttpSolrCall [admin] webapp=null path=/admin/collections params={replicationFactor=1&collection.configName=conf1&name=collection1&nrtReplicas=1&action=CREATE&numShards=2&createNodeSet=&stateFormat=2&wt=javabin&version=2} status=0 QTime=203
   [junit4]   2> 608685 INFO  (TEST-ForceLeaderTest.testLastPublishedStateIsActive-seed#[58D72A5183124D9F]) [    ] o.a.s.c.AbstractFullDistribZkTestBase create jetty 1 in directory /home/jenkins/workspace/Lucene-Solr-master-Linux/solr/build/solr-core/test/J0/temp/solr.cloud.ForceLeaderTest_58D72A5183124D9F-001/shard-1-001 of type TLOG
   [junit4]   2> 608685 INFO  (TEST-ForceLeaderTest.testLastPublishedStateIsActive-seed#[58D72A5183124D9F]) [    ] o.e.j.s.Server jetty-9.3.14.v20161028
   [junit4]   2> 608686 INFO  (TEST-ForceLeaderTest.testLastPublishedStateIsActive-seed#[58D72A5183124D9F]) [    ] o.e.j.s.h.ContextHandler Started o.e.j.s.ServletContextHandler@6a428eb{/,null,AVAILABLE}
   [junit4]   2> 608686 INFO  (TEST-ForceLeaderTest.testLastPublishedStateIsActive-seed#[58D72A5183124D9F]) [    ] o.e.j.s.AbstractConnector Started ServerConnector@115e1a1d{HTTP/1.1,[http/1.1]}{127.0.0.1:37845}
   [junit4]   2> 608686 INFO  (TEST-ForceLeaderTest.testLastPublishedStateIsActive-seed#[58D72A5183124D9F]) [    ] o.e.j.s.Server Started @609822ms
   [junit4]   2> 608686 INFO  (TEST-ForceLeaderTest.testLastPublishedStateIsActive-seed#[58D72A5183124D9F]) [    ] o.a.s.c.s.e.JettySolrRunner Jetty properties: {hostContext=/, solrconfig=solrconfig.xml, solr.data.dir=/home/jenkins/workspace/Lucene-Solr-master-Linux/solr/build/solr-core/test/J0/temp/solr.cloud.ForceLeaderTest_58D72A5183124D9F-001/tempDir-001/jetty1, hostPort=32937, coreRootDirectory=/home/jenkins/workspace/Lucene-Solr-master-Linux/solr/build/solr-core/test/J0/temp/solr.cloud.ForceLeaderTest_58D72A5183124D9F-001/shard-1-001/cores, replicaType=TLOG}
   [junit4]   2> 608687 ERROR (TEST-ForceLeaderTest.testLastPublishedStateIsActive-seed#[58D72A5183124D9F]) [    ] o.a.s.s.StartupLoggingUtils Missing Java Option solr.log.dir. Logging may be missing or incomplete.
   [junit4]   2> 608687 INFO  (TEST-ForceLeaderTest.testLastPublishedStateIsActive-seed#[58D72A5183124D9F]) [    ] o.a.s.s.SolrDispatchFilter  ___      _       Welcome to Apache Solr™ version 8.0.0
   [junit4]   2> 608687 INFO  (TEST-ForceLeaderTest.testLastPublishedStateIsActive-seed#[58D72A5183124D9F]) [    ] o.a.s.s.SolrDispatchFilter / __| ___| |_ _   Starting in cloud mode on port null
   [junit4]   2> 608687 INFO  (TEST-ForceLeaderTest.testLastPublishedStateIsActive-seed#[58D72A5183124D9F]) [    ] o.a.s.s.SolrDispatchFilter \__ \/ _ \ | '_|  Install dir: null, Default config dir: null
   [junit4]   2> 608687 INFO  (TEST-ForceLeaderTest.testLastPublishedStateIsActive-seed#[58D72A5183124D9F]) [    ] o.a.s.s.SolrDispatchFilter |___/\___/_|_|    Start time: 2017-08-12T00:59:30.111230Z
   [junit4]   2> 608698 INFO  (TEST-ForceLeaderTest.testLastPublishedStateIsActive-seed#[58D72A5183124D9F]) [    ] o.a.s.s.SolrDispatchFilter Loading solr.xml from SolrHome (not found in ZooKeeper)
   [junit4]   2> 608698 INFO  (TEST-ForceLeaderTest.testLastPublishedStateIsActive-seed#[58D72A5183124D9F]) [    ] o.a.s.c.SolrXmlConfig Loading container configuration from /home/jenkins/workspace/Lucene-Solr-master-Linux/solr/build/solr-core/test/J0/temp/solr.cloud.ForceLeaderTest_58D72A5183124D9F-001/shard-1-001/solr.xml
   [junit4]   2> 608700 INFO  (TEST-ForceLeaderTest.testLastPublishedStateIsActive-seed#[58D72A5183124D9F]) [    ] o.a.s.c.SolrXmlConfig MBean server found: com.sun.jmx.mbeanserver.JmxMBeanServer@3c91eaad, but no JMX reporters were configured - adding default JMX reporter.
   [junit4]   2> 608701 INFO  (TEST-ForceLeaderTest.testLastPublishedStateIsActive-seed#[58D72A5183124D9F]) [    ] o.a.s.c.ZkContainer Zookeeper client=127.0.0.1:39065/solr
   [junit4]   2> 608705 INFO  (TEST-ForceLeaderTest.testLastPublishedStateIsActive-seed#[58D72A5183124D9F]) [    ] o.a.s.c.c.ZkStateReader Updated live nodes from ZooKeeper... (0) -> (1)
   [junit4]   2> 608705 INFO  (TEST-ForceLeaderTest.testLastPublishedStateIsActive-seed#[58D72A5183124D9F]) [    ] o.a.s.c.Overseer Overseer (id=null) closing
   [junit4]   2> 608706 INFO  (TEST-ForceLeaderTest.testLastPublishedStateIsActive-seed#[58D72A5183124D9F]) [    ] o.a.s.c.ZkController Register node as live in ZooKeeper:/live_nodes/127.0.0.1:32937_
   [junit4]   2> 608706 INFO  (zkCallback-669-thread-1) [    ] o.a.s.c.c.ZkStateReader Updated live nodes from ZooKeeper... (1) -> (2)
   [junit4]   2> 608706 INFO  (zkCallback-662-thread-1) [    ] o.a.s.c.c.ZkStateReader Updated live nodes from ZooKeeper... (1) -> (2)
   [junit4]   2> 608706 INFO  (zkCallback-674-thread-1) [    ] o.a.s.c.c.ZkStateReader Updated live nodes from ZooKeeper... (1) -> (2)
   [junit4]   2> 608728 INFO  (TEST-ForceLeaderTest.testLastPublishedStateIsActive-seed#[58D72A5183124D9F]) [    ] o.a.s.m.r.SolrJmxReporter JMX monitoring for 'solr.node' (registry 'solr.node') enabled at server: com.sun.jmx.mbeanserver.JmxMBeanServer@3c91eaad
   [junit4]   2> 608731 INFO  (TEST-ForceLeaderTest.testLastPublishedStateIsActive-seed#[58D72A5183124D9F]) [    ] o.a.s.m.r.SolrJmxReporter JMX monitoring for 'solr.jvm' (registry 'solr.jvm') enabled at server: com.sun.jmx.mbeanserver.JmxMBeanServer@3c91eaad
   [junit4]   2> 608731 INFO  (TEST-ForceLeaderTest.testLastPublishedStateIsActive-seed#[58D72A5183124D9F]) [    ] o.a.s.m.r.SolrJmxReporter JMX monitoring for 'solr.jetty' (registry 'solr.jetty') enabled at server: com.sun.jmx.mbeanserver.JmxMBeanServer@3c91eaad
   [junit4]   2> 608732 INFO  (TEST-ForceLeaderTest.testLastPublishedStateIsActive-seed#[58D72A5183124D9F]) [    ] o.a.s.c.CorePropertiesLocator Found 0 core definitions underneath /home/jenkins/workspace/Lucene-Solr-master-Linux/solr/build/solr-core/test/J0/temp/solr.cloud.ForceLeaderTest_58D72A5183124D9F-001/shard-1-001/cores
   [junit4]   2> 608743 INFO  (SocketProxy-Acceptor-32937) [    ] o.a.s.c.SocketProxy accepted Socket[addr=/127.0.0.1,port=47356,localport=32937], receiveBufferSize:531000
   [junit4]   2> 608743 INFO  (SocketProxy-Acceptor-32937) [    ] o.a.s.c.SocketProxy proxy connection Socket[addr=/127.0.0.1,port=37845,localport=37384], receiveBufferSize=530904
   [junit4]   2> 608743 INFO  (qtp1245581253-7502) [    ] o.a.s.h.a.CollectionsHandler Invoked Collection Action :addreplica with params node=127.0.0.1:32937_&action=ADDREPLICA&collection=collection1&shard=shard2&type=TLOG&wt=javabin&version=2 and sendToOCPQueue=true
   [junit4]   2> 608744 INFO  (OverseerCollectionConfigSetProcessor-98467811634511876-127.0.0.1:38337_-n_0000000000) [    ] o.a.s.c.OverseerTaskQueue Response ZK path: /overseer/collection-queue-work/qnr-0000000002 doesn't exist.  Requestor may have disconnected from ZooKeeper
   [junit4]   2> 608744 INFO  (OverseerThreadFactory-1978-thread-3) [    ] o.a.s.c.AddReplicaCmd Node Identified 127.0.0.1:32937_ for creating new replica
   [junit4]   2> 608745 INFO  (SocketProxy-Acceptor-32937) [    ] o.a.s.c.SocketProxy accepted Socket[addr=/127.0.0.1,port=47360,localport=32937], receiveBufferSize:531000
   [junit4]   2> 608748 INFO  (SocketProxy-Acceptor-32937) [    ] o.a.s.c.SocketProxy proxy connection Socket[addr=/127.0.0.1,port=37845,localport=37388], receiveBufferSize=530904
   [junit4]   2> 608748 INFO  (qtp1245581253-7504) [    ] o.a.s.h.a.CoreAdminOperation core create command qt=/admin/cores&collection.configName=conf1&name=collection1_shard2_replica_t41&action=CREATE&collection=collection1&shard=shard2&wt=javabin&version=2&replicaType=TLOG
   [junit4]   2> 608748 INFO  (qtp1245581253-7504) [    ] o.a.s.c.TransientSolrCoreCacheDefault Allocating transient cache for 4 transient cores
   [junit4]   2> 608850 INFO  (zkCallback-674-thread-1) [    ] o.a.s.c.c.ZkStateReader A cluster state change: [WatchedEvent state:SyncConnected type:NodeDataChanged path:/collections/collection1/state.json] for collection [collection1] has occurred - updating... (live nodes size: [2])
   [junit4]   2> 609756 INFO  (qtp1245581253-7504) [    ] o.a.s.c.SolrConfig Using Lucene MatchVersion: 8.0.0
   [junit4]   2> 609763 INFO  (qtp1245581253-7504) [    ] o.a.s.s.IndexSchema [collection1_shard2_replica_t41] Schema name=test
   [junit4]   2> 609855 INFO  (qtp1245581253-7504) [    ] o.a.s.s.IndexSchema Loaded schema test/1.0 with uniqueid field id
   [junit4]   2> 609865 INFO  (qtp1245581253-7504) [    ] o.a.s.c.CoreContainer Creating SolrCore 'collection1_shard2_replica_t41' using configuration from collection collection1, trusted=true
   [junit4]   2> 609865 INFO  (qtp1245581253-7504) [    ] o.a.s.m.r.SolrJmxReporter JMX monitoring for 'solr.core.collection1.shard2.replica_t41' (registry 'solr.core.collection1.shard2.replica_t41') enabled at server: com.sun.jmx.mbeanserver.JmxMBeanServer@3c91eaad
   [junit4]   2> 609865 INFO  (qtp1245581253-7504) [    ] o.a.s.c.SolrCore solr.RecoveryStrategy.Builder
   [junit4]   2> 609865 INFO  (qtp1245581253-7504) [    ] o.a.s.c.SolrCore [[collection1_shard2_replica_t41] ] Opening new SolrCore at [/home/jenkins/workspace/Lucene-Solr-master-Linux/solr/build/solr-core/test/J0/temp/solr.cloud.ForceLeaderTest_58D72A5183124D9F-001/shard-1-001/cores/collection1_shard2_replica_t41], dataDir=[/home/jenkins/workspace/Lucene-Solr-master-Linux/solr/build/solr-core/test/J0/temp/solr.cloud.ForceLeaderTest_58D72A5183124D9F-001/shard-1-001/cores/collection1_shard2_replica_t41/data/]
   [junit4]   2> 609867 INFO  (qtp1245581253-7504) [    ] o.a.s.u.RandomMergePolicy RandomMergePolicy wrapping class org.apache.lucene.index.TieredMergePolicy: [TieredMergePolicy: maxMergeAtOnce=15, maxMergeAtOnceExplicit=34, maxMergedSegmentMB=33.2783203125, floorSegmentMB=1.6181640625, forceMergeDeletesPctAllowed=22.69249353926286, segmentsPerTier=37.0, maxCFSSegmentSizeMB=8.796093022207999E12, noCFSRatio=1.0
   [junit4]   2> 609869 WARN  (qtp1245581253-7504) [    ] o.a.s.c.RequestHandlers INVALID paramSet a in requestHandler {type = requestHandler,name = /dump,class = DumpRequestHandler,attributes = {initParams=a, name=/dump, class=DumpRequestHandler},args = {defaults={a=A,b=B}}}
   [junit4]   2> 609894 INFO  (qtp1245581253-7504) [    ] o.a.s.u.UpdateHandler Using UpdateLog implementation: org.apache.solr.update.UpdateLog
   [junit4]   2> 609894 INFO  (qtp1245581253-7504) [    ] o.a.s.u.UpdateLog Initializing UpdateLog: dataDir= defaultSyncLevel=FLUSH numRecordsToKeep=100 maxNumLogsToKeep=10 numVersionBuckets=65536
   [junit4]   2> 609894 INFO  (qtp1245581253-7504) [    ] o.a.s.u.CommitTracker Hard AutoCommit: disabled
   [junit4]   2> 609894 INFO  (qtp1245581253-7504) [    ] o.a.s.u.CommitTracker Soft AutoCommit: disabled
   [junit4]   2> 609895 INFO  (qtp1245581253-7504) [    ] o.a.s.u.RandomMergePolicy RandomMergePolicy wrapping class org.apache.lucene.index.TieredMergePolicy: [TieredMergePolicy: maxMergeAtOnce=35, maxMergeAtOnceExplicit=30, maxMergedSegmentMB=59.5478515625, floorSegmentMB=1.51171875, forceMergeDeletesPctAllowed=18.609701787529357, segmentsPerTier=49.0, maxCFSSegmentSizeMB=8.796093022207999E12, noCFSRatio=0.36929961101371533
   [junit4]   2> 609895 INFO  (qtp1245581253-7504) [    ] o.a.s.s.SolrIndexSearcher Opening [Searcher@5e1dfe7[collection1_shard2_replica_t41] main]
   [junit4]   2> 609896 INFO  (qtp1245581253-7504) [    ] o.a.s.r.ManagedResourceStorage Configured ZooKeeperStorageIO with znodeBase: /configs/conf1
   [junit4]   2> 609896 INFO  (qtp1245581253-7504) [    ] o.a.s.r.ManagedResourceStorage Loaded null at path _rest_managed.json using ZooKeeperStorageIO:path=/configs/conf1
   [junit4]   2> 609896 INFO  (qtp1245581253-7504) [    ] o.a.s.h.ReplicationHandler Commits will be reserved for  10000
   [junit4]   2> 609897 INFO  (searcherExecutor-1992-thread-1) [    ] o.a.s.c.SolrCore [collection1_shard2_replica_t41] Registered new searcher Searcher@5e1dfe7[collection1_shard2_replica_t41] main{ExitableDirectoryReader(UninvertingDirectoryReader())}
   [junit4]   2> 609897 INFO  (qtp1245581253-7504) [    ] o.a.s.u.UpdateLog Could not find max version in index or recent updates, using new clock 1575484990497488896
   [junit4]   2> 609900 INFO  (qtp1245581253-7504) [    ] o.a.s.c.ShardLeaderElectionContext Enough replicas found to continue.
   [junit4]   2> 609900 INFO  (qtp1245581253-7504) [    ] o.a.s.c.ShardLeaderElectionContext I may be the new leader - try and sync
   [junit4]   2> 609900 INFO  (qtp1245581253-7504) [    ] o.a.s.c.SyncStrategy Sync replicas to http://127.0.0.1:32937/collection1_shard2_replica_t41/
   [junit4]   2> 609900 INFO  (qtp1245581253-7504) [    ] o.a.s.c.SyncStrategy Sync Success - now sync replicas to me
   [junit4]   2> 609900 INFO  (qtp1245581253-7504) [    ] o.a.s.c.SyncStrategy http://127.0.0.1:32937/collection1_shard2_replica_t41/ has no replicas
   [junit4]   2> 609900 INFO  (qtp1245581253-7504) [    ] o.a.s.c.ShardLeaderElectionContext Found all replicas participating in election, clear LIR
   [junit4]   2> 609900 INFO  (qtp1245581253-7504) [    ] o.a.s.c.ZkController collection1_shard2_replica_t41 stopping background replication from leader
   [junit4]   2> 609901 INFO  (qtp1245581253-7504) [    ] o.a.s.c.ShardLeaderElectionContext I am the new leader: http://127.0.0.1:32937/collection1_shard2_replica_t41/ shard2
   [junit4]   2> 610003 INFO  (zkCallback-674-thread-1) [    ] o.a.s.c.c.ZkStateReader A cluster state change: [WatchedEvent state:SyncConnected type:NodeDataChanged path:/collections/collection1/state.json] for collection [collection1] has occurred - updating... (live nodes size: [2])
   [junit4]   2> 610052 INFO  (qtp1245581253-7504) [    ] o.a.s.c.ZkController I am the leader, no recovery necessary
   [junit4]   2> 610053 INFO  (qtp1245581253-7504) [    ] o.a.s.s.HttpSolrCall [admin] webapp=null path=/admin/cores params={qt=/admin/cores&collection.configName=conf1&name=collection1_shard2_replica_t41&action=CREATE&collection=collection1&shard=shard2&wt=javabin&version=2&replicaType=TLOG} status=0 QTime=1304
   [junit4]   2> 610054 INFO  (qtp1245581253-7502) [    ] o.a.s.s.HttpSolrCall [admin] webapp=null path=/admin/collections params={node=127.0.0.1:32937_&action=ADDREPLICA&collection=collection1&shard=shard2&type=TLOG&wt=javabin&version=2} status=0 QTime=1311
   [junit4]   2> 610141 INFO  (TEST-ForceLeaderTest.testLastPublishedStateIsActive-seed#[58D72A5183124D9F]) [    ] o.a.s.c.AbstractFullDistribZkTestBase create jetty 2 in directory /home/jenkins/workspace/Lucene-Solr-master-Linux/solr/build/solr-core/test/J0/temp/solr.cloud.ForceLeaderTest_58D72A5183124D9F-001/shard-2-001 of type TLOG
   [junit4]   2> 610142 INFO  (TEST-ForceLeaderTest.testLastPublishedStateIsActive-seed#[58D72A5183124D9F]) [    ] o.e.j.s.Server jetty-9.3.14.v20161028
   [junit4]   2> 610142 INFO  (TEST-ForceLeaderTest.testLastPublishedStateIsActive-seed#[58D72A5183124D9F]) [    ] o.e.j.s.h.ContextHandler Started o.e.j.s.ServletContextHandler@4d4403b6{/,null,AVAILABLE}
   [junit4]   2> 610143 INFO  (TEST-ForceLeaderTest.testLastPublishedStateIsActive-seed#[58D72A5183124D9F]) [    ] o.e.j.s.AbstractConnector Started ServerConnector@4eb6e289{HTTP/1.1,[http/1.1]}{127.0.0.1:33773}
   [junit4]   2> 610143 INFO  (TEST-ForceLeaderTest.testLastPublishedStateIsActive-seed#[58D72A5183124D9F]) [    ] o.e.j.s.Server Started @611279ms
   [junit4]   2> 610143 INFO  (TEST-ForceLeaderTest.testLastPublishedStateIsActive-seed#[58D72A5183124D9F]) [    ] o.a.s.c.s.e.JettySolrRunner Jetty properties: {hostContext=/, solrconfig=solrconfig.xml, solr.data.dir=/home/jenkins/workspace/Lucene-Solr-master-Linux/solr/build/solr-core/test/J0/temp/solr.cloud.ForceLeaderTest_58D72A5183124D9F-001/tempDir-001/jetty2, hostPort=45287, coreRootDirectory=/home/jenkins/workspace/Lucene-Solr-master-Linux/solr/build/solr-core/test/J0/temp/solr.cloud.ForceLeaderTest_58D72A5183124D9F-001/shard-2-001/cores, replicaType=TLOG}
   [junit4]   2> 610143 ERROR (TEST-ForceLeaderTest.testLastPublishedStateIsActive-seed#[58D72A5183124D9F]) [    ] o.a.s.s.StartupLoggingUtils Missing Java Option solr.log.dir. Logging may be missing or incomplete.
   [junit4]   2> 610144 INFO  (TEST-ForceLeaderTest.testLastPublishedStateIsActive-seed#[58D72A5183124D9F]) [    ] o.a.s.s.SolrDispatchFilter  ___      _       Welcome to Apache Solr™ version 8.0.0
   [junit4]   2> 610144 INFO  (TEST-ForceLeaderTest.testLastPublishedStateIsActive-seed#[58D72A5183124D9F]) [    ] o.a.s.s.SolrDispatchFilter / __| ___| |_ _   Starting in cloud mode on port null
   [junit4]   2> 610144 INFO  (TEST-ForceLeaderTest.testLastPublishedStateIsActive-seed#[58D72A5183124D9F]) [    ] o.a.s.s.SolrDispatchFilter \__ \/ _ \ | '_|  Install dir: null, Default config dir: null
   [junit4]   2> 610144 INFO  (TEST-ForceLeaderTest.testLastPublishedStateIsActive-seed#[58D72A5183124D9F]) [    ] o.a.s.s.SolrDispatchFilter |___/\___/_|_|    Start time: 2017-08-12T00:59:31.568276Z
   [junit4]   2> 610145 INFO  (TEST-ForceLeaderTest.testLastPublishedStateIsActive-seed#[58D72A5183124D9F]) [    ] o.a.s.s.SolrDispatchFilter Loading solr.xml from SolrHome (not found in ZooKeeper)
   [junit4]   2> 610145 INFO  (TEST-ForceLeaderTest.testLastPublishedStateIsActive-seed#[58D72A5183124D9F]) [    ] o.a.s.c.SolrXmlConfig Loading container configuration from /home/jenkins/workspace/Lucene-Solr-master-Linux/solr/build/solr-core/test/J0/temp/solr.cloud.ForceLeaderTest_58D72A5183124D9F-001/shard-2-001/solr.xml
   [junit4]   2> 610148 INFO  (TEST-ForceLeaderTest.testLastPublishedStateIsActive-seed#[58D72A5183124D9F]) [    ] o.a.s.c.SolrXmlConfig MBean server found: com.sun.jmx.mbeanserver.JmxMBeanServer@3c91eaad, but no JMX reporters were configured - adding default JMX reporter.
   [junit4]   2> 610150 INFO  (TEST-ForceLeaderTest.testLastPublishedStateIsActive-seed#[58D72A5183124D9F]) [    ] o.a.s.c.ZkContainer Zookeeper client=127.0.0.1:39065/solr
   [junit4]   2> 610154 INFO  (zkCallback-674-thread-1) [    ] o.a.s.c.c.ZkStateReader A cluster state change: [WatchedEvent state:SyncConnected type:NodeDataChanged path:/collections/collection1/state.json] for collection [collection1] has occurred - updating... (live nodes size: [2])
   [junit4]   2> 610155 INFO  (TEST-ForceLeaderTest.testLastPublishedStateIsActive-seed#[58D72A5183124D9F]) [    ] o.a.s.c.c.ZkStateReader Updated live nodes from ZooKeeper... (0) -> (2)
   [junit4]   2> 610155 INFO  (TEST-ForceLeaderTest.testLastPublishedStateIsActive-seed#[58D72A5183124D9F]) [    ] o.a.s.c.Overseer Overseer (id=null) closing
   [junit4]   2> 610156 INFO  (TEST-ForceLeaderTest.testLastPublishedStateIsActive-seed#[58D72A5183124D9F]) [    ] o.a.s.c.ZkController Register node as live in ZooKeeper:/live_nodes/127.0.0.1:45287_
   [junit4]   2> 610157 INFO  (zkCallback-674-thread-1) [    ] o.a.s.c.c.ZkStateReader Updated live nodes from ZooKeeper... (2) -> (3)
   [junit4]   2> 610157 INFO  (zkCallback-662-thread-1) [    ] o.a.s.c.c.ZkStateReader Updated live nodes from ZooKeeper... (2) -> (3)
   [junit4]   2> 610157 INFO  (zkCallback-680-thread-1) [    ] o.a.s.c.c.ZkStateReader Updated live nodes from ZooKeeper... (2) -> (3)
   [junit4]   2> 610160 INFO  (zkCallback-669-thread-1) [    ] o.a.s.c.c.ZkStateReader Updated live nodes from ZooKeeper... (2) -> (3)
   [junit4]   2> 610187 INFO  (TEST-ForceLeaderTest.testLastPublishedStateIsActive-seed#[58D72A5183124D9F]) [    ] o.a.s.m.r.SolrJmxReporter JMX monitoring for 'solr.node' (registry 'solr.node') enabled at server: com.sun.jmx.mbeanserver.JmxMBeanServer@3c91eaad
   [junit4]   2> 610190 INFO  (TEST-ForceLeaderTest.testLastPublishedStateIsActive-seed#[58D72A5183124D9F]) [    ] o.a.s.m.r.SolrJmxReporter JMX monitoring for 'solr.jvm' (registry 'solr.jvm') enabled at server: com.sun.jmx.mbeanserver.JmxMBeanServer@3c91eaad
   [junit4]   2> 610190 INFO  (TEST-ForceLeaderTest.testLastPublishedStateIsActive-seed#[58D72A5183124D9F]) [    ] o.a.s.m.r.SolrJmxReporter JMX monitoring for 'solr.jetty' (registry 'solr.jetty') enabled at server: com.sun.jmx.mbeanserver.JmxMBeanServer@3c91eaad
   [junit4]   2> 610191 INFO  (TEST-ForceLeaderTest.testLastPublishedStateIsActive-seed#[58D72A5183124D9F]) [    ] o.a.s.c.CorePropertiesLocator Found 0 core definitions underneath /home/jenkins/workspace/Lucene-Solr-master-Linux/solr/build/solr-core/test/J0/temp/solr.cloud.ForceLeaderTest_58D72A5183124D9F-001/shard-2-001/cores
   [junit4]   2> 610205 INFO  (qtp1245581253-7503) [    ] o.a.s.h.a.CollectionsHandler Invoked Collection Action :addreplica with params node=127.0.0.1:45287_&action=ADDREPLICA&collection=collection1&shard=shard1&type=TLOG&wt=javabin&version=2 and sendToOCPQueue=true
   [junit4]   2> 610206 INFO  (OverseerCollectionConfigSetProcessor-98467811634511876-127.0.0.1:38337_-n_0000000000) [    ] o.a.s.c.OverseerTaskQueue Response ZK path: /overseer/collection-queue-work/qnr-0000000004 doesn't exist.  Requestor may have disconnected from ZooKeeper
   [junit4]   2> 610207 INFO  (OverseerThreadFactory-1978-thread-4) [    ] o.a.s.c.AddReplicaCmd Node Identified 127.0.0.1:45287_ for creating new replica
   [junit4]   2> 610207 INFO  (SocketProxy-Acceptor-45287) [    ] o.a.s.c.SocketProxy accepted Socket[addr=/127.0.0.1,port=39616,localport=45287], receiveBufferSize:531000
   [junit4]   2> 610208 INFO  (SocketProxy-Acceptor-45287) [    ] o.a.s.c.SocketProxy proxy connection Socket[addr=/127.0.0.1,port=33773,localport=54210], receiveBufferSize=530904
   [junit4]   2> 610208 INFO  (qtp197758393-7536) [    ] o.a.s.h.a.CoreAdminOperation core create command qt=/admin/cores&collection.configName=conf1&name=collection1_shard1_replica_t43&action=CREATE&collection=collection1&shard=shard1&wt=javabin&version=2&replicaType=TLOG
   [junit4]   2> 610208 INFO  (qtp197758393-7536) [    ] o.a.s.c.TransientSolrCoreCacheDefault Allocating transient cache for 4 transient cores
   [junit4]   2> 610310 INFO  (zkCallback-674-thread-1) [    ] o.a.s.c.c.ZkStateReader A cluster state change: [WatchedEvent state:SyncConnected type:NodeDataChanged path:/collections/collection1/state.json] for collection [collection1] has occurred - updating... (live nodes size: [3])
   [junit4]   2> 610310 INFO  (zkCallback-680-thread-1) [    ] o.a.s.c.c.ZkStateReader A cluster state change: [WatchedEvent state:SyncConnected type:NodeDataChanged path:/collections/collection1/state.json] for collection [collection1] has occurred - updating... (live nodes size: [3])
   [junit4]   2> 611227 INFO  (qtp197758393-7536) [    ] o.a.s.c.SolrConfig Using Lucene MatchVersion: 8.0.0
   [junit4]   2> 611250 INFO  (qtp197758393-7536) [    ] o.a.s.s.IndexSchema [collection1_shard1_replica_t43] Schema name=test
   [junit4]   2> 611331 INFO  (qtp197758393-7536) [    ] o.a.s.s.IndexSchema Loaded schema test/1.0 with uniqueid field id
   [junit4]   2> 611339 INFO  (qtp197758393-7536) [    ] o.a.s.c.CoreContainer Creating SolrCore 'collection1_shard1_replica_t43' using configuration from collection collection1, trusted=true
   [junit4]   2> 611339 INFO  (qtp197758393-7536) [    ] o.a.s.m.r.SolrJmxReporter JMX monitoring for 'solr.core.collection1.shard1.replica_t43' (registry 'solr.core.collection1.shard1.replica_t43') enabled at server: com.sun.jmx.mbeanserver.JmxMBeanServer@3c91eaad
   [junit4]   2> 611339 INFO  (qtp197758393-7536) [    ] o.a.s.c.SolrCore solr.RecoveryStrategy.Builder
   [junit4]   2> 611339 INFO  (qtp197758393-7536) [    ] o.a.s.c.SolrCore [[collection1_shard1_replica_t43] ] Opening new SolrCore at [/home/jenkins/workspace/Lucene-Solr-master-Linux/solr/build/solr-core/test/J0/temp/solr.cloud.ForceLeaderTest_58D72A5183124D9F-001/shard-2-001/cores/collection1_shard1_replica_t43], dataDir=[/home/jenkins/workspace/Lucene-Solr-master-Linux/solr/build/solr-core/test/J0/temp/solr.cloud.ForceLeaderTest_58D72A5183124D9F-001/shard-2-001/cores/collection1_shard1_replica_t43/data/]
   [junit4]   2> 611341 INFO  (qtp197758393-7536) [    ] o.a.s.u.RandomMergePolicy RandomMergePolicy wrapping class org.apache.lucene.index.TieredMergePolicy: [TieredMergePolicy: maxMergeAtOnce=15, maxMergeAtOnceExplicit=34, maxMergedSegmentMB=33.2783203125, floorSegmentMB=1.6181640625, forceMergeDeletesPctAllowed=22.69249353926286, segmentsPerTier=37.0, maxCFSSegmentSizeMB=8.796093022207999E12, noCFSRatio=1.0
   [junit4]   2> 611343 WARN  (qtp197758393-7536) [    ] o.a.s.c.RequestHandlers INVALID paramSet a in requestHandler {type = requestHandler,name = /dump,class = DumpRequestHandler,attributes = {initParams=a, name=/dump, class=DumpRequestHandler},args = {defaults={a=A,b=B}}}
   [junit4]   2> 611370 INFO  (qtp197758393-7536) [    ] o.a.s.u.UpdateHandler Using UpdateLog implementation: org.apache.solr.update.UpdateLog
   [junit4]   2> 611370 INFO  (qtp197758393-7536) [    ] o.a.s.u.UpdateLog Initializing UpdateLog: dataDir= defaultSyncLevel=FLUSH numRecordsToKeep=100 maxNumLogsToKeep=10 numVersionBuckets=65536
   [junit4]   2> 611384 INFO  (qtp197758393-7536) [    ] o.a.s.u.CommitTracker Hard AutoCommit: disabled
   [junit4]   2> 611384 INFO  (qtp197758393-7536) [    ] o.a.s.u.CommitTracker Soft AutoCommit: disabled
   [junit4]   2> 611385 INFO  (qtp197758393-7536) [    ] o.a.s.u.RandomMergePolicy RandomMergePolicy wrapping class org.apache.lucene.index.TieredMergePolicy: [TieredMergePolicy: maxMergeAtOnce=35, maxMergeAtOnceExplicit=30, maxMergedSegmentMB=59.5478515625, floorSegmentMB=1.51171875, forceMergeDeletesPctAllowed=18.609701787529357, segmentsPerTier=49.0, maxCFSSegmentSizeMB=8.796093022207999E12, noCFSRatio=0.36929961101371533
   [junit4]   2> 611385 INFO  (qtp197758393-7536) [    ] o.a.s.s.SolrIndexSearcher Opening [Searcher@303818ca[collection1_shard1_replica_t43] main]
   [junit4]   2> 611386 INFO  (qtp197758393-7536) [    ] o.a.s.r.ManagedResourceStorage Configured ZooKeeperStorageIO with znodeBase: /configs/conf1
   [junit4]   2> 611386 INFO  (qtp197758393-7536) [    ] o.a.s.r.ManagedResourceStorage Loaded null at path _rest_managed.json using ZooKeeperStorageIO:path=/configs/conf1
   [junit4]   2> 611387 INFO  (qtp197758393-7536) [    ] o.a.s.h.ReplicationHandler Commits will be reserved for  10000
   [junit4]   2> 611388 INFO  (searcherExecutor-2003-thread-1) [    ] o.a.s.c.SolrCore [collection1_shard1_replica_t43] Registered new searcher Searcher@303818ca[collection1_shard1_replica_t43] main{ExitableDirectoryReader(UninvertingDirectoryReader())}
   [junit4]   2> 611388 INFO  (qtp197758393-7536) [    ] o.a.s.u.UpdateLog Could not find max version in index or recent updates, using new clock 1575484992060915712
   [junit4]   2> 611390 INFO  (qtp197758393-7536) [    ] o.a.s.c.ShardLeaderElectionContext Enough replicas found to continue.
   [junit4]   2> 611390 INFO  (qtp197758393-7536) [    ] o.a.s.c.ShardLeaderElectionContext I may be the new leader - try and sync
   [junit4]   2> 611390 INFO  (qtp197758393-7536) [    ] o.a.s.c.SyncStrategy Sync replicas to http://127.0.0.1:45287/collection1_shard1_replica_t43/
   [junit4]   2> 611390 INFO  (qtp197758393-7536) [    ] o.a.s.c.SyncStrategy Sync Success - now sync replicas to me
   [junit4]   2> 611390 INFO  (qtp197758393-7536) [    ] o.a.s.c.SyncStrategy http://127.0.0.1:45287/collection1_shard1_replica_t43/ has no replicas
   [junit4]   2> 611390 INFO  (qtp197758393-7536) [    ] o.a.s.c.ShardLeaderElectionContext Found all replicas participating in election, clear LIR
   [junit4]   2> 611391 INFO  (qtp197758393-7536) [    ] o.a.s.c.ZkController collection1_shard1_replica_t43 stopping background replication from leader
   [junit4]   2> 611391 INFO  (qtp197758393-7536) [    ] o.a.s.c.ShardLeaderElectionContext I am the new leader: http://127.0.0.1:45287/collection1_shard1_replica_t43/ shard1
   [junit4]   2> 611493 INFO  (zkCallback-674-thread-1) [    ] o.a.s.c.c.ZkStateReader A cluster state change: [WatchedEvent state:SyncConnected type:NodeDataChanged path:/collections/collection1/state.json] for collection [collection1] has occurred - updating... (live nodes size: [3])
   [junit4]   2> 611493 INFO  (zkCallback-680-thread-1) [    ] o.a.s.c.c.ZkStateReader A cluster state change: [WatchedEvent state:SyncConnected type:NodeDataChanged path:/collections/collection1/state.json] for collection [collection1] has occurred - updating... (live nodes size: [3])
   [junit4]   2> 611542 INFO  (qtp197758393-7536) [    ] o.a.s.c.ZkController I am the leader, no recovery necessary
   [junit4]   2> 611543 INFO  (qtp197758393-7536) [    ] o.a.s.s.HttpSolrCall [admin] webapp=null path=/admin/cores params={qt=/admin/cores&collection.configName=conf1&name=collection1_shard1_replica_t43&action=CREATE&collection=collection1&shard=shard1&wt=javabin&version=2&replicaType=TLOG} status=0 QTime=1335
   [junit4]   2> 611544 INFO  (qtp1245581253-7503) [    ] o.a.s.s.HttpSolrCall [admin] webapp=null path=/admin/collections params={node=127.0.0.1:45287_&action=ADDREPLICA&collection=collection1&shard=shard1&type=TLOG&wt=javabin&version=2} status=0 QTime=1338
   [junit4]   2> 611596 INFO  (TEST-ForceLeaderTest.testLastPublishedStateIsActive-seed#[58D72A5183124D9F]) [    ] o.a.s.c.AbstractFullDistribZkTestBase create jetty 3 in directory /home/jenkins/workspace/Lucene-Solr-master-Linux/solr/build/solr-core/test/J0/temp/solr.cloud.ForceLeaderTest_58D72A5183124D9F-001/shard-3-001 of type TLOG
   [junit4]   2> 611596 INFO  (TEST-ForceLeaderTest.testLastPublishedStateIsActive-seed#[58D72A5183124D9F]) [    ] o.e.j.s.Server jetty-9.3.14.v20161028
   [junit4]   2> 611597 INFO  (TEST-ForceLeaderTest.testLastPublishedStateIsActive-seed#[58D72A5183124D9F]) [    ] o.e.j.s.h.ContextHandler Started o.e.j.s.ServletContextHandler@6bb47441{/,null,AVAILABLE}
   [junit4]   2> 611597 INFO  (TEST-ForceLeaderTest.testLastPublishedStateIsActive-seed#[58D72A5183124D9F]) [    ] o.e.j.s.AbstractConnector Started ServerConnector@1714b160{HTTP/1.1,[http/1.1]}{127.0.0.1:46413}
   [junit4]   2> 611597 INFO  (TEST-ForceLeaderTest.testLastPublishedStateIsActive-seed#[58D72A5183124D9F]) [    ] o.e.j.s.Server Started @612733ms
   [junit4]   2> 611597 INFO  (TEST-ForceLeaderTest.testLastPublishedStateIsActive-seed#[58D72A5183124D9F]) [    ] o.a.s.c.s.e.JettySolrRunner Jetty properties: {hostContext=/, solrconfig=solrconfig.xml, solr.data.dir=/home/jenkins/workspace/Lucene-Solr-master-Linux/solr/build/solr-core/test/J0/temp/solr.cloud.ForceLeaderTest_58D72A5183124D9F-001/tempDir-001/jetty3, hostPort=42075, coreRootDirectory=/home/jenkins/workspace/Lucene-Solr-master-Linux/solr/build/solr-core/test/J0/temp/solr.cloud.ForceLeaderTest_58D72A5183124D9F-001/shard-3-001/cores, replicaType=TLOG}
   [junit4]   2> 611598 ERROR (TEST-ForceLeaderTest.testLastPublishedStateIsActive-seed#[58D72A5183124D9F]) [    ] o.a.s.s.StartupLoggingUtils Missing Java Option solr.log.dir. Logging may be missing or incomplete.
   [junit4]   2> 611598 INFO  (TEST-ForceLeaderTest.testLastPublishedStateIsActive-seed#[58D72A5183124D9F]) [    ] o.a.s.s.SolrDispatchFilter  ___      _       Welcome to Apache Solr™ version 8.0.0
   [junit4]   2> 611598 INFO  (TEST-ForceLeaderTest.testLastPublishedStateIsActive-seed#[58D72A5183124D9F]) [    ] o.a.s.s.SolrDispatchFilter / __| ___| |_ _   Starting in cloud mode on port null
   [junit4]   2> 611598 INFO  (TEST-ForceLeaderTest.testLastPublishedStateIsActive-seed#[58D72A5183124D9F]) [    ] o.a.s.s.SolrDispatchFilter \__ \/ _ \ | '_|  Install dir: null, Default config dir: null
   [junit4]   2> 611598 INFO  (TEST-ForceLeaderTest.testLastPublishedStateIsActive-seed#[58D72A5183124D9F]) [    ] o.a.s.s.SolrDispatchFilter |___/\___/_|_|    Start time: 2017-08-12T00:59:33.022525Z
   [junit4]   2> 611600 INFO  (TEST-ForceLeaderTest.testLastPublishedStateIsActive-seed#[58D72A5183124D9F]) [    ] o.a.s.s.SolrDispatchFilter Loading solr.xml from SolrHome (not found in ZooKeeper)
   [junit4]   2> 611600 INFO  (TEST-ForceLeaderTest.testLastPublishedStateIsActive-seed#[58D72A5183124D9F]) [    ] o.a.s.c.SolrXmlConfig Loading container configuration from /home/jenkins/workspace/Lucene-Solr-master-Linux/solr/build/solr-core/test/J0/temp/solr.cloud.ForceLeaderTest_58D72A5183124D9F-001/shard-3-001/solr.xml
   [junit4]   2> 611603 INFO  (TEST-ForceLeaderTest.testLastPublishedStateIsActive-seed#[58D72A5183124D9F]) [    ] o.a.s.c.SolrXmlConfig MBean server found: com.sun.jmx.mbeanserver.JmxMBeanServer@3c91eaad, but no JMX reporters were configured - adding default JMX reporter.
   [junit4]   2> 611604 INFO  (TEST-ForceLeaderTest.testLastPublishedStateIsActive-seed#[58D72A5183124D9F]) [    ] o.a.s.c.ZkContainer Zookeeper client=127.0.0.1:39065/solr
   [junit4]   2> 611608 INFO  (TEST-ForceLeaderTest.testLastPublishedStateIsActive-seed#[58D72A5183124D9F]) [    ] o.a.s.c.c.ZkStateReader Updated live nodes from ZooKeeper... (0) -> (3)
   [junit4]   2> 611609 INFO  (TEST-ForceLeaderTest.testLastPublishedStateIsActive-seed#[58D72A5183124D9F]) [    ] o.a.s.c.Overseer Overseer (id=null) closing
   [junit4]   2> 611609 INFO  (TEST-ForceLeaderTest.testLastPublishedStateIsActive-seed#[58D72A5183124D9F]) [    ] o.a.s.c.ZkController Register node as live in ZooKeeper:/live_nodes/127.0.0.1:42075_
   [junit4]   2> 611610 INFO  (zkCallback-674-thread-1) [    ] o.a.s.c.c.ZkStateReader Updated live nodes from ZooKeeper... (3) -> (4)
   [junit4]   2> 611610 INFO  (zkCallback-669-thread-1) [    ] o.a.s.c.c.ZkStateReader Updated live nodes from ZooKeeper... (3) -> (4)
   [junit4]   2> 611610 INFO  (zkCallback-680-thread-1) [    ] o.a.s.c.c.ZkStateReader Updated live nodes from ZooKeeper... (3) -> (4)
   [junit4]   2> 611610 INFO  (zkCallback-662-thread-2) [    ] o.a.s.c.c.ZkStateReader Updated live nodes from ZooKeeper... (3) -> (4)
   [junit4]   2> 611610 INFO  (zkCallback-686-thread-1) [    ] o.a.s.c.c.ZkStateReader Updated live nodes from ZooKeeper... (3) -> (4)
   [junit4]   2> 611647 INFO  (TEST-ForceLeaderTest.testLastPublishedStateIsActive-seed#[58D72A5183124D9F]) [    ] o.a.s.m.r.SolrJmxReporter JMX monitoring for 'solr.node' (registry 'solr.node') enabled at server: com.sun.jmx.mbeanserver.JmxMBeanServer@3c91eaad
   [junit4]   2> 611650 INFO  (TEST-ForceLeaderTest.testLastPublishedStateIsActive-seed#[58D72A5183124D9F]) [    ] o.a.s.m.r.SolrJmxReporter JMX monitoring for 'solr.jvm' (registry 'solr.jvm') enabled at server: com.sun.jmx.mbeanserver.JmxMBeanServer@3c91eaad
   [junit4]   2> 611650 INFO  (TEST-ForceLeaderTest.testLastPublishedStateIsActive-seed#[58D72A5183124D9F]) [    ] o.a.s.m.r.SolrJmxReporter JMX monitoring for 'solr.jetty' (registry 'solr.jetty') enabled at server: com.sun.jmx.mbeanserver.JmxMBeanServer@3c91eaad
   [junit4]   2> 611651 INFO  (TEST-ForceLeaderTest.testLastPublishedStateIsActive-seed#[58D72A5183124D9F]) [    ] o.a.s.c.CorePropertiesLocator Found 0 core definitions underneath /home/jenkins/workspace/Lucene-Solr-master-Linux/solr/build/solr-core/test/J0/temp/solr.cloud.ForceLeaderTest_58D72A5183124D9F-001/shard-3-001/cores
   [junit4]   2> 611697 INFO  (SocketProxy-Acceptor-42075) [    ] o.a.s.c.SocketProxy accepted Socket[addr=/127.0.0.1,port=53628,localport=42075], receiveBufferSize:531000
   [junit4]   2> 611697 INFO  (SocketProxy-Acceptor-42075) [    ] o.a.s.c.SocketProxy proxy connection Socket[addr=/127.0.0.1,port=46413,localport=46464], receiveBufferSize=530904
   [junit4]   2> 611697 INFO  (qtp1775985127-7569) [    ] o.a.s.h.a.CollectionsHandler Invoked Collection Action :addreplica with params node=127.0.0.1:42075_&action=ADDREPLICA&collection=collection1&shard=shard2&type=TLOG&wt=javabin&version=2 and sendToOCPQueue=true
   [junit4]   2> 611698 INFO  (OverseerCollectionConfigSetProcessor-98467811634511876-127.0.0.1:38337_-n_0000000000) [    ] o.a.s.c.OverseerTaskQueue Response ZK path: /overseer/collection-queue-work/qnr-0000000006 doesn't exist.  Requestor may have disconnected from ZooKeeper
   [junit4]   2> 611699 INFO  (OverseerThreadFactory-1978-thread-5) [    ] o.a.s.c.AddReplicaCmd Node Identified 127.0.0.1:42075_ for creating new replica
   [junit4]   2> 611699 INFO  (SocketProxy-Acceptor-42075) [    ] o.a.s.c.SocketProxy accepted Socket[addr=/127.0.0.1,port=53632,localport=42075], receiveBufferSize:531000
   [junit4]   2> 611700 INFO  (qtp1775985127-7571) [    ] o.a.s.h.a.CoreAdminOperation core create command qt=/admin/cores&collection.configName=conf1&name=collection1_shard2_replica_t45&action=CREATE&collection=collection1&shard=shard2&wt=javabin&version=2&replicaType=TLOG
   [junit4]   2> 611700 INFO  (SocketProxy-Acceptor-42075) [    ] o.a.s.c.SocketProxy proxy connection Socket[addr=/127.0.0.1,port=46413,localport=46468], receiveBufferSize=530904
   [junit4]   2> 611700 INFO  (qtp1775985127-7571) [    ] o.a.s.c.TransientSolrCoreCacheDefault Allocating transient cache for 4 transient cores
   [junit4]   2> 611802 INFO  (zkCallback-674-thread-1) [    ] o.a.s.c.c.ZkStateReader A cluster state change: [WatchedEvent state:SyncConnected type:NodeDataChanged path:/collections/collection1/state.json] for collection [collection1] has occurred - updating... (live nodes size: [4])
   [junit4]   2> 611802 INFO  (zkCallback-686-thread-1) [    ] o.a.s.c.c.ZkStateReader A cluster state change: [WatchedEvent state:SyncConnected type:NodeDataChanged path:/collections/collection1/state.json] for collection [collection1] has occurred - updating... (live nodes size: [4])
   [junit4]   2> 611802 INFO  (zkCallback-680-thread-1) [    ] o.a.s.c.c.ZkStateReader A cluster state change: [WatchedEvent state:SyncConnected type:NodeDataChanged path:/collections/collection1/state.json] for collection [collection1] has occurred - updating... (live nodes size: [4])
   [junit4]   2> 612709 INFO  (qtp1775985127-7571) [    ] o.a.s.c.SolrConfig Using Lucene MatchVersion: 8.0.0
   [junit4]   2> 612716 INFO  (qtp1775985127-7571) [    ] o.a.s.s.IndexSchema [collection1_shard2_replica_t45] Schema name=test
   [junit4]   2> 612786 INFO  (qtp1775985127-7571) [    ] o.a.s.s.IndexSchema Loaded schema test/1.0 with uniqueid field id
   [junit4]   2> 612795 INFO  (qtp1775985127-7571) [    ] o.a.s.c.CoreContainer Creating SolrCore 'collection1_shard2_replica_t45' using configuration from collection collection1, trusted=true
   [junit4]   2> 612795 INFO  (qtp1775985127-7571) [    ] o.a.s.m.r.SolrJmxReporter JMX monitoring for 'solr.core.collection1.shard2.replica_t45' (registry 'solr.core.collection1.shard2.replica_t45') enabled at server: com.sun.jmx.mbeanserver.JmxMBeanServer@3c91eaad
   [junit4]   2> 612795 INFO  (qtp1775985127-7571) [    ] o.a.s.c.SolrCore solr.RecoveryStrategy.Builder
   [junit4]   2> 612795 INFO  (qtp1775985127-7571) [    ] o.a.s.c.SolrCore [[collection1_shard2_replica_t45] ] Opening new SolrCore at [/home/jenkins/workspace/Lucene-Solr-master-Linux/solr/build/solr-core/test/J0/temp/solr.cloud.ForceLeaderTest_58D72A5183124D9F-001/shard-3-001/cores/collection1_shard2_replica_t45], dataDir=[/home/jenkins/workspace/Lucene-Solr-master-Linux/solr/build/solr-core/test/J0/temp/solr.cloud.ForceLeaderTest_58D72A5183124D9F-001/shard-3-001/cores/collection1_shard2_replica_t45/data/]
   [junit4]   2> 612798 INFO  (qtp1775985127-7571) [    ] o.a.s.u.RandomMergePolicy RandomMergePolicy wrapping class org.apache.lucene.index.TieredMergePolicy: [TieredMergePolicy: maxMergeAtOnce=15, maxMergeAtOnceExplicit=34, maxMergedSegmentMB=33.2783203125, floorSegmentMB=1.6181640625, forceMergeDeletesPctAllowed=22.69249353926286, segmentsPerTier=37.0, maxCFSSegmentSizeMB=8.796093022207999E12, noCFSRatio=1.0
   [junit4]   2> 612800 WARN  (qtp1775985127-7571) [    ] o.a.s.c.RequestHandlers INVALID paramSet a in requestHandler {type = requestHandler,name = /dump,class = DumpRequestHandler,attributes = {initParams=a, name=/dump, class=DumpRequestHandler},args = {defaults={a=A,b=B}}}
   [junit4]   2> 612841 INFO  (qtp1775985127-7571) [    ] o.a.s.u.UpdateHandler Using UpdateLog implementation: org.apache.solr.update.UpdateLog
   [junit4]   2> 612841 INFO  (qtp1775985127-7571) [    ] o.a.s.u.UpdateLog Initializing UpdateLog: dataDir= defaultSyncLevel=FLUSH numRecordsToKeep=100 maxNumLogsToKeep=10 numVersionBuckets=65536
   [junit4]   2> 612842 INFO  (qtp1775985127-7571) [    ] o.a.s.u.CommitTracker Hard AutoCommit: disabled
   [junit4]   2> 612842 INFO  (qtp1775985127-7571) [    ] o.a.s.u.CommitTracker Soft AutoCommit: disabled
   [junit4]   2> 612843 INFO  (qtp1775985127-7571) [    ] o.a.s.u.RandomMergePolicy RandomMergePolicy wrapping class org.apache.lucene.index.TieredMergePolicy: [TieredMergePolicy: maxMergeAtOnce=35, maxMergeAtOnceExplicit=30, maxMergedSegmentMB=59.5478515625, floorSegmentMB=1.51171875, forceMergeDeletesPctAllowed=18.609701787529357, segmentsPerTier=49.0, maxCFSSegmentSizeMB=8.796093022207999E12, noCFSRatio=0.36929961101371533
   [junit4]   2> 612843 INFO  (qtp1775985127-7571) [    ] o.a.s.s.SolrIndexSearcher Opening [Searcher@46c23a04[collection1_shard2_replica_t45] main]
   [junit4]   2> 612843 INFO  (qtp1775985127-7571) [    ] o.a.s.r.ManagedResourceStorage Configured ZooKeeperStorageIO with znodeBase: /configs/conf1
   [junit4]   2> 612844 INFO  (qtp1775985127-7571) [    ] o.a.s.r.ManagedResourceStorage Loaded null at path _rest_managed.json using ZooKeeperStorageIO:path=/configs/conf1
   [junit4]   2> 612844 INFO  (qtp1775985127-7571) [    ] o.a.s.h.ReplicationHandler Commits will be reserved for  10000
   [junit4]   2> 612845 INFO  (searcherExecutor-2014-thread-1) [    ] o.a.s.c.SolrCore [collection1_shard2_replica_t45] Registered new searcher Searcher@46c23a04[collection1_shard2_replica_t45] main{ExitableDirectoryReader(UninvertingDirectoryReader())}
   [junit4]   2> 612845 INFO  (qtp1775985127-7571) [    ] o.a.s.u.UpdateLog Could not find max version in index or recent updates, using new clock 1575484993588690944
   [junit4]   2> 612847 INFO  (qtp1775985127-7571) [    ] o.a.s.c.ZkController Core needs to recover:collection1_shard2_replica_t45
   [junit4]   2> 612848 INFO  (updateExecutor-683-thread-1) [    ] o.a.s.u.DefaultSolrCoreState Running recovery
   [junit4]   2> 612848 INFO  (qtp1775985127-7571) [    ] o.a.s.s.HttpSolrCall [admin] webapp=null path=/admin/cores params={qt=/admin/cores&collection.configName=conf1&name=collection1_shard2_replica_t45&action=CREATE&collection=collection1&shard=shard2&wt=javabin&version=2&replicaType=TLOG} status=0 QTime=1147
   [junit4]   2> 612848 INFO  (recoveryExecutor-684-thread-1) [    ] o.a.s.c.RecoveryStrategy Starting recovery process. recoveringAfterStartup=true
   [junit4]   2> 612848 INFO  (recoveryExecutor-684-thread-1) [    ] o.a.s.c.RecoveryStrategy ###### startupVersions=[[]]
   [junit4]   2> 612848 INFO  (recoveryExecutor-684-thread-1) [    ] o.a.s.c.ZkController collection1_shard2_replica_t45 stopping background replication from leader
   [junit4]   2> 612848 INFO  (recoveryExecutor-684-thread-1) [    ] o.a.s.c.RecoveryStrategy Begin buffering updates. core=[collection1_shard2_replica_t45]
   [junit4]   2> 612848 INFO  (recoveryExecutor-684-thread-1) [    ] o.a.s.u.UpdateLog Starting to buffer updates. FSUpdateLog{state=ACTIVE, tlog=null}
   [junit4]   2> 612848 INFO  (recoveryExecutor-684-thread-1) [    ] o.a.s.c.RecoveryStrategy Publishing state of core [collection1_shard2_replica_t45] as recovering, leader is [http://127.0.0.1:32937/collection1_shard2_replica_t41/] and I am [http://127.0.0.1:42075/collection1_shard2_replica_t45/]
   [junit4]   2> 612849 INFO  (qtp1775985127-7569) [    ] o.a.s.s.HttpSolrCall [admin] webapp=null path=/admin/collections params={node=127.0.0.1:42075_&action=ADDREPLICA&collection=collection1&shard=shard2&type=TLOG&wt=javabin&version=2} status=0 QTime=1151
   [junit4]   2> 612849 INFO  (recoveryExecutor-684-thread-1) [    ] o.a.s.c.RecoveryStrategy Sending prep recovery command to [http://127.0.0.1:32937]; [WaitForState: action=PREPRECOVERY&core=collection1_shard2_replica_t41&nodeName=127.0.0.1:42075_&coreNodeName=core_node46&state=recovering&checkLive=true&onlyIfLeader=true&onlyIfLeaderActive=true]
   [junit4]   2> 612850 INFO  (SocketProxy-Acceptor-32937) [    ] o.a.s.c.SocketProxy accepted Socket[addr=/127.0.0.1,port=47440,localport=32937], receiveBufferSize:531000
   [junit4]   2> 612852 INFO  (qtp1245581253-7504) [    ] o.a.s.h.a.PrepRecoveryOp Going to wait for coreNodeName: core_node46, state: recovering, checkLive: true, onlyIfLeader: true, onlyIfLeaderActive: true, maxTime: 183 s
   [junit4]   2> 612853 INFO  (SocketProxy-Acceptor-32937) [    ] o.a.s.c.SocketProxy proxy connection Socket[addr=/127.0.0.1,port=37845,localport=37468], receiveBufferSize=530904
   [junit4]   2> 612854 INFO  (qtp1245581253-7504) [    ] o.a.s.h.a.PrepRecoveryOp In WaitForState(recovering): collection=collection1, shard=shard2, thisCore=collection1_shard2_replica_t41, leaderDoesNotNeedRecovery=false, isLeader? true, live=true, checkLive=true, currentState=down, localState=active, nodeName=127.0.0.1:42075_, coreNodeName=core_node46, onlyIfActiveCheckResult=false, nodeProps: core_node46:{"core":"collection1_shard2_replica_t45","base_url":"http://127.0.0.1:42075","node_name":"127.0.0.1:42075_","state":"down","type":"TLOG"}
   [junit4]   2> 612854 INFO  (TEST-ForceLeaderTest.testLastPublishedStateIsActive-seed#[58D72A5183124D9F]) [    ] o.a.s.SolrTestCaseJ4 ###Starting testLastPublishedStateIsActive
   [junit4]   2> 612855 INFO  (SocketProxy-Acceptor-45287) [    ] o.a.s.c.SocketProxy accepted Socket[addr=/127.0.0.1,port=39676,localport=45287], receiveBufferSize:531000
   [junit4]   2> 612855 INFO  (SocketProxy-Acceptor-45287) [    ] o.a.s.c.SocketProxy proxy connection Socket[addr=/127.0.0.1,port=33773,localport=54270], receiveBufferSize=530904
   [junit4]   2> 612856 INFO  (qtp197758393-7538) [    ] o.a.s.h.a.CollectionsHandler Invoked Collection Action :create with params pullReplicas=0&maxShardsPerNode=1&collection.configName=conf1&nrtReplicas=0&name=forceleader_last_published&action=CREATE&numShards=1&tlogReplicas=3&wt=javabin&version=2 and sendToOCPQueue=true
   [junit4]   2> 612857 INFO  (OverseerThreadFactory-1978-thread-5) [    ] o.a.s.c.CreateCollectionCmd Create collection forceleader_last_published
   [junit4]   2> 612857 INFO  (OverseerCollectionConfigSetProcessor-98467811634511876-127.0.0.1:38337_-n_0000000000) [    ] o.a.s.c.OverseerTaskQueue Response ZK path: /overseer/collection-queue-work/qnr-0000000008 doesn't exist.  Requestor may have disconnected from ZooKeeper
   [junit4]   2> 612959 INFO  (zkCallback-686-thread-1) [    ] o.a.s.c.c.ZkStateReader A cluster state change: [WatchedEvent state:SyncConnected type:NodeDataChanged path:/collections/collection1/state.json] for collection [collection1] has occurred - updating... (live nodes size: [4])
   [junit4]   2> 612959 INFO  (zkCallback-680-thread-1) [    ] o.a.s.c.c.ZkStateReader A cluster state change: [WatchedEvent state:SyncConnected type:NodeDataChanged path:/collections/collection1/state.json] for collection [collection1] has occurred - updating... (live nodes size: [4])
   [junit4]   2> 612959 INFO  (zkCallback-674-thread-1) [    ] o.a.s.c.c.ZkStateReader A cluster state change: [WatchedEvent state:SyncConnected type:NodeDataChanged path:/collections/collection1/state.json] for collection [collection1] has occurred - updating... (live nodes size: [4])
   [junit4]   2> 613061 INFO  (qtp1245581253-7497) [    ] o.a.s.h.a.CoreAdminOperation core create command qt=/admin/cores&collection.configName=conf1&newCollection=true&name=forceleader_last_published_shard1_replica_t1&action=CREATE&numShards=1&collection=forceleader_last_published&shard=shard1&wt=javabin&version=2&replicaType=TLOG
   [junit4]   2> 613062 INFO  (qtp462186617-7449) [    ] o.a.s.h.a.CoreAdminOperation core create command qt=/admin/cores&collection.configName=conf1&newCollection=true&name=forceleader_last_published_shard1_replica_t2&action=CREATE&numShards=1&collection=forceleader_last_published&shard=shard1&wt=javabin&version=2&replicaType=TLOG
   [junit4]   2> 613063 INFO  (qtp197758393-7537) [    ] o.a.s.h.a.CoreAdminOperation core create command qt=/admin/cores&collection.configName=conf1&newCollection=true&name=forceleader_last_published_shard1_replica_t3&action=CREATE&numShards=1&collection=forceleader_last_published&shard=shard1&wt=javabin&version=2&replicaType=TLOG
   [junit4]   2> 613169 INFO  (zkCallback-662-thread-2) [    ] o.a.s.c.c.ZkStateReader A cluster state change: [WatchedEvent state:SyncConnected type:NodeDataChanged path:/collections/forceleader_last_published/state.json] for collection [forceleader_last_published] has occurred - updating... (live nodes size: [4])
   [junit4]   2> 613169 INFO  (zkCallback-680-thread-1) [    ] o.a.s.c.c.ZkStateReader A cluster state change: [WatchedEvent state:SyncConnected type:NodeDataChanged path:/collections/forceleader_last_published/state.json] for collection [forceleader_last_published] has occurred - updating... (live nodes size: [4])
   [junit4]   2> 613169 INFO  (zkCallback-674-thread-1) [    ] o.a.s.c.c.ZkStateReader A cluster state change: [WatchedEvent state:SyncConnected type:NodeDataChanged path:/collections/forceleader_last_published/state.json] for collection [forceleader_last_published] has occurred - updating... (live nodes size: [4])
   [junit4]   2> 613854 INFO  (qtp1245581253-7504) [    ] o.a.s.h.a.PrepRecoveryOp In WaitForState(recovering): collection=collection1, shard=shard2, thisCore=collection1_shard2_replica_t41, leaderDoesNotNeedRecovery=false, isLeader? true, live=true, checkLive=true, currentState=recovering, localState=active, nodeName=127.0.0.1:42075_, coreNodeName=core_node46, onlyIfActiveCheckResult=false, nodeProps: core_node46:{"core":"collection1_shard2_replica_t45","base_url":"http://127.0.0.1:42075","node_name":"127.0.0.1:42075_","state":"recovering","type":"TLOG"}
   [junit4]   2> 613854 INFO  (qtp1245581253-7504) [    ] o.a.s.h.a.PrepRecoveryOp Waited coreNodeName: core_node46, state: recovering, checkLive: true, onlyIfLeader: true for: 1 seconds.
   [junit4]   2> 613854 INFO  (qtp1245581253-7504) [    ] o.a.s.s.HttpSolrCall [admin] webapp=null path=/admin/cores params={nodeName=127.0.0.1:42075_&onlyIfLeaderActive=true&core=collection1_shard2_replica_t41&coreNodeName=core_node46&action=PREPRECOVERY&checkLive=true&state=recovering&onlyIfLeader=true&wt=javabin&version=2} status=0 QTime=1001
   [junit4]   2> 614077 INFO  (qtp1245581253-7497) [    ] o.a.s.c.SolrConfig Using Lucene MatchVersion: 8.0.0
   [junit4]   2> 614077 INFO  (qtp197758393-7537) [    ] o.a.s.c.SolrConfig Using Lucene MatchVersion: 8.0.0
   [junit4]   2> 614109 INFO  (qtp462186617-7449) [    ] o.a.s.c.SolrConfig Using Lucene MatchVersion: 8.0.0
   [junit4]   2> 614114 INFO  (qtp1245581253-7497) [    ] o.a.s.s.IndexSchema [forceleader_last_published_shard1_replica_t1] Schema name=test
   [junit4]   2> 614114 INFO  (qtp197758393-7537) [    ] o.a.s.s.IndexSchema [forceleader_last_published_shard1_replica_t3] Schema name=test
   [junit4]   2> 614120 INFO  (qtp462186617-7449) [    ] o.a.s.s.IndexSchema [forceleader_last_published_shard1_replica_t2] Schema name=test
   [junit4]   2> 614348 INFO  (qtp197758393-7537) [    ] o.a.s.s.IndexSchema Loaded schema test/1.0 with uniqueid field id
   [junit4]   2> 614354 INFO  (recoveryExecutor-684-thread-1) [    ] o.a.s.c.RecoveryStrategy Starting Replication Recovery.
   [junit4]   2> 614354 INFO  (recoveryExecutor-684-thread-1) [    ] o.a.s.c.RecoveryStrategy Attempting to replicate from [http://127.0.0.1:32937/collection1_shard2_replica_t41/].
   [junit4]   2> 614360 INFO  (SocketProxy-Acceptor-32937) [    ] o.a.s.c.SocketProxy accepted Socket[addr=/127.0.0.1,port=47454,localport=32937], receiveBufferSize:531000
   [junit4]   2> 614362 INFO  (qtp462186617-7449) [    ] o.a.s.s.IndexSchema Loaded schema test/1.0 with uniqueid field id
   [junit4]   2> 614362 INFO  (qtp1245581253-7497) [    ] o.a.s.s.IndexSchema Loaded schema test/1.0 with uniqueid field id
   [junit4]   2> 614371 INFO  (qtp197758393-7537) [    ] o.a.s.c.CoreContainer Creating SolrCore 'forceleader_last_published_shard1_replica_t3' using configuration from collection forceleader_last_published, trusted=true
   [junit4]   2> 614371 INFO  (qtp197758393-7537) [    ] o.a.s.m.r.SolrJmxReporter JMX monitoring for 'solr.core.forceleader_last_published.shard1.replica_t3' (registry 'solr.core.forceleader_last_published.shard1.replica_t3') enabled at server: com.sun.jmx.mbeanserver.JmxMBeanServer@3c91eaad
   [junit4]   2> 614371 INFO  (qtp197758393-7537) [    ] o.a.s.c.SolrCore solr.RecoveryStrategy.Builder
   [junit4]   2> 614371 INFO  (qtp197758393-7537) [    ] o.a.s.c.SolrCore [[forceleader_last_published_shard1_replica_t3] ] Opening new SolrCore at [/home/jenkins/workspace/Lucene-Solr-master-Linux/solr/build/solr-core/test/J0/temp/solr.cloud.ForceLeaderTest_58D72A5183124D9F-001/shard-2-001/cores/forceleader_last_published_shard1_replica_t3], dataDir=[/home/jenkins/workspace/Lucene-Solr-master-Linux/solr/build/solr-core/test/J0/temp/solr.cloud.ForceLeaderTest_58D72A5183124D9F-001/shard-2-001/cores/forceleader_last_published_shard1_replica_t3/data/]
   [junit4]   2> 614374 INFO  (qtp197758393-7537) [    ] o.a.s.u.RandomMergePolicy RandomMergePolicy wrapping class org.apache.lucene.index.TieredMergePolicy: [TieredMergePolicy: maxMergeAtOnce=15, maxMergeAtOnceExplicit=34, maxMergedSegmentMB=33.2783203125, floorSegmentMB=1.6181640625, forceMergeDeletesPctAllowed=22.69249353926286, segmentsPerTier=37.0, maxCFSSegmentSizeMB=8.796093022207999E12, noCFSRatio=1.0
   [junit4]   2> 614380 INFO  (qtp462186617-7449) [    ] o.a.s.c.CoreContainer Creating SolrCore 'forceleader_last_published_shard1_replica_t2' using configuration from collection forceleader_last_published, trusted=true
   [junit4]   2> 614380 INFO  (qtp462186617-7449) [    ] o.a.s.m.r.SolrJmxReporter JMX monitoring for 'solr.core.forceleader_last_published.shard1.replica_t2' (registry 'solr.core.forceleader_last_published.shard1.replica_t2') enabled at server: com.sun.jmx.mbeanserver.JmxMBeanServer@3c91eaad
   [junit4]   2> 614380 INFO  (qtp1245581253-7500) [    ] o.a.s.u.DirectUpdateHandler2 start commit{_version_=1575484995198255104,optimize=false,openSearcher=false,waitSearcher=true,expungeDeletes=false,softCommit=false,prepareCommit=false}
   [junit4]   2> 614380 INFO  (qtp462186617-7449) [    ] o.a.s.c.SolrCore solr.RecoveryStrategy.Builder
   [junit4]   2> 614381 INFO  (qtp462186617-7449) [    ] o.a.s.c.SolrCore [[forceleader_last_published_shard1_replica_t2] ] Opening new SolrCore at [/home/jenkins/workspace/Lucene-Solr-master-Linux/solr/build/solr-core/test/J0/temp/solr.cloud.ForceLeaderTest_58D72A5183124D9F-001/control-001/cores/forceleader_last_published_shard1_replica_t2], dataDir=[/home/jenkins/workspace/Lucene-Solr-master-Linux/solr/build/solr-core/test/J0/temp/solr.cloud.ForceLeaderTest_58D72A5183124D9F-001/control-001/cores/forceleader_last_published_shard1_replica_t2/data/]
   [junit4]   2> 614382 INFO  (qtp1245581253-7497) [    ] o.a.s.c.CoreContainer Creating SolrCore 'forceleader_last_published_shard1_replica_t1' using configuration from collection forceleader_last_published, trusted=true
   [junit4]   2> 614382 INFO  (qtp1245581253-7497) [    ] o.a.s.m.r.SolrJmxReporter JMX monitoring for 'solr.core.forceleader_last_published.shard1.replica_t1' (registry 'solr.core.forceleader_last_published.shard1.replica_t1') enabled at server: com.sun.jmx.mbeanserver.JmxMBeanServer@3c91eaad
   [junit4]   2> 614382 INFO  (qtp1245581253-7497) [    ] o.a.s.c.SolrCore solr.RecoveryStrategy.Builder
   [junit4]   2> 614382 INFO  (qtp1245581253-7497) [    ] o.a.s.c.SolrCore [[forceleader_last_published_shard1_replica_t1] ] Opening new SolrCore at [/home/jenkins/workspace/Lucene-Solr-master-Linux/solr/build/solr-core/test/J0/temp/solr.cloud.ForceLeaderTest_58D72A5183124D9F-001/shard-1-001/cores/forceleader_last_published_shard1_replica_t1], dataDir=[/home/jenkins/workspace/Lucene-Solr-master-Linux/solr/build/solr-core/test/J0/temp/solr.cloud.ForceLeaderTest_58D72A5183124D9F-001/shard-1-001/cores/forceleader_last_published_shard1_replica_t1/data/]
   [junit4]   2> 614383 INFO  (qtp462186617-7449) [    ] o.a.s.u.RandomMergePolicy RandomMergePolicy wrapping class org.apache.lucene.index.TieredMergePolicy: [TieredMergePolicy: maxMergeAtOnce=15, maxMergeAtOnceExplicit=34, maxMergedSegmentMB=33.2783203125, floorSegmentMB=1.6181640625, forceMergeDeletesPctAllowed=22.69249353926286, segmentsPerTier=37.0, maxCFSSegmentSizeMB=8.796093022207999E12, noCFSRatio=1.0
   [junit4]   2> 614384 INFO  (SocketProxy-Acceptor-32937) [    ] o.a.s.c.SocketProxy proxy connection Socket[addr=/127.0.0.1,port=37845,localport=37482], receiveBufferSize=530904
   [junit4]   2> 614385 INFO  (qtp1245581253-7497) [    ] o.a.s.u.RandomMergePolicy RandomMergePolicy wrapping class org.apache.lucene.index.TieredMergePolicy: [TieredMergePolicy: maxMergeAtOnce=15, maxMergeAtOnceExplicit=34, maxMergedSegmentMB=33.2783203125, floorSegmentMB=1.6181640625, forceMergeDeletesPctAllowed=22.69249353926286, segmentsPerTier=37.0, maxCFSSegmentSizeMB=8.796093022207999E12, noCFSRatio=1.0
   [junit4]   2> 614400 INFO  (qtp1245581253-7500) [    ] o.a.s.u.DirectUpdateHandler2 No uncommitted changes. Skipping IW.commit.
   [junit4]   2> 614402 WARN  (qtp462186617-7449) [    ] o.a.s.c.RequestHandlers INVALID paramSet a in requestHandler {type = requestHandler,name = /dump,class = DumpRequestHandler,attributes = {initParams=a, name=/dump, class=DumpRequestHandler},args = {defaults={a=A,b=B}}}
   [junit4]   2> 614417 WARN  (qtp197758393-7537) [    ] o.a.s.c.RequestHandlers INVALID paramSet a in requestHandler {type = requestHandler,name = /dump,class = DumpRequestHandler,attributes = {initParams=a, name=/dump, class=DumpRequestHandler},args = {defaults={a=A,b=B}}}
   [junit4]   2> 614418 INFO  (qtp1245581253-7500) [    ] o.a.s.u.DirectUpdateHandler2 end_commit_flush
   [junit4]   2> 614418 INFO  (qtp1245581253-7500) [    ] o.a.s.u.p.LogUpdateProcessorFactory [collection1_shard2_replica_t41]  webapp= path=/update params={waitSearcher=true&openSearcher=false&commit=true&softCommit=false&commit_end_point=true&wt=javabin&version=2}{commit=} 0 38
   [junit4]   2> 614419 INFO  (SocketProxy-Acceptor-32937) [    ] o.a.s.c.SocketProxy accepted Socket[addr=/127.0.0.1,port=47458,localport=32937], receiveBufferSize:531000
   [junit4]   2> 614421 WARN  (qtp1245581253-7497) [    ] o.a.s.c.RequestHandlers INVALID paramSet a in requestHandler {type = requestHandler,name = /dump,class = DumpRequestHandler,attributes = {initParams=a, name=/dump, class=Dum

[...truncated too long message...]

> at com.carrotsearch.randomizedtesting.RandomizedRunner$7.evaluate(RandomizedRunner.java:863)
   [junit4]   2> at com.carrotsearch.randomizedtesting.rules.StatementAdapter.evaluate(StatementAdapter.java:36)
   [junit4]   2> at com.carrotsearch.randomizedtesting.rules.SystemPropertiesRestoreRule$1.evaluate(SystemPropertiesRestoreRule.java:57)
   [junit4]   2> at org.apache.lucene.util.AbstractBeforeAfterRule$1.evaluate(AbstractBeforeAfterRule.java:45)
   [junit4]   2> at com.carrotsearch.randomizedtesting.rules.StatementAdapter.evaluate(StatementAdapter.java:36)
   [junit4]   2> at org.apache.lucene.util.TestRuleStoreClassName$1.evaluate(TestRuleStoreClassName.java:41)
   [junit4]   2> at com.carrotsearch.randomizedtesting.rules.NoShadowingOrOverridesOnMethodsRule$1.evaluate(NoShadowingOrOverridesOnMethodsRule.java:40)
   [junit4]   2> at com.carrotsearch.randomizedtesting.rules.NoShadowingOrOverridesOnMethodsRule$1.evaluate(NoShadowingOrOverridesOnMethodsRule.java:40)
   [junit4]   2> at com.carrotsearch.randomizedtesting.rules.StatementAdapter.evaluate(StatementAdapter.java:36)
   [junit4]   2> at com.carrotsearch.randomizedtesting.rules.StatementAdapter.evaluate(StatementAdapter.java:36)
   [junit4]   2> at org.apache.lucene.util.TestRuleAssertionsRequired$1.evaluate(TestRuleAssertionsRequired.java:53)
   [junit4]   2> at org.apache.lucene.util.TestRuleMarkFailure$1.evaluate(TestRuleMarkFailure.java:47)
   [junit4]   2> at org.apache.lucene.util.TestRuleIgnoreAfterMaxFailures$1.evaluate(TestRuleIgnoreAfterMaxFailures.java:64)
   [junit4]   2> at org.apache.lucene.util.TestRuleIgnoreTestSuites$1.evaluate(TestRuleIgnoreTestSuites.java:54)
   [junit4]   2> at com.carrotsearch.randomizedtesting.rules.StatementAdapter.evaluate(StatementAdapter.java:36)
   [junit4]   2> at com.carrotsearch.randomizedtesting.ThreadLeakControl$StatementRunner.run(ThreadLeakControl.java:368)
   [junit4]   2> at java.base/java.lang.Thread.run(Thread.java:844)
   [junit4]   2>
   [junit4]   2> 1292050 INFO  (TEST-HardAutoCommitTest.testCommitWithin-seed#[58D72A5183124D9F]) [    ] o.a.s.SolrTestCaseJ4 ###Ending testCommitWithin
   [junit4]   2> NOTE: reproduce with: ant test  -Dtestcase=HardAutoCommitTest -Dtests.method=testCommitWithin -Dtests.seed=58D72A5183124D9F -Dtests.multiplier=3 -Dtests.slow=true -Dtests.locale=lg -Dtests.timezone=AET -Dtests.asserts=true -Dtests.file.encoding=UTF-8
   [junit4] ERROR   0.31s J2 | HardAutoCommitTest.testCommitWithin <<<
   [junit4]    > Throwable #1: java.lang.RuntimeException: Exception during query
   [junit4]    > at __randomizedtesting.SeedInfo.seed([58D72A5183124D9F:E2054529003CA38A]:0)
   [junit4]    > at org.apache.solr.SolrTestCaseJ4.assertQ(SolrTestCaseJ4.java:886)
   [junit4]    > at org.apache.solr.update.HardAutoCommitTest.testCommitWithin(HardAutoCommitTest.java:100)
   [junit4]    > at java.base/jdk.internal.reflect.NativeMethodAccessorImpl.invoke0(Native Method)
   [junit4]    > at java.base/jdk.internal.reflect.NativeMethodAccessorImpl.invoke(NativeMethodAccessorImpl.java:62)
   [junit4]    > at java.base/jdk.internal.reflect.DelegatingMethodAccessorImpl.invoke(DelegatingMethodAccessorImpl.java:43)
   [junit4]    > at java.base/java.lang.reflect.Method.invoke(Method.java:564)
   [junit4]    > at java.base/java.lang.Thread.run(Thread.java:844)
   [junit4]    > Caused by: java.lang.RuntimeException: REQUEST FAILED: xpath=//result[@numFound=1]
   [junit4]    > xml response was: <?xml version="1.0" encoding="UTF-8"?>
   [junit4]    > <response>
   [junit4]    > <lst name="responseHeader"><int name="status">0</int><int name="QTime">0</int></lst><result name="response" numFound="0" start="0"></result>
   [junit4]    > </response>
   [junit4]    > request was:q=id:529&qt=&start=0&rows=20&version=2.2
   [junit4]    > at org.apache.solr.SolrTestCaseJ4.assertQ(SolrTestCaseJ4.java:879)
   [junit4]    > ... 39 more
   [junit4]   2> 1292051 INFO  (SUITE-HardAutoCommitTest-seed#[58D72A5183124D9F]-worker) [    ] o.a.s.SolrTestCaseJ4 ###deleteCore
   [junit4]   2> 1292051 INFO  (SUITE-HardAutoCommitTest-seed#[58D72A5183124D9F]-worker) [    ] o.a.s.c.CoreContainer Shutting down CoreContainer instance=1160942937
   [junit4]   2> 1292052 INFO  (SUITE-HardAutoCommitTest-seed#[58D72A5183124D9F]-worker) [    ] o.a.s.m.SolrMetricManager Closing metric reporters for registry=solr.node, tag=null
   [junit4]   2> 1292053 INFO  (SUITE-HardAutoCommitTest-seed#[58D72A5183124D9F]-worker) [    ] o.a.s.m.SolrMetricManager Closing metric reporters for registry=solr.jvm, tag=null
   [junit4]   2> 1292054 INFO  (SUITE-HardAutoCommitTest-seed#[58D72A5183124D9F]-worker) [    ] o.a.s.m.SolrMetricManager Closing metric reporters for registry=solr.jetty, tag=null
   [junit4]   2> 1292058 INFO  (SUITE-HardAutoCommitTest-seed#[58D72A5183124D9F]-worker) [    ] o.a.s.c.TransientSolrCoreCacheDefault Allocating transient cache for 2147483647 transient cores
   [junit4]   2> 1292058 INFO  (coreCloseExecutor-5217-thread-1) [    ] o.a.s.c.SolrCore [collection1]  CLOSING SolrCore org.apache.solr.core.SolrCore@17b25810
   [junit4]   2> 1292058 INFO  (coreCloseExecutor-5217-thread-1) [    ] o.a.s.u.DirectUpdateHandler2 Committing on IndexWriter close.
   [junit4]   2> 1292059 INFO  (coreCloseExecutor-5217-thread-1) [    ] o.a.s.u.SolrIndexWriter Calling setCommitData with IW:org.apache.solr.update.SolrIndexWriter@5ed5f648 commitCommandVersion:0
   [junit4]   2> 1292079 INFO  (coreCloseExecutor-5217-thread-1) [    ] o.a.s.m.SolrMetricManager Closing metric reporters for registry=solr.core.collection1, tag=397563920
   [junit4]   2> NOTE: leaving temporary files on disk at: /home/jenkins/workspace/Lucene-Solr-master-Linux/solr/build/solr-core/test/J2/temp/solr.update.HardAutoCommitTest_58D72A5183124D9F-001
   [junit4]   2> NOTE: test params are: codec=Asserting(Lucene70): {field_t=Lucene50(blocksize=128), multiDefault=PostingsFormat(name=Direct), subject=PostingsFormat(name=Direct), id=FSTOrd50, text=Lucene50(blocksize=128)}, docValues:{range_facet_l_dv=DocValuesFormat(name=Lucene70), _version_=DocValuesFormat(name=Asserting), intDefault=DocValuesFormat(name=Asserting), id_i1=DocValuesFormat(name=Lucene70), range_facet_i_dv=DocValuesFormat(name=Asserting), intDvoDefault=DocValuesFormat(name=Memory), range_facet_l=DocValuesFormat(name=Asserting), timestamp=DocValuesFormat(name=Asserting)}, maxPointsInLeafNode=1991, maxMBSortInHeap=7.314410729496723, sim=RandomSimilarity(queryNorm=true): {}, locale=lg, timezone=AET
   [junit4]   2> NOTE: Linux 4.10.0-27-generic amd64/Oracle Corporation 9 (64-bit)/cpus=8,threads=1,free=124217848,total=518979584
   [junit4]   2> NOTE: All tests run in this JVM: [VMParamsZkACLAndCredentialsProvidersTest, SolrCloudReportersTest, AutoCommitTest, SortByFunctionTest, TestPKIAuthenticationPlugin, TestPointFields, HdfsChaosMonkeySafeLeaderTest, CollectionReloadTest, RegexBoostProcessorTest, TestNonDefinedSimilarityFactory, TestExclusionRuleCollectionAccess, CloneFieldUpdateProcessorFactoryTest, ShowFileRequestHandlerTest, ReturnFieldsTest, TestSolrCloudWithSecureImpersonation, TestGroupingSearch, DirectUpdateHandlerTest, SmileWriterTest, TestSizeLimitedDistributedMap, SimpleMLTQParserTest, V2StandaloneTest, TestMultiValuedNumericRangeQuery, TestConfigSetProperties, TestPrepRecovery, OverseerStatusTest, TestZkChroot, TestStressReorder, TestBlobHandler, LeaderFailureAfterFreshStartTest, TestSSLRandomization, BadIndexSchemaTest, ConjunctionSolrSpellCheckerTest, SolrCLIZkUtilsTest, TestLockTree, DirectUpdateHandlerOptimizeTest, RecoveryZkTest, AsyncCallRequestStatusResponseTest, TestReload, SuggestComponentContextFilterQueryTest, TestJmxIntegration, NodeMutatorTest, TestExportWriter, TestDefaultStatsCache, TestQueryUtils, TestReloadAndDeleteDocs, BigEndianAscendingWordDeserializerTest, TestReversedWildcardFilterFactory, TestTolerantUpdateProcessorRandomCloud, OverseerCollectionConfigSetProcessorTest, SuggesterTest, PropertiesRequestHandlerTest, TestComplexPhraseQParserPlugin, TestTestInjection, SimplePostToolTest, FastVectorHighlighterTest, FullSolrCloudDistribCmdsTest, ManagedSchemaRoundRobinCloudTest, TestDeleteCollectionOnDownNodes, TestManagedResource, TestBlendedInfixSuggestions, TestInPlaceUpdatesStandalone, NotRequiredUniqueKeyTest, TestSuggestSpellingConverter, XsltUpdateRequestHandlerTest, PingRequestHandlerTest, DeleteNodeTest, TestJsonFacets, DistribJoinFromCollectionTest, PreAnalyzedFieldTest, TestObjectReleaseTracker, TemplateUpdateProcessorTest, BlockJoinFacetRandomTest, PathHierarchyTokenizerFactoryTest, PeerSyncWithIndexFingerprintCachingTest, StatsReloadRaceTest, MinimalSchemaTest, TestInfoStreamLogging, SimpleFacetsTest, TestReplicationHandlerBackup, RecoveryAfterSoftCommitTest, StatsComponentTest, TestBulkSchemaAPI, TestQuerySenderListener, TestQueryWrapperFilter, DistributedExpandComponentTest, SolrInfoBeanTest, HdfsBasicDistributedZk2Test, URLClassifyProcessorTest, TestSearcherReuse, TestLFUCache, TestCloudNestedDocsSort, MigrateRouteKeyTest, TestCollectionAPI, SpatialRPTFieldTypeTest, BufferStoreTest, TestSolrCoreSnapshots, TestDynamicFieldResource, TestDelegationWithHadoopAuth, TestTolerantSearch, TestManagedSynonymFilterFactory, TestScoreJoinQPScore, SolrTestCaseJ4Test, TestTrie, DocValuesNotIndexedTest, HdfsUnloadDistributedZkTest, TestRandomFlRTGCloud, TestIndexSearcher, TestNumericTerms64, TestPseudoReturnFields, SolrCoreCheckLockOnStartupTest, SolrMetricReporterTest, OverseerTest, TestSort, PolyFieldTest, CdcrReplicationDistributedZkTest, ReplicationFactorTest, ChaosMonkeySafeLeaderTest, BasicDistributedZk2Test, UnloadDistributedZkTest, OpenCloseCoreStressTest, LeaderElectionIntegrationTest, TestReplicationHandler, LeaderElectionTest, TestRandomDVFaceting, TestDistributedGrouping, TestFaceting, TestRecovery, TestRealTimeGet, HardAutoCommitTest]
   [junit4] Completed [385/729 (2!)] on J2 in 0.90s, 1 test, 1 error <<< FAILURES!

[...truncated 37701 lines...]


---------------------------------------------------------------------
To unsubscribe, e-mail: [hidden email]
For additional commands, e-mail: [hidden email]
Loading...