[JENKINS] Lucene-Solr-4.x-Linux (32bit/jdk1.6.0_45) - Build # 5730 - Failure!

classic Classic list List threaded Threaded
1 message Options
Reply | Threaded
Open this post in threaded view
|

[JENKINS] Lucene-Solr-4.x-Linux (32bit/jdk1.6.0_45) - Build # 5730 - Failure!

Policeman Jenkins Server-2
Build: http://jenkins.thetaphi.de/job/Lucene-Solr-4.x-Linux/5730/
Java: 32bit/jdk1.6.0_45 -client -XX:+UseConcMarkSweepGC

1 tests failed.
REGRESSION:  org.apache.solr.cloud.CollectionsAPIDistributedZkTest.testDistribSearch

Error Message:
There are still nodes recoverying - waited for 230 seconds

Stack Trace:
java.lang.AssertionError: There are still nodes recoverying - waited for 230 seconds
        at __randomizedtesting.SeedInfo.seed([B296600366B56EC4:3370EE1B11EA0EF8]:0)
        at org.junit.Assert.fail(Assert.java:93)
        at org.apache.solr.cloud.AbstractDistribZkTestBase.waitForRecoveriesToFinish(AbstractDistribZkTestBase.java:173)
        at org.apache.solr.cloud.AbstractDistribZkTestBase.waitForRecoveriesToFinish(AbstractDistribZkTestBase.java:131)
        at org.apache.solr.cloud.AbstractDistribZkTestBase.waitForRecoveriesToFinish(AbstractDistribZkTestBase.java:126)
        at org.apache.solr.cloud.CollectionsAPIDistributedZkTest.testCollectionsAPI(CollectionsAPIDistributedZkTest.java:512)
        at org.apache.solr.cloud.CollectionsAPIDistributedZkTest.doTest(CollectionsAPIDistributedZkTest.java:146)
        at org.apache.solr.BaseDistributedSearchTestCase.testDistribSearch(BaseDistributedSearchTestCase.java:815)
        at sun.reflect.NativeMethodAccessorImpl.invoke0(Native Method)
        at sun.reflect.NativeMethodAccessorImpl.invoke(NativeMethodAccessorImpl.java:39)
        at sun.reflect.DelegatingMethodAccessorImpl.invoke(DelegatingMethodAccessorImpl.java:25)
        at java.lang.reflect.Method.invoke(Method.java:597)
        at com.carrotsearch.randomizedtesting.RandomizedRunner.invoke(RandomizedRunner.java:1559)
        at com.carrotsearch.randomizedtesting.RandomizedRunner.access$600(RandomizedRunner.java:79)
        at com.carrotsearch.randomizedtesting.RandomizedRunner$6.evaluate(RandomizedRunner.java:737)
        at com.carrotsearch.randomizedtesting.RandomizedRunner$7.evaluate(RandomizedRunner.java:773)
        at com.carrotsearch.randomizedtesting.RandomizedRunner$8.evaluate(RandomizedRunner.java:787)
        at com.carrotsearch.randomizedtesting.rules.SystemPropertiesRestoreRule$1.evaluate(SystemPropertiesRestoreRule.java:53)
        at org.apache.lucene.util.TestRuleSetupTeardownChained$1.evaluate(TestRuleSetupTeardownChained.java:50)
        at org.apache.lucene.util.TestRuleFieldCacheSanity$1.evaluate(TestRuleFieldCacheSanity.java:51)
        at org.apache.lucene.util.AbstractBeforeAfterRule$1.evaluate(AbstractBeforeAfterRule.java:46)
        at com.carrotsearch.randomizedtesting.rules.SystemPropertiesInvariantRule$1.evaluate(SystemPropertiesInvariantRule.java:55)
        at org.apache.lucene.util.TestRuleThreadAndTestName$1.evaluate(TestRuleThreadAndTestName.java:49)
        at org.apache.lucene.util.TestRuleIgnoreAfterMaxFailures$1.evaluate(TestRuleIgnoreAfterMaxFailures.java:70)
        at org.apache.lucene.util.TestRuleMarkFailure$1.evaluate(TestRuleMarkFailure.java:48)
        at com.carrotsearch.randomizedtesting.rules.StatementAdapter.evaluate(StatementAdapter.java:36)
        at com.carrotsearch.randomizedtesting.ThreadLeakControl$StatementRunner.run(ThreadLeakControl.java:358)
        at com.carrotsearch.randomizedtesting.ThreadLeakControl.forkTimeoutingTask(ThreadLeakControl.java:782)
        at com.carrotsearch.randomizedtesting.ThreadLeakControl$3.evaluate(ThreadLeakControl.java:442)
        at com.carrotsearch.randomizedtesting.RandomizedRunner.runSingleTest(RandomizedRunner.java:746)
        at com.carrotsearch.randomizedtesting.RandomizedRunner$3.evaluate(RandomizedRunner.java:648)
        at com.carrotsearch.randomizedtesting.RandomizedRunner$4.evaluate(RandomizedRunner.java:682)
        at com.carrotsearch.randomizedtesting.RandomizedRunner$5.evaluate(RandomizedRunner.java:693)
        at com.carrotsearch.randomizedtesting.rules.StatementAdapter.evaluate(StatementAdapter.java:36)
        at com.carrotsearch.randomizedtesting.rules.SystemPropertiesRestoreRule$1.evaluate(SystemPropertiesRestoreRule.java:53)
        at org.apache.lucene.util.AbstractBeforeAfterRule$1.evaluate(AbstractBeforeAfterRule.java:46)
        at org.apache.lucene.util.TestRuleStoreClassName$1.evaluate(TestRuleStoreClassName.java:42)
        at com.carrotsearch.randomizedtesting.rules.SystemPropertiesInvariantRule$1.evaluate(SystemPropertiesInvariantRule.java:55)
        at com.carrotsearch.randomizedtesting.rules.NoShadowingOrOverridesOnMethodsRule$1.evaluate(NoShadowingOrOverridesOnMethodsRule.java:39)
        at com.carrotsearch.randomizedtesting.rules.NoShadowingOrOverridesOnMethodsRule$1.evaluate(NoShadowingOrOverridesOnMethodsRule.java:39)
        at com.carrotsearch.randomizedtesting.rules.StatementAdapter.evaluate(StatementAdapter.java:36)
        at org.apache.lucene.util.TestRuleAssertionsRequired$1.evaluate(TestRuleAssertionsRequired.java:43)
        at org.apache.lucene.util.TestRuleMarkFailure$1.evaluate(TestRuleMarkFailure.java:48)
        at org.apache.lucene.util.TestRuleIgnoreAfterMaxFailures$1.evaluate(TestRuleIgnoreAfterMaxFailures.java:70)
        at org.apache.lucene.util.TestRuleIgnoreTestSuites$1.evaluate(TestRuleIgnoreTestSuites.java:55)
        at com.carrotsearch.randomizedtesting.rules.StatementAdapter.evaluate(StatementAdapter.java:36)
        at com.carrotsearch.randomizedtesting.ThreadLeakControl$StatementRunner.run(ThreadLeakControl.java:358)
        at java.lang.Thread.run(Thread.java:662)




Build Log:
[...truncated 9095 lines...]
[junit4:junit4] Suite: org.apache.solr.cloud.CollectionsAPIDistributedZkTest
[junit4:junit4]   2> 662568 T2014 oas.BaseDistributedSearchTestCase.initHostContext Setting hostContext system property: /_ozv/vs
[junit4:junit4]   2> 662571 T2014 oas.SolrTestCaseJ4.setUp ###Starting testDistribSearch
[junit4:junit4]   2> Creating dataDir: /mnt/ssd/jenkins/workspace/Lucene-Solr-4.x-Linux/solr/build/solr-core/test/J1/./solrtest-CollectionsAPIDistributedZkTest-1369312517869
[junit4:junit4]   2> 662572 T2014 oasc.ZkTestServer.run STARTING ZK TEST SERVER
[junit4:junit4]   2> 662573 T2015 oasc.ZkTestServer$ZKServerMain.runFromConfig Starting server
[junit4:junit4]   2> 662673 T2014 oasc.ZkTestServer.run start zk server on port:59838
[junit4:junit4]   2> 662675 T2014 oascc.ConnectionManager.waitForConnected Waiting for client to connect to ZooKeeper
[junit4:junit4]   2> 662774 T2021 oascc.ConnectionManager.process Watcher org.apache.solr.common.cloud.ConnectionManager@6c9b94 name:ZooKeeperConnection Watcher:127.0.0.1:59838 got event WatchedEvent state:SyncConnected type:None path:null path:null type:None
[junit4:junit4]   2> 662775 T2014 oascc.ConnectionManager.waitForConnected Client is connected to ZooKeeper
[junit4:junit4]   2> 662775 T2014 oascc.SolrZkClient.makePath makePath: /solr
[junit4:junit4]   2> 662779 T2014 oascc.ConnectionManager.waitForConnected Waiting for client to connect to ZooKeeper
[junit4:junit4]   2> 662781 T2023 oascc.ConnectionManager.process Watcher org.apache.solr.common.cloud.ConnectionManager@169b1ef name:ZooKeeperConnection Watcher:127.0.0.1:59838/solr got event WatchedEvent state:SyncConnected type:None path:null path:null type:None
[junit4:junit4]   2> 662781 T2014 oascc.ConnectionManager.waitForConnected Client is connected to ZooKeeper
[junit4:junit4]   2> 662781 T2014 oascc.SolrZkClient.makePath makePath: /collections/collection1
[junit4:junit4]   2> 662784 T2014 oascc.SolrZkClient.makePath makePath: /collections/collection1/shards
[junit4:junit4]   2> 662785 T2014 oascc.SolrZkClient.makePath makePath: /collections/control_collection
[junit4:junit4]   2> 662787 T2014 oascc.SolrZkClient.makePath makePath: /collections/control_collection/shards
[junit4:junit4]   2> 662789 T2014 oasc.AbstractZkTestCase.putConfig put /mnt/ssd/jenkins/workspace/Lucene-Solr-4.x-Linux/solr/build/solr-core/test-files/solr/collection1/conf/solrconfig-tlog.xml to /configs/conf1/solrconfig.xml
[junit4:junit4]   2> 662789 T2014 oascc.SolrZkClient.makePath makePath: /configs/conf1/solrconfig.xml
[junit4:junit4]   2> 662792 T2014 oasc.AbstractZkTestCase.putConfig put /mnt/ssd/jenkins/workspace/Lucene-Solr-4.x-Linux/solr/build/solr-core/test-files/solr/collection1/conf/schema.xml to /configs/conf1/schema.xml
[junit4:junit4]   2> 662793 T2014 oascc.SolrZkClient.makePath makePath: /configs/conf1/schema.xml
[junit4:junit4]   2> 662795 T2014 oasc.AbstractZkTestCase.putConfig put /mnt/ssd/jenkins/workspace/Lucene-Solr-4.x-Linux/solr/build/solr-core/test-files/solr/collection1/conf/stopwords.txt to /configs/conf1/stopwords.txt
[junit4:junit4]   2> 662795 T2014 oascc.SolrZkClient.makePath makePath: /configs/conf1/stopwords.txt
[junit4:junit4]   2> 662797 T2014 oasc.AbstractZkTestCase.putConfig put /mnt/ssd/jenkins/workspace/Lucene-Solr-4.x-Linux/solr/build/solr-core/test-files/solr/collection1/conf/protwords.txt to /configs/conf1/protwords.txt
[junit4:junit4]   2> 662798 T2014 oascc.SolrZkClient.makePath makePath: /configs/conf1/protwords.txt
[junit4:junit4]   2> 662799 T2014 oasc.AbstractZkTestCase.putConfig put /mnt/ssd/jenkins/workspace/Lucene-Solr-4.x-Linux/solr/build/solr-core/test-files/solr/collection1/conf/currency.xml to /configs/conf1/currency.xml
[junit4:junit4]   2> 662800 T2014 oascc.SolrZkClient.makePath makePath: /configs/conf1/currency.xml
[junit4:junit4]   2> 662802 T2014 oasc.AbstractZkTestCase.putConfig put /mnt/ssd/jenkins/workspace/Lucene-Solr-4.x-Linux/solr/build/solr-core/test-files/solr/collection1/conf/open-exchange-rates.json to /configs/conf1/open-exchange-rates.json
[junit4:junit4]   2> 662802 T2014 oascc.SolrZkClient.makePath makePath: /configs/conf1/open-exchange-rates.json
[junit4:junit4]   2> 662804 T2014 oasc.AbstractZkTestCase.putConfig put /mnt/ssd/jenkins/workspace/Lucene-Solr-4.x-Linux/solr/build/solr-core/test-files/solr/collection1/conf/mapping-ISOLatin1Accent.txt to /configs/conf1/mapping-ISOLatin1Accent.txt
[junit4:junit4]   2> 662805 T2014 oascc.SolrZkClient.makePath makePath: /configs/conf1/mapping-ISOLatin1Accent.txt
[junit4:junit4]   2> 662807 T2014 oasc.AbstractZkTestCase.putConfig put /mnt/ssd/jenkins/workspace/Lucene-Solr-4.x-Linux/solr/build/solr-core/test-files/solr/collection1/conf/old_synonyms.txt to /configs/conf1/old_synonyms.txt
[junit4:junit4]   2> 662807 T2014 oascc.SolrZkClient.makePath makePath: /configs/conf1/old_synonyms.txt
[junit4:junit4]   2> 662809 T2014 oasc.AbstractZkTestCase.putConfig put /mnt/ssd/jenkins/workspace/Lucene-Solr-4.x-Linux/solr/build/solr-core/test-files/solr/collection1/conf/synonyms.txt to /configs/conf1/synonyms.txt
[junit4:junit4]   2> 662810 T2014 oascc.SolrZkClient.makePath makePath: /configs/conf1/synonyms.txt
[junit4:junit4]   2> 662881 T2014 oejs.Server.doStart jetty-8.1.10.v20130312
[junit4:junit4]   2> 662884 T2014 oejs.AbstractConnector.doStart Started SelectChannelConnector@127.0.0.1:42419
[junit4:junit4]   2> 662884 T2014 oass.SolrDispatchFilter.init SolrDispatchFilter.init()
[junit4:junit4]   2> 662885 T2014 oasc.SolrResourceLoader.locateSolrHome JNDI not configured for solr (NoInitialContextEx)
[junit4:junit4]   2> 662885 T2014 oasc.SolrResourceLoader.locateSolrHome using system property solr.solr.home: /mnt/ssd/jenkins/workspace/Lucene-Solr-4.x-Linux/solr/build/solr-core/test/J1/./org.apache.solr.cloud.CollectionsAPIDistributedZkTest-controljetty-1369312518109
[junit4:junit4]   2> 662886 T2014 oasc.CoreContainer$Initializer.initialize looking for solr config file: /mnt/ssd/jenkins/workspace/Lucene-Solr-4.x-Linux/solr/build/solr-core/test/J1/./org.apache.solr.cloud.CollectionsAPIDistributedZkTest-controljetty-1369312518109/solr.xml
[junit4:junit4]   2> 662886 T2014 oasc.CoreContainer.<init> New CoreContainer 19076921
[junit4:junit4]   2> 662886 T2014 oasc.CoreContainer.load Loading CoreContainer using Solr Home: '/mnt/ssd/jenkins/workspace/Lucene-Solr-4.x-Linux/solr/build/solr-core/test/J1/./org.apache.solr.cloud.CollectionsAPIDistributedZkTest-controljetty-1369312518109/'
[junit4:junit4]   2> 662887 T2014 oasc.SolrResourceLoader.<init> new SolrResourceLoader for directory: '/mnt/ssd/jenkins/workspace/Lucene-Solr-4.x-Linux/solr/build/solr-core/test/J1/./org.apache.solr.cloud.CollectionsAPIDistributedZkTest-controljetty-1369312518109/'
[junit4:junit4]   2> 662951 T2014 oasc.SolrCoreDiscoverer.walkFromHere Looking for cores in /mnt/ssd/jenkins/workspace/Lucene-Solr-4.x-Linux/solr/build/solr-core/test/J1/org.apache.solr.cloud.CollectionsAPIDistributedZkTest-controljetty-1369312518109
[junit4:junit4]   2> 662952 T2014 oasc.SolrCoreDiscoverer.walkFromHere Looking for cores in /mnt/ssd/jenkins/workspace/Lucene-Solr-4.x-Linux/solr/build/solr-core/test/J1/org.apache.solr.cloud.CollectionsAPIDistributedZkTest-controljetty-1369312518109/collection1
[junit4:junit4]   2> 662952 T2014 oasc.SolrCoreDiscoverer.walkFromHere Looking for cores in /mnt/ssd/jenkins/workspace/Lucene-Solr-4.x-Linux/solr/build/solr-core/test/J1/org.apache.solr.cloud.CollectionsAPIDistributedZkTest-controljetty-1369312518109/collection1/conf
[junit4:junit4]   2> 662958 T2014 oasc.SolrCoreDiscoverer.walkFromHere Looking for cores in /mnt/ssd/jenkins/workspace/Lucene-Solr-4.x-Linux/solr/build/solr-core/test/J1/org.apache.solr.cloud.CollectionsAPIDistributedZkTest-controljetty-1369312518109/collection1/conf/xslt
[junit4:junit4]   2> 662976 T2014 oasc.SolrCoreDiscoverer.walkFromHere Looking for cores in /mnt/ssd/jenkins/workspace/Lucene-Solr-4.x-Linux/solr/build/solr-core/test/J1/org.apache.solr.cloud.CollectionsAPIDistributedZkTest-controljetty-1369312518109/collection1/lib
[junit4:junit4]   2> 662977 T2014 oasc.SolrCoreDiscoverer.walkFromHere Looking for cores in /mnt/ssd/jenkins/workspace/Lucene-Solr-4.x-Linux/solr/build/solr-core/test/J1/org.apache.solr.cloud.CollectionsAPIDistributedZkTest-controljetty-1369312518109/collection1/lib/classes
[junit4:junit4]   2> 662979 T2014 oasc.SolrCoreDiscoverer.addCore Discovered properties file /mnt/ssd/jenkins/workspace/Lucene-Solr-4.x-Linux/solr/build/solr-core/test/J1/./org.apache.solr.cloud.CollectionsAPIDistributedZkTest-controljetty-1369312518109/conf/core.properties, adding to cores
[junit4:junit4]   2> 662981 T2014 oashc.HttpShardHandlerFactory.getParameter Setting socketTimeout to: 0
[junit4:junit4]   2> 662981 T2014 oashc.HttpShardHandlerFactory.getParameter Setting urlScheme to: http://
[junit4:junit4]   2> 662982 T2014 oashc.HttpShardHandlerFactory.getParameter Setting connTimeout to: 0
[junit4:junit4]   2> 662982 T2014 oashc.HttpShardHandlerFactory.getParameter Setting maxConnectionsPerHost to: 20
[junit4:junit4]   2> 662983 T2014 oashc.HttpShardHandlerFactory.getParameter Setting corePoolSize to: 0
[junit4:junit4]   2> 662983 T2014 oashc.HttpShardHandlerFactory.getParameter Setting maximumPoolSize to: 2147483647
[junit4:junit4]   2> 662983 T2014 oashc.HttpShardHandlerFactory.getParameter Setting maxThreadIdleTime to: 5
[junit4:junit4]   2> 662984 T2014 oashc.HttpShardHandlerFactory.getParameter Setting sizeOfQueue to: -1
[junit4:junit4]   2> 662984 T2014 oashc.HttpShardHandlerFactory.getParameter Setting fairnessPolicy to: false
[junit4:junit4]   2> 662985 T2014 oascsi.HttpClientUtil.createClient Creating new http client, config:maxConnectionsPerHost=20&maxConnections=10000&socketTimeout=0&connTimeout=0&retry=false
[junit4:junit4]   2> 662988 T2014 oasl.LogWatcher.newRegisteredLogWatcher Registering Log Listener
[junit4:junit4]   2> 662988 T2014 oasc.ZkContainer.initZooKeeper Zookeeper client=127.0.0.1:59838/solr
[junit4:junit4]   2> 662989 T2014 oasc.ZkController.checkChrootPath zkHost includes chroot
[junit4:junit4]   2> 662990 T2014 oascc.ConnectionManager.waitForConnected Waiting for client to connect to ZooKeeper
[junit4:junit4]   2> 662992 T2034 oascc.ConnectionManager.process Watcher org.apache.solr.common.cloud.ConnectionManager@15b73de name:ZooKeeperConnection Watcher:127.0.0.1:59838 got event WatchedEvent state:SyncConnected type:None path:null path:null type:None
[junit4:junit4]   2> 662993 T2014 oascc.ConnectionManager.waitForConnected Client is connected to ZooKeeper
[junit4:junit4]   2> 662994 T2014 oascsi.HttpClientUtil.createClient Creating new http client, config:maxConnections=500&maxConnectionsPerHost=16&socketTimeout=120000&connTimeout=15000
[junit4:junit4]   2> 663006 T2014 oascc.ConnectionManager.waitForConnected Waiting for client to connect to ZooKeeper
[junit4:junit4]   2> 663008 T2036 oascc.ConnectionManager.process Watcher org.apache.solr.common.cloud.ConnectionManager@337db2 name:ZooKeeperConnection Watcher:127.0.0.1:59838/solr got event WatchedEvent state:SyncConnected type:None path:null path:null type:None
[junit4:junit4]   2> 663008 T2014 oascc.ConnectionManager.waitForConnected Client is connected to ZooKeeper
[junit4:junit4]   2> 663010 T2014 oascc.SolrZkClient.makePath makePath: /overseer/queue
[junit4:junit4]   2> 663012 T2014 oascc.SolrZkClient.makePath makePath: /overseer/collection-queue-work
[junit4:junit4]   2> 663014 T2014 oascc.SolrZkClient.makePath makePath: /live_nodes
[junit4:junit4]   2> 663016 T2014 oasc.ZkController.createEphemeralLiveNode Register node as live in ZooKeeper:/live_nodes/127.0.0.1:42419__ozv%2Fvs
[junit4:junit4]   2> 663017 T2014 oascc.SolrZkClient.makePath makePath: /live_nodes/127.0.0.1:42419__ozv%2Fvs
[junit4:junit4]   2> 663019 T2014 oascc.SolrZkClient.makePath makePath: /overseer_elect/election
[junit4:junit4]   2> 663023 T2014 oascc.SolrZkClient.makePath makePath: /overseer_elect/leader
[junit4:junit4]   2> 663024 T2014 oasc.Overseer.start Overseer (id=89739265171193859-127.0.0.1:42419__ozv%2Fvs-n_0000000000) starting
[junit4:junit4]   2> 663027 T2014 oascc.SolrZkClient.makePath makePath: /overseer/queue-work
[junit4:junit4]   2> 663029 T2038 oasc.OverseerCollectionProcessor.run Process current queue of collection creations
[junit4:junit4]   2> 663030 T2014 oascc.SolrZkClient.makePath makePath: /clusterstate.json
[junit4:junit4]   2> 663031 T2014 oascc.SolrZkClient.makePath makePath: /aliases.json
[junit4:junit4]   2> 663032 T2014 oascc.ZkStateReader.createClusterStateWatchersAndUpdate Updating cluster state from ZooKeeper...
[junit4:junit4]   2> 663034 T2037 oasc.Overseer$ClusterStateUpdater.run Starting to work on the main queue
[junit4:junit4]   2> 663036 T2014 oass.SolrDispatchFilter.init user.dir=/mnt/ssd/jenkins/workspace/Lucene-Solr-4.x-Linux/solr/build/solr-core/test/J1
[junit4:junit4]   2> 663036 T2014 oass.SolrDispatchFilter.init SolrDispatchFilter.init() done
[junit4:junit4]   2> 663037 T2014 oascsi.HttpClientUtil.createClient Creating new http client, config:maxConnections=128&maxConnectionsPerHost=32&followRedirects=false
[junit4:junit4]   2> 663039 T2014 oascsi.HttpClientUtil.createClient Creating new http client, config:
[junit4:junit4]   2> 663040 T2014 oascc.ConnectionManager.waitForConnected Waiting for client to connect to ZooKeeper
[junit4:junit4]   2> 663042 T2041 oascc.ConnectionManager.process Watcher org.apache.solr.common.cloud.ConnectionManager@1dfe6a7 name:ZooKeeperConnection Watcher:127.0.0.1:59838/solr got event WatchedEvent state:SyncConnected type:None path:null path:null type:None
[junit4:junit4]   2> 663042 T2014 oascc.ConnectionManager.waitForConnected Client is connected to ZooKeeper
[junit4:junit4]   2> 663043 T2014 oascc.ZkStateReader.createClusterStateWatchersAndUpdate Updating cluster state from ZooKeeper...
[junit4:junit4]   2> 663045 T2014 oasc.ChaosMonkey.monkeyLog monkey: init - expire sessions:true cause connection loss:true
[junit4:junit4]   2> 663115 T2014 oejs.Server.doStart jetty-8.1.10.v20130312
[junit4:junit4]   2> 663117 T2014 oejs.AbstractConnector.doStart Started SelectChannelConnector@127.0.0.1:46482
[junit4:junit4]   2> 663117 T2014 oass.SolrDispatchFilter.init SolrDispatchFilter.init()
[junit4:junit4]   2> 663118 T2014 oasc.SolrResourceLoader.locateSolrHome JNDI not configured for solr (NoInitialContextEx)
[junit4:junit4]   2> 663118 T2014 oasc.SolrResourceLoader.locateSolrHome using system property solr.solr.home: /mnt/ssd/jenkins/workspace/Lucene-Solr-4.x-Linux/solr/build/solr-core/test/J1/./org.apache.solr.cloud.CollectionsAPIDistributedZkTest-jetty1-1369312518342
[junit4:junit4]   2> 663119 T2014 oasc.CoreContainer$Initializer.initialize looking for solr config file: /mnt/ssd/jenkins/workspace/Lucene-Solr-4.x-Linux/solr/build/solr-core/test/J1/./org.apache.solr.cloud.CollectionsAPIDistributedZkTest-jetty1-1369312518342/solr.xml
[junit4:junit4]   2> 663119 T2014 oasc.CoreContainer.<init> New CoreContainer 33456233
[junit4:junit4]   2> 663119 T2014 oasc.CoreContainer.load Loading CoreContainer using Solr Home: '/mnt/ssd/jenkins/workspace/Lucene-Solr-4.x-Linux/solr/build/solr-core/test/J1/./org.apache.solr.cloud.CollectionsAPIDistributedZkTest-jetty1-1369312518342/'
[junit4:junit4]   2> 663120 T2014 oasc.SolrResourceLoader.<init> new SolrResourceLoader for directory: '/mnt/ssd/jenkins/workspace/Lucene-Solr-4.x-Linux/solr/build/solr-core/test/J1/./org.apache.solr.cloud.CollectionsAPIDistributedZkTest-jetty1-1369312518342/'
[junit4:junit4]   2> 663198 T2014 oasc.SolrCoreDiscoverer.walkFromHere Looking for cores in /mnt/ssd/jenkins/workspace/Lucene-Solr-4.x-Linux/solr/build/solr-core/test/J1/org.apache.solr.cloud.CollectionsAPIDistributedZkTest-jetty1-1369312518342
[junit4:junit4]   2> 663199 T2014 oasc.SolrCoreDiscoverer.walkFromHere Looking for cores in /mnt/ssd/jenkins/workspace/Lucene-Solr-4.x-Linux/solr/build/solr-core/test/J1/org.apache.solr.cloud.CollectionsAPIDistributedZkTest-jetty1-1369312518342/collection1
[junit4:junit4]   2> 663200 T2014 oasc.SolrCoreDiscoverer.walkFromHere Looking for cores in /mnt/ssd/jenkins/workspace/Lucene-Solr-4.x-Linux/solr/build/solr-core/test/J1/org.apache.solr.cloud.CollectionsAPIDistributedZkTest-jetty1-1369312518342/collection1/conf
[junit4:junit4]   2> 663205 T2014 oasc.SolrCoreDiscoverer.walkFromHere Looking for cores in /mnt/ssd/jenkins/workspace/Lucene-Solr-4.x-Linux/solr/build/solr-core/test/J1/org.apache.solr.cloud.CollectionsAPIDistributedZkTest-jetty1-1369312518342/collection1/conf/xslt
[junit4:junit4]   2> 663225 T2014 oasc.SolrCoreDiscoverer.walkFromHere Looking for cores in /mnt/ssd/jenkins/workspace/Lucene-Solr-4.x-Linux/solr/build/solr-core/test/J1/org.apache.solr.cloud.CollectionsAPIDistributedZkTest-jetty1-1369312518342/collection1/lib
[junit4:junit4]   2> 663226 T2014 oasc.SolrCoreDiscoverer.walkFromHere Looking for cores in /mnt/ssd/jenkins/workspace/Lucene-Solr-4.x-Linux/solr/build/solr-core/test/J1/org.apache.solr.cloud.CollectionsAPIDistributedZkTest-jetty1-1369312518342/collection1/lib/classes
[junit4:junit4]   2> 663227 T2014 oasc.SolrCoreDiscoverer.addCore Discovered properties file /mnt/ssd/jenkins/workspace/Lucene-Solr-4.x-Linux/solr/build/solr-core/test/J1/./org.apache.solr.cloud.CollectionsAPIDistributedZkTest-jetty1-1369312518342/conf/core.properties, adding to cores
[junit4:junit4]   2> 663230 T2014 oashc.HttpShardHandlerFactory.getParameter Setting socketTimeout to: 0
[junit4:junit4]   2> 663230 T2014 oashc.HttpShardHandlerFactory.getParameter Setting urlScheme to: http://
[junit4:junit4]   2> 663231 T2014 oashc.HttpShardHandlerFactory.getParameter Setting connTimeout to: 0
[junit4:junit4]   2> 663231 T2014 oashc.HttpShardHandlerFactory.getParameter Setting maxConnectionsPerHost to: 20
[junit4:junit4]   2> 663231 T2014 oashc.HttpShardHandlerFactory.getParameter Setting corePoolSize to: 0
[junit4:junit4]   2> 663232 T2014 oashc.HttpShardHandlerFactory.getParameter Setting maximumPoolSize to: 2147483647
[junit4:junit4]   2> 663232 T2014 oashc.HttpShardHandlerFactory.getParameter Setting maxThreadIdleTime to: 5
[junit4:junit4]   2> 663233 T2014 oashc.HttpShardHandlerFactory.getParameter Setting sizeOfQueue to: -1
[junit4:junit4]   2> 663233 T2014 oashc.HttpShardHandlerFactory.getParameter Setting fairnessPolicy to: false
[junit4:junit4]   2> 663233 T2014 oascsi.HttpClientUtil.createClient Creating new http client, config:maxConnectionsPerHost=20&maxConnections=10000&socketTimeout=0&connTimeout=0&retry=false
[junit4:junit4]   2> 663236 T2014 oasl.LogWatcher.newRegisteredLogWatcher Registering Log Listener
[junit4:junit4]   2> 663237 T2014 oasc.ZkContainer.initZooKeeper Zookeeper client=127.0.0.1:59838/solr
[junit4:junit4]   2> 663237 T2014 oasc.ZkController.checkChrootPath zkHost includes chroot
[junit4:junit4]   2> 663238 T2014 oascc.ConnectionManager.waitForConnected Waiting for client to connect to ZooKeeper
[junit4:junit4]   2> 663241 T2052 oascc.ConnectionManager.process Watcher org.apache.solr.common.cloud.ConnectionManager@1082422 name:ZooKeeperConnection Watcher:127.0.0.1:59838 got event WatchedEvent state:SyncConnected type:None path:null path:null type:None
[junit4:junit4]   2> 663241 T2014 oascc.ConnectionManager.waitForConnected Client is connected to ZooKeeper
[junit4:junit4]   2> 663243 T2014 oascsi.HttpClientUtil.createClient Creating new http client, config:maxConnections=500&maxConnectionsPerHost=16&socketTimeout=120000&connTimeout=15000
[junit4:junit4]   2> 663246 T2014 oascc.ConnectionManager.waitForConnected Waiting for client to connect to ZooKeeper
[junit4:junit4]   2> 663248 T2054 oascc.ConnectionManager.process Watcher org.apache.solr.common.cloud.ConnectionManager@ee891a name:ZooKeeperConnection Watcher:127.0.0.1:59838/solr got event WatchedEvent state:SyncConnected type:None path:null path:null type:None
[junit4:junit4]   2> 663248 T2014 oascc.ConnectionManager.waitForConnected Client is connected to ZooKeeper
[junit4:junit4]   2> 663251 T2014 oascc.ZkStateReader.createClusterStateWatchersAndUpdate Updating cluster state from ZooKeeper...
[junit4:junit4]   2> 664254 T2014 oasc.ZkController.createEphemeralLiveNode Register node as live in ZooKeeper:/live_nodes/127.0.0.1:46482__ozv%2Fvs
[junit4:junit4]   2> 664256 T2014 oascc.SolrZkClient.makePath makePath: /live_nodes/127.0.0.1:46482__ozv%2Fvs
[junit4:junit4]   2> 664259 T2041 oascc.ZkStateReader$3.process Updating live nodes... (2)
[junit4:junit4]   2> 664259 T2054 oascc.ZkStateReader$3.process Updating live nodes... (2)
[junit4:junit4]   2> 664259 T2036 oascc.ZkStateReader$3.process Updating live nodes... (2)
[junit4:junit4]   2> 664264 T2014 oass.SolrDispatchFilter.init user.dir=/mnt/ssd/jenkins/workspace/Lucene-Solr-4.x-Linux/solr/build/solr-core/test/J1
[junit4:junit4]   2> 664264 T2014 oass.SolrDispatchFilter.init SolrDispatchFilter.init() done
[junit4:junit4]   2> 664265 T2014 oascsi.HttpClientUtil.createClient Creating new http client, config:maxConnections=128&maxConnectionsPerHost=32&followRedirects=false
[junit4:junit4]   2> 664337 T2014 oejs.Server.doStart jetty-8.1.10.v20130312
[junit4:junit4]   2> 664339 T2014 oejs.AbstractConnector.doStart Started SelectChannelConnector@127.0.0.1:40769
[junit4:junit4]   2> 664340 T2014 oass.SolrDispatchFilter.init SolrDispatchFilter.init()
[junit4:junit4]   2> 664340 T2014 oasc.SolrResourceLoader.locateSolrHome JNDI not configured for solr (NoInitialContextEx)
[junit4:junit4]   2> 664341 T2014 oasc.SolrResourceLoader.locateSolrHome using system property solr.solr.home: /mnt/ssd/jenkins/workspace/Lucene-Solr-4.x-Linux/solr/build/solr-core/test/J1/./org.apache.solr.cloud.CollectionsAPIDistributedZkTest-jetty2-1369312519564
[junit4:junit4]   2> 664341 T2014 oasc.CoreContainer$Initializer.initialize looking for solr config file: /mnt/ssd/jenkins/workspace/Lucene-Solr-4.x-Linux/solr/build/solr-core/test/J1/./org.apache.solr.cloud.CollectionsAPIDistributedZkTest-jetty2-1369312519564/solr.xml
[junit4:junit4]   2> 664342 T2014 oasc.CoreContainer.<init> New CoreContainer 28306489
[junit4:junit4]   2> 664342 T2014 oasc.CoreContainer.load Loading CoreContainer using Solr Home: '/mnt/ssd/jenkins/workspace/Lucene-Solr-4.x-Linux/solr/build/solr-core/test/J1/./org.apache.solr.cloud.CollectionsAPIDistributedZkTest-jetty2-1369312519564/'
[junit4:junit4]   2> 664343 T2014 oasc.SolrResourceLoader.<init> new SolrResourceLoader for directory: '/mnt/ssd/jenkins/workspace/Lucene-Solr-4.x-Linux/solr/build/solr-core/test/J1/./org.apache.solr.cloud.CollectionsAPIDistributedZkTest-jetty2-1369312519564/'
[junit4:junit4]   2> 664405 T2014 oasc.SolrCoreDiscoverer.walkFromHere Looking for cores in /mnt/ssd/jenkins/workspace/Lucene-Solr-4.x-Linux/solr/build/solr-core/test/J1/org.apache.solr.cloud.CollectionsAPIDistributedZkTest-jetty2-1369312519564
[junit4:junit4]   2> 664406 T2014 oasc.SolrCoreDiscoverer.walkFromHere Looking for cores in /mnt/ssd/jenkins/workspace/Lucene-Solr-4.x-Linux/solr/build/solr-core/test/J1/org.apache.solr.cloud.CollectionsAPIDistributedZkTest-jetty2-1369312519564/collection1
[junit4:junit4]   2> 664406 T2014 oasc.SolrCoreDiscoverer.walkFromHere Looking for cores in /mnt/ssd/jenkins/workspace/Lucene-Solr-4.x-Linux/solr/build/solr-core/test/J1/org.apache.solr.cloud.CollectionsAPIDistributedZkTest-jetty2-1369312519564/collection1/conf
[junit4:junit4]   2> 664411 T2014 oasc.SolrCoreDiscoverer.walkFromHere Looking for cores in /mnt/ssd/jenkins/workspace/Lucene-Solr-4.x-Linux/solr/build/solr-core/test/J1/org.apache.solr.cloud.CollectionsAPIDistributedZkTest-jetty2-1369312519564/collection1/conf/xslt
[junit4:junit4]   2> 664429 T2014 oasc.SolrCoreDiscoverer.walkFromHere Looking for cores in /mnt/ssd/jenkins/workspace/Lucene-Solr-4.x-Linux/solr/build/solr-core/test/J1/org.apache.solr.cloud.CollectionsAPIDistributedZkTest-jetty2-1369312519564/collection1/lib
[junit4:junit4]   2> 664431 T2014 oasc.SolrCoreDiscoverer.walkFromHere Looking for cores in /mnt/ssd/jenkins/workspace/Lucene-Solr-4.x-Linux/solr/build/solr-core/test/J1/org.apache.solr.cloud.CollectionsAPIDistributedZkTest-jetty2-1369312519564/collection1/lib/classes
[junit4:junit4]   2> 664432 T2014 oasc.SolrCoreDiscoverer.addCore Discovered properties file /mnt/ssd/jenkins/workspace/Lucene-Solr-4.x-Linux/solr/build/solr-core/test/J1/./org.apache.solr.cloud.CollectionsAPIDistributedZkTest-jetty2-1369312519564/conf/core.properties, adding to cores
[junit4:junit4]   2> 664434 T2014 oashc.HttpShardHandlerFactory.getParameter Setting socketTimeout to: 0
[junit4:junit4]   2> 664435 T2014 oashc.HttpShardHandlerFactory.getParameter Setting urlScheme to: http://
[junit4:junit4]   2> 664435 T2014 oashc.HttpShardHandlerFactory.getParameter Setting connTimeout to: 0
[junit4:junit4]   2> 664436 T2014 oashc.HttpShardHandlerFactory.getParameter Setting maxConnectionsPerHost to: 20
[junit4:junit4]   2> 664436 T2014 oashc.HttpShardHandlerFactory.getParameter Setting corePoolSize to: 0
[junit4:junit4]   2> 664436 T2014 oashc.HttpShardHandlerFactory.getParameter Setting maximumPoolSize to: 2147483647
[junit4:junit4]   2> 664437 T2014 oashc.HttpShardHandlerFactory.getParameter Setting maxThreadIdleTime to: 5
[junit4:junit4]   2> 664437 T2014 oashc.HttpShardHandlerFactory.getParameter Setting sizeOfQueue to: -1
[junit4:junit4]   2> 664438 T2014 oashc.HttpShardHandlerFactory.getParameter Setting fairnessPolicy to: false
[junit4:junit4]   2> 664438 T2014 oascsi.HttpClientUtil.createClient Creating new http client, config:maxConnectionsPerHost=20&maxConnections=10000&socketTimeout=0&connTimeout=0&retry=false
[junit4:junit4]   2> 664441 T2014 oasl.LogWatcher.newRegisteredLogWatcher Registering Log Listener
[junit4:junit4]   2> 664442 T2014 oasc.ZkContainer.initZooKeeper Zookeeper client=127.0.0.1:59838/solr
[junit4:junit4]   2> 664442 T2014 oasc.ZkController.checkChrootPath zkHost includes chroot
[junit4:junit4]   2> 664443 T2014 oascc.ConnectionManager.waitForConnected Waiting for client to connect to ZooKeeper
[junit4:junit4]   2> 664444 T2066 oascc.ConnectionManager.process Watcher org.apache.solr.common.cloud.ConnectionManager@1af45a3 name:ZooKeeperConnection Watcher:127.0.0.1:59838 got event WatchedEvent state:SyncConnected type:None path:null path:null type:None
[junit4:junit4]   2> 664445 T2014 oascc.ConnectionManager.waitForConnected Client is connected to ZooKeeper
[junit4:junit4]   2> 664446 T2014 oascsi.HttpClientUtil.createClient Creating new http client, config:maxConnections=500&maxConnectionsPerHost=16&socketTimeout=120000&connTimeout=15000
[junit4:junit4]   2> 664449 T2014 oascc.ConnectionManager.waitForConnected Waiting for client to connect to ZooKeeper
[junit4:junit4]   2> 664450 T2068 oascc.ConnectionManager.process Watcher org.apache.solr.common.cloud.ConnectionManager@808a48 name:ZooKeeperConnection Watcher:127.0.0.1:59838/solr got event WatchedEvent state:SyncConnected type:None path:null path:null type:None
[junit4:junit4]   2> 664450 T2014 oascc.ConnectionManager.waitForConnected Client is connected to ZooKeeper
[junit4:junit4]   2> 664453 T2014 oascc.ZkStateReader.createClusterStateWatchersAndUpdate Updating cluster state from ZooKeeper...
[junit4:junit4]   2> 665456 T2014 oasc.ZkController.createEphemeralLiveNode Register node as live in ZooKeeper:/live_nodes/127.0.0.1:40769__ozv%2Fvs
[junit4:junit4]   2> 665457 T2014 oascc.SolrZkClient.makePath makePath: /live_nodes/127.0.0.1:40769__ozv%2Fvs
[junit4:junit4]   2> 665460 T2054 oascc.ZkStateReader$3.process Updating live nodes... (3)
[junit4:junit4]   2> 665460 T2036 oascc.ZkStateReader$3.process Updating live nodes... (3)
[junit4:junit4]   2> 665460 T2068 oascc.ZkStateReader$3.process Updating live nodes... (3)
[junit4:junit4]   2> 665460 T2041 oascc.ZkStateReader$3.process Updating live nodes... (3)
[junit4:junit4]   2> 665464 T2014 oass.SolrDispatchFilter.init user.dir=/mnt/ssd/jenkins/workspace/Lucene-Solr-4.x-Linux/solr/build/solr-core/test/J1
[junit4:junit4]   2> 665465 T2014 oass.SolrDispatchFilter.init SolrDispatchFilter.init() done
[junit4:junit4]   2> 665465 T2014 oascsi.HttpClientUtil.createClient Creating new http client, config:maxConnections=128&maxConnectionsPerHost=32&followRedirects=false
[junit4:junit4]   2> 665540 T2014 oejs.Server.doStart jetty-8.1.10.v20130312
[junit4:junit4]   2> 665542 T2014 oejs.AbstractConnector.doStart Started SelectChannelConnector@127.0.0.1:45660
[junit4:junit4]   2> 665543 T2014 oass.SolrDispatchFilter.init SolrDispatchFilter.init()
[junit4:junit4]   2> 665544 T2014 oasc.SolrResourceLoader.locateSolrHome JNDI not configured for solr (NoInitialContextEx)
[junit4:junit4]   2> 665544 T2014 oasc.SolrResourceLoader.locateSolrHome using system property solr.solr.home: /mnt/ssd/jenkins/workspace/Lucene-Solr-4.x-Linux/solr/build/solr-core/test/J1/./org.apache.solr.cloud.CollectionsAPIDistributedZkTest-jetty3-1369312520765
[junit4:junit4]   2> 665545 T2014 oasc.CoreContainer$Initializer.initialize looking for solr config file: /mnt/ssd/jenkins/workspace/Lucene-Solr-4.x-Linux/solr/build/solr-core/test/J1/./org.apache.solr.cloud.CollectionsAPIDistributedZkTest-jetty3-1369312520765/solr.xml
[junit4:junit4]   2> 665545 T2014 oasc.CoreContainer.<init> New CoreContainer 26417164
[junit4:junit4]   2> 665545 T2014 oasc.CoreContainer.load Loading CoreContainer using Solr Home: '/mnt/ssd/jenkins/workspace/Lucene-Solr-4.x-Linux/solr/build/solr-core/test/J1/./org.apache.solr.cloud.CollectionsAPIDistributedZkTest-jetty3-1369312520765/'
[junit4:junit4]   2> 665546 T2014 oasc.SolrResourceLoader.<init> new SolrResourceLoader for directory: '/mnt/ssd/jenkins/workspace/Lucene-Solr-4.x-Linux/solr/build/solr-core/test/J1/./org.apache.solr.cloud.CollectionsAPIDistributedZkTest-jetty3-1369312520765/'
[junit4:junit4]   2> 665610 T2014 oasc.SolrCoreDiscoverer.walkFromHere Looking for cores in /mnt/ssd/jenkins/workspace/Lucene-Solr-4.x-Linux/solr/build/solr-core/test/J1/org.apache.solr.cloud.CollectionsAPIDistributedZkTest-jetty3-1369312520765
[junit4:junit4]   2> 665611 T2014 oasc.SolrCoreDiscoverer.walkFromHere Looking for cores in /mnt/ssd/jenkins/workspace/Lucene-Solr-4.x-Linux/solr/build/solr-core/test/J1/org.apache.solr.cloud.CollectionsAPIDistributedZkTest-jetty3-1369312520765/collection1
[junit4:junit4]   2> 665612 T2014 oasc.SolrCoreDiscoverer.walkFromHere Looking for cores in /mnt/ssd/jenkins/workspace/Lucene-Solr-4.x-Linux/solr/build/solr-core/test/J1/org.apache.solr.cloud.CollectionsAPIDistributedZkTest-jetty3-1369312520765/collection1/conf
[junit4:junit4]   2> 665618 T2014 oasc.SolrCoreDiscoverer.walkFromHere Looking for cores in /mnt/ssd/jenkins/workspace/Lucene-Solr-4.x-Linux/solr/build/solr-core/test/J1/org.apache.solr.cloud.CollectionsAPIDistributedZkTest-jetty3-1369312520765/collection1/conf/xslt
[junit4:junit4]   2> 665638 T2014 oasc.SolrCoreDiscoverer.walkFromHere Looking for cores in /mnt/ssd/jenkins/workspace/Lucene-Solr-4.x-Linux/solr/build/solr-core/test/J1/org.apache.solr.cloud.CollectionsAPIDistributedZkTest-jetty3-1369312520765/collection1/lib
[junit4:junit4]   2> 665639 T2014 oasc.SolrCoreDiscoverer.walkFromHere Looking for cores in /mnt/ssd/jenkins/workspace/Lucene-Solr-4.x-Linux/solr/build/solr-core/test/J1/org.apache.solr.cloud.CollectionsAPIDistributedZkTest-jetty3-1369312520765/collection1/lib/classes
[junit4:junit4]   2> 665641 T2014 oasc.SolrCoreDiscoverer.addCore Discovered properties file /mnt/ssd/jenkins/workspace/Lucene-Solr-4.x-Linux/solr/build/solr-core/test/J1/./org.apache.solr.cloud.CollectionsAPIDistributedZkTest-jetty3-1369312520765/conf/core.properties, adding to cores
[junit4:junit4]   2> 665649 T2014 oashc.HttpShardHandlerFactory.getParameter Setting socketTimeout to: 0
[junit4:junit4]   2> 665649 T2014 oashc.HttpShardHandlerFactory.getParameter Setting urlScheme to: http://
[junit4:junit4]   2> 665650 T2014 oashc.HttpShardHandlerFactory.getParameter Setting connTimeout to: 0
[junit4:junit4]   2> 665650 T2014 oashc.HttpShardHandlerFactory.getParameter Setting maxConnectionsPerHost to: 20
[junit4:junit4]   2> 665651 T2014 oashc.HttpShardHandlerFactory.getParameter Setting corePoolSize to: 0
[junit4:junit4]   2> 665651 T2014 oashc.HttpShardHandlerFactory.getParameter Setting maximumPoolSize to: 2147483647
[junit4:junit4]   2> 665652 T2014 oashc.HttpShardHandlerFactory.getParameter Setting maxThreadIdleTime to: 5
[junit4:junit4]   2> 665652 T2014 oashc.HttpShardHandlerFactory.getParameter Setting sizeOfQueue to: -1
[junit4:junit4]   2> 665652 T2014 oashc.HttpShardHandlerFactory.getParameter Setting fairnessPolicy to: false
[junit4:junit4]   2> 665653 T2014 oascsi.HttpClientUtil.createClient Creating new http client, config:maxConnectionsPerHost=20&maxConnections=10000&socketTimeout=0&connTimeout=0&retry=false
[junit4:junit4]   2> 665656 T2014 oasl.LogWatcher.newRegisteredLogWatcher Registering Log Listener
[junit4:junit4]   2> 665657 T2014 oasc.ZkContainer.initZooKeeper Zookeeper client=127.0.0.1:59838/solr
[junit4:junit4]   2> 665657 T2014 oasc.ZkController.checkChrootPath zkHost includes chroot
[junit4:junit4]   2> 665658 T2014 oascc.ConnectionManager.waitForConnected Waiting for client to connect to ZooKeeper
[junit4:junit4]   2> 665660 T2080 oascc.ConnectionManager.process Watcher org.apache.solr.common.cloud.ConnectionManager@e6969b name:ZooKeeperConnection Watcher:127.0.0.1:59838 got event WatchedEvent state:SyncConnected type:None path:null path:null type:None
[junit4:junit4]   2> 665675 T2014 oascc.ConnectionManager.waitForConnected Client is connected to ZooKeeper
[junit4:junit4]   2> 665677 T2014 oascsi.HttpClientUtil.createClient Creating new http client, config:maxConnections=500&maxConnectionsPerHost=16&socketTimeout=120000&connTimeout=15000
[junit4:junit4]   2> 665680 T2014 oascc.ConnectionManager.waitForConnected Waiting for client to connect to ZooKeeper
[junit4:junit4]   2> 665681 T2082 oascc.ConnectionManager.process Watcher org.apache.solr.common.cloud.ConnectionManager@909675 name:ZooKeeperConnection Watcher:127.0.0.1:59838/solr got event WatchedEvent state:SyncConnected type:None path:null path:null type:None
[junit4:junit4]   2> 665681 T2014 oascc.ConnectionManager.waitForConnected Client is connected to ZooKeeper
[junit4:junit4]   2> 665685 T2014 oascc.ZkStateReader.createClusterStateWatchersAndUpdate Updating cluster state from ZooKeeper...
[junit4:junit4]   2> 666688 T2014 oasc.ZkController.createEphemeralLiveNode Register node as live in ZooKeeper:/live_nodes/127.0.0.1:45660__ozv%2Fvs
[junit4:junit4]   2> 666689 T2014 oascc.SolrZkClient.makePath makePath: /live_nodes/127.0.0.1:45660__ozv%2Fvs
[junit4:junit4]   2> 666692 T2054 oascc.ZkStateReader$3.process Updating live nodes... (4)
[junit4:junit4]   2> 666692 T2068 oascc.ZkStateReader$3.process Updating live nodes... (4)
[junit4:junit4]   2> 666692 T2036 oascc.ZkStateReader$3.process Updating live nodes... (4)
[junit4:junit4]   2> 666693 T2082 oascc.ZkStateReader$3.process Updating live nodes... (4)
[junit4:junit4]   2> 666692 T2041 oascc.ZkStateReader$3.process Updating live nodes... (4)
[junit4:junit4]   2> 666697 T2014 oass.SolrDispatchFilter.init user.dir=/mnt/ssd/jenkins/workspace/Lucene-Solr-4.x-Linux/solr/build/solr-core/test/J1
[junit4:junit4]   2> 666697 T2014 oass.SolrDispatchFilter.init SolrDispatchFilter.init() done
[junit4:junit4]   2> 666698 T2014 oascsi.HttpClientUtil.createClient Creating new http client, config:maxConnections=128&maxConnectionsPerHost=32&followRedirects=false
[junit4:junit4]   2> 666767 T2014 oejs.Server.doStart jetty-8.1.10.v20130312
[junit4:junit4]   2> 666769 T2014 oejs.AbstractConnector.doStart Started SelectChannelConnector@127.0.0.1:37924
[junit4:junit4]   2> 666770 T2014 oass.SolrDispatchFilter.init SolrDispatchFilter.init()
[junit4:junit4]   2> 666770 T2014 oasc.SolrResourceLoader.locateSolrHome JNDI not configured for solr (NoInitialContextEx)
[junit4:junit4]   2> 666770 T2014 oasc.SolrResourceLoader.locateSolrHome using system property solr.solr.home: /mnt/ssd/jenkins/workspace/Lucene-Solr-4.x-Linux/solr/build/solr-core/test/J1/./org.apache.solr.cloud.CollectionsAPIDistributedZkTest-jetty4-1369312521997
[junit4:junit4]   2> 666771 T2014 oasc.CoreContainer$Initializer.initialize looking for solr config file: /mnt/ssd/jenkins/workspace/Lucene-Solr-4.x-Linux/solr/build/solr-core/test/J1/./org.apache.solr.cloud.CollectionsAPIDistributedZkTest-jetty4-1369312521997/solr.xml
[junit4:junit4]   2> 666771 T2014 oasc.CoreContainer.<init> New CoreContainer 4238383
[junit4:junit4]   2> 666772 T2014 oasc.CoreContainer.load Loading CoreContainer using Solr Home: '/mnt/ssd/jenkins/workspace/Lucene-Solr-4.x-Linux/solr/build/solr-core/test/J1/./org.apache.solr.cloud.CollectionsAPIDistributedZkTest-jetty4-1369312521997/'
[junit4:junit4]   2> 666772 T2014 oasc.SolrResourceLoader.<init> new SolrResourceLoader for directory: '/mnt/ssd/jenkins/workspace/Lucene-Solr-4.x-Linux/solr/build/solr-core/test/J1/./org.apache.solr.cloud.CollectionsAPIDistributedZkTest-jetty4-1369312521997/'
[junit4:junit4]   2> 666833 T2014 oasc.SolrCoreDiscoverer.walkFromHere Looking for cores in /mnt/ssd/jenkins/workspace/Lucene-Solr-4.x-Linux/solr/build/solr-core/test/J1/org.apache.solr.cloud.CollectionsAPIDistributedZkTest-jetty4-1369312521997
[junit4:junit4]   2> 666834 T2014 oasc.SolrCoreDiscoverer.walkFromHere Looking for cores in /mnt/ssd/jenkins/workspace/Lucene-Solr-4.x-Linux/solr/build/solr-core/test/J1/org.apache.solr.cloud.CollectionsAPIDistributedZkTest-jetty4-1369312521997/collection1
[junit4:junit4]   2> 666835 T2014 oasc.SolrCoreDiscoverer.walkFromHere Looking for cores in /mnt/ssd/jenkins/workspace/Lucene-Solr-4.x-Linux/solr/build/solr-core/test/J1/org.apache.solr.cloud.CollectionsAPIDistributedZkTest-jetty4-1369312521997/collection1/conf
[junit4:junit4]   2> 666840 T2014 oasc.SolrCoreDiscoverer.walkFromHere Looking for cores in /mnt/ssd/jenkins/workspace/Lucene-Solr-4.x-Linux/solr/build/solr-core/test/J1/org.apache.solr.cloud.CollectionsAPIDistributedZkTest-jetty4-1369312521997/collection1/conf/xslt
[junit4:junit4]   2> 666858 T2014 oasc.SolrCoreDiscoverer.walkFromHere Looking for cores in /mnt/ssd/jenkins/workspace/Lucene-Solr-4.x-Linux/solr/build/solr-core/test/J1/org.apache.solr.cloud.CollectionsAPIDistributedZkTest-jetty4-1369312521997/collection1/lib
[junit4:junit4]   2> 666859 T2014 oasc.SolrCoreDiscoverer.walkFromHere Looking for cores in /mnt/ssd/jenkins/workspace/Lucene-Solr-4.x-Linux/solr/build/solr-core/test/J1/org.apache.solr.cloud.CollectionsAPIDistributedZkTest-jetty4-1369312521997/collection1/lib/classes
[junit4:junit4]   2> 666860 T2014 oasc.SolrCoreDiscoverer.addCore Discovered properties file /mnt/ssd/jenkins/workspace/Lucene-Solr-4.x-Linux/solr/build/solr-core/test/J1/./org.apache.solr.cloud.CollectionsAPIDistributedZkTest-jetty4-1369312521997/conf/core.properties, adding to cores
[junit4:junit4]   2> 666862 T2014 oashc.HttpShardHandlerFactory.getParameter Setting socketTimeout to: 0
[junit4:junit4]   2> 666863 T2014 oashc.HttpShardHandlerFactory.getParameter Setting urlScheme to: http://
[junit4:junit4]   2> 666863 T2014 oashc.HttpShardHandlerFactory.getParameter Setting connTimeout to: 0
[junit4:junit4]   2> 666864 T2014 oashc.HttpShardHandlerFactory.getParameter Setting maxConnectionsPerHost to: 20
[junit4:junit4]   2> 666864 T2014 oashc.HttpShardHandlerFactory.getParameter Setting corePoolSize to: 0
[junit4:junit4]   2> 666864 T2014 oashc.HttpShardHandlerFactory.getParameter Setting maximumPoolSize to: 2147483647
[junit4:junit4]   2> 666865 T2014 oashc.HttpShardHandlerFactory.getParameter Setting maxThreadIdleTime to: 5
[junit4:junit4]   2> 666865 T2014 oashc.HttpShardHandlerFactory.getParameter Setting sizeOfQueue to: -1
[junit4:junit4]   2> 666866 T2014 oashc.HttpShardHandlerFactory.getParameter Setting fairnessPolicy to: false
[junit4:junit4]   2> 666866 T2014 oascsi.HttpClientUtil.createClient Creating new http client, config:maxConnectionsPerHost=20&maxConnections=10000&socketTimeout=0&connTimeout=0&retry=false
[junit4:junit4]   2> 666869 T2014 oasl.LogWatcher.newRegisteredLogWatcher Registering Log Listener
[junit4:junit4]   2> 666869 T2014 oasc.ZkContainer.initZooKeeper Zookeeper client=127.0.0.1:59838/solr
[junit4:junit4]   2> 666870 T2014 oasc.ZkController.checkChrootPath zkHost includes chroot
[junit4:junit4]   2> 666871 T2014 oascc.ConnectionManager.waitForConnected Waiting for client to connect to ZooKeeper
[junit4:junit4]   2> 666872 T2094 oascc.ConnectionManager.process Watcher org.apache.solr.common.cloud.ConnectionManager@1f81511 name:ZooKeeperConnection Watcher:127.0.0.1:59838 got event WatchedEvent state:SyncConnected type:None path:null path:null type:None
[junit4:junit4]   2> 666873 T2014 oascc.ConnectionManager.waitForConnected Client is connected to ZooKeeper
[junit4:junit4]   2> 666874 T2014 oascsi.HttpClientUtil.createClient Creating new http client, config:maxConnections=500&maxConnectionsPerHost=16&socketTimeout=120000&connTimeout=15000
[junit4:junit4]   2> 666877 T2014 oascc.ConnectionManager.waitForConnected Waiting for client to connect to ZooKeeper
[junit4:junit4]   2> 666878 T2096 oascc.ConnectionManager.process Watcher org.apache.solr.common.cloud.ConnectionManager@623658 name:ZooKeeperConnection Watcher:127.0.0.1:59838/solr got event WatchedEvent state:SyncConnected type:None path:null path:null type:None
[junit4:junit4]   2> 666879 T2014 oascc.ConnectionManager.waitForConnected Client is connected to ZooKeeper
[junit4:junit4]   2> 666904 T2014 oascc.ZkStateReader.createClusterStateWatchersAndUpdate Updating cluster state from ZooKeeper...
[junit4:junit4]   2> 667907 T2014 oasc.ZkController.createEphemeralLiveNode Register node as live in ZooKeeper:/live_nodes/127.0.0.1:37924__ozv%2Fvs
[junit4:junit4]   2> 667908 T2014 oascc.SolrZkClient.makePath makePath: /live_nodes/127.0.0.1:37924__ozv%2Fvs
[junit4:junit4]   2> 667911 T2068 oascc.ZkStateReader$3.process Updating live nodes... (5)
[junit4:junit4]   2> 667911 T2054 oascc.ZkStateReader$3.process Updating live nodes... (5)
[junit4:junit4]   2> 667911 T2096 oascc.ZkStateReader$3.process Updating live nodes... (5)
[junit4:junit4]   2> 667911 T2036 oascc.ZkStateReader$3.process Updating live nodes... (5)
[junit4:junit4]   2> 667911 T2041 oascc.ZkStateReader$3.process Updating live nodes... (5)
[junit4:junit4]   2> 667912 T2082 oascc.ZkStateReader$3.process Updating live nodes... (5)
[junit4:junit4]   2> 667917 T2014 oass.SolrDispatchFilter.init user.dir=/mnt/ssd/jenkins/workspace/Lucene-Solr-4.x-Linux/solr/build/solr-core/test/J1
[junit4:junit4]   2> 667918 T2014 oass.SolrDispatchFilter.init SolrDispatchFilter.init() done
[junit4:junit4]   2> 667919 T2014 oascsi.HttpClientUtil.createClient Creating new http client, config:maxConnections=128&maxConnectionsPerHost=32&followRedirects=false
[junit4:junit4]   2> 667924 T2014 oascsi.HttpClientUtil.createClient Creating new http client, config:maxConnections=128&maxConnectionsPerHost=32&followRedirects=false
[junit4:junit4]   2> 667929 T2050 oasha.CollectionsHandler.handleCreateAction Creating Collection : numShards=2&name=nodes_used_collection&replicationFactor=2&action=CREATE&wt=javabin&version=2
[junit4:junit4]   2> 667931 T2036 oasc.DistributedQueue$LatchChildWatcher.process Watcher fired on path: /overseer/collection-queue-work state: SyncConnected type NodeChildrenChanged
[junit4:junit4]   2> 667932 T2038 oasc.OverseerCollectionProcessor.run Overseer Collection Processor: Get the message id:/overseer/collection-queue-work/qn-0000000000 message:{
[junit4:junit4]   2>  "operation":"createcollection",
[junit4:junit4]   2>  "numShards":"2",
[junit4:junit4]   2>  "maxShardsPerNode":null,
[junit4:junit4]   2>  "createNodeSet":null,
[junit4:junit4]   2>  "name":"nodes_used_collection",
[junit4:junit4]   2>  "replicationFactor":"2"}
[junit4:junit4]   2> 667932 T2038 oasc.OverseerCollectionProcessor.createCollection Creating shard nodes_used_collection_shard1_replica1 as part of slice shard1 of collection nodes_used_collection on 127.0.0.1:37924__ozv%2Fvs
[junit4:junit4]   2> 667933 T2038 oasc.OverseerCollectionProcessor.createCollection Creating shard nodes_used_collection_shard1_replica2 as part of slice shard1 of collection nodes_used_collection on 127.0.0.1:45660__ozv%2Fvs
[junit4:junit4]   2> 667933 T2038 oasc.OverseerCollectionProcessor.createCollection Creating shard nodes_used_collection_shard2_replica1 as part of slice shard2 of collection nodes_used_collection on 127.0.0.1:46482__ozv%2Fvs
[junit4:junit4]   2> 667942 T2038 oasc.OverseerCollectionProcessor.createCollection Creating shard nodes_used_collection_shard2_replica2 as part of slice shard2 of collection nodes_used_collection on 127.0.0.1:42419__ozv%2Fvs
[junit4:junit4]   2> 667943 T2091 oasc.CoreContainer.create Creating SolrCore 'nodes_used_collection_shard1_replica1' using instanceDir: /mnt/ssd/jenkins/workspace/Lucene-Solr-4.x-Linux/solr/build/solr-core/test/J1/./org.apache.solr.cloud.CollectionsAPIDistributedZkTest-jetty4-1369312521997/nodes_used_collection_shard1_replica1
[junit4:junit4]   2> 667943 T2047 oasc.CoreContainer.create Creating SolrCore 'nodes_used_collection_shard2_replica1' using instanceDir: /mnt/ssd/jenkins/workspace/Lucene-Solr-4.x-Linux/solr/build/solr-core/test/J1/./org.apache.solr.cloud.CollectionsAPIDistributedZkTest-jetty1-1369312518342/nodes_used_collection_shard2_replica1
[junit4:junit4]   2> 667943 T2077 oasc.CoreContainer.create Creating SolrCore 'nodes_used_collection_shard1_replica2' using instanceDir: /mnt/ssd/jenkins/workspace/Lucene-Solr-4.x-Linux/solr/build/solr-core/test/J1/./org.apache.solr.cloud.CollectionsAPIDistributedZkTest-jetty3-1369312520765/nodes_used_collection_shard1_replica2
[junit4:junit4]   2> 667944 T2047 oasc.ZkController.createCollectionZkNode Check for collection zkNode:nodes_used_collection
[junit4:junit4]   2> 667944 T2032 oasc.CoreContainer.create Creating SolrCore 'nodes_used_collection_shard2_replica2' using instanceDir: /mnt/ssd/jenkins/workspace/Lucene-Solr-4.x-Linux/solr/build/solr-core/test/J1/./org.apache.solr.cloud.CollectionsAPIDistributedZkTest-controljetty-1369312518109/nodes_used_collection_shard2_replica2
[junit4:junit4]   2> 667945 T2047 oasc.ZkController.createCollectionZkNode Creating collection in ZooKeeper:nodes_used_collection
[junit4:junit4]   2> 667943 T2091 oasc.ZkController.createCollectionZkNode Check for collection zkNode:nodes_used_collection
[junit4:junit4]   2> 667945 T2047 oasc.ZkController.getConfName Looking for collection configName
[junit4:junit4]   2> 667945 T2032 oasc.ZkController.createCollectionZkNode Check for collection zkNode:nodes_used_collection
[junit4:junit4]   2> 667944 T2077 oasc.ZkController.createCollectionZkNode Check for collection zkNode:nodes_used_collection
[junit4:junit4]   2> 667947 T2032 oasc.ZkController.createCollectionZkNode Creating collection in ZooKeeper:nodes_used_collection
[junit4:junit4]   2> 667947 T2047 oasc.ZkController.getConfName Only one config set found in zk - using it:conf1
[junit4:junit4]   2> 667946 T2091 oasc.ZkController.createCollectionZkNode Creating collection in ZooKeeper:nodes_used_collection
[junit4:junit4]   2> 667948 T2047 oascc.SolrZkClient.makePath makePath: /collections/nodes_used_collection
[junit4:junit4]   2> 667947 T2032 oasc.ZkController.getConfName Looking for collection configName
[junit4:junit4]   2> 667947 T2077 oasc.ZkController.createCollectionZkNode Creating collection in ZooKeeper:nodes_used_collection
[junit4:junit4]   2> 667948 T2091 oasc.ZkController.getConfName Looking for collection configName
[junit4:junit4]   2> 667950 T2032 oasc.ZkController.getConfName Only one config set found in zk - using it:conf1
[junit4:junit4]   2> 667950 T2047 oasc.ZkController.readConfigName Load collection config from:/collections/nodes_used_collection
[junit4:junit4]   2> 667949 T2077 oasc.ZkController.getConfName Looking for collection configName
[junit4:junit4]   2> 667950 T2091 oascc.SolrZkClient.makePath makePath: /collections/nodes_used_collection
[junit4:junit4]   2> 667950 T2032 oascc.SolrZkClient.makePath makePath: /collections/nodes_used_collection
[junit4:junit4]   2> 667952 T2077 oascc.SolrZkClient.makePath makePath: /collections/nodes_used_collection
[junit4:junit4]   2> 667951 T2047 oasc.SolrResourceLoader.<init> new SolrResourceLoader for directory: '/mnt/ssd/jenkins/workspace/Lucene-Solr-4.x-Linux/solr/build/solr-core/test/J1/./org.apache.solr.cloud.CollectionsAPIDistributedZkTest-jetty1-1369312518342/nodes_used_collection_shard2_replica1/'
[junit4:junit4]   2> 667953 T2091 oasc.ZkController.readConfigName Load collection config from:/collections/nodes_used_collection
[junit4:junit4]   2> 667956 T2032 oasc.ZkController.readConfigName Load collection config from:/collections/nodes_used_collection
[junit4:junit4]   2> 667956 T2091 oasc.SolrResourceLoader.<init> new SolrResourceLoader for directory: '/mnt/ssd/jenkins/workspace/Lucene-Solr-4.x-Linux/solr/build/solr-core/test/J1/./org.apache.solr.cloud.CollectionsAPIDistributedZkTest-jetty4-1369312521997/nodes_used_collection_shard1_replica1/'
[junit4:junit4]   2> 667956 T2077 oasc.ZkController.readConfigName Load collection config from:/collections/nodes_used_collection
[junit4:junit4]   2> 667957 T2032 oasc.SolrResourceLoader.<init> new SolrResourceLoader for directory: '/mnt/ssd/jenkins/workspace/Lucene-Solr-4.x-Linux/solr/build/solr-core/test/J1/./org.apache.solr.cloud.CollectionsAPIDistributedZkTest-controljetty-1369312518109/nodes_used_collection_shard2_replica2/'
[junit4:junit4]   2> 667959 T2077 oasc.SolrResourceLoader.<init> new SolrResourceLoader for directory: '/mnt/ssd/jenkins/workspace/Lucene-Solr-4.x-Linux/solr/build/solr-core/test/J1/./org.apache.solr.cloud.CollectionsAPIDistributedZkTest-jetty3-1369312520765/nodes_used_collection_shard1_replica2/'
[junit4:junit4]   2> 668014 T2077 oasc.SolrConfig.<init> Using Lucene MatchVersion: LUCENE_44
[junit4:junit4]   2> 668017 T2047 oasc.SolrConfig.<init> Using Lucene MatchVersion: LUCENE_44
[junit4:junit4]   2> 668031 T2091 oasc.SolrConfig.<init> Using Lucene MatchVersion: LUCENE_44
[junit4:junit4]   2> 668066 T2032 oasc.SolrConfig.<init> Using Lucene MatchVersion: LUCENE_44
[junit4:junit4]   2> 668102 T2077 oasc.SolrConfig.<init> Loaded SolrConfig: solrconfig.xml
[junit4:junit4]   2> 668103 T2077 oass.IndexSchema.readSchema Reading Solr Schema from schema.xml
[junit4:junit4]   2> 668114 T2077 oass.IndexSchema.readSchema [nodes_used_collection_shard1_replica2] Schema name=test
[junit4:junit4]   2> 668128 T2047 oasc.SolrConfig.<init> Loaded SolrConfig: solrconfig.xml
[junit4:junit4]   2> 668129 T2047 oass.IndexSchema.readSchema Reading Solr Schema from schema.xml
[junit4:junit4]   2> 668134 T2047 oass.IndexSchema.readSchema [nodes_used_collection_shard2_replica1] Schema name=test
[junit4:junit4]   2> 668149 T2091 oasc.SolrConfig.<init> Loaded SolrConfig: solrconfig.xml
[junit4:junit4]   2> 668150 T2091 oass.IndexSchema.readSchema Reading Solr Schema from schema.xml
[junit4:junit4]   2> 668165 T2091 oass.IndexSchema.readSchema [nodes_used_collection_shard1_replica1] Schema name=test
[junit4:junit4]   2> 668167 T2032 oasc.SolrConfig.<init> Loaded SolrConfig: solrconfig.xml
[junit4:junit4]   2> 668168 T2032 oass.IndexSchema.readSchema Reading Solr Schema from schema.xml
[junit4:junit4]   2> 668195 T2032 oass.IndexSchema.readSchema [nodes_used_collection_shard2_replica2] Schema name=test
[junit4:junit4]   2> 669003 T2077 oass.OpenExchangeRatesOrgProvider.init Initialized with rates=open-exchange-rates.json, refreshInterval=1440.
[junit4:junit4]   2> 669016 T2077 oass.IndexSchema.readSchema default search field in schema is text
[junit4:junit4]   2> 669026 T2077 oass.IndexSchema.readSchema unique key field: id
[junit4:junit4]   2> 669036 T2077 oass.FileExchangeRateProvider.reload Reloading exchange rates from file currency.xml
[junit4:junit4]   2> 669050 T2077 oass.FileExchangeRateProvider.reload Reloading exchange rates from file currency.xml
[junit4:junit4]   2> 669054 T2077 oass.OpenExchangeRatesOrgProvider.reload Reloading exchange rates from open-exchange-rates.json
[junit4:junit4]   2> 669055 T2077 oass.OpenExchangeRatesOrgProvider$OpenExchangeRates.<init> WARN Unknown key IMPORTANT NOTE
[junit4:junit4]   2> 669055 T2077 oass.OpenExchangeRatesOrgProvider$OpenExchangeRates.<init> WARN Expected key, got STRING
[junit4:junit4]   2> 669056 T2077 oass.OpenExchangeRatesOrgProvider.reload Reloading exchange rates from open-exchange-rates.json
[junit4:junit4]   2> 669057 T2077 oass.OpenExchangeRatesOrgProvider$OpenExchangeRates.<init> WARN Unknown key IMPORTANT NOTE
[junit4:junit4]   2> 669057 T2077 oass.OpenExchangeRatesOrgProvider$OpenExchangeRates.<init> WARN Expected key, got STRING
[junit4:junit4]   2> 669057 T2077 oasc.SolrCore.initDirectoryFactory org.apache.solr.core.MockDirectoryFactory
[junit4:junit4]   2> 669058 T2077 oasc.SolrCore.<init> [nodes_used_collection_shard1_replica2] Opening new SolrCore at /mnt/ssd/jenkins/workspace/Lucene-Solr-4.x-Linux/solr/build/solr-core/test/J1/./org.apache.solr.cloud.CollectionsAPIDistributedZkTest-jetty3-1369312520765/nodes_used_collection_shard1_replica2/, dataDir=/mnt/ssd/jenkins/workspace/Lucene-Solr-4.x-Linux/solr/build/solr-core/test/J1/./org.apache.solr.cloud.CollectionsAPIDistributedZkTest-jetty3-1369312520765/nodes_used_collection_shard1_replica2/data/
[junit4:junit4]   2> 669058 T2077 oasc.JmxMonitoredMap.<init> JMX monitoring is enabled. Adding Solr mbeans to JMX Server: com.sun.jmx.mbeanserver.JmxMBeanServer@9fa8f
[junit4:junit4]   2> 669059 T2077 oasc.SolrCore.initDirectoryFactory org.apache.solr.core.MockDirectoryFactory
[junit4:junit4]   2> 669069 T2077 oasc.CachingDirectoryFactory.get return new directory for /mnt/ssd/jenkins/workspace/Lucene-Solr-4.x-Linux/solr/build/solr-core/test/J1/./org.apache.solr.cloud.CollectionsAPIDistributedZkTest-jetty3-1369312520765/nodes_used_collection_shard1_replica2/data
[junit4:junit4]   2> 669070 T2077 oasc.SolrCore.getNewIndexDir New index directory detected: old=null new=/mnt/ssd/jenkins/workspace/Lucene-Solr-4.x-Linux/solr/build/solr-core/test/J1/./org.apache.solr.cloud.CollectionsAPIDistributedZkTest-jetty3-1369312520765/nodes_used_collection_shard1_replica2/data/index/
[junit4:junit4]   2> 669070 T2077 oasc.SolrCore.initIndex WARN [nodes_used_collection_shard1_replica2] Solr index directory '/mnt/ssd/jenkins/workspace/Lucene-Solr-4.x-Linux/solr/build/solr-core/test/J1/./org.apache.solr.cloud.CollectionsAPIDistributedZkTest-jetty3-1369312520765/nodes_used_collection_shard1_replica2/data/index' doesn't exist. Creating new index...
[junit4:junit4]   2> 669071 T2077 oasc.CachingDirectoryFactory.get return new directory for /mnt/ssd/jenkins/workspace/Lucene-Solr-4.x-Linux/solr/build/solr-core/test/J1/./org.apache.solr.cloud.CollectionsAPIDistributedZkTest-jetty3-1369312520765/nodes_used_collection_shard1_replica2/data/index
[junit4:junit4]   2> 669073 T2077 oasc.SolrDeletionPolicy.onCommit SolrDeletionPolicy.onCommit: commits: num=1
[junit4:junit4]   2> commit{dir=MockDirWrapper(org.apache.lucene.store.RAMDirectory@a692b2 lockFactory=org.apache.lucene.store.NativeFSLockFactory@1a163e0),segFN=segments_1,generation=1}
[junit4:junit4]   2> 669074 T2077 oasc.SolrDeletionPolicy.updateCommits newest commit generation = 1
[junit4:junit4]   2> 669076 T2077 oasup.UpdateRequestProcessorChain.init inserting DistributedUpdateProcessorFactory into updateRequestProcessorChain "dedupe"
[junit4:junit4]   2> 669077 T2077 oasup.UpdateRequestProcessorChain.init inserting DistributedUpdateProcessorFactory into updateRequestProcessorChain "stored_sig"
[junit4:junit4]   2> 669078 T2077 oasup.UpdateRequestProcessorChain.init inserting DistributedUpdateProcessorFactory into updateRequestProcessorChain "distrib-dup-test-chain-implicit"
[junit4:junit4]   2> 669079 T2077 oasc.RequestHandlers.initHandlersFromConfig created standard: solr.StandardRequestHandler
[junit4:junit4]   2> 669080 T2077 oasc.RequestHandlers.initHandlersFromConfig created /get: solr.RealTimeGetHandler
[junit4:junit4]   2> 669080 T2077 oasc.RequestHandlers.initHandlersFromConfig adding lazy requestHandler: solr.ReplicationHandler
[junit4:junit4]   2> 669087 T2077 oasc.RequestHandlers.initHandlersFromConfig created /replication: solr.ReplicationHandler
[junit4:junit4]   2> 669087 T2077 oasc.RequestHandlers.initHandlersFromConfig created /update: solr.UpdateRequestHandler
[junit4:junit4]   2> 669088 T2077 oasc.RequestHandlers.initHandlersFromConfig created /admin/: org.apache.solr.handler.admin.AdminHandlers
[junit4:junit4]   2> 669090 T2077 oashl.XMLLoader.init xsltCacheLifetimeSeconds=60
[junit4:junit4]   2> 669092 T2077 oass.SolrIndexSearcher.<init> Opening Searcher@198e297 main
[junit4:junit4]   2> 669093 T2077 oasu.UpdateHandler.clearLog Clearing tlog files, tlogDir=/mnt/ssd/jenkins/workspace/Lucene-Solr-4.x-Linux/solr/build/solr-core/test/J1/./org.apache.solr.cloud.CollectionsAPIDistributedZkTest-jetty3-1369312520765/nodes_used_collection_shard1_replica2/data/tlog
[junit4:junit4]   2> 669094 T2077 oasu.CommitTracker.<init> Hard AutoCommit: disabled
[junit4:junit4]   2> 669094 T2077 oasu.CommitTracker.<init> Soft AutoCommit: disabled
[junit4:junit4]   2> 669107 T2102 oasc.SolrCore.registerSearcher [nodes_used_collection_shard1_replica2] Registered new searcher Searcher@198e297 main{StandardDirectoryReader(segments_1:1)}
[junit4:junit4]   2> 669109 T2077 oasc.ZkController.publish publishing core=nodes_used_collection_shard1_replica2 state=down
[junit4:junit4]   2> 669171 T2047 oass.OpenExchangeRatesOrgProvider.init Initialized with rates=open-exchange-rates.json, refreshInterval=1440.
[junit4:junit4]   2> 669183 T2032 oass.OpenExchangeRatesOrgProvider.init Initialized with rates=open-exchange-rates.json, refreshInterval=1440.
[junit4:junit4]   2> 669187 T2047 oass.IndexSchema.readSchema default search field in schema is text
[junit4:junit4]   2> 669190 T2032 oass.IndexSchema.readSchema default search field in schema is text
[junit4:junit4]   2> 669192 T2047 oass.IndexSchema.readSchema unique key field: id
[junit4:junit4]   2> 669192 T2091 oass.OpenExchangeRatesOrgProvider.init Initialized with rates=open-exchange-rates.json, refreshInterval=1440.
[junit4:junit4]   2> 669193 T2032 oass.IndexSchema.readSchema unique key field: id
[junit4:junit4]   2> 669207 T2091 oass.IndexSchema.readSchema default search field in schema is text
[junit4:junit4]   2> 669209 T2047 oass.FileExchangeRateProvider.reload Reloading exchange rates from file currency.xml
[junit4:junit4]   2> 669209 T2032 oass.FileExchangeRateProvider.reload Reloading exchange rates from file currency.xml
[junit4:junit4]   2> 669211 T2091 oass.IndexSchema.readSchema unique key field: id
[junit4:junit4]   2> 669213 T2047 oass.FileExchangeRateProvider.reload Reloading exchange rates from file currency.xml
[junit4:junit4]   2> 669214 T2032 oass.FileExchangeRateProvider.reload Reloading exchange rates from file currency.xml
[junit4:junit4]   2> 669218 T2047 oass.OpenExchangeRatesOrgProvider.reload Reloading exchange rates from open-exchange-rates.json
[junit4:junit4]   2> 669219 T2047 oass.OpenExchangeRatesOrgProvider$OpenExchangeRates.<init> WARN Unknown key IMPORTANT NOTE
[junit4:junit4]   2> 669220 T2047 oass.OpenExchangeRatesOrgProvider$OpenExchangeRates.<init> WARN Expected key, got STRING
[junit4:junit4]   2> 669219 T2032 oass.OpenExchangeRatesOrgProvider.reload Reloading exchange rates from open-exchange-rates.json
[junit4:junit4]   2> 669220 T2047 oass.OpenExchangeRatesOrgProvider.reload Reloading exchange rates from open-exchange-rates.json
[junit4:junit4]   2> 669221 T2032 oass.OpenExchangeRatesOrgProvider$OpenExchangeRates.<init> WARN Unknown key IMPORTANT NOTE
[junit4:junit4]   2> 669222 T2032 oass.OpenExchangeRatesOrgProvider$OpenExchangeRates.<init> WARN Expected key, got STRING
[junit4:junit4]   2> 669222 T2047 oass.OpenExchangeRatesOrgProvider$OpenExchangeRates.<init> WARN Unknown key IMPORTANT NOTE
[junit4:junit4]   2> 669223 T2047 oass.OpenExchangeRatesOrgProvider$OpenExchangeRates.<init> WARN Expected key, got STRING
[junit4:junit4]   2> 669223 T2032 oass.OpenExchangeRatesOrgProvider.reload Reloading exchange rates from open-exchange-rates.json
[junit4:junit4]   2> 669222 T2091 oass.FileExchangeRateProvider.reload Reloading exchange rates from file currency.xml
[junit4:junit4]   2> 669223 T2047 oasc.SolrCore.initDirectoryFactory org.apache.solr.core.MockDirectoryFactory
[junit4:junit4]   2> 669224 T2032 oass.OpenExchangeRatesOrgProvider$OpenExchangeRates.<init> WARN Unknown key IMPORTANT NOTE
[junit4:junit4]   2> 669225 T2032 oass.OpenExchangeRatesOrgProvider$OpenExchangeRates.<init> WARN Expected key, got STRING
[junit4:junit4]   2> 669225 T2047 oasc.SolrCore.<init> [nodes_used_collection_shard2_replica1] Opening new SolrCore at /mnt/ssd/jenkins/workspace/Lucene-Solr-4.x-Linux/solr/build/solr-core/test/J1/./org.apache.solr.cloud.CollectionsAPIDistributedZkTest-jetty1-1369312518342/nodes_used_collection_shard2_replica1/, dataDir=/mnt/ssd/jenkins/workspace/Lucene-Solr-4.x-Linux/solr/build/solr-core/test/J1/./org.apache.solr.cloud.CollectionsAPIDistributedZkTest-jetty1-1369312518342/nodes_used_collection_shard2_replica1/data/
[junit4:junit4]   2> 669226 T2032 oasc.SolrCore.initDirectoryFactory org.apache.solr.core.MockDirectoryFactory
[junit4:junit4]   2> 669226 T2047 oasc.JmxMonitoredMap.<init> JMX monitoring is enabled. Adding Solr mbeans to JMX Server: com.sun.jmx.mbeanserver.JmxMBeanServer@9fa8f
[junit4:junit4]   2> 669227 T2032 oasc.SolrCore.<init> [nodes_used_collection_shard2_replica2] Opening new SolrCore at /mnt/ssd/jenkins/workspace/Lucene-Solr-4.x-Linux/solr/build/solr-core/test/J1/./org.apache.solr.cloud.CollectionsAPIDistributedZkTest-controljetty-1369312518109/nodes_used_collection_shard2_replica2/, dataDir=/mnt/ssd/jenkins/workspace/Lucene-Solr-4.x-Linux/solr/build/solr-core/test/J1/./org.apache.solr.cloud.CollectionsAPIDistributedZkTest-controljetty-1369312518109/nodes_used_collection_shard2_replica2/data/
[junit4:junit4]   2> 669227 T2047 oasc.SolrCore.initDirectoryFactory org.apache.solr.core.MockDirectoryFactory
[junit4:junit4]   2> 669227 T2091 oass.FileExchangeRateProvider.reload Reloading exchange rates from file currency.xml
[junit4:junit4]   2> 669227 T2032 oasc.JmxMonitoredMap.<init> JMX monitoring is enabled. Adding Solr mbeans to JMX Server: com.sun.jmx.mbeanserver.JmxMBeanServer@9fa8f
[junit4:junit4]   2> 669228 T2047 oasc.CachingDirectoryFactory.get return new directory for /mnt/ssd/jenkins/workspace/Lucene-Solr-4.x-Linux/solr/build/solr-core/test/J1/./org.apache.solr.cloud.CollectionsAPIDistributedZkTest-jetty1-1369312518342/nodes_used_collection_shard2_replica1/data
[junit4:junit4]   2> 669229 T2032 oasc.SolrCore.initDirectoryFactory org.apache.solr.core.MockDirectoryFactory
[junit4:junit4]   2> 669229 T2047 oasc.SolrCore.getNewIndexDir New index directory detected: old=null new=/mnt/ssd/jenkins/workspace/Lucene-Solr-4.x-Linux/solr/build/solr-core/test/J1/./org.apache.solr.cloud.CollectionsAPIDistributedZkTest-jetty1-1369312518342/nodes_used_collection_shard2_replica1/data/index/
[junit4:junit4]   2> 669230 T2032 oasc.CachingDirectoryFactory.get return new directory for /mnt/ssd/jenkins/workspace/Lucene-Solr-4.x-Linux/solr/build/solr-core/test/J1/./org.apache.solr.cloud.CollectionsAPIDistributedZkTest-controljetty-1369312518109/nodes_used_collection_shard2_replica2/data
[junit4:junit4]   2> 669231 T2032 oasc.SolrCore.getNewIndexDir New index directory detected: old=null new=/mnt/ssd/jenkins/workspace/Lucene-Solr-4.x-Linux/solr/build/solr-core/test/J1/./org.apache.solr.cloud.CollectionsAPIDistributedZkTest-controljetty-1369312518109/nodes_used_collection_shard2_replica2/data/index/
[junit4:junit4]   2> 669230 T2047 oasc.SolrCore.initIndex WARN [nodes_used_collection_shard2_replica1] Solr index directory '/mnt/ssd/jenkins/workspace/Lucene-Solr-4.x-Linux/solr/build/solr-core/test/J1/./org.apache.solr.cloud.CollectionsAPIDistributedZkTest-jetty1-1369312518342/nodes_used_collection_shard2_replica1/data/index' doesn't exist. Creating new index...
[junit4:junit4]   2> 669232 T2091 oass.OpenExchangeRatesOrgProvider.reload Reloading exchange rates from open-exchange-rates.json
[junit4:junit4]   2> 669231 T2032 oasc.SolrCore.initIndex WARN [nodes_used_collection_shard2_replica2] Solr index directory '/mnt/ssd/jenkins/workspace/Lucene-Solr-4.x-Linux/solr/build/solr-core/test/J1/./org.apache.solr.cloud.CollectionsAPIDistributedZkTest-controljetty-1369312518109/nodes_used_collection_shard2_replica2/data/index' doesn't exist. Creating new index...
[junit4:junit4]   2> 669232 T2047 oasc.CachingDirectoryFactory.get return new directory for /mnt/ssd/jenkins/workspace/Lucene-Solr-4.x-Linux/solr/build/solr-core/test/J1/./org.apache.solr.cloud.CollectionsAPIDistributedZkTest-jetty1-1369312518342/nodes_used_collection_shard2_replica1/data/index
[junit4:junit4]   2> 669233 T2032 oasc.CachingDirectoryFactory.get return new directory for /mnt/ssd/jenkins/workspace/Lucene-Solr-4.x-Linux/solr/build/solr-core/test/J1/./org.apache.solr.cloud.CollectionsAPIDistributedZkTest-controljetty-1369312518109/nodes_used_collection_shard2_replica2/data/index
[junit4:junit4]   2> 669233 T2091 oass.OpenExchangeRatesOrgProvider$OpenExchangeRates.<init> WARN Unknown key IMPORTANT NOTE
[junit4:junit4]   2> 669234 T2091 oass.OpenExchangeRatesOrgProvider$OpenExchangeRates.<init> WARN Expected key, got STRING
[junit4:junit4]   2> 669245 T2047 oasc.SolrDeletionPolicy.onCommit SolrDeletionPolicy.onCommit: commits: num=1
[junit4:junit4]   2> commit{dir=MockDirWrapper(org.apache.lucene.store.RAMDirectory@a48637 lockFactory=org.apache.lucene.store.NativeFSLockFactory@1f8a578),segFN=segments_1,generation=1}
[junit4:junit4]   2> 669245 T2032 oasc.SolrDeletionPolicy.onCommit SolrDeletionPolicy.onCommit: commits: num=1
[junit4:junit4]   2> commit{dir=MockDirWrapper(org.apache.lucene.store.RAMDirectory@18e74bc lockFactory=org.apache.lucene.store.NativeFSLockFactory@1aa869b),segFN=segments_1,generation=1}
[junit4:junit4]   2> 669246 T2032 oasc.SolrDeletionPolicy.updateCommits newest commit generation = 1
[junit4:junit4]   2> 669245 T2047 oasc.SolrDeletionPolicy.updateCommits newest commit generation = 1
[junit4:junit4]   2> 669245 T2091 oass.OpenExchangeRatesOrgProvider.reload Reloading exchange rates from open-exchange-rates.json
[junit4:junit4]   2> 669248 T2091 oass.OpenExchangeRatesOrgProvider$OpenExchangeRates.<init> WARN Unknown key IMPORTANT NOTE
[junit4:junit4]   2> 669249 T2091 oass.OpenExchangeRatesOrgProvider$OpenExchangeRates.<init> WARN Expected key, got STRING
[junit4:junit4]   2> 669249 T2032 oasup.UpdateRequestProcessorChain.init inserting DistributedUpdateProcessorFactory into updateRequestProcessorChain "dedupe"
[junit4:junit4]   2> 669249 T2047 oasup.UpdateRequestProcessorChain.init inserting DistributedUpdateProcessorFactory into updateRequestProcessorChain "dedupe"
[junit4:junit4]   2> 669249 T2032 oasup.UpdateRequestProcessorChain.init inserting DistributedUpdateProcessorFactory into updateRequestProcessorChain "stored_sig"
[junit4:junit4]   2> 669249 T2091 oasc.SolrCore.initDirectoryFactory org.apache.solr.core.MockDirectoryFactory
[junit4:junit4]   2> 669250 T2047 oasup.UpdateRequestProcessorChain.init inserting DistributedUpdateProcessorFactory into updateRequestProcessorChain "stored_sig"
[junit4:junit4]   2> 669251 T2091 oasc.SolrCore.<init> [nodes_used_collection_shard1_replica1] Opening new SolrCore at /mnt/ssd/jenkins/workspace/Lucene-Solr-4.x-Linux/solr/build/solr-core/test/J1/./org.apache.solr.cloud.CollectionsAPIDistributedZkTest-jetty4-1369312521997/nodes_used_collection_shard1_replica1/, dataDir=/mnt/ssd/jenkins/workspace/Lucene-Solr-4.x-Linux/solr/build/solr-core/test/J1/./org.apache.solr.cloud.CollectionsAPIDistributedZkTest-jetty4-1369312521997/nodes_used_collection_shard1_replica1/data/
[junit4:junit4]   2> 669251 T2032 oasup.UpdateRequestProcessorChain.init inserting DistributedUpdateProcessorFactory into updateRequestProcessorChain "distrib-dup-test-chain-implicit"
[junit4:junit4]   2> 669252 T2091 oasc.JmxMonitoredMap.<init> JMX monitoring is enabled. Adding Solr mbeans to JMX Server: com.sun.jmx.mbeanserver.JmxMBeanServer@9fa8f
[junit4:junit4]   2> 669251 T2047 oasup.UpdateRequestProcessorChain.init inserting DistributedUpdateProcessorFactory into updateRequestProcessorChain "distrib-dup-test-chain-implicit"
[junit4:junit4]   2> 669253 T2091 oasc.SolrCore.initDirectoryFactory org.apache.solr.core.MockDirectoryFactory
[junit4:junit4]   2> 669253 T2032 oasc.RequestHandlers.initHandlersFromConfig created standard: solr.StandardRequestHandler
[junit4:junit4]   2> 669254 T2091 oasc.CachingDirectoryFactory.get return new directory for /mnt/ssd/jenkins/workspace/Lucene-Solr-4.x-Linux/solr/build/solr-core/test/J1/./org.apache.solr.cloud.CollectionsAPIDistributedZkTest-jetty4-1369312521997/nodes_used_collection_shard1_replica1/data
[junit4:junit4]   2> 669253 T2047 oasc.RequestHandlers.initHandlersFromConfig created standard: solr.StandardRequestHandler
[junit4:junit4]   2> 669254 T2032 oasc.RequestHandlers.initHandlersFromConfig created /get: solr.RealTimeGetHandler
[junit4:junit4]   2> 669255 T2032 oasc.RequestHandlers.initHandlersFromConfig adding lazy requestHandler: solr.ReplicationHandler
[junit4:junit4]   2> 669254 T2091 oasc.SolrCore.getNewIndexDir New index directory detected: old=null new=/mnt/ssd/jenkins/workspace/Lucene-Solr-4.x-Linux/solr/build/solr-core/test/J1/./org.apache.solr.cloud.CollectionsAPIDistributedZkTest-jetty4-1369312521997/nodes_used_collection_shard1_replica1/data/index/
[junit4:junit4]   2> 669256 T2032 oasc.RequestHandlers.initHandlersFromConfig created /replication: solr.ReplicationHandler
[junit4:junit4]   2> 669255 T2047 oasc.RequestHandlers.initHandlersFromConfig created /get: solr.RealTimeGetHandler
[junit4:junit4]   2> 669257 T2032 oasc.RequestHandlers.initHandlersFromConfig created /update: solr.UpdateRequestHandler
[junit4:junit4]   2> 669257 T2047 oasc.RequestHandlers.initHandlersFromConfig adding lazy requestHandler: solr.ReplicationHandler
[junit4:junit4]   2> 669256 T2091 oasc.SolrCore.initIndex WARN [nodes_used_collection_shard1_replica1] Solr index directory '/mnt/ssd/jenkins/workspace/Lucene-Solr-4.x-Linux/solr/build/solr-core/test/J1/./org.apache.solr.cloud.CollectionsAPIDistributedZkTest-jetty4-1369312521997/nodes_used_collection_shard1_replica1/data/index' doesn't exist. Creating new index...
[junit4:junit4]   2> 669258 T2047 oasc.RequestHandlers.initHandlersFromConfig created /replication: solr.ReplicationHandler
[junit4:junit4]   2> 669258 T2032 oasc.RequestHandlers.initHandlersFromConfig created /admin/: org.apache.solr.handler.admin.AdminHandlers
[junit4:junit4]   2> 669259 T2047 oasc.RequestHandlers.initHandlersFromConfig created /update: solr.UpdateRequestHandler
[junit4:junit4]   2> 669259 T2091 oasc.CachingDirectoryFactory.get return new directory for /mnt/ssd/jenkins/workspace/Lucene-Solr-4.x-Linux/solr/build/solr-core/test/J1/./org.apache.solr.cloud.CollectionsAPIDistributedZkTest-jetty4-1369312521997/nodes_used_collection_shard1_replica1/data/index
[junit4:junit4]   2> 669260 T2047 oasc.RequestHandlers.initHandlersFromConfig created /admin/: org.apache.solr.handler.admin.AdminHandlers
[junit4:junit4]   2> 669261 T2091 oasc.SolrDeletionPolicy.onCommit SolrDeletionPolicy.onCommit: commits: num=1
[junit4:junit4]   2> commit{dir=MockDirWrapper(org.apache.lucene.store.RAMDirectory@fc5a40 lockFactory=org.apache.lucene.store.NativeFSLockFactory@773caf),segFN=segments_1,generation=1}
[junit4:junit4]   2> 669262 T2091 oasc.SolrDeletionPolicy.updateCommits newest commit generation = 1
[junit4:junit4]   2> 669262 T2047 oashl.XMLLoader.init xsltCacheLifetimeSeconds=60
[junit4:junit4]   2> 669262 T2032 oashl.XMLLoader.init xsltCacheLifetimeSeconds=60
[junit4:junit4]   2> 669264 T2091 oasup.UpdateRequestProcessorChain.init inserting DistributedUpdateProcessorFactory into updateRequestProcessorChain "dedupe"
[junit4:junit4]   2> 669264 T2091 oasup.UpdateRequestProcessorChain.init inserting DistributedUpdateProcessorFactory into updateRequestProcessorChain "stored_sig"
[junit4:junit4]   2> 669265 T2091 oasup.UpdateRequestProcessorChain.init inserting DistributedUpdateProcessorFactory into updateRequestProcessorChain "distrib-dup-test-chain-implicit"
[junit4:junit4]   2> 669265 T2091 oasc.RequestHandlers.initHandlersFromConfig created standard: solr.StandardRequestHandler
[junit4:junit4]   2> 669266 T2047 oass.SolrIndexSearcher.<init> Opening Searcher@6f9b68 main
[junit4:junit4]   2> 669266 T2032 oass.SolrIndexSearcher.<init> Opening Searcher@18fe216 main
[junit4:junit4]   2> 669266 T2091 oasc.RequestHandlers.initHandlersFromConfig created /get: solr.RealTimeGetHandler
[junit4:junit4]   2> 669267 T2091 oasc.RequestHandlers.initHandlersFromConfig adding lazy requestHandler: solr.ReplicationHandler
[junit4:junit4]   2> 669267 T2032 oasu.UpdateHandler.clearLog Clearing tlog files, tlogDir=/mnt/ssd/jenkins/workspace/Lucene-Solr-4.x-Linux/solr/build/solr-core/test/J1/./org.apache.solr.cloud.CollectionsAPIDistributedZkTest-controljetty-1369312518109/nodes_used_collection_shard2_replica2/data/tlog
[junit4:junit4]   2> 669266 T2047 oasu.UpdateHandler.clearLog Clearing tlog files, tlogDir=/mnt/ssd/jenkins/workspace/Lucene-Solr-4.x-Linux/solr/build/solr-core/test/J1/./org.apache.solr.cloud.CollectionsAPIDistributedZkTest-jetty1-1369312518342/nodes_used_collection_shard2_replica1/data/tlog
[junit4:junit4]   2> 669268 T2032 oasu.CommitTracker.<init> Hard AutoCommit: disabled
[junit4:junit4]   2> 669267 T2091 oasc.RequestHandlers.initHandlersFromConfig created /replication: solr.ReplicationHandler
[junit4:junit4]   2> 669269 T2032 oasu.CommitTracker.<init> Soft AutoCommit: disabled
[junit4:junit4]   2> 669269 T2047 oasu.CommitTracker.<init> Hard AutoCommit: disabled
[junit4:junit4]   2> 669270 T2091 oasc.RequestHandlers.initHandlersFromConfig created /update: solr.UpdateRequestHandler
[junit4:junit4]   2> 669270 T2047 oasu.CommitTracker.<init> Soft AutoCommit: disabled
[junit4:junit4]   2> 669271 T2091 oasc.RequestHandlers.initHandlersFromConfig created /admin/: org.apache.solr.handler.admin.AdminHandlers
[junit4:junit4]   2> 669274 T2104 oasc.SolrCore.registerSearcher [nodes_used_collection_shard2_replica2] Registered new searcher Searcher@18fe216 main{StandardDirectoryReader(segments_1:1)}
[junit4:junit4]   2> 669274 T2091 oashl.XMLLoader.init xsltCacheLifetimeSeconds=60
[junit4:junit4]   2> 669276 T2103 oasc.SolrCore.registerSearcher [nodes_used_collection_shard2_replica1] Registered new searcher Searcher@6f9b68 main{StandardDirectoryReader(segments_1:1)}
[junit4:junit4]   2> 669278 T2032 oasc.ZkController.publish publishing core=nodes_used_collection_shard2_replica2 state=down
[junit4:junit4]   2> 669280 T2091 oass.SolrIndexSearcher.<init> Opening Searcher@f1cf77 main
[junit4:junit4]   2> 669280 T2047 oasc.ZkController.publish publishing core=nodes_used_collection_shard2_replica1 state=down
[junit4:junit4]   2> 669281 T2091 oasu.UpdateHandler.clearLog Clearing tlog files, tlogDir=/mnt/ssd/jenkins/workspace/Lucene-Solr-4.x-Linux/solr/build/solr-core/test/J1/./org.apache.solr.cloud.CollectionsAPIDistributedZkTest-jetty4-1369312521997/nodes_used_collection_shard1_replica1/data/tlog
[junit4:junit4]   2> 669282 T2091 oasu.CommitTracker.<init> Hard AutoCommit: disabled
[junit4:junit4]   2> 669282 T2091 oasu.CommitTracker.<init> Soft AutoCommit: disabled
[junit4:junit4]   2> 669286 T2105 oasc.SolrCore.registerSearcher [nodes_used_collection_shard1_replica1] Registered new searcher Searcher@f1cf77 main{StandardDirectoryReader(segments_1:1)}
[junit4:junit4]   2> 669288 T2091 oasc.ZkController.publish publishing core=nodes_used_collection_shard1_replica1 state=down
[junit4:junit4]   2> 670549 T2037 oascc.ZkStateReader.updateClusterState Updating cloud state from ZooKeeper...
[junit4:junit4]   2> 670550 T2037 oasc.Overseer$ClusterStateUpdater.updateState Update state numShards=2 message={
[junit4:junit4]   2>  "operation":"state",
[junit4:junit4]   2>  "core_node_name":null,
[junit4:junit4]   2>  "numShards":"2",
[junit4:junit4]   2>  "shard":"shard1",
[junit4:junit4]   2>  "roles":null,
[junit4:junit4]   2>  "state":"down",
[junit4:junit4]   2>  "shard_state":"active",
[junit4:junit4]   2>  "core":"nodes_used_collection_shard1_replica2",
[junit4:junit4]   2>  "collection":"nodes_used_collection",
[junit4:junit4]   2>  "shard_range":null,
[junit4:junit4]   2>  "node_name":"127.0.0.1:45660__ozv%2Fvs",
[junit4:junit4]   2>  "base_url":"http://127.0.0.1:45660/_ozv/vs"}
[junit4:junit4]   2> 670550 T2037 oasc.Overseer$ClusterStateUpdater.createCollection Create collection nodes_used_collection with numShards 2
[junit4:junit4]   2> 670552 T2037 oasc.Overseer$ClusterStateUpdater.updateState Update state numShards=2 message={
[junit4:junit4]   2>  "operation":"state",
[junit4:junit4]   2>  "core_node_name":null,
[junit4:junit4]   2>  "numShards":"2",
[junit4:junit4]   2>  "shard":"shard2",
[junit4:junit4]   2>  "roles":null,
[junit4:junit4]   2>  "state":"down",
[junit4:junit4]   2>  "shard_state":"active",
[junit4:junit4]   2>  "core":"nodes_used_collection_shard2_replica2",
[junit4:junit4]   2>  "collection":"nodes_used_collection",
[junit4:junit4]   2>  "shard_range":null,
[junit4:junit4]   2>  "node_name":"127.0.0.1:42419__ozv%2Fvs",
[junit4:junit4]   2>  "base_url":"http://127.0.0.1:42419/_ozv/vs"}
[junit4:junit4]   2> 670554 T2037 oasc.Overseer$ClusterStateUpdater.updateState Update state numShards=2 message={
[junit4:junit4]   2>  "operation":"state",
[junit4:junit4]   2>  "core_node_name":null,
[junit4:junit4]   2>  "numShards":"2",
[junit4:junit4]   2>  "shard":"shard2",
[junit4:junit4]   2>  "roles":null,
[junit4:junit4]   2>  "state":"down",
[junit4:junit4]   2>  "shard_state":"active",
[junit4:junit4]   2>  "core":"nodes_used_collection_shard2_replica1",
[junit4:junit4]   2>  "collection":"nodes_used_collection",
[junit4:junit4]   2>  "shard_range":null,
[junit4:junit4]   2>  "node_name":"127.0.0.1:46482__ozv%2Fvs",
[junit4:junit4]   2>  "base_url":"http://127.0.0.1:46482/_ozv/vs"}
[junit4:junit4]   2> 670556 T2037 oasc.Overseer$ClusterStateUpdater.updateState Update state numShards=2 message={
[junit4:junit4]   2>  "operation":"state",
[junit4:junit4]   2>  "core_node_name":null,
[junit4:junit4]   2>  "numShards":"2",
[junit4:junit4]   2>  "shard":"shard1",
[junit4:junit4]   2>  "roles":null,
[junit4:junit4]   2>  "state":"down",
[junit4:junit4]   2>  "shard_state":"active",
[junit4:junit4]   2>  "core":"nodes_used_collection_shard1_replica1",
[junit4:junit4]   2>  "collection":"nodes_used_collection",
[junit4:junit4]   2>  "shard_range":null,
[junit4:junit4]   2>  "node_name":"127.0.0.1:37924__ozv%2Fvs",
[junit4:junit4]   2>  "base_url":"http://127.0.0.1:37924/_ozv/vs"}
[junit4:junit4]   2> 670559 T2068 oascc.ZkStateReader$2.process A cluster state change: WatchedEvent state:SyncConnected type:NodeDataChanged path:/clusterstate.json, has occurred - updating... (live nodes size: 5)
[junit4:junit4]   2> 670559 T2036 oascc.ZkStateReader$2.process A cluster state change: WatchedEvent state:SyncConnected type:NodeDataChanged path:/clusterstate.json, has occurred - updating... (live nodes size: 5)
[junit4:junit4]   2> 670559 T2041 oascc.ZkStateReader$2.process A cluster state change: WatchedEvent state:SyncConnected type:NodeDataChanged path:/clusterstate.json, has occurred - updating... (live nodes size: 5)
[junit4:junit4]   2> 670559 T2096 oascc.ZkStateReader$2.process A cluster state change: WatchedEvent state:SyncConnected type:NodeDataChanged path:/clusterstate.json, has occurred - updating... (live nodes size: 5)
[junit4:junit4]   2> 670559 T2054 oascc.ZkStateReader$2.process A cluster state change: WatchedEvent state:SyncConnected type:NodeDataChanged path:/clusterstate.json, has occurred - updating... (live nodes size: 5)
[junit4:junit4]   2> 670559 T2082 oascc.ZkStateReader$2.process A cluster state change: WatchedEvent state:SyncConnected type:NodeDataChanged path:/clusterstate.json, has occurred - updating... (live nodes size: 5)
[junit4:junit4]   2> 671111 T2077 oasc.CoreContainer.registerCore registering core: nodes_used_collection_shard1_replica2
[junit4:junit4]   2> 671112 T2077 oasc.ZkController.register Register replica - core:nodes_used_collection_shard1_replica2 address:http://127.0.0.1:45660/_ozv/vs collection:nodes_used_collection shard:shard1
[junit4:junit4]   2> 671113 T2077 oascc.SolrZkClient.makePath makePath: /collections/nodes_used_collection/leader_elect/shard1/election
[junit4:junit4]   2> 671117 T2077 oasc.ShardLeaderElectionContext.runLeaderProcess Running the leader process.
[junit4:junit4]   2> 671119 T2077 oasc.ShardLeaderElectionContext.waitForReplicasToComeUp Waiting until we see more replicas up: total=2 found=1 timeoutin=180000
[junit4:junit4]   2> 671281 T2032 oasc.CoreContainer.registerCore registering core: nodes_used_collection_shard2_replica2
[junit4:junit4]   2> 671282 T2032 oasc.ZkController.register Register replica - core:nodes_used_collection_shard2_replica2 address:http://127.0.0.1:42419/_ozv/vs collection:nodes_used_collection shard:shard2
[junit4:junit4]   2> 671282 T2047 oasc.CoreContainer.registerCore registering core: nodes_used_collection_shard2_replica1
[junit4:junit4]   2> 671283 T2047 oasc.ZkController.register Register replica - core:nodes_used_collection_shard2_replica1 address:http://127.0.0.1:46482/_ozv/vs collection:nodes_used_collection shard:shard2
[junit4:junit4]   2> 671283 T2032 oascc.SolrZkClient.makePath makePath: /collections/nodes_used_collection/leader_elect/shard2/election
[junit4:junit4]   2> 671283 T2047 oascc.SolrZkClient.makePath makePath: /collections/nodes_used_collection/leader_elect/shard2/election
[junit4:junit4]   2> 671288 T2032 oasc.ShardLeaderElectionContext.runLeaderProcess Running the leader process.
[junit4:junit4]   2> 671289 T2091 oasc.CoreContainer.registerCore registering core: nodes_used_collection_shard1_replica1
[junit4:junit4]   2> 671290 T2091 oasc.ZkController.register Register replica - core:nodes_used_collection_shard1_replica1 address:http://127.0.0.1:37924/_ozv/vs collection:nodes_used_collection shard:shard1
[junit4:junit4]   2> 671291 T2032 oasc.ShardLeaderElectionContext.waitForReplicasToComeUp Enough replicas found to continue.
[junit4:junit4]   2> 671291 T2032 oasc.ShardLeaderElectionContext.runLeaderProcess I may be the new leader - try and sync
[junit4:junit4]   2> 671292 T2032 oasc.SyncStrategy.sync Sync replicas to http://127.0.0.1:42419/_ozv/vs/nodes_used_collection_shard2_replica2/
[junit4:junit4]   2> 671292 T2032 oasu.PeerSync.sync PeerSync: core=nodes_used_collection_shard2_replica2 url=http://127.0.0.1:42419/_ozv/vs START replicas=[http://127.0.0.1:46482/_ozv/vs/nodes_used_collection_shard2_replica1/] nUpdates=100
[junit4:junit4]   2> 671292 T2032 oasu.PeerSync.sync PeerSync: core=nodes_used_collection_shard2_replica2 url=http://127.0.0.1:42419/_ozv/vs DONE.  We have no versions.  sync failed.
[junit4:junit4]   2> 671293 T2032 oasc.SyncStrategy.syncReplicas Leader's attempt to sync with shard failed, moving to the next canidate
[junit4:junit4]   2> 671293 T2032 oasc.ShardLeaderElectionContext.runLeaderProcess We failed sync, but we have no versions - we can't sync in that case - we were active before, so become leader anyway
[junit4:junit4]   2> 671294 T2032 oasc.ShardLeaderElectionContext.runLeaderProcess I am the new leader: http://127.0.0.1:42419/_ozv/vs/nodes_used_collection_shard2_replica2/
[junit4:junit4]   2> 671294 T2032 oascc.SolrZkClient.makePath makePath: /collections/nodes_used_collection/leaders/shard2
[junit4:junit4]   2> ASYNC  NEW_CORE C6369 name=nodes_used_collection_shard2_replica1 org.apache.solr.core.SolrCore@11988c8 url=http://127.0.0.1:46482/_ozv/vs/nodes_used_collection_shard2_replica1 node=127.0.0.1:46482__ozv%2Fvs C6369_STATE=coll:nodes_used_collection core:nodes_used_collection_shard2_replica1 props:{shard=shard2, state=down, core=nodes_used_collection_shard2_replica1, collection=nodes_used_collection, node_name=127.0.0.1:46482__ozv%2Fvs, base_url=http://127.0.0.1:46482/_ozv/vs}
[junit4:junit4]   2> 671298 T2048 C6369 P46482 oasc.SolrCore.execute [nodes_used_collection_shard2_replica1] webapp=/_ozv/vs path=/get params={getVersions=100&distrib=false&wt=javabin&qt=/get&version=2} status=0 QTime=0
[junit4:junit4]   2> 671621 T2077 oasc.ShardLeaderElectionContext.waitForReplicasToComeUp Enough replicas found to continue.
[junit4:junit4]   2> 671621 T2077 oasc.ShardLeaderElectionContext.runLeaderProcess I may be the new leader - try and sync
[junit4:junit4]   2> 671622 T2077 oasc.SyncStrategy.sync Sync replicas to http://127.0.0.1:45660/_ozv/vs/nodes_used_collection_shard1_replica2/
[junit4:junit4]   2> 671622 T2077 oasu.PeerSync.sync PeerSync: core=nodes_used_collection_shard1_replica2 url=http://127.0.0.1:45660/_ozv/vs START replicas=[http://127.0.0.1:37924/_ozv/vs/nodes_used_collection_shard1_replica1/] nUpdates=100
[junit4:junit4]   2> 671622 T2077 oasu.PeerSync.sync PeerSync: core=nodes_used_collection_shard1_replica2 url=http://127.0.0.1:45660/_ozv/vs DONE.  We have no versions.  sync failed.
[junit4:junit4]   2> 671623 T2077 oasc.SyncStrategy.syncReplicas Leader's attempt to sync with shard failed, moving to the next canidate
[junit4:junit4]   2> 671623 T2077 oasc.ShardLeaderElectionContext.runLeaderProcess We failed sync, but we have no versions - we can't sync in that case - we were active before, so become leader anyway
[junit4:junit4]   2> 671623 T2077 oasc.ShardLeaderElectionContext.runLeaderProcess I am the new leader: http://127.0.0.1:45660/_ozv/vs/nodes_used_collection_shard1_replica2/
[junit4:junit4]   2> 671624 T2077 oascc.SolrZkClient.makePath makePath: /collections/nodes_used_collection/leaders/shard1
[junit4:junit4]   2> ASYNC  NEW_CORE C6370 name=nodes_used_collection_shard1_replica1 org.apache.solr.core.SolrCore@131f7ef url=http://127.0.0.1:37924/_ozv/vs/nodes_used_collection_shard1_replica1 node=127.0.0.1:37924__ozv%2Fvs C6370_STATE=coll:nodes_used_collection core:nodes_used_collection_shard1_replica1 props:{shard=shard1, state=down, core=nodes_used_collection_shard1_replica1, collection=nodes_used_collection, node_name=127.0.0.1:37924__ozv%2Fvs, base_url=http://127.0.0.1:37924/_ozv/vs}
[junit4:junit4]   2> 671630 T2092 C6370 P37924 oasc.SolrCore.execute [nodes_used_collection_shard1_replica1] webapp=/_ozv/vs path=/get params={getVersions=100&distrib=false&wt=javabin&qt=/get&version=2} status=0 QTime=0
[junit4:junit4]   2> 672065 T2037 oascc.ZkStateReader.updateClusterState Updating cloud state from ZooKeeper...
[junit4:junit4]   2> 672078 T2054 oascc.ZkStateReader$2.process A cluster state change: WatchedEvent state:SyncConnected type:NodeDataChanged path:/clusterstate.json, has occurred - updating... (live nodes size: 5)
[junit4:junit4]   2> 672078 T2096 oascc.ZkStateReader$2.process A cluster state change: WatchedEvent state:SyncConnected type:NodeDataChanged path:/clusterstate.json, has occurred - updating... (live nodes size: 5)
[junit4:junit4]   2> 672078 T2082 oascc.ZkStateReader$2.process A cluster state change: WatchedEvent state:SyncConnected type:NodeDataChanged path:/clusterstate.json, has occurred - updating... (live nodes size: 5)
[junit4:junit4]   2> 672078 T2036 oascc.ZkStateReader$2.process A cluster state change: WatchedEvent state:SyncConnected type:NodeDataChanged path:/clusterstate.json, has occurred - updating... (live nodes size: 5)
[junit4:junit4]   2> 672078 T2041 oascc.ZkStateReader$2.process A cluster state change: WatchedEvent state:SyncConnected type:NodeDataChanged path:/clusterstate.json, has occurred - updating... (live nodes size: 5)
[junit4:junit4]   2> 672078 T2068 oascc.ZkStateReader$2.process A cluster state change: WatchedEvent state:SyncConnected type:NodeDataChanged path:/clusterstate.json, has occurred - updating... (live nodes size: 5)
[junit4:junit4]   2> 672100 T2032 oasc.ZkController.register We are http://127.0.0.1:42419/_ozv/vs/nodes_used_collection_shard2_replica2/ and leader is http://127.0.0.1:42419/_ozv/vs/nodes_used_collection_shard2_replica2/
[junit4:junit4]   2> 672101 T2032 oasc.ZkController.register No LogReplay needed for core=nodes_used_collection_shard2_replica2 baseURL=http://127.0.0.1:42419/_ozv/vs
[junit4:junit4]   2> 672101 T2032 oasc.ZkController.checkRecovery I am the leader, no recovery necessary
[junit4:junit4]   2> 672101 T2032 oasc.ZkController.publish publishing core=nodes_used_collection_shard2_replica2 state=active
[junit4:junit4]   2> 672103 T2032 oascc.ZkStateReader.updateClusterState Updating cloud state from ZooKeeper...
[junit4:junit4]   2> 672104 T2032 oass.SolrDispatchFilter.handleAdminRequest [admin] webapp=null path=/admin/cores params={numShards=2&shard=shard2&name=nodes_used_collection_shard2_replica2&action=CREATE&collection=nodes_used_collection&wt=javabin&qt=/admin/cores&version=2} status=0 QTime=4160
[junit4:junit4]   2> 672129 T2077 oasc.ZkController.register We are http://127.0.0.1:45660/_ozv/vs/nodes_used_collection_shard1_replica2/ and leader is http://127.0.0.1:45660/_ozv/vs/nodes_used_collection_shard1_replica2/
[junit4:junit4]   2> 672129 T2077 oasc.ZkController.register No LogReplay needed for core=nodes_used_collection_shard1_replica2 baseURL=http://127.0.0.1:45660/_ozv/vs
[junit4:junit4]   2> 672130 T2077 oasc.ZkController.checkRecovery I am the leader, no recovery necessary
[junit4:junit4]   2> 672130 T2077 oasc.ZkController.publish publishing core=nodes_used_collection_shard1_replica2 state=active
[junit4:junit4]   2> 672132 T2077 oascc.ZkStateReader.updateClusterState Updating cloud state from ZooKeeper...
[junit4:junit4]   2> 672133 T2077 oass.SolrDispatchFilter.handleAdminRequest [admin] webapp=null path=/admin/cores params={numShards=2&shard=shard1&name=nodes_used_collection_shard1_replica2&action=CREATE&collection=nodes_used_collection&wt=javabin&qt=/admin/cores&version=2} status=0 QTime=4190
[junit4:junit4]   2> 672289 T2047 oasc.ZkController.register We are http://127.0.0.1:46482/_ozv/vs/nodes_used_collection_shard2_replica1/ and leader is http://127.0.0.1:42419/_ozv/vs/nodes_used_collection_shard2_replica2/
[junit4:junit4]   2> 672290 T2047 oasc.ZkController.register No LogReplay needed for core=nodes_used_collection_shard2_replica1 baseURL=http://127.0.0.1:46482/_ozv/vs
[junit4:junit4]   2> 672290 T2047 oasc.ZkController.checkRecovery Core needs to recover:nodes_used_collection_shard2_replica1
[junit4:junit4]   2> 672291 T2047 oasu.DefaultSolrCoreState.doRecovery Running recovery - first canceling any ongoing recovery
[junit4:junit4]   2> 672291 T2108 C6369 P46482 oasc.RecoveryStrategy.run Starting recovery process.  core=nodes_used_collection_shard2_replica1 recoveringAfterStartup=true
[junit4:junit4]   2> 672292 T2108 C6369 P46482 oasc.RecoveryStrategy.doRecovery ###### startupVersions=[]
[junit4:junit4]   2> 672292 T2047 oascc.ZkStateReader.updateClusterState Updating cloud state from ZooKeeper...
[junit4:junit4]   2> 672293 T2091 oasc.ZkController.register We are http://127.0.0.1:37924/_ozv/vs/nodes_used_collection_shard1_replica1/ and leader is http://127.0.0.1:45660/_ozv/vs/nodes_used_collection_shard1_replica2/
[junit4:junit4]   2> 672292 T2108 C6369 P46482 oasc.ZkController.publish publishing core=nodes_used_collection_shard2_replica1 state=recovering
[junit4:junit4]   2> 672293 T2091 oasc.ZkController.register No LogReplay needed for core=nodes_used_collection_shard1_replica1 baseURL=http://127.0.0.1:37924/_ozv/vs
[junit4:junit4]   2> 672294 T2091 oasc.ZkController.checkRecovery Core needs to recover:nodes_used_collection_shard1_replica1
[junit4:junit4]   2> 672294 T2091 oasu.DefaultSolrCoreState.doRecovery Running recovery - first canceling any ongoing recovery
[junit4:junit4]   2> 672293 T2047 oass.SolrDispatchFilter.handleAdminRequest [admin] webapp=null path=/admin/cores params={numShards=2&shard=shard2&name=nodes_used_collection_shard2_replica1&action=CREATE&collection=nodes_used_collection&wt=javabin&qt=/admin/cores&version=2} status=0 QTime=4350
[junit4:junit4]   2> 672295 T2109 C6370 P37924 oasc.RecoveryStrategy.run Starting recovery process.  core=nodes_used_collection_shard1_replica1 recoveringAfterStartup=true
[junit4:junit4]   2> 672294 T2108 C6369 P46482 oascsi.HttpClientUtil.createClient Creating new http client, config:maxConnections=128&maxConnectionsPerHost=32&followRedirects=false
[junit4:junit4]   2> 672295 T2109 C6370 P37924 oasc.RecoveryStrategy.doRecovery ###### startupVersions=[]
[junit4:junit4]   2> 672295 T2091 oascc.ZkStateReader.updateClusterState Updating cloud state from ZooKeeper...
[junit4:junit4]   2> 672296 T2109 C6370 P37924 oasc.ZkController.publish publishing core=nodes_used_collection_shard1_replica1 state=recovering
[junit4:junit4]   2> 672297 T2091 oass.SolrDispatchFilter.handleAdminRequest [admin] webapp=null path=/admin/cores params={numShards=2&shard=shard1&name=nodes_used_collection_shard1_replica1&action=CREATE&collection=nodes_used_collection&wt=javabin&qt=/admin/cores&version=2} status=0 QTime=4354
[junit4:junit4]   2> 672297 T2109 C6370 P37924 oascsi.HttpClientUtil.createClient Creating new http client, config:maxConnections=128&maxConnectionsPerHost=32&followRedirects=false
[junit4:junit4]   2> 672297 T2038 oasc.OverseerCollectionProcessor.createCollection Finished create command on all shards for collection: nodes_used_collection
[junit4:junit4]   2> 672300 T2030 oasha.CoreAdminHandler.handleWaitForStateAction Going to wait for coreNodeName: 127.0.0.1:46482__ozv%2Fvs_nodes_used_collection_shard2_replica1, state: recovering, checkLive: true, onlyIfLeader: true
[junit4:junit4]   2> 672301 T2075 oasha.CoreAdminHandler.handleWaitForStateAction Going to wait for coreNodeName: 127.0.0.1:37924__ozv%2Fvs_nodes_used_collection_shard1_replica1, state: recovering, checkLive: true, onlyIfLeader: true
[junit4:junit4]   2> 672305 T2054 oasc.DistributedQueue$LatchChildWatcher.process Watcher fired on path: /overseer/collection-queue-work/qnr-0000000000 state: SyncConnected type NodeDataChanged
[junit4:junit4]   2> 672306 T2036 oasc.DistributedQueue$LatchChildWatcher.process Watcher fired on path: /overseer/collection-queue-work state: SyncConnected type NodeChildrenChanged
[junit4:junit4]   2> 672306 T2038 oasc.OverseerCollectionProcessor.run Overseer Collection Processor: Message id:/overseer/collection-queue-work/qn-0000000000 complete, response:{success={null={responseHeader={status=0,QTime=4160},core=nodes_used_collection_shard2_replica2},null={responseHeader={status=0,QTime=4190},core=nodes_used_collection_shard1_replica2},null={responseHeader={status=0,QTime=4350},core=nodes_used_collection_shard2_replica1},null={responseHeader={status=0,QTime=4354},core=nodes_used_collection_shard1_replica1}}}
[junit4:junit4]   2> 672310 T2050 oass.SolrDispatchFilter.handleAdminRequest [admin] webapp=null path=/admin/collections params={numShards=2&name=nodes_used_collection&replicationFactor=2&action=CREATE&wt=javabin&version=2} status=0 QTime=4382
[junit4:junit4]   2> 672311 T2014 oascsi.HttpClientUtil.createClient Creating new http client, config:
[junit4:junit4]   2> 672312 T2014 oascc.ConnectionManager.waitForConnected Waiting for client to connect to ZooKeeper
[junit4:junit4]   2> 672326 T2111 oascc.ConnectionManager.process Watcher org.apache.solr.common.cloud.ConnectionManager@1d92036 name:ZooKeeperConnection Watcher:127.0.0.1:59838/solr got event WatchedEvent state:SyncConnected type:None path:null path:null type:None
[junit4:junit4]   2> 672327 T2014 oascc.ConnectionManager.waitForConnected Client is connected to ZooKeeper
[junit4:junit4]   2> 672328 T2014 oascc.ZkStateReader.createClusterStateWatchersAndUpdate Updating cluster state from ZooKeeper...
[junit4:junit4]   2> 672330 T2014 oascsi.HttpClientUtil.createClient Creating new http client, config:
[junit4:junit4]   2> 672332 T2014 oascc.ConnectionManager.waitForConnected Waiting for client to connect to ZooKeeper
[junit4:junit4]   2> 672333 T2113 oascc.ConnectionManager.process Watcher org.apache.solr.common.cloud.ConnectionManager@a80067 name:ZooKeeperConnection Watcher:127.0.0.1:59838/solr got event WatchedEvent state:SyncConnected type:None path:null path:null type:None
[junit4:junit4]   2> 672333 T2014 oascc.ConnectionManager.waitForConnected Client is connected to ZooKeeper
[junit4:junit4]   2> 672334 T2014 oascc.ZkStateReader.createClusterStateWatchersAndUpdate Updating cluster state from ZooKeeper...
[junit4:junit4]   2> 672338 T2092 oasha.CollectionsHandler.handleCreateAction Creating Collection : numShards=4&maxShardsPerNode=5&name=awholynewcollection_0&replicationFactor=5&action=CREATE&wt=javabin&version=2
[junit4:junit4]   2> 672340 T2036 oasc.DistributedQueue$LatchChildWatcher.process Watcher fired on path: /overseer/collection-queue-work state: SyncConnected type NodeChildrenChanged
[junit4:junit4]   2> 672340 T2038 oasc.OverseerCollectionProcessor.run Overseer Collection Processor: Get the message id:/overseer/collection-queue-work/qn-0000000002 message:{
[junit4:junit4]   2>  "operation":"createcollection",
[junit4:junit4]   2>  "numShards":"4",
[junit4:junit4]   2>  "maxShardsPerNode":"5",
[junit4:junit4]   2>  "createNodeSet":null,
[junit4:junit4]   2>  "name":"awholynewcollection_0",
[junit4:junit4]   2>  "replicationFactor":"5"}
[junit4:junit4]   2> 672341 T2038 oasc.OverseerCollectionProcessor.createCollection Creating shard awholynewcollection_0_shard1_replica1 as part of slice shard1 of collection awholynewcollection_0 on 127.0.0.1:37924__ozv%2Fvs
[junit4:junit4]   2> 672341 T2038 oasc.OverseerCollectionProcessor.createCollection Creating shard awholynewcollection_0_shard1_replica2 as part of slice shard1 of collection awholynewcollection_0 on 127.0.0.1:45660__ozv%2Fvs
[junit4:junit4]   2> 672341 T2038 oasc.OverseerCollectionProcessor.createCollection Creating shard awholynewcollection_0_shard1_replica3 as part of slice shard1 of collection awholynewcollection_0 on 127.0.0.1:40769__ozv%2Fvs
[junit4:junit4]   2> 672341 T2038 oasc.OverseerCollectionProcessor.createCollection Creating shard awholynewcollection_0_shard1_replica4 as part of slice shard1 of collection awholynewcollection_0 on 127.0.0.1:46482__ozv%2Fvs
[junit4:junit4]   2> 672342 T2038 oasc.OverseerCollectionProcessor.createCollection Creating shard awholynewcollection_0_shard1_replica5 as part of slice shard1 of collection awholynewcollection_0 on 127.0.0.1:42419__ozv%2Fvs
[junit4:junit4]   2> 672342 T2038 oasc.OverseerCollectionProcessor.createCollection Creating shard awholynewcollection_0_shard2_replica1 as part of slice shard2 of collection awholynewcollection_0 on 127.0.0.1:37924__ozv%2Fvs
[junit4:junit4]   2> 672342 T2062 oasc.CoreContainer.create Creating SolrCore 'awholynewcollection_0_shard1_replica3' using instanceDir: /mnt/ssd/jenkins/workspace/Lucene-Solr-4.x-Linux/solr/build/solr-core/test/J1/./org.apache.solr.cloud.CollectionsAPIDistributedZkTest-jetty2-1369312519564/awholynewcollection_0_shard1_replica3
[junit4:junit4]   2> 672342 T2089 oasc.CoreContainer.create Creating SolrCore 'awholynewcollection_0_shard1_replica1' using instanceDir: /mnt/ssd/jenkins/workspace/Lucene-Solr-4.x-Linux/solr/build/solr-core/test/J1/./org.apache.solr.cloud.CollectionsAPIDistributedZkTest-jetty4-1369312521997/awholynewcollection_0_shard1_replica1
[junit4:junit4]   2> 672343 T2089 oasc.ZkController.createCollectionZkNode Check for collection zkNode:awholynewcollection_0
[junit4:junit4]   2> 672342 T2038 oasc.OverseerCollectionProcessor.createCollection Creating shard awholynewcollection_0_shard2_replica2 as part of slice shard2 of collection awholynewcollection_0 on 127.0.0.1:45660__ozv%2Fvs
[junit4:junit4]   2> 672343 T2031 oasc.CoreContainer.create Creating SolrCore 'awholynewcollection_0_shard1_replica5' using instanceDir: /mnt/ssd/jenkins/workspace/Lucene-Solr-4.x-Linux/solr/build/solr-core/test/J1/./org.apache.solr.cloud.CollectionsAPIDistributedZkTest-controljetty-1369312518109/awholynewcollection_0_shard1_replica5
[junit4:junit4]   2> 672343 T2049 oasc.CoreContainer.create Creating SolrCore 'awholynewcollection_0_shard1_replica4' using instanceDir: /mnt/ssd/jenkins/workspace/Lucene-Solr-4.x-Linux/solr/build/solr-core/test/J1/./org.apache.solr.cloud.CollectionsAPIDistributedZkTest-jetty1-1369312518342/awholynewcollection_0_shard1_replica4
[junit4:junit4]   2> 672343 T2090 oasc.CoreContainer.create Creating SolrCore 'awholynewcollection_0_shard2_replica1' using instanceDir: /mnt/ssd/jenkins/workspace/Lucene-Solr-4.x-Linux/solr/build/solr-core/test/J1/./org.apache.solr.cloud.CollectionsAPIDistributedZkTest-jetty4-1369312521997/awholynewcollection_0_shard2_replica1
[junit4:junit4]   2> 672345 T2090 oasc.ZkController.createCollectionZkNode Check for collection zkNode:awholynewcollection_0
[junit4:junit4]   2> 672343 T2076 oasc.CoreContainer.create Creating SolrCore 'awholynewcollection_0_shard1_replica2' using instanceDir: /mnt/ssd/jenkins/workspace/Lucene-Solr-4.x-Linux/solr/build/solr-core/test/J1/./org.apache.solr.cloud.CollectionsAPIDistributedZkTest-jetty3-1369312520765/awholynewcollection_0_shard1_replica2
[junit4:junit4]   2> 672346 T2076 oasc.ZkController.createCollectionZkNode Check for collection zkNode:awholynewcollection_0
[junit4:junit4]   2> 672343 T2062 oasc.ZkController.createCollectionZkNode Check for collection zkNode:awholynewcollection_0
[junit4:junit4]   2> 672346 T2090 oasc.ZkController.createCollectionZkNode Creating collection in ZooKeeper:awholynewcollection_0
[junit4:junit4]   2> 672345 T2049 oasc.ZkController.createCollectionZkNode Check for collection zkNode:awholynewcollection_0
[junit4:junit4]   2> 672344 T2078 oasc.CoreContainer.create Creating SolrCore 'awholynewcollection_0_shard2_replica2' using instanceDir: /mnt/ssd/jenkins/workspace/Lucene-Solr-4.x-Linux/solr/build/solr-core/test/J1/./org.apache.solr.cloud.CollectionsAPIDistributedZkTest-jetty3-1369312520765/awholynewcollection_0_shard2_replica2
[junit4:junit4]   2> 672349 T2049 oasc.ZkController.createCollectionZkNode Creating collection in ZooKeeper:awholynewcollection_0
[junit4:junit4]   2> 672344 T2031 oasc.ZkController.createCollectionZkNode Check for collection zkNode:awholynewcollection_0
[junit4:junit4]   2> 672344 T2038 oasc.OverseerCollectionProcessor.createCollection Creating shard awholynewcollection_0_shard2_replica3 as part of slice shard2 of collection awholynewcollection_0 on 127.0.0.1:40769__ozv%2Fvs
[junit4:junit4]   2> 672344 T2089 oasc.ZkController.createCollectionZkNode Creating collection in ZooKeeper:awholynewcollection_0
[junit4:junit4]   2> 672351 T2031 oasc.ZkController.createCollectionZkNode Creating collection in ZooKeeper:awholynewcollection_0
[junit4:junit4]   2> 672351 T2038 oasc.OverseerCollectionProcessor.createCollection Creating shard awholynewcollection_0_shard2_replica4 as part of slice shard2 of collection awholynewcollection_0 on 127.0.0.1:46482__ozv%2Fvs
[junit4:junit4]   2> 672350 T2049 oasc.ZkController.getConfName Looking for collection configName
[junit4:junit4]   2> 672349 T2078 oasc.ZkController.createCollectionZkNode Check for collection zkNode:awholynewcollection_0
[junit4:junit4]   2> 672348 T2090 oasc.ZkController.getConfName Looking for collection configName
[junit4:junit4]   2> 672347 T2062 oasc.ZkController.createCollectionZkNode Creating collection in ZooKeeper:awholynewcollection_0
[junit4:junit4]   2> 672347 T2076 oasc.ZkController.createCollectionZkNode Creating collection in ZooKeeper:awholynewcollection_0
[junit4:junit4]   2> 672354 T2090 oasc.ZkController.getConfName Only one config set found in zk - using it:conf1
[junit4:junit4]   2> 672354 T2062 oasc.ZkController.getConfName Looking for collection configName
[junit4:junit4]   2> 672353 T2078 oasc.ZkController.createCollectionZkNode Creating collection in ZooKeeper:awholynewcollection_0
[junit4:junit4]   2> 672353 T2049 oasc.ZkController.getConfName Only one config set found in zk - using it:conf1
[junit4:junit4]   2> 672353 T2050 oasc.CoreContainer.create Creating SolrCore 'awholynewcollection_0_shard2_replica4' using instanceDir: /mnt/ssd/jenkins/workspace/Lucene-Solr-4.x-Linux/solr/build/solr-core/test/J1/./org.apache.solr.cloud.CollectionsAPIDistributedZkTest-jetty1-1369312518342/awholynewcollection_0_shard2_replica4
[junit4:junit4]   2> 672352 T2038 oasc.OverseerCollectionProcessor.createCollection Creating shard awholynewcollection_0_shard2_replica5 as part of slice shard2 of collection awholynewcollection_0 on 127.0.0.1:42419__ozv%2Fvs
[junit4:junit4]   2> 672352 T2064 oasc.CoreContainer.create Creating SolrCore 'awholynewcollection_0_shard2_replica3' using instanceDir: /mnt/ssd/jenkins/workspace/Lucene-Solr-4.x-Linux/solr/build/solr-core/test/J1/./org.apache.solr.cloud.CollectionsAPIDistributedZkTest-jetty2-1369312519564/awholynewcollection_0_shard2_replica3
[junit4:junit4]   2> 672358 T2064 oasc.ZkController.createCollectionZkNode Check for collection zkNode:awholynewcollection_0
[junit4:junit4]   2> 672351 T2031 oasc.ZkController.getConfName Looking for collection configName
[junit4:junit4]   2> 672359 T2064 oasc.ZkController.createCollectionZkNode Creating collection in ZooKeeper:awholynewcollection_0
[junit4:junit4]   2> 672351 T2089 oasc.ZkController.getConfName Looking for collection configName
[junit4:junit4]   2> 672360 T2031 oasc.ZkController.getConfName Only one config set found in zk - using it:conf1
[junit4:junit4]   2> 672360 T2064 oasc.ZkController.getConfName Looking for collection configName
[junit4:junit4]   2> 672361 T2089 oasc.ZkController.getConfName Only one config set found in zk - using it:conf1
[junit4:junit4]   2> 672359 T2029 oasc.CoreContainer.create Creating SolrCore 'awholynewcollection_0_shard2_replica5' using instanceDir: /mnt/ssd/jenkins/workspace/Lucene-Solr-4.x-Linux/solr/build/solr-core/test/J1/./org.apache.solr.cloud.CollectionsAPIDistributedZkTest-controljetty-1369312518109/awholynewcollection_0_shard2_replica5
[junit4:junit4]   2> 672362 T2029 oasc.ZkController.createCollectionZkNode Check for collection zkNode:awholynewcollection_0
[junit4:junit4]   2> 672358 T2038 oasc.OverseerCollectionProcessor.createCollection Creating shard awholynewcollection_0_shard3_replica1 as part of slice shard3 of collection awholynewcollection_0 on 127.0.0.1:37924__ozv%2Fvs
[junit4:junit4]   2> 672357 T2050 oasc.ZkController.createCollectionZkNode Check for collection zkNode:awholynewcollection_0
[junit4:junit4]   2> 672357 T2049 oascc.SolrZkClient.makePath makePath: /collections/awholynewcollection_0
[junit4:junit4]   2> 672356 T2062 oasc.ZkController.getConfName Only one config set found in zk - using it:conf1
[junit4:junit4]   2> 672356 T2078 oasc.ZkController.getConfName Looking for collection configName
[junit4:junit4]   2> 672355 T2090 oascc.SolrZkClient.makePath makePath: /collections/awholynewcollection_0
[junit4:junit4]   2> 672354 T2076 oasc.ZkController.getConfName Looking for collection configName
[junit4:junit4]   2> 672365 T2078 oascc.SolrZkClient.makePath makePath: /collections/awholynewcollection_0
[junit4:junit4]   2> 672364 T2062 oascc.SolrZkClient.makePath makePath: /collections/awholynewcollection_0
[junit4:junit4]   2> 672364 T2091 oasc.CoreContainer.create Creating SolrCore 'awholynewcollection_0_shard3_replica1' using instanceDir: /mnt/ssd/jenkins/workspace/Lucene-Solr-4.x-Linux/solr/build/solr-core/test/J1/./org.apache.solr.cloud.CollectionsAPIDistributedZkTest-jetty4-1369312521997/awholynewcollection_0_shard3_replica1
[junit4:junit4]   2> 672364 T2050 oasc.ZkController.createCollectionZkNode Creating collection in ZooKeeper:awholynewcollection_0
[junit4:junit4]   2> 672367 T2078 oasc.ZkController.readConfigName Load collection config from:/collections/awholynewcollection_0
[junit4:junit4]   2> 672363 T2038 oasc.OverseerCollectionProcessor.createCollection Creating shard awholynewcollection_0_shard3_replica2 as part of slice shard3 of collection awholynewcollection_0 on 127.0.0.1:45660__ozv%2Fvs
[junit4:junit4]   2> 672363 T2029 oasc.ZkController.createCollectionZkNode Creating collection in ZooKeeper:awholynewcollection_0
[junit4:junit4]   2> 672368 T2029 oasc.ZkController.getConfName Looking for collection configName
[junit4:junit4]   2> 672362 T2064 oasc.ZkController.getConfName Only one config set found in zk - using it:conf1
[junit4:junit4]   2> 672362 T2089 oascc.SolrZkClient.makePath makePath: /collections/awholynewcollection_0
[junit4:junit4]   2> 672361 T2031 oascc.SolrZkClient.makePath makePath: /collections/awholynewcollection_0
[junit4:junit4]   2> 672369 T2064 oascc.SolrZkClient.makePath makePath: /collections/awholynewcollection_0
[junit4:junit4]   2> 672369 T2029 oascc.SolrZkClient.makePath makePath: /collections/awholynewcollection_0
[junit4:junit4]   2> 672368 T2077 oasc.CoreContainer.create Creating SolrCore 'awholynewcollection_0_shard3_replica2' using instanceDir: /mnt/ssd/jenkins/workspace/Lucene-Solr-4.x-Linux/solr/build/solr-core/test/J1/./org.apache.solr.cloud.CollectionsAPIDistributedZkTest-jetty3-1369312520765/awholynewcollection_0_shard3_replica2
[junit4:junit4]   2> 672371 T2077 oasc.ZkController.createCollectionZkNode Check for collection zkNode:awholynewcollection_0
[junit4:junit4]   2> 672368 T2078 oasc.SolrResourceLoader.<init> new SolrResourceLoader for directory: '/mnt/ssd/jenkins/workspace/Lucene-Solr-4.x-Linux/solr/build/solr-core/test/J1/./org.apache.solr.cloud.CollectionsAPIDistributedZkTest-jetty3-1369312520765/awholynewcollection_0_shard2_replica2/'
[junit4:junit4]   2> 672372 T2029 oasc.ZkController.readConfigName Load collection config from:/collections/awholynewcollection_0
[junit4:junit4]   2> 672368 T2038 oasc.OverseerCollectionProcessor.createCollection Creating shard awholynewcollection_0_shard3_replica3 as part of slice shard3 of collection awholynewcollection_0 on 127.0.0.1:40769__ozv%2Fvs
[junit4:junit4]   2> 672368 T2062 oasc.ZkController.readConfigName Load collection config from:/collections/awholynewcollection_0
[junit4:junit4]   2> 672367 T2050 oasc.ZkController.getConfName Looking for collection configName
[junit4:junit4]   2> 672367 T2090 oasc.ZkController.readConfigName Load collection config from:/collections/awholynewcollection_0
[junit4:junit4]   2> 672366 T2091 oasc.ZkController.createCollectionZkNode Check for collection zkNode:awholynewcollection_0
[junit4:junit4]   2> 672374 T2050 oascc.SolrZkClient.makePath makePath: /collections/awholynewcollection_0
[junit4:junit4]   2> 672366 T2076 oascc.SolrZkClient.makePath makePath: /collections/awholynewcollection_0
[junit4:junit4]   2> 672365 T2049 oasc.ZkController.readConfigName Load collection config from:/collections/awholynewcollection_0
[junit4:junit4]   2> 672375 T2090 oasc.SolrResourceLoader.<init> new SolrResourceLoader for directory: '/mnt/ssd/jenkins/workspace/Lucene-Solr-4.x-Linux/solr/build/solr-core/test/J1/./org.apache.solr.cloud.CollectionsAPIDistributedZkTest-jetty4-1369312521997/awholynewcollection_0_shard2_replica1/'
[junit4:junit4]   2> 672374 T2091 oasc.ZkController.createCollectionZkNode Collection zkNode exists
[junit4:junit4]   2> 672374 T2062 oasc.SolrResourceLoader.<init> new SolrResourceLoader for directory: '/mnt/ssd/jenkins/workspace/Lucene-Solr-4.x-Linux/solr/build/solr-core/test/J1/./org.apache.solr.cloud.CollectionsAPIDistributedZkTest-jetty2-1369312519564/awholynewcollection_0_shard1_replica3/'
[junit4:junit4]   2> 672373 T2061 oasc.CoreContainer.create Creating SolrCore 'awholynewcollection_0_shard3_replica3' using instanceDir: /mnt/ssd/jenkins/workspace/Lucene-Solr-4.x-Linux/solr/build/solr-core/test/J1/./org.apache.solr.cloud.CollectionsAPIDistributedZkTest-jetty2-1369312519564/awholynewcollection_0_shard3_replica3
[junit4:junit4]   2> 672373 T2029 oasc.SolrResourceLoader.<init> new SolrResourceLoader for directory: '/mnt/ssd/jenkins/workspace/Lucene-Solr-4.x-Linux/solr/build/solr-core/test/J1/./org.apache.solr.cloud.CollectionsAPIDistributedZkTest-controljetty-1369312518109/awholynewcollection_0_shard2_replica5/'
[junit4:junit4]   2> 672372 T2038 oasc.OverseerCollectionProcessor.createCollection Creating shard awholynewcollection_0_shard3_replica4 as part of slice shard3 of collection awholynewcollection_0 on 127.0.0.1:46482__ozv%2Fvs
[junit4:junit4]   2> 672372 T2077 oasc.ZkController.createCollectionZkNode Collection zkNode exists
[junit4:junit4]   2> 672379 T2077 oasc.ZkController.readConfigName Load collection config from:/collections/awholynewcollection_0
[junit4:junit4]   2> 672371 T2031 oasc.ZkController.readConfigName Load collection config from:/collections/awholynewcollection_0
[junit4:junit4]   2> 672371 T2064 oasc.ZkController.readConfigName Load collection config from:/collections/awholynewcollection_0
[junit4:junit4]   2> 672370 T2089 oasc.ZkController.readConfigName Load collection config from:/collections/awholynewcollection_0
[junit4:junit4]   2> 672380 T2047 oasc.CoreContainer.create Creating SolrCore 'awholynewcollection_0_shard3_replica4' using instanceDir: /mnt/ssd/jenkins/workspace/Lucene-Solr-4.x-Linux/solr/build/solr-core/test/J1/./org.apache.solr.cloud.CollectionsAPIDistributedZkTest-jetty1-1369312518342/awholynewcollection_0_shard3_replica4
[junit4:junit4]   2> 672381 T2047 oasc.ZkController.createCollectionZkNode Check for collection zkNode:awholynewcollection_0
[junit4:junit4]   2> 672379 T2038 oasc.OverseerCollectionProcessor.createCollection Creating shard awholynewcollection_0_shard3_replica5 as part of slice shard3 of collection awholynewcollection_0 on 127.0.0.1:42419__ozv%2Fvs
[junit4:junit4]   2> 672379 T2049 oasc.SolrResourceLoader.<init> new SolrResourceLoader for directory: '/mnt/ssd/jenkins/workspace/Lucene-Solr-4.x-Linux/solr/build/solr-core/test/J1/./org.apache.solr.cloud.CollectionsAPIDistributedZkTest-jetty1-1369312518342/awholynewcollection_0_shard1_replica4/'
[junit4:junit4]   2> 672383 T2038 oasc.OverseerCollectionProcessor.createCollection Creating shard awholynewcollection_0_shard4_replica1 as part of slice shard4 of collection awholynewcollection_0 on 127.0.0.1:37924__ozv%2Fvs
[junit4:junit4]   2> 672377 T2076 oasc.ZkController.readConfigName Load collection config from:/collections/awholynewcollection_0
[junit4:junit4]   2> 672377 T2061 oasc.ZkController.createCollectionZkNode Check for collection zkNode:awholynewcollection_0
[junit4:junit4]   2> 672376 T2091 oasc.ZkController.readConfigName Load collection config from:/collections/awholynewcollection_0
[junit4:junit4]   2> 672376 T2050 oasc.ZkController.readConfigName Load collection config from:/collections/awholynewcollection_0
[junit4:junit4]   2> 672395 T2076 oasc.SolrResourceLoader.<init> new SolrResourceLoader for directory: '/mnt/ssd/jenkins/workspace/Lucene-Solr-4.x-Linux/solr/build/solr-core/test/J1/./org.apache.solr.cloud.CollectionsAPIDistributedZkTest-jetty3-1369312520765/awholynewcollection_0_shard1_replica2/'
[junit4:junit4]   2> 672395 T2061 oasc.ZkController.createCollectionZkNode Collection zkNode exists
[junit4:junit4]   2> 672398 T2061 oasc.ZkController.readConfigName Load collection config from:/collections/awholynewcollection_0
[junit4:junit4]   2> 672393 T2038 oasc.OverseerCollectionProcessor.createCollection Creating shard awholynewcollection_0_shard4_replica2 as part of slice shard4 of collection awholynewcollection_0 on 127.0.0.1:45660__ozv%2Fvs
[junit4:junit4]   2> 672384 T2032 oasc.CoreContainer.create Creating SolrCore 'awholynewcollection_0_shard3_replica5' using instanceDir: /mnt/ssd/jenkins/workspace/Lucene-Solr-4.x-Linux/solr/build/solr-core/test/J1/./org.apache.solr.cloud.CollectionsAPIDistributedZkTest-controljetty-1369312518109/awholynewcollection_0_shard3_replica5
[junit4:junit4]   2> 672399 T2032 oasc.ZkController.createCollectionZkNode Check for collection zkNode:awholynewcollection_0
[junit4:junit4]   2> 672383 T2064 oasc.SolrResourceLoader.<init> new SolrResourceLoader for directory: '/mnt/ssd/jenkins/workspace/Lucene-Solr-4.x-Linux/solr/build/solr-core/test/J1/./org.apache.solr.cloud.CollectionsAPIDistributedZkTest-jetty2-1369312519564/awholynewcollection_0_shard2_replica3/'
[junit4:junit4]   2> 672383 T2089 oasc.SolrResourceLoader.<init> new SolrResourceLoader for directory: '/mnt/ssd/jenkins/workspace/Lucene-Solr-4.x-Linux/solr/build/solr-core/test/J1/./org.apache.solr.cloud.CollectionsAPIDistributedZkTest-jetty4-1369312521997/awholynewcollection_0_shard1_replica1/'
[junit4:junit4]   2> 672382 T2047 oasc.ZkController.createCollectionZkNode Collection zkNode exists
[junit4:junit4]   2> 672402 T2047 oasc.ZkController.readConfigName Load collection config from:/collections/awholynewcollection_0
[junit4:junit4]   2> 672382 T2031 oasc.SolrResourceLoader.<init> new SolrResourceLoader for directory: '/mnt/ssd/jenkins/workspace/Lucene-Solr-4.x-Linux/solr/build/solr-core/test/J1/./org.apache.solr.cloud.CollectionsAPIDistributedZkTest-controljetty-1369312518109/awholynewcollection_0_shard1_replica5/'
[junit4:junit4]   2> 672382 T2077 oasc.SolrResourceLoader.<init> new SolrResourceLoader for directory: '/mnt/ssd/jenkins/workspace/Lucene-Solr-4.x-Linux/solr/build/solr-core/test/J1/./org.apache.solr.cloud.CollectionsAPIDistributedZkTest-jetty3-1369312520765/awholynewcollection_0_shard3_replica2/'
[junit4:junit4]   2> 672402 T2032 oasc.ZkController.createCollectionZkNode Collection zkNode exists
[junit4:junit4]   2> 672404 T2032 oasc.ZkController.readConfigName Load collection config from:/collections/awholynewcollection_0
[junit4:junit4]   2> 672404 T2047 oasc.SolrResourceLoader.<init> new SolrResourceLoader for directory: '/mnt/ssd/jenkins/workspace/Lucene-Solr-4.x-Linux/solr/build/solr-core/test/J1/./org.apache.solr.cloud.CollectionsAPIDistributedZkTest-jetty1-1369312518342/awholynewcollection_0_shard3_replica4/'
[junit4:junit4]   2> 672400 T2130 oasc.CoreContainer.create Creating SolrCore 'awholynewcollection_0_shard4_replica2' using instanceDir: /mnt/ssd/jenkins/workspace/Lucene-Solr-4.x-Linux/solr/build/solr-core/test/J1/./org.apache.solr.cloud.CollectionsAPIDistributedZkTest-jetty3-1369312520765/awholynewcollection_0_shard4_replica2
[junit4:junit4]   2> 672406 T2130 oasc.ZkController.createCollectionZkNode Check for collection zkNode:awholynewcollection_0
[junit4:junit4]   2> 672400 T2061 oasc.SolrResourceLoader.<init> new SolrResourceLoader for directory: '/mnt/ssd/jenkins/workspace/Lucene-Solr-4.x-Linux/solr/build/solr-core/test/J1/./org.apache.solr.cloud.CollectionsAPIDistributedZkTest-jetty2-1369312519564/awholynewcollection_0_shard3_replica3/'
[junit4:junit4]   2> 672412 T2130 oasc.ZkController.createCollectionZkNode Collection zkNode exists
[junit4:junit4]   2> 672399 T2038 oasc.OverseerCollectionProcessor.createCollection Creating shard awholynewcollection_0_shard4_replica3 as part of slice shard4 of collection awholynewcollection_0 on 127.0.0.1:40769__ozv%2Fvs
[junit4:junit4]   2> 672413 T2038 oasc.OverseerCollectionProcessor.createCollection Creating shard awholynewcollection_0_shard4_replica4 as part of slice shard4 of collection awholynewcollection_0 on 127.0.0.1:46482__ozv%2Fvs
[junit4:junit4]   2> 672414 T2038 oasc.OverseerCollectionProcessor.createCollection Creating shard awholynewcollection_0_shard4_replica5 as part of slice shard4 of collection awholynewcollection_0 on 127.0.0.1:42419__ozv%2Fvs
[junit4:junit4]   2> 672399 T2050 oasc.SolrResourceLoader.<init> new SolrResourceLoader for directory: '/mnt/ssd/jenkins/workspace/Lucene-Solr-4.x-Linux/solr/build/solr-core/test/J1/./org.apache.solr.cloud.CollectionsAPIDistributedZkTest-jetty1-1369312518342/awholynewcollection_0_shard2_replica4/'
[junit4:junit4]   2> 672398 T2091 oasc.SolrResourceLoader.<init> new SolrResourceLoader for directory: '/mnt/ssd/jenkins/workspace/Lucene-Solr-4.x-Linux/solr/build/solr-core/test/J1/./org.apache.solr.cloud.CollectionsAPIDistributedZkTest-jetty4-1369312521997/awholynewcollection_0_shard3_replica1/'
[junit4:junit4]   2> 672396 T2127 oasc.CoreContainer.create Creating SolrCore 'awholynewcollection_0_shard4_replica1' using instanceDir: /mnt/ssd/jenkins/workspace/Lucene-Solr-4.x-Linux/solr/build/solr-core/test/J1/./org.apache.solr.cloud.CollectionsAPIDistributedZkTest-jetty4-1369312521997/awholynewcollection_0_shard4_replica1
[junit4:junit4]   2> 672416 T2127 oasc.ZkController.createCollectionZkNode Check for collection zkNode:awholynewcollection_0
[junit4:junit4]   2> 672413 T2130 oasc.ZkController.readConfigName Load collection config from:/collections/awholynewcollection_0
[junit4:junit4]   2> 672412 T2032 oasc.SolrResourceLoader.<init> new SolrResourceLoader for directory: '/mnt/ssd/jenkins/workspace/Lucene-Solr-4.x-Linux/solr/build/solr-core/test/J1/./org.apache.solr.cloud.CollectionsAPIDistributedZkTest-controljetty-1369312518109/awholynewcollection_0_shard3_replica5/'
[junit4:junit4]   2> 672419 T2127 oasc.ZkController.createCollectionZkNode Collection zkNode exists
[junit4:junit4]   2> 672419 T2127 oasc.ZkController.readConfigName Load collection config from:/collections/awholynewcollection_0
[junit4:junit4]   2> 672417 T2134 oasc.CoreContainer.create Creating SolrCore 'awholynewcollection_0_shard4_replica5' using instanceDir: /mnt/ssd/jenkins/workspace/Lucene-Solr-4.x-Linux/solr/build/solr-core/test/J1/./org.apache.solr.cloud.CollectionsAPIDistributedZkTest-controljetty-1369312518109/awholynewcollection_0_shard4_replica5
[junit4:junit4]   2> 672416 T2048 oasc.CoreContainer.create Creating SolrCore 'awholynewcollection_0_shard4_replica4' using instanceDir: /mnt/ssd/jenkins/workspace/Lucene-Solr-4.x-Linux/solr/build/solr-core/test/J1/./org.apache.solr.cloud.CollectionsAPIDistributedZkTest-jetty1-1369312518342/awholynewcollection_0_shard4_replica4
[junit4:junit4]   2> 672421 T2048 oasc.ZkController.createCollectionZkNode Check for collection zkNode:awholynewcollection_0
[junit4:junit4]   2> 672421 T2134 oasc.ZkController.createCollectionZkNode Check for collection zkNode:awholynewcollection_0
[junit4:junit4]   2> 672416 T2063 oasc.CoreContainer.create Creating SolrCore 'awholynewcollection_0_shard4_replica3' using instanceDir: /mnt/ssd/jenkins/workspace/Lucene-Solr-4.x-Linux/solr/build/solr-core/test/J1/./org.apache.solr.cloud.CollectionsAPIDistributedZkTest-jetty2-1369312519564/awholynewcollection_0_shard4_replica3
[junit4:junit4]   2> 672428 T2134 oasc.ZkController.createCollectionZkNode Collection zkNode exists
[junit4:junit4]   2> 672428 T2127 oasc.SolrResourceLoader.<init> new SolrResourceLoader for directory: '/mnt/ssd/jenkins/workspace/Lucene-Solr-4.x-Linux/solr/build/solr-core/test/J1/./org.apache.solr.cloud.CollectionsAPIDistributedZkTest-jetty4-1369312521997/awholynewcollection_0_shard4_replica1/'
[junit4:junit4]   2> 672430 T2134 oasc.ZkController.readConfigName Load collection config from:/collections/awholynewcollection_0
[junit4:junit4]   2> 672431 T2134 oasc.SolrResourceLoader.<init> new SolrResourceLoader for directory: '/mnt/ssd/jenkins/workspace/Lucene-Solr-4.x-Linux/solr/build/solr-core/test/J1/./org.apache.solr.cloud.CollectionsAPIDistributedZkTest-controljetty-1369312518109/awholynewcollection_0_shard4_replica5/'
[junit4:junit4]   2> 672422 T2048 oasc.ZkController.createCollectionZkNode Collection zkNode exists
[junit4:junit4]   2> 672442 T2048 oasc.ZkController.readConfigName Load collection config from:/collections/awholynewcollection_0
[junit4:junit4]   2> 672443 T2048 oasc.SolrResourceLoader.<init> new SolrResourceLoader for directory: '/mnt/ssd/jenkins/workspace/Lucene-Solr-4.x-Linux/solr/build/solr-core/test/J1/./org.apache.solr.cloud.CollectionsAPIDistributedZkTest-jetty1-1369312518342/awholynewcollection_0_shard4_replica4/'
[junit4:junit4]   2> 672429 T2130 oasc.SolrResourceLoader.<init> new SolrResourceLoader for directory: '/mnt/ssd/jenkins/workspace/Lucene-Solr-4.x-Linux/solr/build/solr-core/test/J1/./org.apache.solr.cloud.CollectionsAPIDistributedZkTest-jetty3-1369312520765/awholynewcollection_0_shard4_replica2/'
[junit4:junit4]   2> 672428 T2063 oasc.ZkController.createCollectionZkNode Check for collection zkNode:awholynewcollection_0
[junit4:junit4]   2> 672446 T2063 oasc.ZkController.createCollectionZkNode Collection zkNode exists
[junit4:junit4]   2> 672446 T2063 oasc.ZkController.readConfigName Load collection config from:/collections/awholynewcollection_0
[junit4:junit4]   2> 672448 T2063 oasc.SolrResourceLoader.<init> new SolrResourceLoader for directory: '/mnt/ssd/jenkins/workspace/Lucene-Solr-4.x-Linux/solr/build/solr-core/test/J1/./org.apache.solr.cloud.CollectionsAPIDistributedZkTest-jetty2-1369312519564/awholynewcollection_0_shard4_replica3/'
[junit4:junit4]   2> 672467 T2078 oasc.SolrConfig.<init> Using Lucene MatchVersion: LUCENE_44
[junit4:junit4]   2> 672532 T2090 oasc.SolrConfig.<init> Using Lucene MatchVersion: LUCENE_44
[junit4:junit4]   2> 672537 T2062 oasc.SolrConfig.<init> Using Lucene MatchVersion: LUCENE_44
[junit4:junit4]   2> 672550 T2029 oasc.SolrConfig.<init> Using Lucene MatchVersion: LUCENE_44
[junit4:junit4]   2> 672561 T2049 oasc.SolrConfig.<init> Using Lucene MatchVersion: LUCENE_44
[junit4:junit4]   2> 672579 T2031 oasc.SolrConfig.<init> Using Lucene MatchVersion: LUCENE_44
[junit4:junit4]   2> 672608 T2076 oasc.SolrConfig.<init> Using Lucene MatchVersion: LUCENE_44
[junit4:junit4]   2> 672652 T2064 oasc.SolrConfig.<init> Using Lucene MatchVersion: LUCENE_44
[junit4:junit4]   2> 672726 T2134 oasc.SolrConfig.<init> Using Lucene MatchVersion: LUCENE_44
[junit4:junit4]   2> 672765 T2047 oasc.SolrConfig.<init> Using Lucene MatchVersion: LUCENE_44
[junit4:junit4]   2> 672767 T2032 oasc.SolrConfig.<init> Using Lucene MatchVersion: LUCENE_44
[junit4:junit4]   2> 672780 T2063 oasc.SolrConfig.<init> Using Lucene MatchVersion: LUCENE_44
[junit4:junit4]   2> 672806 T2077 oasc.SolrConfig.<init> Using Lucene MatchVersion: LUCENE_44
[junit4:junit4]   2> 672808 T2127 oasc.SolrConfig.<init> Using Lucene MatchVersion: LUCENE_44
[junit4:junit4]   2> 672826 T2048 oasc.SolrConfig.<init> Using Lucene MatchVersion: LUCENE_44
[junit4:junit4]   2> 672876 T2130 oasc.SolrConfig.<init> Using Lucene MatchVersion: LUCENE_44
[junit4:junit4]   2> 672880 T2089 oasc.SolrConfig.<init> Using Lucene MatchVersion: LUCENE_44
[junit4:junit4]   2> 672904 T2090 oasc.SolrConfig.<init> Loaded SolrConfig: solrconfig.xml
[junit4:junit4]   2> 672917 T2090 oass.IndexSchema.readSchema Reading Solr Schema from schema.xml
[junit4:junit4]   2> 672921 T2078 oasc.SolrConfig.<init> Loaded SolrConfig: solrconfig.xml
[junit4:junit4]   2> 672923 T2078 oass.IndexSchema.readSchema Reading Solr Schema from schema.xml
[junit4:junit4]   2> 672925 T2090 oass.IndexSchema.readSchema [awholynewcollection_0_shard2_replica1] Schema name=test
[junit4:junit4]   2> 672937 T2078 oass.IndexSchema.readSchema [awholynewcollection_0_shard2_replica2] Schema name=test
[junit4:junit4]   2> 672951 T2050 oasc.SolrConfig.<init> Using Lucene MatchVersion: LUCENE_44
[junit4:junit4]   2> 672989 T2031 oasc.SolrConfig.<init> Loaded SolrConfig: solrconfig.xml
[junit4:junit4]   2> 672991 T2029 oasc.SolrConfig.<init> Loaded SolrConfig: solrconfig.xml
[junit4:junit4]   2> 672993 T2031 oass.IndexSchema.readSchema Reading Solr Schema from schema.xml
[junit4:junit4]   2> 672995 T2061 oasc.SolrConfig.<init> Using Lucene MatchVersion: LUCENE_44
[junit4:junit4]   2> 672995 T2029 oass.IndexSchema.readSchema Reading Solr Schema from schema.xml
[junit4:junit4]   2> 673006 T2091 oasc.SolrConfig.<init> Using Lucene MatchVersion: LUCENE_44
[junit4:junit4]   2> 673008 T2031 oass.IndexSchema.readSchema [awholynewcollection_0_shard1_replica5] Schema name=test
[junit4:junit4]   2> 673009 T2029 oass.IndexSchema.readSchema [awholynewcollection_0_shard2_replica5] Schema name=test
[junit4:junit4]   2> 673063 T2076 oasc.SolrConfig.<init> Loaded SolrConfig: solrconfig.xml
[junit4:junit4]   2> 673076 T2076 oass.IndexSchema.readSchema Reading Solr Schema from schema.xml
[junit4:junit4]   2> 673089 T2076 oass.IndexSchema.readSchema [awholynewcollection_0_shard1_replica2] Schema name=test
[junit4:junit4]   2> 673090 T2062 oasc.SolrConfig.<init> Loaded SolrConfig: solrconfig.xml
[junit4:junit4]   2> 673108 T2064 oasc.SolrConfig.<init> Loaded SolrConfig: solrconfig.xml
[junit4:junit4]   2> 673115 T2062 oass.IndexSchema.readSchema Reading Solr Schema from schema.xml
[junit4:junit4]   2> 673123 T2062 oass.IndexSchema.readSchema [awholynewcollection_0_shard1_replica3] Schema name=test
[junit4:junit4]   2> 673124 T2064 oass.IndexSchema.readSchema Reading Solr Schema from schema.xml
[junit4:junit4]   2> 673150 T2064 oass.IndexSchema.readSchema [awholynewcollection_0_shard2_replica3] Schema name=test
[junit4:junit4]   2> 673193 T2049 oasc.SolrConfig.<init> Loaded SolrConfig: solrconfig.xml
[junit4:junit4]   2> 673220 T2049 oass.IndexSchema.readSchema Reading Solr Schema from schema.xml
[junit4:junit4]   2> 673242 T2127 oasc.SolrConfig.<init> Loaded SolrConfig: solrconfig.xml
[junit4:junit4]   2> 673247 T2049 oass.IndexSchema.readSchema [awholynewcollection_0_shard1_replica4] Schema name=test
[junit4:junit4]   2> 673248 T2089 oasc.SolrConfig.<init> Loaded SolrConfig: solrconfig.xml
[junit4:junit4]   2> 673261 T2127 oass.IndexSchema.readSchema Reading Solr Schema from schema.xml
[junit4:junit4]   2> 673262 T2134 oasc.SolrConfig.<init> Loaded SolrConfig: solrconfig.xml
[junit4:junit4]   2> 673263 T2047 oasc.SolrConfig.<init> Loaded SolrConfig: solrconfig.xml
[junit4:junit4]   2> 673278 T2089 oass.IndexSchema.readSchema Reading Solr Schema from schema.xml
[junit4:junit4]   2> 673286 T2134 oass.IndexSchema.readSchema Reading Solr Schema from schema.xml
[junit4:junit4]   2> 673286 T2047 oass.IndexSchema.readSchema Reading Solr Schema from schema.xml
[junit4:junit4]   2> 673288 T2127 oass.IndexSchema.readSchema [awholynewcollection_0_shard4_replica1] Schema name=test
[junit4:junit4]   2> 673292 T2130 oasc.SolrConfig.<init> Loaded SolrConfig: solrconfig.xml
[junit4:junit4]   2> 673294 T2130 oass.IndexSchema.readSchema Reading Solr Schema from schema.xml
[junit4:junit4]   2> 673294 T2134 oass.IndexSchema.readSchema [awholynewcollection_0_shard4_replica5] Schema name=test
[junit4:junit4]   2> 673307 T2047 oass.IndexSchema.readSchema [awholynewcollection_0_shard3_replica4] Schema name=test
[junit4:junit4]   2> 673311 T2077 oasc.SolrConfig.<init> Loaded SolrConfig: solrconfig.xml
[junit4:junit4]   2> 673312 T2077 oass.IndexSchema.readSchema Reading Solr Schema from schema.xml
[junit4:junit4]   2> 673338 T2048 oasc.SolrConfig.<init> Loaded SolrConfig: solrconfig.xml
[junit4:junit4]   2> 673339 T2063 oasc.SolrConfig.<init> Loaded SolrConfig: solrconfig.xml
[junit4:junit4]   2> 673340 T2089 oass.IndexSchema.readSchema [awholynewcollection_0_shard1_replica1] Schema name=test
[junit4:junit4]   2> 673342 T2063 oass.IndexSchema.readSchema Reading Solr Schema from schema.xml
[junit4:junit4]   2> 673342 T2048 oass.IndexSchema.readSchema Reading Solr Schema from schema.xml
[junit4:junit4]   2> 673346 T2077 oass.IndexSchema.readSchema [awholynewcollection_0_shard3_replica2] Schema name=test
[junit4:junit4]   2> 673346 T2032 oasc.SolrConfig.<init> Loaded SolrConfig: solrconfig.xml
[junit4:junit4]   2> 673355 T2032 oass.IndexSchema.readSchema Reading Solr Schema from schema.xml
[junit4:junit4]   2> 673362 T2091 oasc.SolrConfig.<init> Loaded SolrConfig: solrconfig.xml
[junit4:junit4]   2> 673368 T2130 oass.IndexSchema.readSchema [awholynewcollection_0_shard4_replica2] Schema name=test
[junit4:junit4]   2> 673372 T2063 oass.IndexSchema.readSchema [awholynewcollection_0_shard4_replica3] Schema name=test
[junit4:junit4]   2> 673373 T2091 oass.IndexSchema.readSchema Reading Solr Schema from schema.xml
[junit4:junit4]   2> 673375 T2048 oass.IndexSchema.readSchema [awholynewcollection_0_shard4_replica4] Schema name=test
[junit4:junit4]   2> 673384 T2032 oass.IndexSchema.readSchema [awholynewcollection_0_shard3_replica5] Schema name=test
[junit4:junit4]   2> 673390 T2091 oass.IndexSchema.readSchema [awholynewcollection_0_shard3_replica1] Schema name=test
[junit4:junit4]   2> 673474 T2061 oasc.SolrConfig.<init> Loaded SolrConfig: solrconfig.xml
[junit4:junit4]   2> 673476 T2061 oass.IndexSchema.readSchema Reading Solr Schema from schema.xml
[junit4:junit4]   2> 673513 T2061 oass.IndexSchema.readSchema [awholynewcollection_0_shard3_replica3] Schema name=test
[junit4:junit4]   2> 673557 T2050 oasc.SolrConfig.<init> Loaded SolrConfig: solrconfig.xml
[junit4:junit4]   2> 673567 T2050 oass.IndexSchema.readSchema Reading Solr Schema from schema.xml
[junit4:junit4]   2> 673609 T2050 oass.IndexSchema.readSchema [awholynewcollection_0_shard2_replica4] Schema name=test
[junit4:junit4]   2> 673622 T2037 oascc.ZkStateReader.updateClusterState Updating cloud state from ZooKeeper...
[junit4:junit4]   2> 673632 T2037 oasc.Overseer$ClusterStateUpdater.updateState Update state numShards=2 message={
[junit4:junit4]   2>  "operation":"state",
[junit4:junit4]   2>  "core_node_name":"127.0.0.1:42419__ozv%2Fvs_nodes_used_collection_shard2_replica2",
[junit4:junit4]   2>  "numShards":"2",
[junit4:junit4]   2>  "shard":"shard2",
[junit4:junit4]   2>  "roles":null,
[junit4:junit4]   2>  "state":"active",
[junit4:junit4]   2>  "shard_state":"active",
[junit4:junit4]   2>  "core":"nodes_used_collection_shard2_replica2",
[junit4:junit4]   2>  "collection":"nodes_used_collection",
[junit4:junit4]   2>  "shard_range":null,
[junit4:junit4]   2>  "node_name":"127.0.0.1:42419__ozv%2Fvs",
[junit4:junit4]   2>  "base_url":"http://127.0.0.1:42419/_ozv/vs"}
[junit4:junit4]   2> 673646 T2037 oasc.Overseer$ClusterStateUpdater.updateState Update state numShards=2 message={
[junit4:junit4]   2>  "operation":"state",
[junit4:junit4]   2>  "core_node_name":"127.0.0.1:45660__ozv%2Fvs_nodes_used_collection_shard1_replica2",
[junit4:junit4]   2>  "numShards":"2",
[junit4:junit4]   2>  "shard":"shard1",
[junit4:junit4]   2>  "roles":null,
[junit4:junit4]   2>  "state":"active",
[junit4:junit4]   2>  "shard_state":"active",
[junit4:junit4]   2>  "core":"nodes_used_collection_shard1_replica2",
[junit4:junit4]   2>  "collection":"nodes_used_collection",
[junit4:junit4]   2>  "shard_range":null,
[junit4:junit4]   2>  "node_name":"127.0.0.1:45660__ozv%2Fvs",
[junit4:junit4]   2>  "base_url":"http://127.0.0.1:45660/_ozv/vs"}
[junit4:junit4]   2> 673714 T2037 oasc.Overseer$ClusterStateUpdater.updateState Update state numShards=2 message={
[junit4:junit4]   2>  "operation":"state",
[junit4:junit4]   2>  "core_node_name":"127.0.0.1:46482__ozv%2Fvs_nodes_used_collection_shard2_replica1",
[junit4:junit4]   2>  "numShards":"2",
[junit4:junit4]   2>  "shard":"shard2",
[junit4:junit4]   2>  "roles":null,
[junit4:junit4]   2>  "state":"recovering",
[junit4:junit4]   2>  "shard_state":"active",
[junit4:junit4]   2>  "core":"nodes_used_collection_shard2_replica1",
[junit4:junit4]   2>  "collection":"nodes_used_collection",
[junit4:junit4]   2>  "shard_range":null,
[junit4:junit4]   2>  "node_name":"127.0.0.1:46482__ozv%2Fvs",
[junit4:junit4]   2>  "base_url":"http://127.0.0.1:46482/_ozv/vs"}
[junit4:junit4]   2> 673760 T2037 oasc.Overseer$ClusterStateUpdater.updateState Update state numShards=2 message={
[junit4:junit4]   2>  "operation":"state",
[junit4:junit4]   2>  "core_node_name":"127.0.0.1:37924__ozv%2Fvs_nodes_used_collection_shard1_replica1",
[junit4:junit4]   2>  "numShards":"2",
[junit4:junit4]   2>  "shard":"shard1",
[junit4:junit4]   2>  "roles":null,
[junit4:junit4]   2>  "state":"recovering",
[junit4:junit4]   2>  "shard_state":"active",
[junit4:junit4]   2>  "core":"nodes_used_collection_shard1_replica1",
[junit4:junit4]   2>  "collection":"nodes_used_collection",
[junit4:junit4]   2>  "shard_range":null,
[junit4:junit4]   2>  "node_name":"127.0.0.1:37924__ozv%2Fvs",
[junit4:junit4]   2>  "base_url":"http://127.0.0.1:37924/_ozv/vs"}
[junit4:junit4]   2> 673787 T2082 oascc.ZkStateReader$2.process A cluster state change: WatchedEvent state:SyncConnected type:NodeDataChanged path:/clusterstate.json, has occurred - updating... (live nodes size: 5)
[junit4:junit4]   2> 673787 T2041 oascc.ZkStateReader$2.process A cluster state change: WatchedEvent state:SyncConnected type:NodeDataChanged path:/clusterstate.json, has occurred - updating... (live nodes size: 5)
[junit4:junit4]   2> 673787 T2036 oascc.ZkStateReader$2.process A cluster state change: WatchedEvent state:SyncConnected type:NodeDataChanged path:/clusterstate.json, has occurred - updating... (live nodes size: 5)
[junit4:junit4]   2> 673787 T2054 oascc.ZkStateReader$2.process A cluster state change: WatchedEvent state:SyncConnected type:NodeDataChanged path:/clusterstate.json, has occurred - updating... (live nodes size: 5)
[junit4:junit4]   2> 673787 T2111 oascc.ZkStateReader$2.process A cluster state change: WatchedEvent state:SyncConnected type:NodeDataChanged path:/clusterstate.json, has occurred - updating... (live nodes size: 5)
[junit4:junit4]   2> 673787 T2113 oascc.ZkStateReader$2.process A cluster state change: WatchedEvent state:SyncConnected type:NodeDataChanged path:/clusterstate.json, has occurred - updating... (live nodes size: 5)
[junit4:junit4]   2> 673787 T2096 oascc.ZkStateReader$2.process A cluster state change: WatchedEvent state:SyncConnected type:NodeDataChanged path:/clusterstate.json, has occurred - updating... (live nodes size: 5)
[junit4:junit4]   2> 673787 T2068 oascc.ZkStateReader$2.process A cluster state change: WatchedEvent state:SyncConnected type:NodeDataChanged path:/clusterstate.json, has occurred - updating... (live nodes size: 5)
[junit4:junit4]   2> 674302 T2030 oasha.CoreAdminHandler.handleWaitForStateAction Waited coreNodeName: 127.0.0.1:46482__ozv%2Fvs_nodes_used_collection_shard2_replica1, state: recovering, checkLive: true, onlyIfLeader: true for: 2 seconds.
[junit4:junit4]   2> 674302 T2030 oass.SolrDispatchFilter.handleAdminRequest [admin] webapp=null path=/admin/cores params={coreNodeName=127.0.0.1:46482__ozv%252Fvs_nodes_used_collection_shard2_replica1&state=recovering&nodeName=127.0.0.1:46482__ozv%252Fvs&action=PREPRECOVERY&checkLive=true&core=nodes_used_collection_shard2_replica2&wt=javabin&onlyIfLeader=true&version=2} status=0 QTime=2002
[junit4:junit4]   2> 674311 T2075 oasha.CoreAdminHandler.handleWaitForStateAction Waited coreNodeName: 127.0.0.1:37924__ozv%2Fvs_nodes_used_collection_shard1_replica1, state: recovering, checkLive: true, onlyIfLeader: true for: 2 seconds.
[junit4:junit4]   2> 674312 T2075 oass.SolrDispatchFilter.handleAdminRequest [admin] webapp=null path=/admin/cores params={coreNodeName=127.0.0.1:37924__ozv%252Fvs_nodes_used_collection_shard1_replica1&state=recovering&nodeName=127.0.0.1:37924__ozv%252Fvs&action=PREPRECOVERY&checkLive=true&core=nodes_used_collection_shard1_replica2&wt=javabin&onlyIfLeader=true&version=2} status=0 QTime=2011
[junit4:junit4]   2> ASYNC  NEW_CORE C6371 name=nodes_used_collection_shard2_replica1 org.apache.solr.core.SolrCore@11988c8 url=http://127.0.0.1:46482/_ozv/vs/nodes_used_collection_shard2_replica1 node=127.0.0.1:46482__ozv%2Fvs C6371_STATE=coll:nodes_used_collection core:nodes_used_collection_shard2_replica1 props:{shard=shard2, state=recovering, core=nodes_used_collection_shard2_replica1, collection=nodes_used_collection, node_name=127.0.0.1:46482__ozv%2Fvs, base_url=http://127.0.0.1:46482/_ozv/vs}
[junit4:junit4]   2> 676312 T2108 C6371 P46482 oasc.RecoveryStrategy.doRecovery Attempting to PeerSync from http://127.0.0.1:42419/_ozv/vs/nodes_used_collection_shard2_replica2/ core=nodes_used_collection_shard2_replica1 - recoveringAfterStartup=true
[junit4:junit4]   2> 676313 T2108 C6371 P46482 oasu.PeerSync.sync PeerSync: core=nodes_used_collection_shard2_replica1 url=http://127.0.0.1:46482/_ozv/vs START replicas=[http://127.0.0.1:42419/_ozv/vs/nodes_used_collection_shard2_replica2/] nUpdates=100
[junit4:junit4]   2> 676313 T2108 C6371 P46482 oasu.PeerSync.sync WARN no frame of reference to tell of we've missed updates
[junit4:junit4]   2> 676314 T2108 C6371 P46482 oasc.RecoveryStrategy.doRecovery PeerSync Recovery was not successful - trying replication. core=nodes_used_collection_shard2_replica1
[junit4:junit4]   2> 676314 T2108 C6371 P46482 oasc.RecoveryStrategy.doRecovery Starting Replication Recovery. core=nodes_used_collection_shard2_replica1
[junit4:junit4]   2> 676314 T2108 C6371 P46482 oasc.RecoveryStrategy.doRecovery Begin buffering updates. core=nodes_used_collection_shard2_replica1
[junit4:junit4]   2> 676315 T2108 C6371 P46482 oasu.UpdateLog.bufferUpdates Starting to buffer updates. FSUpdateLog{state=ACTIVE, tlog=null}
[junit4:junit4]   2> 676315 T2108 C6371 P46482 oasc.RecoveryStrategy.replicate Attempting to replicate from http://127.0.0.1:42419/_ozv/vs/nodes_used_collection_shard2_replica2/. core=nodes_used_collection_shard2_replica1
[junit4:junit4]   2> 676315 T2108 C6371 P46482 oascsi.HttpClientUtil.createClient Creating new http client, config:maxConnections=128&maxConnectionsPerHost=32&followRedirects=false
[junit4:junit4]   2> ASYNC  NEW_CORE C6372 name=nodes_used_collection_shard1_replica1 org.apache.solr.core.SolrCore@131f7ef url=http://127.0.0.1:37924/_ozv/vs/nodes_used_collection_shard1_replica1 node=127.0.0.1:37924__ozv%2Fvs C6372_STATE=coll:nodes_used_collection core:nodes_used_collection_shard1_replica1 props:{shard=shard1, state=recovering, core=nodes_used_collection_shard1_replica1, collection=nodes_used_collection, node_name=127.0.0.1:37924__ozv%2Fvs, base_url=http://127.0.0.1:37924/_ozv/vs}
[junit4:junit4]   2> 676318 T2109 C6372 P37924 oasc.RecoveryStrategy.doRecovery Attempting to PeerSync from http://127.0.0.1:45660/_ozv/vs/nodes_used_collection_shard1_replica2/ core=nodes_used_collection_shard1_replica1 - recoveringAfterStartup=true
[junit4:junit4]   2> 676318 T2109 C6372 P37924 oasu.PeerSync.sync PeerSync: core=nodes_used_collection_shard1_replica1 url=http://127.0.0.1:37924/_ozv/vs START replicas=[http://127.0.0.1:45660/_ozv/vs/nodes_used_collection_shard1_replica2/] nUpdates=100
[junit4:junit4]   2> ASYNC  NEW_CORE C6373 name=nodes_used_collection_shard1_replica1 org.apache.solr.core.SolrCore@131f7ef url=http://127.0.0.1:37924/_ozv/vs/nodes_used_collection_shard1_replica1 node=127.0.0.1:37924__ozv%2Fvs C6373_STATE=coll:nodes_used_collection core:nodes_used_collection_shard1_replica1 props:{shard=shard1, state=recovering, core=nodes_used_collection_shard1_replica1, collection=nodes_used_collection, node_name=127.0.0.1:37924__ozv%2Fvs, base_url=http://127.0.0.1:37924/_ozv/vs}
[junit4:junit4]   2> 676331 T2109 C6373 P37924 oasu.PeerSync.sync WARN no frame of reference to tell of we've missed updates
[junit4:junit4]   2> 676332 T2109 C6373 P37924 oasc.RecoveryStrategy.doRecovery PeerSync Recovery was not successful - trying replication. core=nodes_used_collection_shard1_replica1
[junit4:junit4]   2> 676333 T2109 C6373 P37924 oasc.RecoveryStrategy.doRecovery Starting Replication Recovery. core=nodes_used_collection_shard1_replica1
[junit4:junit4]   2> 676333 T2109 C6373 P37924 oasc.RecoveryStrategy.doRecovery Begin buffering updates. core=nodes_used_collection_shard1_replica1
[junit4:junit4]   2> 676333 T2109 C6373 P37924 oasu.UpdateLog.bufferUpdates Starting to buffer updates. FSUpdateLog{state=ACTIVE, tlog=null}
[junit4:junit4]   2> 676333 T2109 C6373 P37924 oasc.RecoveryStrategy.replicate Attempting to replicate from http://127.0.0.1:45660/_ozv/vs/nodes_used_collection_shard1_replica2/. core=nodes_used_collection_shard1_replica1
[junit4:junit4]   2> 676334 T2109 C6373 P37924 oascsi.HttpClientUtil.createClient Creating new http client, config:maxConnections=128&maxConnectionsPerHost=32&followRedirects=false
[junit4:junit4]   2> ASYNC  NEW_CORE C6374 name=nodes_used_collection_shard1_replica2 org.apache.solr.core.SolrCore@1efb7ce url=http://127.0.0.1:45660/_ozv/vs/nodes_used_collection_shard1_replica2 node=127.0.0.1:45660__ozv%2Fvs C6374_STATE=coll:nodes_used_collection core:nodes_used_collection_shard1_replica2 props:{shard=shard1, state=active, core=nodes_used_collection_shard1_replica2, collection=nodes_used_collection, node_name=127.0.0.1:45660__ozv%2Fvs, base_url=http://127.0.0.1:45660/_ozv/vs, leader=true}
[junit4:junit4]   2> 676378 T2138 C6374 P45660 oasc.SolrCore.execute [nodes_used_collection_shard1_replica2] webapp=/_ozv/vs path=/get params={getVersions=100&distrib=false&wt=javabin&qt=/get&version=2} status=0 QTime=8
[junit4:junit4]   2> 676381 T2075 C6374 P45660 oasu.DirectUpdateHandler2.commit start commit{,optimize=false,openSearcher=false,waitSearcher=true,expungeDeletes=false,softCommit=false,prepareCommit=false}
[junit4:junit4]   2> ASYNC  NEW_CORE C6375 name=nodes_used_collection_shard2_replica2 org.apache.solr.core.SolrCore@1631478 url=http://127.0.0.1:42419/_ozv/vs/nodes_used_collection_shard2_replica2 node=127.0.0.1:42419__ozv%2Fvs C6375_STATE=coll:nodes_used_collection core:nodes_used_collection_shard2_replica2 props:{shard=shard2, state=active, core=nodes_used_collection_shard2_replica2, collection=nodes_used_collection, node_name=127.0.0.1:42419__ozv%2Fvs, base_url=http://127.0.0.1:42419/_ozv/vs, leader=true}
[junit4:junit4]   2> 676397 T2142 C6375 P42419 oasc.SolrCore.execute [nodes_used_collection_shard2_replica2] webapp=/_ozv/vs path=/get params={getVersions=100&distrib=false&wt=javabin&qt=/get&version=2} status=0 QTime=14
[junit4:junit4]   2> ASYNC  NEW_CORE C6376 name=nodes_used_collection_shard1_replica2 org.apache.solr.core.SolrCore@1efb7ce url=http://127.0.0.1:45660/_ozv/vs/nodes_used_collection_shard1_replica2 node=127.0.0.1:45660__ozv%2Fvs C6376_STATE=coll:nodes_used_collection core:nodes_used_collection_shard1_replica2 props:{shard=shard1, state=active, core=nodes_used_collection_shard1_replica2, collection=nodes_used_collection, node_name=127.0.0.1:45660__ozv%2Fvs, base_url=http://127.0.0.1:45660/_ozv/vs, leader=true}
[junit4:junit4]   2> 676406 T2075 C6376 P45660 oasc.SolrDeletionPolicy.onInit SolrDeletionPolicy.onInit: commits: num=1
[junit4:junit4]   2> commit{dir=MockDirWrapper(org.apache.lucene.store.RAMDirectory@a692b2 lockFactory=org.apache.lucene.store.NativeFSLockFactory@1a163e0),segFN=segments_1,generation=1}
[junit4:junit4]   2> 676407 T2075 C6376 P45660 oasc.SolrDeletionPolicy.updateCommits newest commit generation = 1
[junit4:junit4]   2> 676408 T2075 C6376 P45660 oasc.SolrDeletionPolicy.onCommit SolrDeletionPolicy.onCommit: commits: num=2
[junit4:junit4]   2> commit{dir=MockDirWrapper(org.apache.lucene.store.RAMDirectory@a692b2 lockFactory=org.apache.lucene.store.NativeFSLockFactory@1a163e0),segFN=segments_1,generation=1}
[junit4:junit4]   2> commit{dir=MockDirWrapper(org.apache.lucene.store.RAMDirectory@a692b2 lockFactory=org.apache.lucene.store.NativeFSLockFactory@1a163e0),segFN=segments_2,generation=2}
[junit4:junit4]   2> 676408 T2075 C6376 P45660 oasc.SolrDeletionPolicy.updateCommits newest commit generation = 2
[junit4:junit4]   2> 676410 T2075 C6376 P45660 oass.SolrIndexSearcher.<init> Opening Searcher@1e42cde realtime
[junit4:junit4]   2> 676411 T2075 C6376 P45660 oasu.DirectUpdateHandler2.commit end_commit_flush
[junit4:junit4]   2> 676411 T2075 C6376 P45660 oasup.LogUpdateProcessor.finish [nodes_used_collection_shard1_replica2] webapp=/_ozv/vs path=/update params={waitSearcher=true&openSearcher=false&commit=true&wt=javabin&commit_end_point=true&version=2&softCommit=false} {commit=} 0 30
[junit4:junit4]   2> ASYNC  NEW_CORE C6377 name=nodes_used_collection_shard2_replica2 org.apache.solr.core.SolrCore@1631478 url=http://127.0.0.1:42419/_ozv/vs/nodes_used_collection_shard2_replica2 node=127.0.0.1:42419__ozv%2Fvs C6377_STATE=coll:nodes_used_collection core:nodes_used_collection_shard2_replica2 props:{shard=shard2, state=active, core=nodes_used_collection_shard2_replica2, collection=nodes_used_collection, node_name=127.0.0.1:42419__ozv%2Fvs, base_url=http://127.0.0.1:42419/_ozv/vs, leader=true}
[junit4:junit4]   2> 676422 T2030 C6377 P42419 oasu.DirectUpdateHandler2.commit start commit{,optimize=false,openSearcher=false,waitSearcher=true,expungeDeletes=false,softCommit=false,prepareCommit=false}
[junit4:junit4]   2> ASYNC  NEW_CORE C6378 name=nodes_used_collection_shard1_replica1 org.apache.solr.core.SolrCore@131f7ef url=http://127.0.0.1:37924/_ozv/vs/nodes_used_collection_shard1_replica1 node=127.0.0.1:37924__ozv%2Fvs C6378_STATE=coll:nodes_used_collection core:nodes_used_collection_shard1_replica1 props:{shard=shard1, state=recovering, core=nodes_used_collection_shard1_replica1, collection=nodes_used_collection, node_name=127.0.0.1:37924__ozv%2Fvs, base_url=http://127.0.0.1:37924/_ozv/vs}
[junit4:junit4]   2> 676422 T2109 C6378 P37924 oash.ReplicationHandler.inform Commits will be reserved for  10000
[junit4:junit4]   2> 676423 T2109 C6378 P37924 oash.SnapPuller.<init>  No value set for 'pollInterval'. Timer Task not started.
[junit4:junit4]   2> ASYNC  NEW_CORE C6379 name=nodes_used_collection_shard1_replica2 org.apache.solr.core.SolrCore@1efb7ce url=http://127.0.0.1:45660/_ozv/vs/nodes_used_collection_shard1_replica2 node=127.0.0.1:45660__ozv%2Fvs C6379_STATE=coll:nodes_used_collection core:nodes_used_collection_shard1_replica2 props:{shard=shard1, state=active, core=nodes_used_collection_shard1_replica2, collection=nodes_used_collection, node_name=127.0.0.1:45660__ozv%2Fvs, base_url=http://127.0.0.1:45660/_ozv/vs, leader=true}
[junit4:junit4]   2> 676426 T2138 C6379 P45660 oash.ReplicationHandler.inform Commits will be reserved for  10000
[junit4:junit4]   2> 676427 T2138 C6379 P45660 oasc.SolrCore.execute [nodes_used_collection_shard1_replica2] webapp=/_ozv/vs path=/replication params={command=indexversion&qt=/replication&wt=javabin&version=2} status=0 QTime=2
[junit4:junit4]   2> 676427 T2109 C6378 P37924 oash.SnapPuller.fetchLatestIndex Master's generation: 2
[junit4:junit4]   2> 676428 T2109 C6378 P37924 oash.SnapPuller.fetchLatestIndex Slave's generation: 1
[junit4:junit4]   2> 676428 T2109 C6378 P37924 oash.SnapPuller.fetchLatestIndex Starting replication process
[junit4:junit4]   2> ASYNC  NEW_CORE C6380 name=nodes_used_collection_shard1_replica2 org.apache.solr.core.SolrCore@1efb7ce url=http://127.0.0.1:45660/_ozv/vs/nodes_used_collection_shard1_replica2 node=127.0.0.1:45660__ozv%2Fvs C6380_STATE=coll:nodes_used_collection core:nodes_used_collection_shard1_replica2 props:{shard=shard1, state=active, core=nodes_used_collection_shard1_replica2, collection=nodes_used_collection, node_name=127.0.0.1:45660__ozv%2Fvs, base_url=http://127.0.0.1:45660/_ozv/vs, leader=true}
[junit4:junit4]   2> 676441 T2075 C6380 P45660 oasc.SolrCore.execute [nodes_used_collection_shard1_replica2] webapp=/_ozv/vs path=/replication params={command=filelist&qt=/replication&wt=javabin&generation=2&version=2} status=0 QTime=0
[junit4:junit4]   2> ASYNC  NEW_CORE C6381 name=nodes_used_collection_shard1_replica1 org.apache.solr.core.SolrCore@131f7ef url=http://127.0.0.1:37924/_ozv/vs/nodes_used_collection_shard1_replica1 node=127.0.0.1:37924__ozv%2Fvs C6381_STATE=coll:nodes_used_collection core:nodes_used_collection_shard1_replica1 props:{shard=shard1, state=recovering, core=nodes_used_collection_shard1_replica1, collection=nodes_used_collection, node_name=127.0.0.1:37924__ozv%2Fvs, base_url=http://127.0.0.1:37924/_ozv/vs}
[junit4:junit4]   2> 676442 T2109 C6381 P37924 oash.SnapPuller.fetchLatestIndex Number of files in latest index in master: 1
[junit4:junit4]   2> ASYNC  NEW_CORE C6382 name=nodes_used_collection_shard2_replica2 org.apache.solr.core.SolrCore@1631478 url=http://127.0.0.1:42419/_ozv/vs/nodes_used_collection_shard2_replica2 node=127.0.0.1:42419__ozv%2Fvs C6382_STATE=coll:nodes_used_collection core:nodes_used_collection_shard2_replica2 props:{shard=shard2, state=active, core=nodes_used_collection_shard2_replica2, collection=nodes_used_collection, node_name=127.0.0.1:42419__ozv%2Fvs, base_url=http://127.0.0.1:42419/_ozv/vs, leader=true}
[junit4:junit4]   2> 676445 T2030 C6382 P42419 oasc.SolrDeletionPolicy.onInit SolrDeletionPolicy.onInit: commits: num=1
[junit4:junit4]   2> commit{dir=MockDirWrapper(org.apache.lucene.store.RAMDirectory@18e74bc lockFactory=org.apache.lucene.store.NativeFSLockFactory@1aa869b),segFN=segments_1,generation=1}
[junit4:junit4]   2> 676445 T2109 C6381 P37924 oasc.CachingDirectoryFactory.get return new directory for /mnt/ssd/jenkins/workspace/Lucene-Solr-4.x-Linux/solr/build/solr-core/test/J1/./org.apache.solr.cloud.CollectionsAPIDistributedZkTest-jetty4-1369312521997/nodes_used_collection_shard1_replica1/data/index.20130523083531740
[junit4:junit4]   2> 676448 T2109 C6381 P37924 oash.SnapPuller.fetchLatestIndex Starting download to MockDirWrapper(org.apache.lucene.store.RAMDirectory@1e6f142 lockFactory=org.apache.lucene.store.NativeFSLockFactory@1da5c75) fullCopy=false
[junit4:junit4]   2> ASYNC  NEW_CORE C6383 name=nodes_used_collection_shard2_replica2 org.apache.solr.core.SolrCore@1631478 url=http://127.0.0.1:42419/_ozv/vs/nodes_used_collection_shard2_replica2 node=127.0.0.1:42419__ozv%2Fvs C6383_STATE=coll:nodes_used_collection core:nodes_used_collection_shard2_replica2 props:{shard=shard2, state=active, core=nodes_used_collection_shard2_replica2, collection=nodes_used_collection, node_name=127.0.0.1:42419__ozv%2Fvs, base_url=http://127.0.0.1:42419/_ozv/vs, leader=true}
[junit4:junit4]   2> 676480 T2030 C6383 P42419 oasc.SolrDeletionPolicy.updateCommits newest commit generation = 1
[junit4:junit4]   2> ASYNC  NEW_CORE C6384 name=nodes_used_collection_shard1_replica2 org.apache.solr.core.SolrCore@1efb7ce url=http://127.0.0.1:45660/_ozv/vs/nodes_used_collection_shard1_replica2 node=127.0.0.1:45660__ozv%2Fvs C6384_STATE=coll:nodes_used_collection core:nodes_used_collection_shard1_replica2 props:{shard=shard1, state=active, core=nodes_used_collection_shard1_replica2, collection=nodes_used_collection, node_name=127.0.0.1:45660__ozv%2Fvs, base_url=http://127.0.0.1:45660/_ozv/vs, leader=true}
[junit4:junit4]   2> 676488 T2138 C6384 P45660 oasc.SolrCore.execute [nodes_used_collection_shard1_replica2] webapp=/_ozv/vs path=/replication params={file=segments_2&command=filecontent&checksum=true&wt=filestream&qt=/replication&generation=2} status=0 QTime=0
[junit4:junit4]   2> ASYNC  NEW_CORE C6385 name=nodes_used_collection_shard1_replica1 org.apache.solr.core.SolrCore@131f7ef url=http://127.0.0.1:37924/_ozv/vs/nodes_used_collection_shard1_replica1 node=127.0.0.1:37924__ozv%2Fvs C6385_STATE=coll:nodes_used_collection core:nodes_used_collection_shard1_replica1 props:{shard=shard1, state=recovering, core=nodes_used_collection_shard1_replica1, collection=nodes_used_collection, node_name=127.0.0.1:37924__ozv%2Fvs, base_url=http://127.0.0.1:37924/_ozv/vs}
[junit4:junit4]   2> 676522 T2109 C6385 P37924 oash.SnapPuller.fetchLatestIndex Total time taken for download : 0 secs
[junit4:junit4]   2> ASYNC  NEW_CORE C6386 name=nodes_used_collection_shard2_replica2 org.apache.solr.core.SolrCore@1631478 url=http://127.0.0.1:42419/_ozv/vs/nodes_used_collection_shard2_replica2 node=127.0.0.1:42419__ozv%2Fvs C6386_STATE=coll:nodes_used_collection core:nodes_used_collection_shard2_replica2 props:{shard=shard2, state=active, core=nodes_used_collection_shard2_replica2, collection=nodes_used_collection, node_name=127.0.0.1:42419__ozv%2Fvs, base_url=http://127.0.0.1:42419/_ozv/vs, leader=true}
[junit4:junit4]   2> 676522 T2030 C6386 P42419 oasc.SolrDeletionPolicy.onCommit SolrDeletionPolicy.onCommit: commits: num=2
[junit4:junit4]   2> commit{dir=MockDirWrapper(org.apache.lucene.store.RAMDirectory@18e74bc lockFactory=org.apache.lucene.store.NativeFSLockFactory@1aa869b),segFN=segments_1,generation=1}
[junit4:junit4]   2> commit{dir=MockDirWrapper(org.apache.lucene.store.RAMDirectory@18e74bc lockFactory=org.apache.lucene.store.NativeFSLockFactory@1aa869b),segFN=segments_2,generation=2}
[junit4:junit4]   2> 676523 T2030 C6386 P42419 oasc.SolrDeletionPolicy.updateCommits newest commit generation = 2
[junit4:junit4]   2> 676524 T2030 C6386 P42419 oass.SolrIndexSearcher.<init> Opening Searcher@74f2b9 realtime
[junit4:junit4]   2> 676525 T2030 C6386 P42419 oasu.DirectUpdateHandler2.commit end_commit_flush
[junit4:junit4]   2> 676525 T2030 C6386 P42419 oasup.LogUpdateProcessor.finish [nodes_used_collection_shard2_replica2] webapp=/_ozv/vs path=/update params={waitSearcher=true&openSearcher=false&commit=true&wt=javabin&commit_end_point=true&version=2&softCommit=false} {commit=} 0 103
[junit4:junit4]   2> ASYNC  NEW_CORE C6387 name=nodes_used_collection_shard2_replica1 org.apache.solr.core.SolrCore@11988c8 url=http://127.0.0.1:46482/_ozv/vs/nodes_used_collection_shard2_replica1 node=127.0.0.1:46482__ozv%2Fvs C6387_STATE=coll:nodes_used_collection core:nodes_used_collection_shard2_replica1 props:{shard=shard2, state=recovering, core=nodes_used_collection_shard2_replica1, collection=nodes_used_collection, node_name=127.0.0.1:46482__ozv%2Fvs, base_url=http://127.0.0.1:46482/_ozv/vs}
[junit4:junit4]   2> 676527 T2108 C6387 P46482 oash.ReplicationHandler.inform Commits will be reserved for  10000
[junit4:junit4]   2> 676527 T2108 C6387 P46482 oash.SnapPuller.<init>  No value set for 'pollInterval'. Timer Task not started.
[junit4:junit4]   2> 676529 T2030 C6386 P42419 oash.ReplicationHandler.inform Commits will be reserved for  10000
[junit4:junit4]   2> 676529 T2030 C6386 P42419 oasc.SolrCore.execute [nodes_used_collection_shard2_replica2] webapp=/_ozv/vs path=/replication params={command=indexversion&qt=/replication&wt=javabin&version=2} status=0 QTime=0
[junit4:junit4]   2> 676530 T2108 C6387 P46482 oash.SnapPuller.fetchLatestIndex Master's generation: 2
[junit4:junit4]   2> 676531 T2108 C6387 P46482 oash.SnapPuller.fetchLatestIndex Slave's generation: 1
[junit4:junit4]   2> 676531 T2108 C6387 P46482 oash.SnapPuller.fetchLatestIndex Starting replication process
[junit4:junit4]   2> 676533 T2142 C6386 P42419 oasc.SolrCore.execute [nodes_used_collection_shard2_replica2] webapp=/_ozv/vs path=/replication params={command=filelist&qt=/replication&wt=javabin&generation=2&version=2} status=0 QTime=0
[junit4:junit4]   2> 676534 T2108 C6387 P46482 oash.SnapPuller.fetchLatestIndex Number of files in latest index in master: 1
[junit4:junit4]   2> 676535 T2108 C6387 P46482 oasc.CachingDirectoryFactory.get return new directory for /mnt/ssd/jenkins/workspace/Lucene-Solr-4.x-Linux/solr/build/solr-core/test/J1/./org.apache.solr.cloud.CollectionsAPIDistributedZkTest-jetty1-1369312518342/nodes_used_collection_shard2_replica1/data/index.20130523083531831
[junit4:junit4]   2> 676536 T2108 C6387 P46482 oash.SnapPuller.fetchLatestIndex Starting download to MockDirWrapper(org.apache.lucene.store.RAMDirectory@13e8e84 lockFactory=org.apache.lucene.store.NativeFSLockFactory@3d853d) fullCopy=false
[junit4:junit4]   2> ASYNC  NEW_CORE C6388 name=nodes_used_collection_shard1_replica1 org.apache.solr.core.SolrCore@131f7ef url=http://127.0.0.1:37924/_ozv/vs/nodes_used_collection_shard1_replica1 node=127.0.0.1:37924__ozv%2Fvs C6388_STATE=coll:nodes_used_collection core:nodes_used_collection_shard1_replica1 props:{shard=shard1, state=recovering, core=nodes_used_collection_shard1_replica1, collection=nodes_used_collection, node_name=127.0.0.1:37924__ozv%2Fvs, base_url=http://127.0.0.1:37924/_ozv/vs}
[junit4:junit4]   2> 676553 T2109 C6388 P37924 oasu.DefaultSolrCoreState.newIndexWriter Creating new IndexWriter...
[junit4:junit4]   2> 676553 T2109 C6388 P37924 oasu.DefaultSolrCoreState.newIndexWriter Waiting until IndexWriter is unused... core=nodes_used_collection_shard1_replica1
[junit4:junit4]   2> ASYNC  NEW_CORE C6389 name=nodes_used_collection_shard2_replica2 org.apache.solr.core.SolrCore@1631478 url=http://127.0.0.1:42419/_ozv/vs/nodes_used_collection_shard2_replica2 node=127.0.0.1:42419__ozv%2Fvs C6389_STATE=coll:nodes_used_collection core:nodes_used_collection_shard2_replica2 props:{shard=shard2, state=active, core=nodes_used_collection_shard2_replica2, collection=nodes_used_collection, node_name=127.0.0.1:42419__ozv%2Fvs, base_url=http://127.0.0.1:42419/_ozv/vs, leader=true}
[junit4:junit4]   2> 676555 T2030 C6389 P42419 oasc.SolrCore.execute [nodes_used_collection_shard2_replica2] webapp=/_ozv/vs path=/replication params={file=segments_2&command=filecontent&checksum=true&wt=filestream&qt=/replication&generation=2} status=0 QTime=0
[junit4:junit4]   2> ASYNC  NEW_CORE C6390 name=nodes_used_collection_shard2_replica1 org.apache.solr.core.SolrCore@11988c8 url=http://127.0.0.1:46482/_ozv/vs/nodes_used_collection_shard2_replica1 node=127.0.0.1:46482__ozv%2Fvs C6390_STATE=coll:nodes_used_collection core:nodes_used_collection_shard2_replica1 props:{shard=shard2, state=recovering, core=nodes_used_collection_shard2_replica1, collection=nodes_used_collection, node_name=127.0.0.1:46482__ozv%2Fvs, base_url=http://127.0.0.1:46482/_ozv/vs}
[junit4:junit4]   2> 676558 T2108 C6390 P46482 oash.SnapPuller.fetchLatestIndex Total time taken for download : 0 secs
[junit4:junit4]   2> ASYNC  NEW_CORE C6391 name=nodes_used_collection_shard1_replica1 org.apache.solr.core.SolrCore@131f7ef url=http://127.0.0.1:37924/_ozv/vs/nodes_used_collection_shard1_replica1 node=127.0.0.1:37924__ozv%2Fvs C6391_STATE=coll:nodes_used_collection core:nodes_used_collection_shard1_replica1 props:{shard=shard1, state=recovering, core=nodes_used_collection_shard1_replica1, collection=nodes_used_collection, node_name=127.0.0.1:37924__ozv%2Fvs, base_url=http://127.0.0.1:37924/_ozv/vs}
[junit4:junit4]   2> 676569 T2109 C6391 P37924 oasc.SolrDeletionPolicy.onInit SolrDeletionPolicy.onInit: commits: num=2
[junit4:junit4]   2> commit{dir=MockDirWrapper(org.apache.lucene.store.RAMDirectory@fc5a40 lockFactory=org.apache.lucene.store.NativeFSLockFactory@773caf),segFN=segments_1,generation=1}
[junit4:junit4]   2> commit{dir=MockDirWrapper(org.apache.lucene.store.RAMDirectory@fc5a40 lockFactory=org.apache.lucene.store.NativeFSLockFactory@773caf),segFN=segments_2,generation=2}
[junit4:junit4]   2> 676570 T2109 C6391 P37924 oasc.SolrDeletionPolicy.updateCommits newest commit generation = 2
[junit4:junit4]   2> ASYNC  NEW_CORE C6392 name=nodes_used_collection_shard2_replica1 org.apache.solr.core.SolrCore@11988c8 url=http://127.0.0.1:46482/_ozv/vs/nodes_used_collection_shard2_replica1 node=127.0.0.1:46482__ozv%2Fvs C6392_STATE=coll:nodes_used_collection core:nodes_used_collection_shard2_replica1 props:{shard=shard2, state=recovering, core=nodes_used_collection_shard2_replica1, collection=nodes_used_collection, node_name=127.0.0.1:46482__ozv%2Fvs, base_url=http://127.0.0.1:46482/_ozv/vs}
[junit4:junit4]   2> 676570 T2108 C6392 P46482 oasu.DefaultSolrCoreState.newIndexWriter Creating new IndexWriter...
[junit4:junit4]   2> 676571 T2108 C6392 P46482 oasu.DefaultSolrCoreState.newIndexWriter Waiting until IndexWriter is unused... core=nodes_used_collection_shard2_replica1
[junit4:junit4]   2> 676570 T2109 C6391 P37924 oasu.DefaultSolrCoreState.newIndexWriter New IndexWriter is ready to be used.
[junit4:junit4]   2> 676571 T2109 C6391 P37924 oass.SolrIndexSearcher.<init> Opening Searcher@1f8a691 main
[junit4:junit4]   2> 676591 T2105 oasc.SolrCore.registerSearcher [nodes_used_collection_shard1_replica1] Registered new searcher Searcher@1f8a691 main{StandardDirectoryReader(segments_2:1:nrt)}
[junit4:junit4]   2> ASYNC  NEW_CORE C6393 name=nodes_used_collection_shard1_replica1 org.apache.solr.core.SolrCore@131f7ef url=http://127.0.0.1:37924/_ozv/vs/nodes_used_collection_shard1_replica1 node=127.0.0.1:37924__ozv%2Fvs C6393_STATE=coll:nodes_used_collection core:nodes_used_collection_shard1_replica1 props:{shard=shard1, state=recovering, core=nodes_used_collection_shard1_replica1, collection=nodes_used_collection, node_name=127.0.0.1:37924__ozv%2Fvs, base_url=http://127.0.0.1:37924/_ozv/vs}
[junit4:junit4]   2> 676592 T2109 C6393 P37924 oasc.CachingDirectoryFactory.closeCacheValue looking to close /mnt/ssd/jenkins/workspace/Lucene-Solr-4.x-Linux/solr/build/solr-core/test/J1/./org.apache.solr.cloud.CollectionsAPIDistributedZkTest-jetty4-1369312521997/nodes_used_collection_shard1_replica1/data/index.20130523083531740 [CachedDir<<refCount=0;path=/mnt/ssd/jenkins/workspace/Lucene-Solr-4.x-Linux/solr/build/solr-core/test/J1/./org.apache.solr.cloud.CollectionsAPIDistributedZkTest-jetty4-1369312521997/nodes_used_collection_shard1_replica1/data/index.20130523083531740;done=true>>]
[junit4:junit4]   2> 676593 T2109 C6393 P37924 oasc.CachingDirectoryFactory.close Closing directory: /mnt/ssd/jenkins/workspace/Lucene-Solr-4.x-Linux/solr/build/solr-core/test/J1/./org.apache.solr.cloud.CollectionsAPIDistributedZkTest-jetty4-1369312521997/nodes_used_collection_shard1_replica1/data/index.20130523083531740
[junit4:junit4]   2> 676593 T2109 C6393 P37924 oasc.CachingDirectoryFactory.closeCacheValue Removing directory before core close: /mnt/ssd/jenkins/workspace/Lucene-Solr-4.x-Linux/solr/build/solr-core/test/J1/./org.apache.solr.cloud.CollectionsAPIDistributedZkTest-jetty4-1369312521997/nodes_used_collection_shard1_replica1/data/index.20130523083531740
[junit4:junit4]   2> 676594 T2109 C6393 P37924 oasc.RecoveryStrategy.replay No replay needed. core=nodes_used_collection_shard1_replica1
[junit4:junit4]   2> 676594 T2109 C6393 P37924 oasc.RecoveryStrategy.doRecovery Replication Recovery was successful - registering as Active. core=nodes_used_collection_shard1_replica1
[junit4:junit4]   2> 676594 T2109 C6393 P37924 oasc.ZkController.publish publishing core=nodes_used_collection_shard1_replica1 state=active
[junit4:junit4]   2> ASYNC  NEW_CORE C6394 name=nodes_used_collection_shard2_replica1 org.apache.solr.core.SolrCore@11988c8 url=http://127.0.0.1:46482/_ozv/vs/nodes_used_collection_shard2_replica1 node=127.0.0.1:46482__ozv%2Fvs C6394_STATE=coll:nodes_used_collection core:nodes_used_collection_shard2_replica1 props:{shard=shard2, state=recovering, core=nodes_used_collection_shard2_replica1, collection=nodes_used_collection, node_name=127.0.0.1:46482__ozv%2Fvs, base_url=http://127.0.0.1:46482/_ozv/vs}
[junit4:junit4]   2> 676602 T2108 C6394 P46482 oasc.SolrDeletionPolicy.onInit SolrDeletionPolicy.onInit: commits: num=2
[junit4:junit4]   2> commit{dir=MockDirWrapper(org.apache.lucene.store.RAMDirectory@a48637 lockFactory=org.apache.lucene.store.NativeFSLockFactory@1f8a578),segFN=segments_1,generation=1}
[junit4:junit4]   2> commit{dir=MockDirWrapper(org.apache.lucene.store.RAMDirectory@a48637 lockFactory=org.apache.lucene.store.NativeFSLockFactory@1f8a578),segFN=segments_2,generation=2}
[junit4:junit4]   2> ASYNC  NEW_CORE C6395 name=nodes_used_collection_shard1_replica1 org.apache.solr.core.SolrCore@131f7ef url=http://127.0.0.1:37924/_ozv/vs/nodes_used_collection_shard1_replica1 node=127.0.0.1:37924__ozv%2Fvs C6395_STATE=coll:nodes_used_collection core:nodes_used_collection_shard1_replica1 props:{shard=shard1, state=recovering, core=nodes_used_collection_shard1_replica1, collection=nodes_used_collection, node_name=127.0.0.1:37924__ozv%2Fvs, base_url=http://127.0.0.1:37924/_ozv/vs}
[junit4:junit4]   2> 676616 T2109 C6395 P37924 oasc.RecoveryStrategy.doRecovery Finished recovery process. core=nodes_used_collection_shard1_replica1
[junit4:junit4]   2> ASYNC  NEW_CORE C6396 name=nodes_used_collection_shard2_replica1 org.apache.solr.core.SolrCore@11988c8 url=http://127.0.0.1:46482/_ozv/vs/nodes_used_collection_shard2_replica1 node=127.0.0.1:46482__ozv%2Fvs C6396_STATE=coll:nodes_used_collection core:nodes_used_collection_shard2_replica1 props:{shard=shard2, state=recovering, core=nodes_used_collection_shard2_replica1, collection=nodes_used_collection, node_name=127.0.0.1:46482__ozv%2Fvs, base_url=http://127.0.0.1:46482/_ozv/vs}
[junit4:junit4]   2> 676617 T2108 C6396 P46482 oasc.SolrDeletionPolicy.updateCommits newest commit generation = 2
[junit4:junit4]   2> 676617 T2108 C6396 P46482 oasu.DefaultSolrCoreState.newIndexWriter New IndexWriter is ready to be used.
[junit4:junit4]   2> 676618 T2108 C6396 P46482 oass.SolrIndexSearcher.<init> Opening Searcher@15a2edd main
[junit4:junit4]   2> 676619 T2103 oasc.SolrCore.registerSearcher [nodes_used_collection_shard2_replica1] Registered new searcher Searcher@15a2edd main{StandardDirectoryReader(segments_2:1:nrt)}
[junit4:junit4]   2> 676628 T2108 C6396 P46482 oasc.CachingDirectoryFactory.closeCacheValue looking to close /mnt/ssd/jenkins/workspace/Lucene-Solr-4.x-Linux/solr/build/solr-core/test/J1/./org.apache.solr.cloud.CollectionsAPIDistributedZkTest-jetty1-1369312518342/nodes_used_collection_shard2_replica1/data/index.20130523083531831 [CachedDir<<refCount=0;path=/mnt/ssd/jenkins/workspace/Lucene-Solr-4.x-Linux/solr/build/solr-core/test/J1/./org.apache.solr.cloud.CollectionsAPIDistributedZkTest-jetty1-1369312518342/nodes_used_collection_shard2_replica1/data/index.20130523083531831;done=true>>]
[junit4:junit4]   2> 676629 T2108 C6396 P46482 oasc.CachingDirectoryFactory.close Closing directory: /mnt/ssd/jenkins/workspace/Lucene-Solr-4.x-Linux/solr/build/solr-core/test/J1/./org.apache.solr.cloud.CollectionsAPIDistributedZkTest-jetty1-1369312518342/nodes_used_collection_shard2_replica1/data/index.20130523083531831
[junit4:junit4]   2> 676629 T2108 C6396 P46482 oasc.CachingDirectoryFactory.closeCacheValue Removing directory before core close: /mnt/ssd/jenkins/workspace/Lucene-Solr-4.x-Linux/solr/build/solr-core/test/J1/./org.apache.solr.cloud.CollectionsAPIDistributedZkTest-jetty1-1369312518342/nodes_used_collection_shard2_replica1/data/index.20130523083531831
[junit4:junit4]   2> 676629 T2108 C6396 P46482 oasc.RecoveryStrategy.replay No replay needed. core=nodes_used_collection_shard2_replica1
[junit4:junit4]   2> 676630 T2108 C6396 P46482 oasc.RecoveryStrategy.doRecovery Replication Recovery was successful - registering as Active. core=nodes_used_collection_shard2_replica1
[junit4:junit4]   2> 676630 T2108 C6396 P46482 oasc.ZkController.publish publishing core=nodes_used_collection_shard2_replica1 state=active
[junit4:junit4]   2> 676634 T2108 C6396 P46482 oasc.RecoveryStrategy.doRecovery Finished recovery process. core=nodes_used_collection_shard2_replica1
[junit4:junit4]   2> 676826 T2037 oascc.ZkStateReader.updateClusterState Updating cloud state from ZooKeeper...
[junit4:junit4]   2> 676827 T2037 oasc.Overseer$ClusterStateUpdater.updateState Update state numShards=2 message={
[junit4:junit4]   2>  "operation":"state",
[junit4:junit4]   2>  "core_node_name":"127.0.0.1:37924__ozv%2Fvs_nodes_used_collection_shard1_replica1",
[junit4:junit4]   2>  "numShards":"2",
[junit4:junit4]   2>  "shard":"shard1",
[junit4:junit4]   2>  "roles":null,
[junit4:junit4]   2>  "state":"active",
[junit4:junit4]   2>  "shard_state":"active",
[junit4:junit4]   2>  "core":"nodes_used_collection_shard1_replica1",
[junit4:junit4]   2>  "collection":"nodes_used_collection",
[junit4:junit4]   2>  "shard_range":null,
[junit4:junit4]   2>  "node_name":"127.0.0.1:37924__ozv%2Fvs",
[junit4:junit4]   2>  "base_url":"http://127.0.0.1:37924/_ozv/vs"}
[junit4:junit4]   2> 676954 T2037 oasc.Overseer$ClusterStateUpdater.updateState Update state numShards=2 message={
[junit4:junit4]   2>  "operation":"state",
[junit4:junit4]   2>  "core_node_name":"127.0.0.1:46482__ozv%2Fvs_nodes_used_collection_shard2_replica1",
[junit4:junit4]   2>  "numShards":"2",
[junit4:junit4]   2>  "shard":"shard2",
[junit4:junit4]   2>  "roles":null,
[junit4:junit4]   2>  "state":"active",
[junit4:junit4]   2>  "shard_state":"active",
[junit4:junit4]   2>  "core":"nodes_used_collection_shard2_replica1",
[junit4:junit4]   2>  "collection":"nodes_used_collection",
[junit4:junit4]   2>  "shard_range":null,
[junit4:junit4]   2>  "node_name":"127.0.0.1:46482__ozv%2Fvs",
[junit4:junit4]   2>  "base_url":"http://127.0.0.1:46482/_ozv/vs"}
[junit4:junit4]   2> 676974 T2054 oascc.ZkStateReader$2.process A cluster state change: WatchedEvent state:SyncConnected type:NodeDataChanged path:/clusterstate.json, has occurred - updating... (live nodes size: 5)
[junit4:junit4]   2> 676974 T2036 oascc.ZkStateReader$2.process A cluster state change: WatchedEvent state:SyncConnected type:NodeDataChanged path:/clusterstate.json, has occurred - updating... (live nodes size: 5)
[junit4:junit4]   2> 676974 T2111 oascc.ZkStateReader$2.process A cluster state change: WatchedEvent state:SyncConnected type:NodeDataChanged path:/clusterstate.json, has occurred - updating... (live nodes size: 5)
[junit4:junit4]   2> 676974 T2113 oascc.ZkStateReader$2.process A cluster state change: WatchedEvent state:SyncConnected type:NodeDataChanged path:/clusterstate.json, has occurred - updating... (live nodes size: 5)
[junit4:junit4]   2> 676974 T2096 oascc.ZkStateReader$2.process A cluster state change: WatchedEvent state:SyncConnected type:NodeDataChanged path:/clusterstate.json, has occurred - updating... (live nodes size: 5)
[junit4:junit4]   2> 676974 T2068 oascc.ZkStateReader$2.process A cluster state change: WatchedEvent state:SyncConnected type:NodeDataChanged path:/clusterstate.json, has occurred - updating... (live nodes size: 5)
[junit4:junit4]   2> 676974 T2082 oascc.ZkStateReader$2.process A cluster state change: WatchedEvent state:SyncConnected type:NodeDataChanged path:/clusterstate.json, has occurred - updating... (live nodes size: 5)
[junit4:junit4]   2> 676974 T2041 oascc.ZkStateReader$2.process A cluster state change: WatchedEvent state:SyncConnected type:NodeDataChanged path:/clusterstate.json, has occurred - updating... (live nodes size: 5)
[junit4:junit4]   2> 677400 T2078 oass.OpenExchangeRatesOrgProvider.init Initialized with rates=open-exchange-rates.json, refreshInterval=1440.
[junit4:junit4]   2> 677536 T2078 oass.IndexSchema.readSchema default search field in schema is text
[junit4:junit4]   2> 677558 T2078 oass.IndexSchema.readSchema unique key field: id
[junit4:junit4]   2> 677601 T2078 oass.FileExchangeRateProvider.reload Reloading exchange rates from file currency.xml
[junit4:junit4]   2> 677657 T2078 oass.FileExchangeRateProvider.reload Reloading exchange rates from file currency.xml
[junit4:junit4]   2> 677707 T2078 oass.OpenExchangeRatesOrgProvider.reload Reloading exchange rates from open-exchange-rates.json
[junit4:junit4]   2> 677709 T2078 oass.OpenExchangeRatesOrgProvider$OpenExchangeRates.<init> WARN Unknown key IMPORTANT NOTE
[junit4:junit4]   2> 677710 T2078 oass.OpenExchangeRatesOrgProvider$OpenExchangeRates.<init> WARN Expected key, got STRING
[junit4:junit4]   2> 677710 T2078 oass.OpenExchangeRatesOrgProvider.reload Reloading exchange rates from open-exchange-rates.json
[junit4:junit4]   2> 677712 T2078 oass.OpenExchangeRatesOrgProvider$OpenExchangeRates.<init> WARN Unknown key IMPORTANT NOTE
[junit4:junit4]   2> 677712 T2078 oass.OpenExchangeRatesOrgProvider$OpenExchangeRates.<init> WARN Expected key, got STRING
[junit4:junit4]   2> 677713 T2078 oasc.SolrCore.initDirectoryFactory org.apache.solr.core.MockDirectoryFactory
[junit4:junit4]   2> 677714 T2078 oasc.SolrCore.<init> [awholynewcollection_0_shard2_replica2] Opening new SolrCore at /mnt/ssd/jenkins/workspace/Lucene-Solr-4.x-Linux/solr/build/solr-core/test/J1/./org.apache.solr.cloud.CollectionsAPIDistributedZkTest-jetty3-1369312520765/awholynewcollection_0_shard2_replica2/, dataDir=/mnt/ssd/jenkins/workspace/Lucene-Solr-4.x-Linux/solr/build/solr-core/test/J1/./org.apache.solr.cloud.CollectionsAPIDistributedZkTest-jetty3-1369312520765/awholynewcollection_0_shard2_replica2/data/
[junit4:junit4]   2> 677714 T2078 oasc.JmxMonitoredMap.<init> JMX monitoring is enabled. Adding Solr mbeans to JMX Server: com.sun.jmx.mbeanserver.JmxMBeanServer@9fa8f
[junit4:junit4]   2> 677715 T2078 oasc.SolrCore.initDirectoryFactory org.apache.solr.core.MockDirectoryFactory
[junit4:junit4]   2> 677733 T2078 oasc.CachingDirectoryFactory.get return new directory for /mnt/ssd/jenkins/workspace/Lucene-Solr-4.x-Linux/solr/build/solr-core/test/J1/./org.apache.solr.cloud.CollectionsAPIDistributedZkTest-jetty3-1369312520765/awholynewcollection_0_shard2_replica2/data
[junit4:junit4]   2> 677734 T2078 oasc.SolrCore.getNewIndexDir New index directory detected: old=null new=/mnt/ssd/jenkins/workspace/Lucene-Solr-4.x-Linux/solr/build/solr-core/test/J1/./org.apache.solr.cloud.CollectionsAPIDistributedZkTest-jetty3-1369312520765/awholynewcollection_0_shard2_replica2/data/index/
[junit4:junit4]   2> 677735 T2078 oasc.SolrCore.initIndex WARN [awholynewcollection_0_shard2_replica2] Solr index directory '/mnt/ssd/jenkins/workspace/Lucene-Solr-4.x-Linux/solr/build/solr-core/test/J1/./org.apache.solr.cloud.CollectionsAPIDistributedZkTest-jetty3-1369312520765/awholynewcollection_0_shard2_replica2/data/index' doesn't exist. Creating new index...
[junit4:junit4]   2> 677735 T2078 oasc.CachingDirectoryFactory.get return new directory for /mnt/ssd/jenkins/workspace/Lucene-Solr-4.x-Linux/solr/build/solr-core/test/J1/./org.apache.solr.cloud.CollectionsAPIDistributedZkTest-jetty3-1369312520765/awholynewcollection_0_shard2_replica2/data/index
[junit4:junit4]   2> 677738 T2078 oasc.SolrDeletionPolicy.onCommit SolrDeletionPolicy.onCommit: commits: num=1
[junit4:junit4]   2> commit{dir=MockDirWrapper(org.apache.lucene.store.RAMDirectory@18fd51a lockFactory=org.apache.lucene.store.NativeFSLockFactory@1390f08),segFN=segments_1,generation=1}
[junit4:junit4]   2> 677738 T2078 oasc.SolrDeletionPolicy.updateCommits newest commit generation = 1
[junit4:junit4]   2> 677741 T2078 oasup.UpdateRequestProcessorChain.init inserting DistributedUpdateProcessorFactory into updateRequestProcessorChain "dedupe"
[junit4:junit4]   2> 677742 T2078 oasup.UpdateRequestProcessorChain.init inserting DistributedUpdateProcessorFactory into updateRequestProcessorChain "stored_sig"
[junit4:junit4]   2> 677743 T2078 oasup.UpdateRequestProcessorChain.init inserting DistributedUpdateProcessorFactory into updateRequestProcessorChain "distrib-dup-test-chain-implicit"
[junit4:junit4]   2> 677744 T2078 oasc.RequestHandlers.initHandlersFromConfig created standard: solr.StandardRequestHandler
[junit4:junit4]   2> 677745 T2078 oasc.RequestHandlers.initHandlersFromConfig created /get: solr.RealTimeGetHandler
[junit4:junit4]   2> 677745 T2078 oasc.RequestHandlers.initHandlersFromConfig adding lazy requestHandler: solr.ReplicationHandler
[junit4:junit4]   2> 677746 T2078 oasc.RequestHandlers.initHandlersFromConfig created /replication: solr.ReplicationHandler
[junit4:junit4]   2> 677747 T2078 oasc.RequestHandlers.initHandlersFromConfig created /update: solr.UpdateRequestHandler
[junit4:junit4]   2> 677747 T2078 oasc.RequestHandlers.initHandlersFromConfig created /admin/: org.apache.solr.handler.admin.AdminHandlers
[junit4:junit4]   2> 677767 T2078 oashl.XMLLoader.init xsltCacheLifetimeSeconds=60
[junit4:junit4]   2> 677814 T2078 oass.SolrIndexSearcher.<init> Opening Searcher@1f92596 main
[junit4:junit4]   2> 677815 T2078 oasu.UpdateHandler.clearLog Clearing tlog files, tlogDir=/mnt/ssd/jenkins/workspace/Lucene-Solr-4.x-Linux/solr/build/solr-core/test/J1/./org.apache.solr.cloud.CollectionsAPIDistributedZkTest-jetty3-1369312520765/awholynewcollection_0_shard2_replica2/data/tlog
[junit4:junit4]   2> 677817 T2078 oasu.CommitTracker.<init> Hard AutoCommit: disabled
[junit4:junit4]   2> 677817 T2078 oasu.CommitTracker.<init> Soft AutoCommit: disabled
[junit4:junit4]   2> 677837 T2147 oasc.SolrCore.registerSearcher [awholynewcollection_0_shard2_replica2] Registered new searcher Searcher@1f92596 main{StandardDirectoryReader(segments_1:1)}
[junit4:junit4]   2> 677839 T2078 oasc.ZkController.publish publishing core=awholynewcollection_0_shard2_replica2 state=down
[junit4:junit4]   2> 677973 T2090 oass.OpenExchangeRatesOrgProvider.init Initialized with rates=open-exchange-rates.json, refreshInterval=1440.
[junit4:junit4]   2> 678010 T2090 oass.IndexSchema.readSchema default search field in schema is text
[junit4:junit4]   2> 678052 T2090 oass.IndexSchema.readSchema unique key field: id
[junit4:junit4]   2> 678120 T2134 oass.OpenExchangeRatesOrgProvider.init Initialized with rates=open-exchange-rates.json, refreshInterval=1440.
[junit4:junit4]   2> 678153 T2090 oass.FileExchangeRateProvider.reload Reloading exchange rates from file currency.xml
[junit4:junit4]   2> 678170 T2134 oass.IndexSchema.readSchema default search field in schema is text
[junit4:junit4]   2> 678177 T2134 oass.IndexSchema.readSchema unique key field: id
[junit4:junit4]   2> 678216 T2090 oass.FileExchangeRateProvider.reload Reloading exchange rates from file currency.xml
[junit4:junit4]   2> 678243 T2029 oass.OpenExchangeRatesOrgProvider.init Initialized with rates=open-exchange-rates.json, refreshInterval=1440.
[junit4:junit4]   2> 678244 T2134 oass.FileExchangeRateProvider.reload Reloading exchange rates from file currency.xml
[junit4:junit4]   2> 678248 T2134 oass.FileExchangeRateProvider.reload Reloading exchange rates from file currency.xml
[junit4:junit4]   2> 678258 T2049 oass.OpenExchangeRatesOrgProvider.init Initialized with rates=open-exchange-rates.json, refreshInterval=1440.
[junit4:junit4]   2> 678267 T2029 oass.IndexSchema.readSchema default search field in schema is text
[junit4:junit4]   2> 678285 T2091 oass.OpenExchangeRatesOrgProvider.init Initialized with rates=open-exchange-rates.json, refreshInterval=1440.
[junit4:junit4]   2> 678305 T2091 oass.IndexSchema.readSchema default search field in schema is text
[junit4:junit4]   2> 678324 T2049 oass.IndexSchema.readSchema default search field in schema is text
[junit4:junit4]   2> 678330 T2049 oass.IndexSchema.readSchema unique key field: id
[junit4:junit4]   2> 678348 T2090 oass.OpenExchangeRatesOrgProvider.reload Reloading exchange rates from open-exchange-rates.json
[junit4:junit4]   2> 678350 T2134 oass.OpenExchangeRatesOrgProvider.reload Reloading exchange rates from open-exchange-rates.json
[junit4:junit4]   2> 678351 T2090 oass.OpenExchangeRatesOrgProvider$OpenExchangeRates.<init> WARN Unknown key IMPORTANT NOTE
[junit4:junit4]   2> 678352 T2090 oass.OpenExchangeRatesOrgProvider$OpenExchangeRates.<init> WARN Expected key, got STRING
[junit4:junit4]   2> 678352 T2090 oass.OpenExchangeRatesOrgProvider.reload Reloading exchange rates from open-exchange-rates.json
[junit4:junit4]   2> 678353 T2090 oass.OpenExchangeRatesOrgProvider$OpenExchangeRates.<init> WARN Unknown key IMPORTANT NOTE
[junit4:junit4]   2> 678353 T2090 oass.OpenExchangeRatesOrgProvider$OpenExchangeRates.<init> WARN Expected key, got STRING
[junit4:junit4]   2> 678353 T2134 oass.OpenExchangeRatesOrgProvider$OpenExchangeRates.<init> WARN Unknown key IMPORTANT NOTE
[junit4:junit4]   2> 678355 T2134 oass.OpenExchangeRatesOrgProvider$OpenExchangeRates.<init> WARN Expected key, got STRING
[junit4:junit4]   2> 678354 T2090 oasc.SolrCore.initDirectoryFactory org.apache.solr.core.MockDirectoryFactory
[junit4:junit4]   2> 678356 T2090 oasc.SolrCore.<init> [awholynewcollection_0_shard2_replica1] Opening new SolrCore at /mnt/ssd/jenkins/workspace/Lucene-Solr-4.x-Linux/solr/build/solr-core/test/J1/./org.apache.solr.cloud.CollectionsAPIDistributedZkTest-jetty4-1369312521997/awholynewcollection_0_shard2_replica1/, dataDir=/mnt/ssd/jenkins/workspace/Lucene-Solr-4.x-Linux/solr/build/solr-core/test/J1/./org.apache.solr.cloud.CollectionsAPIDistributedZkTest-jetty4-1369312521997/awholynewcollection_0_shard2_replica1/data/
[junit4:junit4]   2> 678356 T2090 oasc.JmxMonitoredMap.<init> JMX monitoring is enabled. Adding Solr mbeans to JMX Server: com.sun.jmx.mbeanserver.JmxMBeanServer@9fa8f
[junit4:junit4]   2> 678357 T2090 oasc.SolrCore.initDirectoryFactory org.apache.solr.core.MockDirectoryFactory
[junit4:junit4]   2> 678354 T2029 oass.IndexSchema.readSchema unique key field: id
[junit4:junit4]   2> 678355 T2134 oass.OpenExchangeRatesOrgProvider.reload Reloading exchange rates from open-exchange-rates.json
[junit4:junit4]   2> 678370 T2090 oasc.CachingDirectoryFactory.get return new directory for /mnt/ssd/jenkins/workspace/Lucene-Solr-4.x-Linux/solr/build/solr-core/test/J1/./org.apache.solr.cloud.CollectionsAPIDistributedZkTest-jetty4-1369312521997/awholynewcollection_0_shard2_replica1/data
[junit4:junit4]   2> 678370 T2090 oasc.SolrCore.getNewIndexDir New index directory detected: old=null new=/mnt/ssd/jenkins/workspace/Luc

[...truncated too long message...]

tedZkTest.java:512)
[junit4:junit4]    > at org.apache.solr.cloud.CollectionsAPIDistributedZkTest.doTest(CollectionsAPIDistributedZkTest.java:146)
[junit4:junit4]    > at org.apache.solr.BaseDistributedSearchTestCase.testDistribSearch(BaseDistributedSearchTestCase.java:815)
[junit4:junit4]    > at java.lang.Thread.run(Thread.java:662)
[junit4:junit4]   2> 939518 T2014 oas.SolrTestCaseJ4.deleteCore ###deleteCore
[junit4:junit4]   2> 276953 T2013 ccr.ThreadLeakControl.checkThreadLeaks WARNING Will linger awaiting termination of 2 leaked thread(s).
[junit4:junit4]   2> 940709 T2096 oasc.LeaderElector$1.process WARN  org.apache.zookeeper.KeeperException$SessionExpiredException: KeeperErrorCode = Session expired for /collections/awholynewcollection_0/leader_elect/shard1/election
[junit4:junit4]   2> at org.apache.zookeeper.KeeperException.create(KeeperException.java:127)
[junit4:junit4]   2> at org.apache.zookeeper.KeeperException.create(KeeperException.java:51)
[junit4:junit4]   2> at org.apache.zookeeper.ZooKeeper.getChildren(ZooKeeper.java:1468)
[junit4:junit4]   2> at org.apache.solr.common.cloud.SolrZkClient$6.execute(SolrZkClient.java:235)
[junit4:junit4]   2> at org.apache.solr.common.cloud.SolrZkClient$6.execute(SolrZkClient.java:232)
[junit4:junit4]   2> at org.apache.solr.common.cloud.ZkCmdExecutor.retryOperation(ZkCmdExecutor.java:65)
[junit4:junit4]   2> at org.apache.solr.common.cloud.SolrZkClient.getChildren(SolrZkClient.java:232)
[junit4:junit4]   2> at org.apache.solr.cloud.LeaderElector.checkIfIamLeader(LeaderElector.java:84)
[junit4:junit4]   2> at org.apache.solr.cloud.LeaderElector.access$000(LeaderElector.java:55)
[junit4:junit4]   2> at org.apache.solr.cloud.LeaderElector$1.process(LeaderElector.java:129)
[junit4:junit4]   2> at org.apache.zookeeper.ClientCnxn$EventThread.processEvent(ClientCnxn.java:519)
[junit4:junit4]   2> at org.apache.zookeeper.ClientCnxn$EventThread.run(ClientCnxn.java:495)
[junit4:junit4]   2>
[junit4:junit4]   2> 940711 T2096 oascc.ZkStateReader$2.process A cluster state change: WatchedEvent state:SyncConnected type:NodeChildrenChanged path:/live_nodes, has occurred - updating... (live nodes size: 1)
[junit4:junit4]   2> 940711 T2096 oascc.ZkStateReader$2.process WARN ZooKeeper watch triggered, but Solr cannot talk to ZK
[junit4:junit4]   2> 940711 T2096 oascc.ZkStateReader$3.process WARN ZooKeeper watch triggered, but Solr cannot talk to ZK
[junit4:junit4]   2> 940712 T2096 oasc.LeaderElector$1.process WARN  org.apache.zookeeper.KeeperException$SessionExpiredException: KeeperErrorCode = Session expired for /collections/awholynewcollection_0/leader_elect/shard4/election
[junit4:junit4]   2> at org.apache.zookeeper.KeeperException.create(KeeperException.java:127)
[junit4:junit4]   2> at org.apache.zookeeper.KeeperException.create(KeeperException.java:51)
[junit4:junit4]   2> at org.apache.zookeeper.ZooKeeper.getChildren(ZooKeeper.java:1468)
[junit4:junit4]   2> at org.apache.solr.common.cloud.SolrZkClient$6.execute(SolrZkClient.java:235)
[junit4:junit4]   2> at org.apache.solr.common.cloud.SolrZkClient$6.execute(SolrZkClient.java:232)
[junit4:junit4]   2> at org.apache.solr.common.cloud.ZkCmdExecutor.retryOperation(ZkCmdExecutor.java:65)
[junit4:junit4]   2> at org.apache.solr.common.cloud.SolrZkClient.getChildren(SolrZkClient.java:232)
[junit4:junit4]   2> at org.apache.solr.cloud.LeaderElector.checkIfIamLeader(LeaderElector.java:84)
[junit4:junit4]   2> at org.apache.solr.cloud.LeaderElector.access$000(LeaderElector.java:55)
[junit4:junit4]   2> at org.apache.solr.cloud.LeaderElector$1.process(LeaderElector.java:129)
[junit4:junit4]   2> at org.apache.zookeeper.ClientCnxn$EventThread.processEvent(ClientCnxn.java:519)
[junit4:junit4]   2> at org.apache.zookeeper.ClientCnxn$EventThread.run(ClientCnxn.java:495)
[junit4:junit4]   2>
[junit4:junit4]   2> 940713 T2096 oasc.LeaderElector$1.process WARN  org.apache.zookeeper.KeeperException$SessionExpiredException: KeeperErrorCode = Session expired for /collections/awholynewcollection_0/leader_elect/shard2/election
[junit4:junit4]   2> at org.apache.zookeeper.KeeperException.create(KeeperException.java:127)
[junit4:junit4]   2> at org.apache.zookeeper.KeeperException.create(KeeperException.java:51)
[junit4:junit4]   2> at org.apache.zookeeper.ZooKeeper.getChildren(ZooKeeper.java:1468)
[junit4:junit4]   2> at org.apache.solr.common.cloud.SolrZkClient$6.execute(SolrZkClient.java:235)
[junit4:junit4]   2> at org.apache.solr.common.cloud.SolrZkClient$6.execute(SolrZkClient.java:232)
[junit4:junit4]   2> at org.apache.solr.common.cloud.ZkCmdExecutor.retryOperation(ZkCmdExecutor.java:65)
[junit4:junit4]   2> at org.apache.solr.common.cloud.SolrZkClient.getChildren(SolrZkClient.java:232)
[junit4:junit4]   2> at org.apache.solr.cloud.LeaderElector.checkIfIamLeader(LeaderElector.java:84)
[junit4:junit4]   2> at org.apache.solr.cloud.LeaderElector.access$000(LeaderElector.java:55)
[junit4:junit4]   2> at org.apache.solr.cloud.LeaderElector$1.process(LeaderElector.java:129)
[junit4:junit4]   2> at org.apache.zookeeper.ClientCnxn$EventThread.processEvent(ClientCnxn.java:519)
[junit4:junit4]   2> at org.apache.zookeeper.ClientCnxn$EventThread.run(ClientCnxn.java:495)
[junit4:junit4]   2>
[junit4:junit4]   2> 940714 T2096 oasc.LeaderElector$1.process WARN  org.apache.zookeeper.KeeperException$SessionExpiredException: KeeperErrorCode = Session expired for /collections/awholynewcollection_0/leader_elect/shard3/election
[junit4:junit4]   2> at org.apache.zookeeper.KeeperException.create(KeeperException.java:127)
[junit4:junit4]   2> at org.apache.zookeeper.KeeperException.create(KeeperException.java:51)
[junit4:junit4]   2> at org.apache.zookeeper.ZooKeeper.getChildren(ZooKeeper.java:1468)
[junit4:junit4]   2> at org.apache.solr.common.cloud.SolrZkClient$6.execute(SolrZkClient.java:235)
[junit4:junit4]   2> at org.apache.solr.common.cloud.SolrZkClient$6.execute(SolrZkClient.java:232)
[junit4:junit4]   2> at org.apache.solr.common.cloud.ZkCmdExecutor.retryOperation(ZkCmdExecutor.java:65)
[junit4:junit4]   2> at org.apache.solr.common.cloud.SolrZkClient.getChildren(SolrZkClient.java:232)
[junit4:junit4]   2> at org.apache.solr.cloud.LeaderElector.checkIfIamLeader(LeaderElector.java:84)
[junit4:junit4]   2> at org.apache.solr.cloud.LeaderElector.access$000(LeaderElector.java:55)
[junit4:junit4]   2> at org.apache.solr.cloud.LeaderElector$1.process(LeaderElector.java:129)
[junit4:junit4]   2> at org.apache.zookeeper.ClientCnxn$EventThread.processEvent(ClientCnxn.java:519)
[junit4:junit4]   2> at org.apache.zookeeper.ClientCnxn$EventThread.run(ClientCnxn.java:495)
[junit4:junit4]   2>
[junit4:junit4]   2> NOTE: test params are: codec=Appending, sim=RandomSimilarityProvider(queryNorm=true,coord=no): {}, locale=ko, timezone=America/Tortola
[junit4:junit4]   2> NOTE: Linux 3.2.0-41-generic i386/Sun Microsystems Inc. 1.6.0_45 (32-bit)/cpus=8,threads=1,free=83421152,total=213757952
[junit4:junit4]   2> NOTE: All tests run in this JVM: [ClusterStateTest, ZkNodePropsTest, SampleTest, TestRecovery, TestSolr4Spatial, TestPropInject, SpellCheckComponentTest, TestHashPartitioner, SolrPluginUtilsTest, PingRequestHandlerTest, ShardRoutingCustomTest, TestCollationField, TestSolrQueryParserDefaultOperatorResource, SolrRequestParserTest, TestNumberUtils, SortByFunctionTest, NoCacheHeaderTest, IndexSchemaRuntimeFieldTest, TestArbitraryIndexDir, CurrencyFieldXmlFileTest, PathHierarchyTokenizerFactoryTest, TestUpdate, DateMathParserTest, SolrCmdDistributorTest, FieldAnalysisRequestHandlerTest, TestSuggestSpellingConverter, DocValuesMultiTest, TestSchemaSimilarityResource, StatsComponentTest, TestSystemIdResolver, TestStressReorder, TestDistributedSearch, SolrIndexConfigTest, SignatureUpdateProcessorFactoryTest, TestCoreDiscovery, IndexBasedSpellCheckerTest, URLClassifyProcessorTest, HighlighterTest, JSONWriterTest, TestZkChroot, TestReload, TestFieldTypeResource, SolrCoreCheckLockOnStartupTest, TestBM25SimilarityFactory, FullSolrCloudDistribCmdsTest, TestAddFieldRealTimeGet, TestCSVResponseWriter, IndexReaderFactoryTest, TestSchemaNameResource, TestUniqueKeyFieldResource, TestStressLucene, TestMultiCoreConfBootstrap, TestRangeQuery, ChaosMonkeySafeLeaderTest, FileUtilsTest, BasicDistributedZk2Test, TestRandomFaceting, LeaderElectionIntegrationTest, TestUtils, TestSolrJ, TestRTGBase, TestPartialUpdateDeduplication, CopyFieldTest, DistanceFunctionTest, UpdateParamsTest, NumericFieldsTest, SolrTestCaseJ4Test, TestDynamicFieldCollectionResource, TestPostingsSolrHighlighter, TestWordDelimiterFilterFactory, CollectionsAPIDistributedZkTest]
[junit4:junit4] Completed on J1 in 278.25s, 1 test, 1 failure <<< FAILURES!

[...truncated 461 lines...]
BUILD FAILED
/mnt/ssd/jenkins/workspace/Lucene-Solr-4.x-Linux/build.xml:386: The following error occurred while executing this line:
/mnt/ssd/jenkins/workspace/Lucene-Solr-4.x-Linux/build.xml:366: The following error occurred while executing this line:
/mnt/ssd/jenkins/workspace/Lucene-Solr-4.x-Linux/build.xml:39: The following error occurred while executing this line:
/mnt/ssd/jenkins/workspace/Lucene-Solr-4.x-Linux/solr/build.xml:181: The following error occurred while executing this line:
/mnt/ssd/jenkins/workspace/Lucene-Solr-4.x-Linux/solr/common-build.xml:437: The following error occurred while executing this line:
/mnt/ssd/jenkins/workspace/Lucene-Solr-4.x-Linux/lucene/common-build.xml:1243: The following error occurred while executing this line:
/mnt/ssd/jenkins/workspace/Lucene-Solr-4.x-Linux/lucene/common-build.xml:887: There were test failures: 296 suites, 1234 tests, 1 failure, 13 ignored (7 assumptions)

Total time: 43 minutes 4 seconds
Build step 'Invoke Ant' marked build as failure
Description set: Java: 32bit/jdk1.6.0_45 -client -XX:+UseConcMarkSweepGC
Archiving artifacts
Recording test results
Email was triggered for: Failure
Sending email for trigger: Failure




---------------------------------------------------------------------
To unsubscribe, e-mail: [hidden email]
For additional commands, e-mail: [hidden email]