[JENKINS] Lucene-Solr-4.x-Windows (32bit/jdk1.6.0_33) - Build # 135 - Failure!

Previous Topic Next Topic
 
classic Classic list List threaded Threaded
1 message Options
Reply | Threaded
Open this post in threaded view
|

[JENKINS] Lucene-Solr-4.x-Windows (32bit/jdk1.6.0_33) - Build # 135 - Failure!

Policeman Jenkins Server
Build: http://jenkins.sd-datasolutions.de/job/Lucene-Solr-4.x-Windows/135/
Java: 32bit/jdk1.6.0_33 -server -XX:+UseParallelGC

1 tests failed.
REGRESSION:  org.apache.solr.servlet.SolrRequestParserTest.testStreamURL

Error Message:
Read timed out

Stack Trace:
java.net.SocketTimeoutException: Read timed out
        at __randomizedtesting.SeedInfo.seed([DE02E95B46EE9A76:8737D74832CC5743]:0)
        at sun.reflect.NativeConstructorAccessorImpl.newInstance0(Native Method)
        at sun.reflect.NativeConstructorAccessorImpl.newInstance(NativeConstructorAccessorImpl.java:39)
        at sun.reflect.DelegatingConstructorAccessorImpl.newInstance(DelegatingConstructorAccessorImpl.java:27)
        at java.lang.reflect.Constructor.newInstance(Constructor.java:513)
        at sun.net.www.protocol.http.HttpURLConnection$6.run(HttpURLConnection.java:1491)
        at java.security.AccessController.doPrivileged(Native Method)
        at sun.net.www.protocol.http.HttpURLConnection.getChainedException(HttpURLConnection.java:1485)
        at sun.net.www.protocol.http.HttpURLConnection.getInputStream(HttpURLConnection.java:1139)
        at org.apache.solr.common.util.ContentStreamBase$URLStream.getStream(ContentStreamBase.java:85)
        at org.apache.solr.servlet.SolrRequestParserTest.testStreamURL(SolrRequestParserTest.java:137)
        at sun.reflect.NativeMethodAccessorImpl.invoke0(Native Method)
        at sun.reflect.NativeMethodAccessorImpl.invoke(NativeMethodAccessorImpl.java:39)
        at sun.reflect.DelegatingMethodAccessorImpl.invoke(DelegatingMethodAccessorImpl.java:25)
        at java.lang.reflect.Method.invoke(Method.java:597)
        at com.carrotsearch.randomizedtesting.RandomizedRunner.invoke(RandomizedRunner.java:1995)
        at com.carrotsearch.randomizedtesting.RandomizedRunner.access$1100(RandomizedRunner.java:132)
        at com.carrotsearch.randomizedtesting.RandomizedRunner$6.evaluate(RandomizedRunner.java:818)
        at com.carrotsearch.randomizedtesting.RandomizedRunner$7.evaluate(RandomizedRunner.java:877)
        at com.carrotsearch.randomizedtesting.RandomizedRunner$8.evaluate(RandomizedRunner.java:891)
        at com.carrotsearch.randomizedtesting.rules.SystemPropertiesRestoreRule$1.evaluate(SystemPropertiesRestoreRule.java:53)
        at org.apache.lucene.util.TestRuleSetupTeardownChained$1.evaluate(TestRuleSetupTeardownChained.java:50)
        at org.apache.lucene.util.TestRuleFieldCacheSanity$1.evaluate(TestRuleFieldCacheSanity.java:32)
        at org.apache.lucene.util.AbstractBeforeAfterRule$1.evaluate(AbstractBeforeAfterRule.java:45)
        at com.carrotsearch.randomizedtesting.rules.SystemPropertiesInvariantRule$1.evaluate(SystemPropertiesInvariantRule.java:55)
        at org.apache.lucene.util.TestRuleReportUncaughtExceptions$1.evaluate(TestRuleReportUncaughtExceptions.java:68)
        at org.apache.lucene.util.TestRuleThreadAndTestName$1.evaluate(TestRuleThreadAndTestName.java:48)
        at org.apache.lucene.util.TestRuleIgnoreAfterMaxFailures$1.evaluate(TestRuleIgnoreAfterMaxFailures.java:70)
        at org.apache.lucene.util.TestRuleMarkFailure$1.evaluate(TestRuleMarkFailure.java:48)
        at com.carrotsearch.randomizedtesting.RandomizedRunner.runSingleTest(RandomizedRunner.java:825)
        at com.carrotsearch.randomizedtesting.RandomizedRunner.access$700(RandomizedRunner.java:132)
        at com.carrotsearch.randomizedtesting.RandomizedRunner$3$1.run(RandomizedRunner.java:671)
        at com.carrotsearch.randomizedtesting.RandomizedRunner$3.evaluate(RandomizedRunner.java:697)
        at com.carrotsearch.randomizedtesting.RandomizedRunner$4.evaluate(RandomizedRunner.java:736)
        at com.carrotsearch.randomizedtesting.RandomizedRunner$5.evaluate(RandomizedRunner.java:747)
        at com.carrotsearch.randomizedtesting.rules.SystemPropertiesRestoreRule$1.evaluate(SystemPropertiesRestoreRule.java:53)
        at org.apache.lucene.util.AbstractBeforeAfterRule$1.evaluate(AbstractBeforeAfterRule.java:45)
        at org.apache.lucene.util.TestRuleReportUncaughtExceptions$1.evaluate(TestRuleReportUncaughtExceptions.java:68)
        at org.apache.lucene.util.TestRuleStoreClassName$1.evaluate(TestRuleStoreClassName.java:38)
        at com.carrotsearch.randomizedtesting.rules.SystemPropertiesInvariantRule$1.evaluate(SystemPropertiesInvariantRule.java:55)
        at org.apache.lucene.util.TestRuleNoInstanceHooksOverrides$1.evaluate(TestRuleNoInstanceHooksOverrides.java:53)
        at org.apache.lucene.util.TestRuleNoStaticHooksShadowing$1.evaluate(TestRuleNoStaticHooksShadowing.java:52)
        at org.apache.lucene.util.TestRuleAssertionsRequired$1.evaluate(TestRuleAssertionsRequired.java:36)
        at org.apache.lucene.util.TestRuleMarkFailure$1.evaluate(TestRuleMarkFailure.java:48)
        at org.apache.lucene.util.TestRuleIgnoreAfterMaxFailures$1.evaluate(TestRuleIgnoreAfterMaxFailures.java:70)
        at org.apache.lucene.util.TestRuleIgnoreTestSuites$1.evaluate(TestRuleIgnoreTestSuites.java:55)
        at com.carrotsearch.randomizedtesting.RandomizedRunner.runSuite(RandomizedRunner.java:605)
        at com.carrotsearch.randomizedtesting.RandomizedRunner.access$400(RandomizedRunner.java:132)
        at com.carrotsearch.randomizedtesting.RandomizedRunner$2.run(RandomizedRunner.java:551)
Caused by: java.net.SocketTimeoutException: Read timed out
        at java.net.SocketInputStream.socketRead0(Native Method)
        at java.net.SocketInputStream.read(SocketInputStream.java:129)
        at java.io.BufferedInputStream.fill(BufferedInputStream.java:218)
        at java.io.BufferedInputStream.read1(BufferedInputStream.java:258)
        at java.io.BufferedInputStream.read(BufferedInputStream.java:317)
        at sun.net.www.http.HttpClient.parseHTTPHeader(HttpClient.java:690)
        at sun.net.www.http.HttpClient.parseHTTP(HttpClient.java:633)
        at sun.net.www.protocol.http.HttpURLConnection.getInputStream(HttpURLConnection.java:1195)
        at sun.net.www.protocol.http.HttpURLConnection.getHeaderField(HttpURLConnection.java:2300)
        at java.net.URLConnection.getContentType(URLConnection.java:485)
        at org.apache.solr.common.util.ContentStreamBase$URLStream.getStream(ContentStreamBase.java:82)
        ... 39 more




Build Log:
[...truncated 6607 lines...]
[junit4:junit4] Suite: org.apache.solr.servlet.SolrRequestParserTest
[junit4:junit4]    > (@BeforeClass output)
[junit4:junit4]   2> 0 T1428 oas.SolrTestCaseJ4.initCore ####initCore
[junit4:junit4]   2> Creating dataDir: C:\Jenkins\workspace\Lucene-Solr-4.x-Windows\solr\build\solr-core\test\J0\.\solrtest-SolrRequestParserTest-1344383307128
[junit4:junit4]   2> 1 T1428 oasc.SolrResourceLoader.<init> new SolrResourceLoader for directory: 'C:\Jenkins\workspace\Lucene-Solr-4.x-Windows\solr\build\solr-core\test-files\solr\collection1\'
[junit4:junit4]   2> 2 T1428 oasc.SolrResourceLoader.replaceClassLoader Adding 'file:/C:/Jenkins/workspace/Lucene-Solr-4.x-Windows/solr/build/solr-core/test-files/solr/collection1/lib/classes/' to classloader
[junit4:junit4]   2> 2 T1428 oasc.SolrResourceLoader.replaceClassLoader Adding 'file:/C:/Jenkins/workspace/Lucene-Solr-4.x-Windows/solr/build/solr-core/test-files/solr/collection1/lib/README' to classloader
[junit4:junit4]   2> 47 T1428 oasc.SolrConfig.<init> Using Lucene MatchVersion: LUCENE_40
[junit4:junit4]   2> 140 T1428 oasc.SolrConfig.<init> Loaded SolrConfig: solrconfig.xml
[junit4:junit4]   2> 141 T1428 oass.IndexSchema.readSchema Reading Solr Schema
[junit4:junit4]   2> 147 T1428 oass.IndexSchema.readSchema Schema name=test
[junit4:junit4]   2> 942 T1428 oass.OpenExchangeRatesOrgProvider.init Initialized with rates=open-exchange-rates.json, refreshInterval=1440.
[junit4:junit4]   2> 950 T1428 oass.IndexSchema.readSchema default search field in schema is text
[junit4:junit4]   2> 955 T1428 oass.IndexSchema.readSchema unique key field: id
[junit4:junit4]   2> 960 T1428 oass.FileExchangeRateProvider.reload Reloading exchange rates from file currency.xml
[junit4:junit4]   2> 964 T1428 oass.FileExchangeRateProvider.reload Reloading exchange rates from file currency.xml
[junit4:junit4]   2> 966 T1428 oass.OpenExchangeRatesOrgProvider.reload Reloading exchange rates from open-exchange-rates.json
[junit4:junit4]   2> 967 T1428 oass.OpenExchangeRatesOrgProvider.reload Reloading exchange rates from open-exchange-rates.json
[junit4:junit4]   2> 968 T1428 oasc.SolrResourceLoader.locateSolrHome JNDI not configured for solr (NoInitialContextEx)
[junit4:junit4]   2> 968 T1428 oasc.SolrResourceLoader.locateSolrHome using system property solr.solr.home: C:\Jenkins\workspace\Lucene-Solr-4.x-Windows\solr\build\solr-core\test-files\solr
[junit4:junit4]   2> 968 T1428 oasc.SolrResourceLoader.<init> new SolrResourceLoader for directory: 'C:\Jenkins\workspace\Lucene-Solr-4.x-Windows\solr\build\solr-core\test-files\solr\'
[junit4:junit4]   2> 977 T1428 oasc.CoreContainer.<init> New CoreContainer 31415777
[junit4:junit4]   2> 977 T1428 oasc.SolrCore.<init> [collection1] Opening new SolrCore at C:\Jenkins\workspace\Lucene-Solr-4.x-Windows\solr\build\solr-core\test-files\solr\collection1\, dataDir=C:\Jenkins\workspace\Lucene-Solr-4.x-Windows\solr\build\solr-core\test\J0\.\solrtest-SolrRequestParserTest-1344383307128\
[junit4:junit4]   2> 977 T1428 oasc.JmxMonitoredMap.<init> JMX monitoring is enabled. Adding Solr mbeans to JMX Server: com.sun.jmx.mbeanserver.JmxMBeanServer@4310d0
[junit4:junit4]   2> 979 T1428 oasc.SolrCore.getNewIndexDir WARNING New index directory detected: old=null new=C:\Jenkins\workspace\Lucene-Solr-4.x-Windows\solr\build\solr-core\test\J0\.\solrtest-SolrRequestParserTest-1344383307128\index/
[junit4:junit4]   2> 979 T1428 oasc.SolrCore.initIndex WARNING [collection1] Solr index directory 'C:\Jenkins\workspace\Lucene-Solr-4.x-Windows\solr\build\solr-core\test\J0\.\solrtest-SolrRequestParserTest-1344383307128\index' doesn't exist. Creating new index...
[junit4:junit4]   2> 980 T1428 oasc.SolrDeletionPolicy.onCommit SolrDeletionPolicy.onCommit: commits:num=1
[junit4:junit4]   2> commit{dir=MockDirWrapper(org.apache.lucene.store.RAMDirectory@1edff89 lockFactory=org.apache.lucene.store.SingleInstanceLockFactory@839f78),segFN=segments_1,generation=1,filenames=[segments_1]
[junit4:junit4]   2> 980 T1428 oasc.SolrDeletionPolicy.updateCommits newest commit = 1
[junit4:junit4]   2> 980 T1428 oasc.SolrCore.initWriters created xml: solr.XMLResponseWriter
[junit4:junit4]   2> 981 T1428 oasup.UpdateRequestProcessorChain.init inserting DistributedUpdateProcessorFactory into updateRequestProcessorChain "dedupe"
[junit4:junit4]   2> 981 T1428 oasup.UpdateRequestProcessorChain.init inserting DistributedUpdateProcessorFactory into updateRequestProcessorChain "dedupe-allfields"
[junit4:junit4]   2> 982 T1428 oasup.UpdateRequestProcessorChain.init inserting DistributedUpdateProcessorFactory into updateRequestProcessorChain "stored_sig"
[junit4:junit4]   2> 983 T1428 oasup.UpdateRequestProcessorChain.init inserting DistributedUpdateProcessorFactory into updateRequestProcessorChain "uniq-fields"
[junit4:junit4]   2> 983 T1428 oasup.UpdateRequestProcessorChain.init inserting DistributedUpdateProcessorFactory into updateRequestProcessorChain "distrib-dup-test-chain-implicit"
[junit4:junit4]   2> 983 T1428 oasc.RequestHandlers.initHandlersFromConfig adding lazy requestHandler: solr.ReplicationHandler
[junit4:junit4]   2> 983 T1428 oasc.RequestHandlers.initHandlersFromConfig created /replication: solr.ReplicationHandler
[junit4:junit4]   2> 984 T1428 oasc.RequestHandlers.initHandlersFromConfig created standard: solr.StandardRequestHandler
[junit4:junit4]   2> 984 T1428 oasc.RequestHandlers.initHandlersFromConfig created /get: solr.RealTimeGetHandler
[junit4:junit4]   2> 984 T1428 oasc.RequestHandlers.initHandlersFromConfig created dismax: solr.SearchHandler
[junit4:junit4]   2> 984 T1428 oasc.RequestHandlers.initHandlersFromConfig created mock: org.apache.solr.core.MockQuerySenderListenerReqHandler
[junit4:junit4]   2> 985 T1428 oasc.RequestHandlers.initHandlersFromConfig created /admin/: org.apache.solr.handler.admin.AdminHandlers
[junit4:junit4]   2> 985 T1428 oasc.RequestHandlers.initHandlersFromConfig created defaults: solr.StandardRequestHandler
[junit4:junit4]   2> 985 T1428 oasc.RequestHandlers.initHandlersFromConfig adding lazy requestHandler: solr.StandardRequestHandler
[junit4:junit4]   2> 985 T1428 oasc.RequestHandlers.initHandlersFromConfig created lazy: solr.StandardRequestHandler
[junit4:junit4]   2> 985 T1428 oasc.RequestHandlers.initHandlersFromConfig created /update: solr.UpdateRequestHandler
[junit4:junit4]   2> 985 T1428 oasc.RequestHandlers.initHandlersFromConfig created /terms: org.apache.solr.handler.component.SearchHandler
[junit4:junit4]   2> 985 T1428 oasc.RequestHandlers.initHandlersFromConfig created spellCheckCompRH: org.apache.solr.handler.component.SearchHandler
[junit4:junit4]   2> 985 T1428 oasc.RequestHandlers.initHandlersFromConfig created spellCheckCompRH_Direct: org.apache.solr.handler.component.SearchHandler
[junit4:junit4]   2> 986 T1428 oasc.RequestHandlers.initHandlersFromConfig created spellCheckWithWordbreak: org.apache.solr.handler.component.SearchHandler
[junit4:junit4]   2> 986 T1428 oasc.RequestHandlers.initHandlersFromConfig created spellCheckWithWordbreak_Direct: org.apache.solr.handler.component.SearchHandler
[junit4:junit4]   2> 986 T1428 oasc.RequestHandlers.initHandlersFromConfig created spellCheckCompRH1: org.apache.solr.handler.component.SearchHandler
[junit4:junit4]   2> 987 T1428 oasc.RequestHandlers.initHandlersFromConfig created tvrh: org.apache.solr.handler.component.SearchHandler
[junit4:junit4]   2> 987 T1428 oasc.RequestHandlers.initHandlersFromConfig created /mlt: solr.MoreLikeThisHandler
[junit4:junit4]   2> 988 T1428 oasc.RequestHandlers.initHandlersFromConfig created /debug/dump: solr.DumpRequestHandler
[junit4:junit4]   2> 988 T1428 oashl.XMLLoader.init xsltCacheLifetimeSeconds=60
[junit4:junit4]   2> 990 T1428 oasc.SolrCore.initDeprecatedSupport WARNING solrconfig.xml uses deprecated <admin/gettableFiles>, Please update your config to use the ShowFileRequestHandler.
[junit4:junit4]   2> 993 T1428 oasc.SolrCore.initDeprecatedSupport WARNING adding ShowFileRequestHandler with hidden files: [THROW.ERROR.ON.ADD.UPDATEPROCESSOR.JS, SOLRCONFIG-HIGHLIGHT.XML, SCHEMA-REQUIRED-FIELDS.XML, TRIVIAL.UPDATEPROCESSOR1.JS, BAD-SCHEMA-DUP-DYNAMICFIELD.XML, SCHEMA-MINIMAL.XML, SCHEMA-REPLICATION2.XML, SOLRCONFIG-CACHING.XML, SOLRCONFIG-REPEATER.XML, BAD-SCHEMA-NONTEXT-ANALYZER.XML, CURRENCY.XML, SOLRCONFIG-MERGEPOLICY.XML, SOLRCONFIG-TLOG.XML, SOLRCONFIG-MASTER.XML, BAD-SCHEMA-UNIQUEKEY-MULTIVALUED.XML, SCHEMA11.XML, SOLRCONFIG-BASIC.XML, DA_COMPOUNDDICTIONARY.TXT, MISSLEADING.EXTENSION.UPDATEPROCESSOR.JS.TXT, SCHEMA-COPYFIELD-TEST.XML, SOLRCONFIG-SLAVE.XML, ELEVATE.XML, SOLRCONFIG-PROPINJECT-INDEXDEFAULT.XML, TRIVIAL.UPDATEPROCESSOR0.JS, BAD-SOLRCONFIG-BOGUS-SCRIPTENGINE-NAME.XML, SCHEMA-IB.XML, SCHEMA-CHARFILTERS.XML, SOLRCONFIG-QUERYSENDER.XML, DA_UTF8.XML, SCHEMA-REPLICATION1.XML, CONDITIONAL.UPDATEPROCESSOR.JS, MISSING.FUNCTIONS.UPDATEPROCESSOR.JS, HYPHENATION.DTD, SOLRCONFIG-ENABLEPLUGIN.XML, STEMDICT.TXT, SCHEMA-PHRASESUGGEST.XML, HUNSPELL-TEST.AFF, STOPTYPES-1.TXT, STOPWORDSWRONGENCODING.TXT, SCHEMA-NUMERIC.XML, SOLRCONFIG-TRANSFORMERS.XML, SOLRCONFIG-PROPINJECT.XML, BAD-SCHEMA-NOT-INDEXED-BUT-TF.XML, SOLRCONFIG-SIMPLELOCK.XML, WDFTYPES.TXT, STOPTYPES-2.TXT, SCHEMA-REVERSED.XML, SOLRCONFIG-SPELLCHECKCOMPONENT.XML, SCHEMA-DFR.XML, SOLRCONFIG-PHRASESUGGEST.XML, BAD-SCHEMA-NOT-INDEXED-BUT-POS.XML, KEEP-1.TXT, OPEN-EXCHANGE-RATES.JSON, STOPWITHBOM.TXT, SOLRCONFIG-SPELLCHECKER.XML, SCHEMA-BINARYFIELD.XML, SOLRCONFIG-UPDATE-PROCESSOR-CHAINS.XML, BAD-SCHEMA-OMIT-TF-BUT-NOT-POS.XML, BAD-SCHEMA-DUP-FIELDTYPE.XML, SOLRCONFIG-MASTER1.XML, SYNONYMS.TXT, SCHEMA.XML, SCHEMA_CODEC.XML, SOLRCONFIG-SOLR-749.XML, SOLRCONFIG-MASTER1-KEEPONEBACKUP.XML, STOP-2.TXT, SOLRCONFIG-FUNCTIONQUERY.XML, SOLRCONFIG-TERMINDEX.XML, SCHEMA-LMDIRICHLET.XML, SOLRCONFIG-ELEVATE.XML, STOPWORDS.TXT, SCHEMA-FOLDING.XML, SCHEMA-STOP-KEEP.XML, BAD-SCHEMA-NOT-INDEXED-BUT-NORMS.XML, SOLRCONFIG-SOLCOREPROPERTIES.XML, STOP-1.TXT, SOLRCONFIG-MASTER2.XML, SCHEMA-SPELLCHECKER.XML, SOLRCONFIG-LAZYWRITER.XML, SCHEMA-LUCENEMATCHVERSION.XML, FRENCHARTICLES.TXT, BAD-MP-SOLRCONFIG.XML, SCHEMA15.XML, SOLRCONFIG-REQHANDLER.INCL, SCHEMASURROUND.XML, SCHEMA-COLLATEFILTER.XML, SOLRCONFIG-MASTER3.XML, HUNSPELL-TEST.DIC, SOLRCONFIG-XINCLUDE.XML, BAD-SCHEMA-CODEC-GLOBAL-VS-FT-MISMATCH.XML, SOLRCONFIG-SLAVE1.XML, SOLRCONFIG-DELPOLICY1.XML, SCHEMA-SIM.XML, SCHEMA-COLLATE.XML, STOP-SNOWBALL.TXT, BAD-SCHEMA-SIM-GLOBAL-VS-FT-MISMATCH.XML, PROTWORDS.TXT, SCHEMA-TRIE.XML, SOLRCONFIG_CODEC.XML, BAD-SOLRCONFIG-INVALID-SCRIPTFILE.XML, SCHEMA-TFIDF.XML, SOLRCONFIG-SCRIPT-UPDATEPROCESSOR.XML, SCHEMA-LMJELINEKMERCER.XML, PHRASESUGGEST.TXT, BAD-SOLRCONFIG-MISSING-SCRIPTFILE.XML, SOLRCONFIG-BASIC-LUCENEVERSION31.XML, BAD-SCHEMA-UNIQUEKEY-USES-DEFAULT.XML, OLD_SYNONYMS.TXT, SOLRCONFIG-DELPOLICY2.XML, XSLT, SOLRCONFIG-NATIVELOCK.XML, BAD-SCHEMA-DUP-FIELD.XML, SOLRCONFIG-NOCACHE.XML, SCHEMA-BM25.XML, ADDFIELDS.UPDATEPROCESSOR.JS, SOLRCONFIG-ALTDIRECTORY.XML, SOLRCONFIG-QUERYSENDER-NOQUERY.XML, COMPOUNDDICTIONARY.TXT, SOLRCONFIG_PERF.XML, BAD-SCHEMA-ANALYZER-CLASS-AND-NESTED.XML, SCHEMA-NOT-REQUIRED-UNIQUE-KEY.XML, KEEP-2.TXT, BAD-SCHEMA-UNIQUEKEY-IS-COPYFIELD-DEST.XML, SCHEMA12.XML, MAPPING-ISOLATIN1ACCENT.TXT, BAD_SOLRCONFIG.XML, BAD-SCHEMA-EXTERNAL-FILEFIELD.XML]
[junit4:junit4]   2> 996 T1428 oass.SolrIndexSearcher.<init> Opening Searcher@742ffc main
[junit4:junit4]   2> 996 T1428 oass.SolrIndexSearcher.getIndexDir WARNING WARNING: Directory impl does not support setting indexDir: org.apache.lucene.store.MockDirectoryWrapper
[junit4:junit4]   2> 996 T1428 oasu.CommitTracker.<init> Hard AutoCommit: disabled
[junit4:junit4]   2> 996 T1428 oasu.CommitTracker.<init> Soft AutoCommit: disabled
[junit4:junit4]   2> 997 T1428 oashc.SpellCheckComponent.inform Initializing spell checkers
[junit4:junit4]   2> 1004 T1428 oass.DirectSolrSpellChecker.init init: {name=direct,classname=DirectSolrSpellChecker,field=lowerfilt,minQueryLength=3}
[junit4:junit4]   2> 1042 T1428 oashc.HttpShardHandlerFactory.getParameter Setting socketTimeout to: 0
[junit4:junit4]   2> 1043 T1428 oashc.HttpShardHandlerFactory.getParameter Setting urlScheme to: http://
[junit4:junit4]   2> 1043 T1428 oashc.HttpShardHandlerFactory.getParameter Setting connTimeout to: 0
[junit4:junit4]   2> 1043 T1428 oashc.HttpShardHandlerFactory.getParameter Setting maxConnectionsPerHost to: 20
[junit4:junit4]   2> 1043 T1428 oashc.HttpShardHandlerFactory.getParameter Setting corePoolSize to: 0
[junit4:junit4]   2> 1043 T1428 oashc.HttpShardHandlerFactory.getParameter Setting maximumPoolSize to: 2147483647
[junit4:junit4]   2> 1043 T1428 oashc.HttpShardHandlerFactory.getParameter Setting maxThreadIdleTime to: 5
[junit4:junit4]   2> 1043 T1428 oashc.HttpShardHandlerFactory.getParameter Setting sizeOfQueue to: -1
[junit4:junit4]   2> 1044 T1428 oashc.HttpShardHandlerFactory.getParameter Setting fairnessPolicy to: false
[junit4:junit4]   2> 1044 T1428 oascsi.HttpClientUtil.createClient Creating new http client, config:maxConnectionsPerHost=20&maxConnections=10000&socketTimeout=0&connTimeout=0&retry=false
[junit4:junit4]   2> 1052 T1429 oasc.SolrCore.registerSearcher [collection1] Registered new searcher Searcher@742ffc main{StandardDirectoryReader(segments_1:1)}
[junit4:junit4]   2> 1053 T1428 oasc.CoreContainer.register registering core: collection1
[junit4:junit4]   2> 1054 T1428 oas.SolrTestCaseJ4.initCore ####initCore end
[junit4:junit4]   2>
[junit4:junit4] ERROR   9.45s | SolrRequestParserTest.testStreamURL
[junit4:junit4]    > Throwable #1: java.net.SocketTimeoutException: Read timed out
[junit4:junit4]    > at __randomizedtesting.SeedInfo.seed([DE02E95B46EE9A76:8737D74832CC5743]:0)
[junit4:junit4]    > at sun.reflect.NativeConstructorAccessorImpl.newInstance0(Native Method)
[junit4:junit4]    > at sun.reflect.NativeConstructorAccessorImpl.newInstance(NativeConstructorAccessorImpl.java:39)
[junit4:junit4]    > at sun.reflect.DelegatingConstructorAccessorImpl.newInstance(DelegatingConstructorAccessorImpl.java:27)
[junit4:junit4]    > at java.lang.reflect.Constructor.newInstance(Constructor.java:513)
[junit4:junit4]    > at sun.net.www.protocol.http.HttpURLConnection$6.run(HttpURLConnection.java:1491)
[junit4:junit4]    > at java.security.AccessController.doPrivileged(Native Method)
[junit4:junit4]    > at sun.net.www.protocol.http.HttpURLConnection.getChainedException(HttpURLConnection.java:1485)
[junit4:junit4]    > at sun.net.www.protocol.http.HttpURLConnection.getInputStream(HttpURLConnection.java:1139)
[junit4:junit4]    > at org.apache.solr.common.util.ContentStreamBase$URLStream.getStream(ContentStreamBase.java:85)
[junit4:junit4]    > at org.apache.solr.servlet.SolrRequestParserTest.testStreamURL(SolrRequestParserTest.java:137)
[junit4:junit4]    > at sun.reflect.NativeMethodAccessorImpl.invoke0(Native Method)
[junit4:junit4]    > at sun.reflect.NativeMethodAccessorImpl.invoke(NativeMethodAccessorImpl.java:39)
[junit4:junit4]    > at sun.reflect.DelegatingMethodAccessorImpl.invoke(DelegatingMethodAccessorImpl.java:25)
[junit4:junit4]    > at java.lang.reflect.Method.invoke(Method.java:597)
[junit4:junit4]    > at com.carrotsearch.randomizedtesting.RandomizedRunner.invoke(RandomizedRunner.java:1995)
[junit4:junit4]    > at com.carrotsearch.randomizedtesting.RandomizedRunner.access$1100(RandomizedRunner.java:132)
[junit4:junit4]    > at com.carrotsearch.randomizedtesting.RandomizedRunner$6.evaluate(RandomizedRunner.java:818)
[junit4:junit4]    > at com.carrotsearch.randomizedtesting.RandomizedRunner$7.evaluate(RandomizedRunner.java:877)
[junit4:junit4]    > at com.carrotsearch.randomizedtesting.RandomizedRunner$8.evaluate(RandomizedRunner.java:891)
[junit4:junit4]    > at com.carrotsearch.randomizedtesting.rules.SystemPropertiesRestoreRule$1.evaluate(SystemPropertiesRestoreRule.java:53)
[junit4:junit4]    > at org.apache.lucene.util.TestRuleSetupTeardownChained$1.evaluate(TestRuleSetupTeardownChained.java:50)
[junit4:junit4]    > at org.apache.lucene.util.TestRuleFieldCacheSanity$1.evaluate(TestRuleFieldCacheSanity.java:32)
[junit4:junit4]    > at org.apache.lucene.util.AbstractBeforeAfterRule$1.evaluate(AbstractBeforeAfterRule.java:45)
[junit4:junit4]    > at com.carrotsearch.randomizedtesting.rules.SystemPropertiesInvariantRule$1.evaluate(SystemPropertiesInvariantRule.java:55)
[junit4:junit4]    > at org.apache.lucene.util.TestRuleReportUncaughtExceptions$1.evaluate(TestRuleReportUncaughtExceptions.java:68)
[junit4:junit4]    > at org.apache.lucene.util.TestRuleThreadAndTestName$1.evaluate(TestRuleThreadAndTestName.java:48)
[junit4:junit4]    > at org.apache.lucene.util.TestRuleIgnoreAfterMaxFailures$1.evaluate(TestRuleIgnoreAfterMaxFailures.java:70)
[junit4:junit4]    > at org.apache.lucene.util.TestRuleMarkFailure$1.evaluate(TestRuleMarkFailure.java:48)
[junit4:junit4]    > at com.carrotsearch.randomizedtesting.RandomizedRunner.runSingleTest(RandomizedRunner.java:825)
[junit4:junit4]    > at com.carrotsearch.randomizedtesting.RandomizedRunner.access$700(RandomizedRunner.java:132)
[junit4:junit4]    > at com.carrotsearch.randomizedtesting.RandomizedRunner$3$1.run(RandomizedRunner.java:671)
[junit4:junit4]    > at com.carrotsearch.randomizedtesting.RandomizedRunner$3.evaluate(RandomizedRunner.java:697)
[junit4:junit4]    > at com.carrotsearch.randomizedtesting.RandomizedRunner$4.evaluate(RandomizedRunner.java:736)
[junit4:junit4]    > at com.carrotsearch.randomizedtesting.RandomizedRunner$5.evaluate(RandomizedRunner.java:747)
[junit4:junit4]    > at com.carrotsearch.randomizedtesting.rules.SystemPropertiesRestoreRule$1.evaluate(SystemPropertiesRestoreRule.java:53)
[junit4:junit4]    > at org.apache.lucene.util.AbstractBeforeAfterRule$1.evaluate(AbstractBeforeAfterRule.java:45)
[junit4:junit4]    > at org.apache.lucene.util.TestRuleReportUncaughtExceptions$1.evaluate(TestRuleReportUncaughtExceptions.java:68)
[junit4:junit4]    > at org.apache.lucene.util.TestRuleStoreClassName$1.evaluate(TestRuleStoreClassName.java:38)
[junit4:junit4]    > at com.carrotsearch.randomizedtesting.rules.SystemPropertiesInvariantRule$1.evaluate(SystemPropertiesInvariantRule.java:55)
[junit4:junit4]    > at org.apache.lucene.util.TestRuleNoInstanceHooksOverrides$1.evaluate(TestRuleNoInstanceHooksOverrides.java:53)
[junit4:junit4]    > at org.apache.lucene.util.TestRuleNoStaticHooksShadowing$1.evaluate(TestRuleNoStaticHooksShadowing.java:52)
[junit4:junit4]    > at org.apache.lucene.util.TestRuleAssertionsRequired$1.evaluate(TestRuleAssertionsRequired.java:36)
[junit4:junit4]    > at org.apache.lucene.util.TestRuleMarkFailure$1.evaluate(TestRuleMarkFailure.java:48)
[junit4:junit4]    > at org.apache.lucene.util.TestRuleIgnoreAfterMaxFailures$1.evaluate(TestRuleIgnoreAfterMaxFailures.java:70)
[junit4:junit4]    > at org.apache.lucene.util.TestRuleIgnoreTestSuites$1.evaluate(TestRuleIgnoreTestSuites.java:55)
[junit4:junit4]    > at com.carrotsearch.randomizedtesting.RandomizedRunner.runSuite(RandomizedRunner.java:605)
[junit4:junit4]    > at com.carrotsearch.randomizedtesting.RandomizedRunner.access$400(RandomizedRunner.java:132)
[junit4:junit4]    > at com.carrotsearch.randomizedtesting.RandomizedRunner$2.run(RandomizedRunner.java:551)
[junit4:junit4]    > Caused by: java.net.SocketTimeoutException: Read timed out
[junit4:junit4]    > at java.net.SocketInputStream.socketRead0(Native Method)
[junit4:junit4]    > at java.net.SocketInputStream.read(SocketInputStream.java:129)
[junit4:junit4]    > at java.io.BufferedInputStream.fill(BufferedInputStream.java:218)
[junit4:junit4]    > at java.io.BufferedInputStream.read1(BufferedInputStream.java:258)
[junit4:junit4]    > at java.io.BufferedInputStream.read(BufferedInputStream.java:317)
[junit4:junit4]    > at sun.net.www.http.HttpClient.parseHTTPHeader(HttpClient.java:690)
[junit4:junit4]    > at sun.net.www.http.HttpClient.parseHTTP(HttpClient.java:633)
[junit4:junit4]    > at sun.net.www.protocol.http.HttpURLConnection.getInputStream(HttpURLConnection.java:1195)
[junit4:junit4]    > at sun.net.www.protocol.http.HttpURLConnection.getHeaderField(HttpURLConnection.java:2300)
[junit4:junit4]    > at java.net.URLConnection.getContentType(URLConnection.java:485)
[junit4:junit4]    > at org.apache.solr.common.util.ContentStreamBase$URLStream.getStream(ContentStreamBase.java:82)
[junit4:junit4]    > ... 39 more
[junit4:junit4]    >
[junit4:junit4]   2> 1070 T1428 oas.SolrTestCaseJ4.setUp ###Starting testStreamURL
[junit4:junit4]   2> 10472 T1428 oas.SolrTestCaseJ4.tearDown ###Ending testStreamURL
[junit4:junit4]   2> NOTE: reproduce with: ant test  -Dtestcase=SolrRequestParserTest -Dtests.method=testStreamURL -Dtests.seed=DE02E95B46EE9A76 -Dtests.slow=true -Dtests.locale=en_GB -Dtests.timezone=Brazil/DeNoronha -Dtests.file.encoding=UTF-8
[junit4:junit4]   2>
[junit4:junit4]    > (@AfterClass output)
[junit4:junit4]   2> 10606 T1428 oas.SolrTestCaseJ4.deleteCore ###deleteCore
[junit4:junit4]   2> 10606 T1428 oasc.CoreContainer.shutdown Shutting down CoreContainer instance=31415777
[junit4:junit4]   2> 10607 T1428 oasc.SolrCore.close [collection1]  CLOSING SolrCore org.apache.solr.core.SolrCore@18c8ad2
[junit4:junit4]   2> 10610 T1428 oasc.SolrCore.closeSearcher [collection1] Closing main searcher on request.
[junit4:junit4]   2> 10610 T1428 oasu.DirectUpdateHandler2.close closing DirectUpdateHandler2{commits=0,autocommits=0,soft autocommits=0,optimizes=0,rollbacks=0,expungeDeletes=0,docsPending=0,adds=0,deletesById=0,deletesByQuery=0,errors=0,cumulative_adds=0,cumulative_deletesById=0,cumulative_deletesByQuery=0,cumulative_errors=0}
[junit4:junit4]   2> NOTE: test params are: codec=Lucene40: {}, sim=RandomSimilarityProvider(queryNorm=true,coord=false): {}, locale=en_GB, timezone=Brazil/DeNoronha
[junit4:junit4]   2> NOTE: Windows 7 6.1 x86/Sun Microsystems Inc. 1.6.0_33 (32-bit)/cpus=2,threads=1,free=65740584,total=156041216
[junit4:junit4]   2> NOTE: All tests run in this JVM: [MBeansHandlerTest, RAMDirectoryFactoryTest, SolrInfoMBeanTest, TestStressRecovery, MultiTermTest, ZkNodePropsTest, TestSolrDeletionPolicy1, ZkCLITest, TestWordDelimiterFilterFactory, IndexSchemaTest, TestDocumentBuilder, SortByFunctionTest, FieldMutatingUpdateProcessorTest, StatsComponentTest, SpellingQueryConverterTest, SimpleFacetsTest, TestXIncludeConfig, DOMUtilTest, SolrCoreTest, TestQueryUtils, SpellPossibilityIteratorTest, SuggesterTest, TestMergePolicyConfig, DocumentAnalysisRequestHandlerTest, TestRecovery, PingRequestHandlerTest, OverseerTest, XmlUpdateRequestHandlerTest, TestJmxIntegration, DebugComponentTest, HighlighterConfigTest, CoreContainerCoreInitFailuresTest, TestFunctionQuery, TestSuggestSpellingConverter, LukeRequestHandlerTest, CopyFieldTest, MinimalSchemaTest, TestFaceting, QueryParsingTest, BadIndexSchemaTest, TestCollationField, TestLFUCache, DistanceFunctionTest, TestCodecSupport, LeaderElectionIntegrationTest, TestQueryTypes, TestCSVLoader, TestStressVersions, TestRangeQuery, LeaderElectionTest, DistributedTermsComponentTest, BasicZkTest, TestDFRSimilarityFactory, SuggesterFSTTest, DirectSolrConnectionTest, HighlighterTest, TestReload, TestUpdate, ClusterStateUpdateTest, StandardRequestHandlerTest, SolrPluginUtilsTest, AutoCommitTest, DirectUpdateHandlerTest, DistributedSpellCheckComponentTest, TestRealTimeGet, TestReversedWildcardFilterFactory, FullSolrCloudDistribCmdsTest, StatelessScriptUpdateProcessorFactoryTest, SystemInfoHandlerTest, PolyFieldTest, SolrCmdDistributorTest, SearchHandlerTest, PrimUtilsTest, TestNumberUtils, TestLRUCache, ZkSolrClientTest, SolrCoreCheckLockOnStartupTest, UpdateRequestProcessorFactoryTest, TestQuerySenderNoQuery, SolrRequestParserTest]
[junit4:junit4]   2>
[junit4:junit4] Completed in 10.63s, 4 tests, 1 error <<< FAILURES!

[...truncated 677 lines...]
BUILD FAILED
C:\Jenkins\workspace\Lucene-Solr-4.x-Windows\build.xml:29: The following error occurred while executing this line:
C:\Jenkins\workspace\Lucene-Solr-4.x-Windows\solr\build.xml:144: The following error occurred while executing this line:
C:\Jenkins\workspace\Lucene-Solr-4.x-Windows\lucene\module-build.xml:62: The following error occurred while executing this line:
C:\Jenkins\workspace\Lucene-Solr-4.x-Windows\lucene\common-build.xml:1095: The following error occurred while executing this line:
C:\Jenkins\workspace\Lucene-Solr-4.x-Windows\lucene\common-build.xml:790: There were test failures: 224 suites, 904 tests, 1 error, 11 ignored (6 assumptions)

Total time: 37 minutes 48 seconds
Build step 'Invoke Ant' marked build as failure
Recording test results
Email was triggered for: Failure
Sending email for trigger: Failure




---------------------------------------------------------------------
To unsubscribe, e-mail: [hidden email]
For additional commands, e-mail: [hidden email]