[JENKINS] Lucene-Solr-6.x-Linux (64bit/jdk1.8.0_121) - Build # 3104 - Unstable!

Previous Topic Next Topic
 
classic Classic list List threaded Threaded
1 message Options
Reply | Threaded
Open this post in threaded view
|

[JENKINS] Lucene-Solr-6.x-Linux (64bit/jdk1.8.0_121) - Build # 3104 - Unstable!

Policeman Jenkins Server-2
Build: https://jenkins.thetaphi.de/job/Lucene-Solr-6.x-Linux/3104/
Java: 64bit/jdk1.8.0_121 -XX:+UseCompressedOops -XX:+UseConcMarkSweepGC

1 tests failed.
FAILED:  org.apache.solr.handler.extraction.TestExtractionDateUtil.testParseDate

Error Message:
Incorrect parsed timestamp: 1226583351000 != 1226579751000 (Thu Nov 13 04:35:51 AKST 2008)

Stack Trace:
java.lang.AssertionError: Incorrect parsed timestamp: 1226583351000 != 1226579751000 (Thu Nov 13 04:35:51 AKST 2008)
        at __randomizedtesting.SeedInfo.seed([4D41425D224C011C:7583A6859E576A9]:0)
        at org.junit.Assert.fail(Assert.java:93)
        at org.junit.Assert.assertTrue(Assert.java:43)
        at org.apache.solr.handler.extraction.TestExtractionDateUtil.assertParsedDate(TestExtractionDateUtil.java:59)
        at org.apache.solr.handler.extraction.TestExtractionDateUtil.testParseDate(TestExtractionDateUtil.java:54)
        at sun.reflect.NativeMethodAccessorImpl.invoke0(Native Method)
        at sun.reflect.NativeMethodAccessorImpl.invoke(NativeMethodAccessorImpl.java:62)
        at sun.reflect.DelegatingMethodAccessorImpl.invoke(DelegatingMethodAccessorImpl.java:43)
        at java.lang.reflect.Method.invoke(Method.java:498)
        at com.carrotsearch.randomizedtesting.RandomizedRunner.invoke(RandomizedRunner.java:1713)
        at com.carrotsearch.randomizedtesting.RandomizedRunner$8.evaluate(RandomizedRunner.java:907)
        at com.carrotsearch.randomizedtesting.RandomizedRunner$9.evaluate(RandomizedRunner.java:943)
        at com.carrotsearch.randomizedtesting.RandomizedRunner$10.evaluate(RandomizedRunner.java:957)
        at org.apache.lucene.util.TestRuleSetupTeardownChained$1.evaluate(TestRuleSetupTeardownChained.java:49)
        at org.apache.lucene.util.AbstractBeforeAfterRule$1.evaluate(AbstractBeforeAfterRule.java:45)
        at org.apache.lucene.util.TestRuleThreadAndTestName$1.evaluate(TestRuleThreadAndTestName.java:48)
        at org.apache.lucene.util.TestRuleIgnoreAfterMaxFailures$1.evaluate(TestRuleIgnoreAfterMaxFailures.java:64)
        at org.apache.lucene.util.TestRuleMarkFailure$1.evaluate(TestRuleMarkFailure.java:47)
        at com.carrotsearch.randomizedtesting.rules.StatementAdapter.evaluate(StatementAdapter.java:36)
        at com.carrotsearch.randomizedtesting.ThreadLeakControl$StatementRunner.run(ThreadLeakControl.java:368)
        at com.carrotsearch.randomizedtesting.ThreadLeakControl.forkTimeoutingTask(ThreadLeakControl.java:817)
        at com.carrotsearch.randomizedtesting.ThreadLeakControl$3.evaluate(ThreadLeakControl.java:468)
        at com.carrotsearch.randomizedtesting.RandomizedRunner.runSingleTest(RandomizedRunner.java:916)
        at com.carrotsearch.randomizedtesting.RandomizedRunner$5.evaluate(RandomizedRunner.java:802)
        at com.carrotsearch.randomizedtesting.RandomizedRunner$6.evaluate(RandomizedRunner.java:852)
        at com.carrotsearch.randomizedtesting.RandomizedRunner$7.evaluate(RandomizedRunner.java:863)
        at org.apache.lucene.util.AbstractBeforeAfterRule$1.evaluate(AbstractBeforeAfterRule.java:45)
        at com.carrotsearch.randomizedtesting.rules.StatementAdapter.evaluate(StatementAdapter.java:36)
        at org.apache.lucene.util.TestRuleStoreClassName$1.evaluate(TestRuleStoreClassName.java:41)
        at com.carrotsearch.randomizedtesting.rules.NoShadowingOrOverridesOnMethodsRule$1.evaluate(NoShadowingOrOverridesOnMethodsRule.java:40)
        at com.carrotsearch.randomizedtesting.rules.NoShadowingOrOverridesOnMethodsRule$1.evaluate(NoShadowingOrOverridesOnMethodsRule.java:40)
        at com.carrotsearch.randomizedtesting.rules.StatementAdapter.evaluate(StatementAdapter.java:36)
        at com.carrotsearch.randomizedtesting.rules.StatementAdapter.evaluate(StatementAdapter.java:36)
        at com.carrotsearch.randomizedtesting.rules.StatementAdapter.evaluate(StatementAdapter.java:36)
        at org.apache.lucene.util.TestRuleAssertionsRequired$1.evaluate(TestRuleAssertionsRequired.java:53)
        at org.apache.lucene.util.TestRuleMarkFailure$1.evaluate(TestRuleMarkFailure.java:47)
        at org.apache.lucene.util.TestRuleIgnoreAfterMaxFailures$1.evaluate(TestRuleIgnoreAfterMaxFailures.java:64)
        at org.apache.lucene.util.TestRuleIgnoreTestSuites$1.evaluate(TestRuleIgnoreTestSuites.java:54)
        at com.carrotsearch.randomizedtesting.rules.StatementAdapter.evaluate(StatementAdapter.java:36)
        at com.carrotsearch.randomizedtesting.ThreadLeakControl$StatementRunner.run(ThreadLeakControl.java:368)
        at java.lang.Thread.run(Thread.java:745)




Build Log:
[...truncated 18476 lines...]
   [junit4] Suite: org.apache.solr.handler.extraction.TestExtractionDateUtil
   [junit4]   2> NOTE: reproduce with: ant test  -Dtestcase=TestExtractionDateUtil -Dtests.method=testParseDate -Dtests.seed=4D41425D224C011C -Dtests.multiplier=3 -Dtests.slow=true -Dtests.locale=es-MX -Dtests.timezone=America/Metlakatla -Dtests.asserts=true -Dtests.file.encoding=UTF-8
   [junit4] FAILURE 0.16s J1 | TestExtractionDateUtil.testParseDate <<<
   [junit4]    > Throwable #1: java.lang.AssertionError: Incorrect parsed timestamp: 1226583351000 != 1226579751000 (Thu Nov 13 04:35:51 AKST 2008)
   [junit4]    > at __randomizedtesting.SeedInfo.seed([4D41425D224C011C:7583A6859E576A9]:0)
   [junit4]    > at org.apache.solr.handler.extraction.TestExtractionDateUtil.assertParsedDate(TestExtractionDateUtil.java:59)
   [junit4]    > at org.apache.solr.handler.extraction.TestExtractionDateUtil.testParseDate(TestExtractionDateUtil.java:54)
   [junit4]    > at java.lang.Thread.run(Thread.java:745)
   [junit4]   2> NOTE: test params are: codec=Asserting(Lucene62): {}, docValues:{}, maxPointsInLeafNode=1527, maxMBSortInHeap=5.410818124554822, sim=RandomSimilarity(queryNorm=false,coord=yes): {}, locale=es-MX, timezone=America/Metlakatla
   [junit4]   2> NOTE: Linux 4.4.0-66-generic amd64/Oracle Corporation 1.8.0_121 (64-bit)/cpus=12,threads=1,free=396891080,total=508887040
   [junit4]   2> NOTE: All tests run in this JVM: [TestExtractionDateUtil]
   [junit4] Completed [1/4 (1!)] on J1 in 0.98s, 2 tests, 1 failure <<< FAILURES!

[...truncated 57443 lines...]



---------------------------------------------------------------------
To unsubscribe, e-mail: [hidden email]
For additional commands, e-mail: [hidden email]