[JENKINS] Lucene-Solr-6.x-Linux (64bit/jdk1.8.0_131) - Build # 3535 - Failure!

Previous Topic Next Topic
 
classic Classic list List threaded Threaded
2 messages Options
Reply | Threaded
Open this post in threaded view
|

[JENKINS] Lucene-Solr-6.x-Linux (64bit/jdk1.8.0_131) - Build # 3535 - Failure!

Policeman Jenkins Server-2
Build: https://jenkins.thetaphi.de/job/Lucene-Solr-6.x-Linux/3535/
Java: 64bit/jdk1.8.0_131 -XX:+UseCompressedOops -XX:+UseConcMarkSweepGC

All tests passed

Build Log:
[...truncated 20889 lines...]
-validate-source-patterns:
[source-patterns] tabs instead spaces: solr/solr-ref-guide/src/css/ref-guide.css
[source-patterns] tabs instead spaces: solr/solr-ref-guide/src/js/ref-guide-toc.js

BUILD FAILED
/home/jenkins/workspace/Lucene-Solr-6.x-Linux/build.xml:775: The following error occurred while executing this line:
/home/jenkins/workspace/Lucene-Solr-6.x-Linux/build.xml:130: Found 2 violations in source files (tabs instead spaces).

Total time: 56 minutes 0 seconds
Build step 'Invoke Ant' marked build as failure
Archiving artifacts
[WARNINGS] Skipping publisher since build result is FAILURE
Recording test results
Email was triggered for: Failure - Any
Sending email for trigger: Failure - Any


---------------------------------------------------------------------
To unsubscribe, e-mail: [hidden email]
For additional commands, e-mail: [hidden email]
Reply | Threaded
Open this post in threaded view
|

[JENKINS-EA] Lucene-Solr-6.x-Linux (64bit/jdk-9-ea+168) - Build # 3536 - Still Failing!

Policeman Jenkins Server-2
Build: https://jenkins.thetaphi.de/job/Lucene-Solr-6.x-Linux/3536/
Java: 64bit/jdk-9-ea+168 -XX:-UseCompressedOops -XX:+UseParallelGC

All tests passed

Build Log:
[...truncated 20789 lines...]
-validate-source-patterns:
[source-patterns] tabs instead spaces: solr/solr-ref-guide/src/css/ref-guide.css
[source-patterns] tabs instead spaces: solr/solr-ref-guide/src/js/ref-guide-toc.js

BUILD FAILED
/home/jenkins/workspace/Lucene-Solr-6.x-Linux/build.xml:775: The following error occurred while executing this line:
/home/jenkins/workspace/Lucene-Solr-6.x-Linux/build.xml:130: Found 2 violations in source files (tabs instead spaces).

Total time: 56 minutes 24 seconds
Build step 'Invoke Ant' marked build as failure
Archiving artifacts
[WARNINGS] Skipping publisher since build result is FAILURE
Recording test results
Email was triggered for: Failure - Any
Sending email for trigger: Failure - Any


---------------------------------------------------------------------
To unsubscribe, e-mail: [hidden email]
For additional commands, e-mail: [hidden email]