[JENKINS] Lucene-Solr-6.x-MacOSX (64bit/jdk1.8.0) - Build # 773 - Unstable!

Previous Topic Next Topic
 
classic Classic list List threaded Threaded
1 message Options
Reply | Threaded
Open this post in threaded view
|  
Report Content as Inappropriate

[JENKINS] Lucene-Solr-6.x-MacOSX (64bit/jdk1.8.0) - Build # 773 - Unstable!

Policeman Jenkins Server-2
Build: https://jenkins.thetaphi.de/job/Lucene-Solr-6.x-MacOSX/773/
Java: 64bit/jdk1.8.0 -XX:+UseCompressedOops -XX:+UseConcMarkSweepGC

1 tests failed.
FAILED:  org.apache.solr.cloud.ShardSplitTest.testSplitWithChaosMonkey

Error Message:
There are still nodes recoverying - waited for 330 seconds

Stack Trace:
java.lang.AssertionError: There are still nodes recoverying - waited for 330 seconds
        at __randomizedtesting.SeedInfo.seed([E4F22928E3181647:6FD5FAF9A21EBDC3]:0)
        at org.junit.Assert.fail(Assert.java:93)
        at org.apache.solr.cloud.AbstractDistribZkTestBase.waitForRecoveriesToFinish(AbstractDistribZkTestBase.java:187)
        at org.apache.solr.cloud.AbstractDistribZkTestBase.waitForRecoveriesToFinish(AbstractDistribZkTestBase.java:144)
        at org.apache.solr.cloud.AbstractDistribZkTestBase.waitForRecoveriesToFinish(AbstractDistribZkTestBase.java:139)
        at org.apache.solr.cloud.AbstractFullDistribZkTestBase.waitForRecoveriesToFinish(AbstractFullDistribZkTestBase.java:865)
        at org.apache.solr.cloud.ShardSplitTest.testSplitWithChaosMonkey(ShardSplitTest.java:437)
        at sun.reflect.NativeMethodAccessorImpl.invoke0(Native Method)
        at sun.reflect.NativeMethodAccessorImpl.invoke(NativeMethodAccessorImpl.java:62)
        at sun.reflect.DelegatingMethodAccessorImpl.invoke(DelegatingMethodAccessorImpl.java:43)
        at java.lang.reflect.Method.invoke(Method.java:498)
        at com.carrotsearch.randomizedtesting.RandomizedRunner.invoke(RandomizedRunner.java:1713)
        at com.carrotsearch.randomizedtesting.RandomizedRunner$8.evaluate(RandomizedRunner.java:907)
        at com.carrotsearch.randomizedtesting.RandomizedRunner$9.evaluate(RandomizedRunner.java:943)
        at com.carrotsearch.randomizedtesting.RandomizedRunner$10.evaluate(RandomizedRunner.java:957)
        at org.apache.solr.BaseDistributedSearchTestCase$ShardsRepeatRule$ShardsFixedStatement.callStatement(BaseDistributedSearchTestCase.java:992)
        at org.apache.solr.BaseDistributedSearchTestCase$ShardsRepeatRule$ShardsStatement.evaluate(BaseDistributedSearchTestCase.java:967)
        at com.carrotsearch.randomizedtesting.rules.SystemPropertiesRestoreRule$1.evaluate(SystemPropertiesRestoreRule.java:57)
        at org.apache.lucene.util.TestRuleSetupTeardownChained$1.evaluate(TestRuleSetupTeardownChained.java:49)
        at org.apache.lucene.util.AbstractBeforeAfterRule$1.evaluate(AbstractBeforeAfterRule.java:45)
        at org.apache.lucene.util.TestRuleThreadAndTestName$1.evaluate(TestRuleThreadAndTestName.java:48)
        at org.apache.lucene.util.TestRuleIgnoreAfterMaxFailures$1.evaluate(TestRuleIgnoreAfterMaxFailures.java:64)
        at org.apache.lucene.util.TestRuleMarkFailure$1.evaluate(TestRuleMarkFailure.java:47)
        at com.carrotsearch.randomizedtesting.rules.StatementAdapter.evaluate(StatementAdapter.java:36)
        at com.carrotsearch.randomizedtesting.ThreadLeakControl$StatementRunner.run(ThreadLeakControl.java:368)
        at com.carrotsearch.randomizedtesting.ThreadLeakControl.forkTimeoutingTask(ThreadLeakControl.java:817)
        at com.carrotsearch.randomizedtesting.ThreadLeakControl$3.evaluate(ThreadLeakControl.java:468)
        at com.carrotsearch.randomizedtesting.RandomizedRunner.runSingleTest(RandomizedRunner.java:916)
        at com.carrotsearch.randomizedtesting.RandomizedRunner$5.evaluate(RandomizedRunner.java:802)
        at com.carrotsearch.randomizedtesting.RandomizedRunner$6.evaluate(RandomizedRunner.java:852)
        at com.carrotsearch.randomizedtesting.RandomizedRunner$7.evaluate(RandomizedRunner.java:863)
        at com.carrotsearch.randomizedtesting.rules.StatementAdapter.evaluate(StatementAdapter.java:36)
        at com.carrotsearch.randomizedtesting.rules.SystemPropertiesRestoreRule$1.evaluate(SystemPropertiesRestoreRule.java:57)
        at org.apache.lucene.util.AbstractBeforeAfterRule$1.evaluate(AbstractBeforeAfterRule.java:45)
        at com.carrotsearch.randomizedtesting.rules.StatementAdapter.evaluate(StatementAdapter.java:36)
        at org.apache.lucene.util.TestRuleStoreClassName$1.evaluate(TestRuleStoreClassName.java:41)
        at com.carrotsearch.randomizedtesting.rules.NoShadowingOrOverridesOnMethodsRule$1.evaluate(NoShadowingOrOverridesOnMethodsRule.java:40)
        at com.carrotsearch.randomizedtesting.rules.NoShadowingOrOverridesOnMethodsRule$1.evaluate(NoShadowingOrOverridesOnMethodsRule.java:40)
        at com.carrotsearch.randomizedtesting.rules.StatementAdapter.evaluate(StatementAdapter.java:36)
        at com.carrotsearch.randomizedtesting.rules.StatementAdapter.evaluate(StatementAdapter.java:36)
        at com.carrotsearch.randomizedtesting.rules.StatementAdapter.evaluate(StatementAdapter.java:36)
        at org.apache.lucene.util.TestRuleAssertionsRequired$1.evaluate(TestRuleAssertionsRequired.java:53)
        at org.apache.lucene.util.TestRuleMarkFailure$1.evaluate(TestRuleMarkFailure.java:47)
        at org.apache.lucene.util.TestRuleIgnoreAfterMaxFailures$1.evaluate(TestRuleIgnoreAfterMaxFailures.java:64)
        at org.apache.lucene.util.TestRuleIgnoreTestSuites$1.evaluate(TestRuleIgnoreTestSuites.java:54)
        at com.carrotsearch.randomizedtesting.rules.StatementAdapter.evaluate(StatementAdapter.java:36)
        at com.carrotsearch.randomizedtesting.ThreadLeakControl$StatementRunner.run(ThreadLeakControl.java:368)
        at java.lang.Thread.run(Thread.java:745)




Build Log:
[...truncated 11436 lines...]
   [junit4] Suite: org.apache.solr.cloud.ShardSplitTest
   [junit4]   2> Creating dataDir: /Users/jenkins/workspace/Lucene-Solr-6.x-MacOSX/solr/build/solr-core/test/J1/temp/solr.cloud.ShardSplitTest_E4F22928E3181647-001/init-core-data-001
   [junit4]   2> 310894 INFO  (SUITE-ShardSplitTest-seed#[E4F22928E3181647]-worker) [    ] o.a.s.SolrTestCaseJ4 Using PointFields
   [junit4]   2> 310898 INFO  (SUITE-ShardSplitTest-seed#[E4F22928E3181647]-worker) [    ] o.a.s.SolrTestCaseJ4 Randomized ssl (false) and clientAuth (false) via: @org.apache.solr.SolrTestCaseJ4$SuppressSSL(bugUrl=https://issues.apache.org/jira/browse/SOLR-5776) w/ MAC_OS_X supressed clientAuth
   [junit4]   2> 310898 INFO  (SUITE-ShardSplitTest-seed#[E4F22928E3181647]-worker) [    ] o.a.s.BaseDistributedSearchTestCase Setting hostContext system property: /gz_/
   [junit4]   2> 310903 INFO  (TEST-ShardSplitTest.testSplitWithChaosMonkey-seed#[E4F22928E3181647]) [    ] o.a.s.c.ZkTestServer STARTING ZK TEST SERVER
   [junit4]   2> 310904 INFO  (Thread-420) [    ] o.a.s.c.ZkTestServer client port:0.0.0.0/0.0.0.0:0
   [junit4]   2> 310904 INFO  (Thread-420) [    ] o.a.s.c.ZkTestServer Starting server
   [junit4]   2> 311008 INFO  (TEST-ShardSplitTest.testSplitWithChaosMonkey-seed#[E4F22928E3181647]) [    ] o.a.s.c.ZkTestServer start zk server on port:54941
   [junit4]   2> 311045 INFO  (TEST-ShardSplitTest.testSplitWithChaosMonkey-seed#[E4F22928E3181647]) [    ] o.a.s.c.AbstractZkTestCase put /Users/jenkins/workspace/Lucene-Solr-6.x-MacOSX/solr/core/src/test-files/solr/collection1/conf/solrconfig-tlog.xml to /configs/conf1/solrconfig.xml
   [junit4]   2> 311049 INFO  (TEST-ShardSplitTest.testSplitWithChaosMonkey-seed#[E4F22928E3181647]) [    ] o.a.s.c.AbstractZkTestCase put /Users/jenkins/workspace/Lucene-Solr-6.x-MacOSX/solr/core/src/test-files/solr/collection1/conf/schema15.xml to /configs/conf1/schema.xml
   [junit4]   2> 311052 INFO  (TEST-ShardSplitTest.testSplitWithChaosMonkey-seed#[E4F22928E3181647]) [    ] o.a.s.c.AbstractZkTestCase put /Users/jenkins/workspace/Lucene-Solr-6.x-MacOSX/solr/core/src/test-files/solr/collection1/conf/solrconfig.snippet.randomindexconfig.xml to /configs/conf1/solrconfig.snippet.randomindexconfig.xml
   [junit4]   2> 311054 INFO  (TEST-ShardSplitTest.testSplitWithChaosMonkey-seed#[E4F22928E3181647]) [    ] o.a.s.c.AbstractZkTestCase put /Users/jenkins/workspace/Lucene-Solr-6.x-MacOSX/solr/core/src/test-files/solr/collection1/conf/stopwords.txt to /configs/conf1/stopwords.txt
   [junit4]   2> 311057 INFO  (TEST-ShardSplitTest.testSplitWithChaosMonkey-seed#[E4F22928E3181647]) [    ] o.a.s.c.AbstractZkTestCase put /Users/jenkins/workspace/Lucene-Solr-6.x-MacOSX/solr/core/src/test-files/solr/collection1/conf/protwords.txt to /configs/conf1/protwords.txt
   [junit4]   2> 311060 INFO  (TEST-ShardSplitTest.testSplitWithChaosMonkey-seed#[E4F22928E3181647]) [    ] o.a.s.c.AbstractZkTestCase put /Users/jenkins/workspace/Lucene-Solr-6.x-MacOSX/solr/core/src/test-files/solr/collection1/conf/currency.xml to /configs/conf1/currency.xml
   [junit4]   2> 311063 INFO  (TEST-ShardSplitTest.testSplitWithChaosMonkey-seed#[E4F22928E3181647]) [    ] o.a.s.c.AbstractZkTestCase put /Users/jenkins/workspace/Lucene-Solr-6.x-MacOSX/solr/core/src/test-files/solr/collection1/conf/enumsConfig.xml to /configs/conf1/enumsConfig.xml
   [junit4]   2> 311066 INFO  (TEST-ShardSplitTest.testSplitWithChaosMonkey-seed#[E4F22928E3181647]) [    ] o.a.s.c.AbstractZkTestCase put /Users/jenkins/workspace/Lucene-Solr-6.x-MacOSX/solr/core/src/test-files/solr/collection1/conf/open-exchange-rates.json to /configs/conf1/open-exchange-rates.json
   [junit4]   2> 311069 INFO  (TEST-ShardSplitTest.testSplitWithChaosMonkey-seed#[E4F22928E3181647]) [    ] o.a.s.c.AbstractZkTestCase put /Users/jenkins/workspace/Lucene-Solr-6.x-MacOSX/solr/core/src/test-files/solr/collection1/conf/mapping-ISOLatin1Accent.txt to /configs/conf1/mapping-ISOLatin1Accent.txt
   [junit4]   2> 311071 INFO  (TEST-ShardSplitTest.testSplitWithChaosMonkey-seed#[E4F22928E3181647]) [    ] o.a.s.c.AbstractZkTestCase put /Users/jenkins/workspace/Lucene-Solr-6.x-MacOSX/solr/core/src/test-files/solr/collection1/conf/old_synonyms.txt to /configs/conf1/old_synonyms.txt
   [junit4]   2> 311074 INFO  (TEST-ShardSplitTest.testSplitWithChaosMonkey-seed#[E4F22928E3181647]) [    ] o.a.s.c.AbstractZkTestCase put /Users/jenkins/workspace/Lucene-Solr-6.x-MacOSX/solr/core/src/test-files/solr/collection1/conf/synonyms.txt to /configs/conf1/synonyms.txt
   [junit4]   2> 311368 INFO  (TEST-ShardSplitTest.testSplitWithChaosMonkey-seed#[E4F22928E3181647]) [    ] o.a.s.SolrTestCaseJ4 Writing core.properties file to /Users/jenkins/workspace/Lucene-Solr-6.x-MacOSX/solr/build/solr-core/test/J1/temp/solr.cloud.ShardSplitTest_E4F22928E3181647-001/control-001/cores/collection1
   [junit4]   2> 311370 INFO  (TEST-ShardSplitTest.testSplitWithChaosMonkey-seed#[E4F22928E3181647]) [    ] o.e.j.s.Server jetty-9.3.14.v20161028
   [junit4]   2> 311374 INFO  (TEST-ShardSplitTest.testSplitWithChaosMonkey-seed#[E4F22928E3181647]) [    ] o.e.j.s.h.ContextHandler Started o.e.j.s.ServletContextHandler@125f539a{/gz_,null,AVAILABLE}
   [junit4]   2> 311376 INFO  (TEST-ShardSplitTest.testSplitWithChaosMonkey-seed#[E4F22928E3181647]) [    ] o.e.j.s.AbstractConnector Started ServerConnector@34cd0b6{HTTP/1.1,[http/1.1]}{127.0.0.1:54944}
   [junit4]   2> 311376 INFO  (TEST-ShardSplitTest.testSplitWithChaosMonkey-seed#[E4F22928E3181647]) [    ] o.e.j.s.Server Started @316732ms
   [junit4]   2> 311376 INFO  (TEST-ShardSplitTest.testSplitWithChaosMonkey-seed#[E4F22928E3181647]) [    ] o.a.s.c.s.e.JettySolrRunner Jetty properties: {solr.data.dir=/Users/jenkins/workspace/Lucene-Solr-6.x-MacOSX/solr/build/solr-core/test/J1/temp/solr.cloud.ShardSplitTest_E4F22928E3181647-001/tempDir-001/control/data, hostContext=/gz_, hostPort=54944, coreRootDirectory=/Users/jenkins/workspace/Lucene-Solr-6.x-MacOSX/solr/build/solr-core/test/J1/temp/solr.cloud.ShardSplitTest_E4F22928E3181647-001/control-001/cores}
   [junit4]   2> 311376 ERROR (TEST-ShardSplitTest.testSplitWithChaosMonkey-seed#[E4F22928E3181647]) [    ] o.a.s.s.StartupLoggingUtils Missing Java Option solr.log.dir. Logging may be missing or incomplete.
   [junit4]   2> 311377 INFO  (TEST-ShardSplitTest.testSplitWithChaosMonkey-seed#[E4F22928E3181647]) [    ] o.a.s.s.SolrDispatchFilter  ___      _       Welcome to Apache Solr™ version 6.6.0
   [junit4]   2> 311377 INFO  (TEST-ShardSplitTest.testSplitWithChaosMonkey-seed#[E4F22928E3181647]) [    ] o.a.s.s.SolrDispatchFilter / __| ___| |_ _   Starting in cloud mode on port null
   [junit4]   2> 311377 INFO  (TEST-ShardSplitTest.testSplitWithChaosMonkey-seed#[E4F22928E3181647]) [    ] o.a.s.s.SolrDispatchFilter \__ \/ _ \ | '_|  Install dir: null
   [junit4]   2> 311377 INFO  (TEST-ShardSplitTest.testSplitWithChaosMonkey-seed#[E4F22928E3181647]) [    ] o.a.s.s.SolrDispatchFilter |___/\___/_|_|    Start time: 2017-03-20T23:02:00.444Z
   [junit4]   2> 311386 INFO  (TEST-ShardSplitTest.testSplitWithChaosMonkey-seed#[E4F22928E3181647]) [    ] o.a.s.s.SolrDispatchFilter Loading solr.xml from SolrHome (not found in ZooKeeper)
   [junit4]   2> 311386 INFO  (TEST-ShardSplitTest.testSplitWithChaosMonkey-seed#[E4F22928E3181647]) [    ] o.a.s.c.SolrXmlConfig Loading container configuration from /Users/jenkins/workspace/Lucene-Solr-6.x-MacOSX/solr/build/solr-core/test/J1/temp/solr.cloud.ShardSplitTest_E4F22928E3181647-001/control-001/solr.xml
   [junit4]   2> 311416 INFO  (TEST-ShardSplitTest.testSplitWithChaosMonkey-seed#[E4F22928E3181647]) [    ] o.a.s.u.UpdateShardHandler Creating UpdateShardHandler HTTP client with params: socketTimeout=340000&connTimeout=45000&retry=true
   [junit4]   2> 311417 INFO  (TEST-ShardSplitTest.testSplitWithChaosMonkey-seed#[E4F22928E3181647]) [    ] o.a.s.c.ZkContainer Zookeeper client=127.0.0.1:54941/solr
   [junit4]   2> 311456 INFO  (TEST-ShardSplitTest.testSplitWithChaosMonkey-seed#[E4F22928E3181647]) [n:127.0.0.1:54944_gz_    ] o.a.s.c.Overseer Overseer (id=null) closing
   [junit4]   2> 311457 INFO  (TEST-ShardSplitTest.testSplitWithChaosMonkey-seed#[E4F22928E3181647]) [n:127.0.0.1:54944_gz_    ] o.a.s.c.OverseerElectionContext I am going to be the leader 127.0.0.1:54944_gz_
   [junit4]   2> 311459 INFO  (TEST-ShardSplitTest.testSplitWithChaosMonkey-seed#[E4F22928E3181647]) [n:127.0.0.1:54944_gz_    ] o.a.s.c.Overseer Overseer (id=97651977091350532-127.0.0.1:54944_gz_-n_0000000000) starting
   [junit4]   2> 311473 INFO  (TEST-ShardSplitTest.testSplitWithChaosMonkey-seed#[E4F22928E3181647]) [n:127.0.0.1:54944_gz_    ] o.a.s.c.ZkController Register node as live in ZooKeeper:/live_nodes/127.0.0.1:54944_gz_
   [junit4]   2> 311475 INFO  (zkCallback-312-thread-1-processing-n:127.0.0.1:54944_gz_) [n:127.0.0.1:54944_gz_    ] o.a.s.c.c.ZkStateReader Updated live nodes from ZooKeeper... (0) -> (1)
   [junit4]   2> 311565 INFO  (TEST-ShardSplitTest.testSplitWithChaosMonkey-seed#[E4F22928E3181647]) [n:127.0.0.1:54944_gz_    ] o.a.s.c.CorePropertiesLocator Found 1 core definitions underneath /Users/jenkins/workspace/Lucene-Solr-6.x-MacOSX/solr/build/solr-core/test/J1/temp/solr.cloud.ShardSplitTest_E4F22928E3181647-001/control-001/cores
   [junit4]   2> 311565 INFO  (TEST-ShardSplitTest.testSplitWithChaosMonkey-seed#[E4F22928E3181647]) [n:127.0.0.1:54944_gz_    ] o.a.s.c.CorePropertiesLocator Cores are: [collection1]
   [junit4]   2> 311569 INFO  (OverseerStateUpdate-97651977091350532-127.0.0.1:54944_gz_-n_0000000000) [n:127.0.0.1:54944_gz_    ] o.a.s.c.o.ReplicaMutator Assigning new node to shard shard=shard1
   [junit4]   2> 312616 WARN  (coreLoadExecutor-865-thread-1-processing-n:127.0.0.1:54944_gz_) [n:127.0.0.1:54944_gz_ c:control_collection   x:collection1] o.a.s.c.Config Beginning with Solr 5.5, <mergePolicy> is deprecated, use <mergePolicyFactory> instead.
   [junit4]   2> 312616 INFO  (coreLoadExecutor-865-thread-1-processing-n:127.0.0.1:54944_gz_) [n:127.0.0.1:54944_gz_ c:control_collection   x:collection1] o.a.s.c.SolrConfig Using Lucene MatchVersion: 6.6.0
   [junit4]   2> 312645 INFO  (coreLoadExecutor-865-thread-1-processing-n:127.0.0.1:54944_gz_) [n:127.0.0.1:54944_gz_ c:control_collection   x:collection1] o.a.s.s.IndexSchema [collection1] Schema name=test
   [junit4]   2> 312722 WARN  (coreLoadExecutor-865-thread-1-processing-n:127.0.0.1:54944_gz_) [n:127.0.0.1:54944_gz_ c:control_collection   x:collection1] o.a.s.s.IndexSchema [collection1] default search field in schema is text. WARNING: Deprecated, please use 'df' on request instead.
   [junit4]   2> 312727 INFO  (coreLoadExecutor-865-thread-1-processing-n:127.0.0.1:54944_gz_) [n:127.0.0.1:54944_gz_ c:control_collection   x:collection1] o.a.s.s.IndexSchema Loaded schema test/1.6 with uniqueid field id
   [junit4]   2> 312771 INFO  (coreLoadExecutor-865-thread-1-processing-n:127.0.0.1:54944_gz_) [n:127.0.0.1:54944_gz_ c:control_collection   x:collection1] o.a.s.c.CoreContainer Creating SolrCore 'collection1' using configuration from collection control_collection
   [junit4]   2> 312786 INFO  (coreLoadExecutor-865-thread-1-processing-n:127.0.0.1:54944_gz_) [n:127.0.0.1:54944_gz_ c:control_collection   x:collection1] o.a.s.c.SolrCore solr.RecoveryStrategy.Builder
   [junit4]   2> 312786 INFO  (coreLoadExecutor-865-thread-1-processing-n:127.0.0.1:54944_gz_) [n:127.0.0.1:54944_gz_ c:control_collection   x:collection1] o.a.s.c.SolrCore [[collection1] ] Opening new SolrCore at [/Users/jenkins/workspace/Lucene-Solr-6.x-MacOSX/solr/build/solr-core/test/J1/temp/solr.cloud.ShardSplitTest_E4F22928E3181647-001/control-001/cores/collection1], dataDir=[/Users/jenkins/workspace/Lucene-Solr-6.x-MacOSX/solr/build/solr-core/test/J1/temp/solr.cloud.ShardSplitTest_E4F22928E3181647-001/control-001/cores/collection1/data/]
   [junit4]   2> 312786 INFO  (coreLoadExecutor-865-thread-1-processing-n:127.0.0.1:54944_gz_) [n:127.0.0.1:54944_gz_ c:control_collection   x:collection1] o.a.s.c.JmxMonitoredMap JMX monitoring is enabled. Adding Solr mbeans to JMX Server: com.sun.jmx.mbeanserver.JmxMBeanServer@74bf5860
   [junit4]   2> 312789 INFO  (coreLoadExecutor-865-thread-1-processing-n:127.0.0.1:54944_gz_) [n:127.0.0.1:54944_gz_ c:control_collection   x:collection1] o.a.s.u.RandomMergePolicy RandomMergePolicy wrapping class org.apache.lucene.index.TieredMergePolicy: [TieredMergePolicy: maxMergeAtOnce=24, maxMergeAtOnceExplicit=26, maxMergedSegmentMB=78.09765625, floorSegmentMB=1.1435546875, forceMergeDeletesPctAllowed=28.739950130920136, segmentsPerTier=30.0, maxCFSSegmentSizeMB=8.796093022207999E12, noCFSRatio=0.0
   [junit4]   2> 312820 WARN  (coreLoadExecutor-865-thread-1-processing-n:127.0.0.1:54944_gz_) [n:127.0.0.1:54944_gz_ c:control_collection   x:collection1] o.a.s.c.RequestHandlers INVALID paramSet a in requestHandler {type = requestHandler,name = /dump,class = DumpRequestHandler,attributes = {initParams=a, name=/dump, class=DumpRequestHandler},args = {defaults={a=A,b=B}}}
   [junit4]   2> 312923 INFO  (coreLoadExecutor-865-thread-1-processing-n:127.0.0.1:54944_gz_) [n:127.0.0.1:54944_gz_ c:control_collection   x:collection1] o.a.s.u.UpdateHandler Using UpdateLog implementation: org.apache.solr.update.UpdateLog
   [junit4]   2> 312923 INFO  (coreLoadExecutor-865-thread-1-processing-n:127.0.0.1:54944_gz_) [n:127.0.0.1:54944_gz_ c:control_collection   x:collection1] o.a.s.u.UpdateLog Initializing UpdateLog: dataDir= defaultSyncLevel=FLUSH numRecordsToKeep=100 maxNumLogsToKeep=10 numVersionBuckets=65536
   [junit4]   2> 312924 INFO  (coreLoadExecutor-865-thread-1-processing-n:127.0.0.1:54944_gz_) [n:127.0.0.1:54944_gz_ c:control_collection   x:collection1] o.a.s.u.CommitTracker Hard AutoCommit: disabled
   [junit4]   2> 312924 INFO  (coreLoadExecutor-865-thread-1-processing-n:127.0.0.1:54944_gz_) [n:127.0.0.1:54944_gz_ c:control_collection   x:collection1] o.a.s.u.CommitTracker Soft AutoCommit: disabled
   [junit4]   2> 312925 INFO  (coreLoadExecutor-865-thread-1-processing-n:127.0.0.1:54944_gz_) [n:127.0.0.1:54944_gz_ c:control_collection   x:collection1] o.a.s.u.RandomMergePolicy RandomMergePolicy wrapping class org.apache.lucene.index.AlcoholicMergePolicy: [AlcoholicMergePolicy: minMergeSize=0, mergeFactor=10, maxMergeSize=1934337337, maxMergeSizeForForcedMerge=9223372036854775807, calibrateSizeByDeletes=true, maxMergeDocs=2147483647, maxCFSSegmentSizeMB=8.796093022207999E12, noCFSRatio=0.1]
   [junit4]   2> 312948 INFO  (coreLoadExecutor-865-thread-1-processing-n:127.0.0.1:54944_gz_) [n:127.0.0.1:54944_gz_ c:control_collection   x:collection1] o.a.s.s.SolrIndexSearcher Opening [Searcher@4a39e7b8[collection1] main]
   [junit4]   2> 312955 INFO  (coreLoadExecutor-865-thread-1-processing-n:127.0.0.1:54944_gz_) [n:127.0.0.1:54944_gz_ c:control_collection   x:collection1] o.a.s.r.ManagedResourceStorage Configured ZooKeeperStorageIO with znodeBase: /configs/conf1
   [junit4]   2> 312956 INFO  (coreLoadExecutor-865-thread-1-processing-n:127.0.0.1:54944_gz_) [n:127.0.0.1:54944_gz_ c:control_collection   x:collection1] o.a.s.r.ManagedResourceStorage Loaded null at path _rest_managed.json using ZooKeeperStorageIO:path=/configs/conf1
   [junit4]   2> 312956 INFO  (coreLoadExecutor-865-thread-1-processing-n:127.0.0.1:54944_gz_) [n:127.0.0.1:54944_gz_ c:control_collection   x:collection1] o.a.s.h.ReplicationHandler Commits will be reserved for  10000
   [junit4]   2> 312957 INFO  (searcherExecutor-866-thread-1-processing-n:127.0.0.1:54944_gz_ x:collection1 c:control_collection) [n:127.0.0.1:54944_gz_ c:control_collection   x:collection1] o.a.s.c.SolrCore [collection1] Registered new searcher Searcher@4a39e7b8[collection1] main{ExitableDirectoryReader(UninvertingDirectoryReader())}
   [junit4]   2> 312958 INFO  (coreLoadExecutor-865-thread-1-processing-n:127.0.0.1:54944_gz_) [n:127.0.0.1:54944_gz_ c:control_collection   x:collection1] o.a.s.u.UpdateLog Could not find max version in index or recent updates, using new clock 1562431635613286400
   [junit4]   2> 312967 INFO  (coreZkRegister-858-thread-1-processing-n:127.0.0.1:54944_gz_ x:collection1 c:control_collection) [n:127.0.0.1:54944_gz_ c:control_collection s:shard1 r:core_node1 x:collection1] o.a.s.c.ShardLeaderElectionContext Enough replicas found to continue.
   [junit4]   2> 312967 INFO  (coreZkRegister-858-thread-1-processing-n:127.0.0.1:54944_gz_ x:collection1 c:control_collection) [n:127.0.0.1:54944_gz_ c:control_collection s:shard1 r:core_node1 x:collection1] o.a.s.c.ShardLeaderElectionContext I may be the new leader - try and sync
   [junit4]   2> 312967 INFO  (coreZkRegister-858-thread-1-processing-n:127.0.0.1:54944_gz_ x:collection1 c:control_collection) [n:127.0.0.1:54944_gz_ c:control_collection s:shard1 r:core_node1 x:collection1] o.a.s.c.SyncStrategy Sync replicas to http://127.0.0.1:54944/gz_/collection1/
   [junit4]   2> 312967 INFO  (coreZkRegister-858-thread-1-processing-n:127.0.0.1:54944_gz_ x:collection1 c:control_collection) [n:127.0.0.1:54944_gz_ c:control_collection s:shard1 r:core_node1 x:collection1] o.a.s.c.SyncStrategy Sync Success - now sync replicas to me
   [junit4]   2> 312967 INFO  (coreZkRegister-858-thread-1-processing-n:127.0.0.1:54944_gz_ x:collection1 c:control_collection) [n:127.0.0.1:54944_gz_ c:control_collection s:shard1 r:core_node1 x:collection1] o.a.s.c.SyncStrategy http://127.0.0.1:54944/gz_/collection1/ has no replicas
   [junit4]   2> 312967 INFO  (coreZkRegister-858-thread-1-processing-n:127.0.0.1:54944_gz_ x:collection1 c:control_collection) [n:127.0.0.1:54944_gz_ c:control_collection s:shard1 r:core_node1 x:collection1] o.a.s.c.ShardLeaderElectionContext Found all replicas participating in election, clear LIR
   [junit4]   2> 312974 INFO  (coreZkRegister-858-thread-1-processing-n:127.0.0.1:54944_gz_ x:collection1 c:control_collection) [n:127.0.0.1:54944_gz_ c:control_collection s:shard1 r:core_node1 x:collection1] o.a.s.c.ShardLeaderElectionContext I am the new leader: http://127.0.0.1:54944/gz_/collection1/ shard1
   [junit4]   2> 313131 INFO  (coreZkRegister-858-thread-1-processing-n:127.0.0.1:54944_gz_ x:collection1 c:control_collection) [n:127.0.0.1:54944_gz_ c:control_collection s:shard1 r:core_node1 x:collection1] o.a.s.c.ZkController I am the leader, no recovery necessary
   [junit4]   2> 313198 INFO  (TEST-ShardSplitTest.testSplitWithChaosMonkey-seed#[E4F22928E3181647]) [    ] o.a.s.c.c.ZkStateReader Updated live nodes from ZooKeeper... (0) -> (1)
   [junit4]   2> 313200 INFO  (TEST-ShardSplitTest.testSplitWithChaosMonkey-seed#[E4F22928E3181647]) [    ] o.a.s.c.s.i.ZkClientClusterStateProvider Cluster at 127.0.0.1:54941/solr ready
   [junit4]   2> 313200 INFO  (TEST-ShardSplitTest.testSplitWithChaosMonkey-seed#[E4F22928E3181647]) [    ] o.a.s.c.ChaosMonkey monkey: init - expire sessions:false cause connection loss:false
   [junit4]   2> 313200 INFO  (TEST-ShardSplitTest.testSplitWithChaosMonkey-seed#[E4F22928E3181647]) [    ] o.a.s.c.AbstractFullDistribZkTestBase Creating collection1 with stateFormat=2
   [junit4]   2> 313501 INFO  (TEST-ShardSplitTest.testSplitWithChaosMonkey-seed#[E4F22928E3181647]) [    ] o.a.s.SolrTestCaseJ4 Writing core.properties file to /Users/jenkins/workspace/Lucene-Solr-6.x-MacOSX/solr/build/solr-core/test/J1/temp/solr.cloud.ShardSplitTest_E4F22928E3181647-001/shard-1-001/cores/collection1
   [junit4]   2> 313502 INFO  (TEST-ShardSplitTest.testSplitWithChaosMonkey-seed#[E4F22928E3181647]) [    ] o.a.s.c.AbstractFullDistribZkTestBase create jetty 1 in directory /Users/jenkins/workspace/Lucene-Solr-6.x-MacOSX/solr/build/solr-core/test/J1/temp/solr.cloud.ShardSplitTest_E4F22928E3181647-001/shard-1-001
   [junit4]   2> 313503 INFO  (TEST-ShardSplitTest.testSplitWithChaosMonkey-seed#[E4F22928E3181647]) [    ] o.e.j.s.Server jetty-9.3.14.v20161028
   [junit4]   2> 313505 INFO  (TEST-ShardSplitTest.testSplitWithChaosMonkey-seed#[E4F22928E3181647]) [    ] o.e.j.s.h.ContextHandler Started o.e.j.s.ServletContextHandler@40cc29dc{/gz_,null,AVAILABLE}
   [junit4]   2> 313505 INFO  (TEST-ShardSplitTest.testSplitWithChaosMonkey-seed#[E4F22928E3181647]) [    ] o.e.j.s.AbstractConnector Started ServerConnector@5f3c282e{HTTP/1.1,[http/1.1]}{127.0.0.1:54956}
   [junit4]   2> 313505 INFO  (TEST-ShardSplitTest.testSplitWithChaosMonkey-seed#[E4F22928E3181647]) [    ] o.e.j.s.Server Started @318860ms
   [junit4]   2> 313505 INFO  (TEST-ShardSplitTest.testSplitWithChaosMonkey-seed#[E4F22928E3181647]) [    ] o.a.s.c.s.e.JettySolrRunner Jetty properties: {solr.data.dir=/Users/jenkins/workspace/Lucene-Solr-6.x-MacOSX/solr/build/solr-core/test/J1/temp/solr.cloud.ShardSplitTest_E4F22928E3181647-001/tempDir-001/jetty1, solrconfig=solrconfig.xml, hostContext=/gz_, hostPort=54956, coreRootDirectory=/Users/jenkins/workspace/Lucene-Solr-6.x-MacOSX/solr/build/solr-core/test/J1/temp/solr.cloud.ShardSplitTest_E4F22928E3181647-001/shard-1-001/cores}
   [junit4]   2> 313506 ERROR (TEST-ShardSplitTest.testSplitWithChaosMonkey-seed#[E4F22928E3181647]) [    ] o.a.s.s.StartupLoggingUtils Missing Java Option solr.log.dir. Logging may be missing or incomplete.
   [junit4]   2> 313506 INFO  (TEST-ShardSplitTest.testSplitWithChaosMonkey-seed#[E4F22928E3181647]) [    ] o.a.s.s.SolrDispatchFilter  ___      _       Welcome to Apache Solr™ version 6.6.0
   [junit4]   2> 313506 INFO  (TEST-ShardSplitTest.testSplitWithChaosMonkey-seed#[E4F22928E3181647]) [    ] o.a.s.s.SolrDispatchFilter / __| ___| |_ _   Starting in cloud mode on port null
   [junit4]   2> 313506 INFO  (TEST-ShardSplitTest.testSplitWithChaosMonkey-seed#[E4F22928E3181647]) [    ] o.a.s.s.SolrDispatchFilter \__ \/ _ \ | '_|  Install dir: null
   [junit4]   2> 313506 INFO  (TEST-ShardSplitTest.testSplitWithChaosMonkey-seed#[E4F22928E3181647]) [    ] o.a.s.s.SolrDispatchFilter |___/\___/_|_|    Start time: 2017-03-20T23:02:02.573Z
   [junit4]   2> 313511 INFO  (TEST-ShardSplitTest.testSplitWithChaosMonkey-seed#[E4F22928E3181647]) [    ] o.a.s.s.SolrDispatchFilter Loading solr.xml from SolrHome (not found in ZooKeeper)
   [junit4]   2> 313511 INFO  (TEST-ShardSplitTest.testSplitWithChaosMonkey-seed#[E4F22928E3181647]) [    ] o.a.s.c.SolrXmlConfig Loading container configuration from /Users/jenkins/workspace/Lucene-Solr-6.x-MacOSX/solr/build/solr-core/test/J1/temp/solr.cloud.ShardSplitTest_E4F22928E3181647-001/shard-1-001/solr.xml
   [junit4]   2> 313551 INFO  (TEST-ShardSplitTest.testSplitWithChaosMonkey-seed#[E4F22928E3181647]) [    ] o.a.s.u.UpdateShardHandler Creating UpdateShardHandler HTTP client with params: socketTimeout=340000&connTimeout=45000&retry=true
   [junit4]   2> 313552 INFO  (TEST-ShardSplitTest.testSplitWithChaosMonkey-seed#[E4F22928E3181647]) [    ] o.a.s.c.ZkContainer Zookeeper client=127.0.0.1:54941/solr
   [junit4]   2> 313570 INFO  (TEST-ShardSplitTest.testSplitWithChaosMonkey-seed#[E4F22928E3181647]) [n:127.0.0.1:54956_gz_    ] o.a.s.c.c.ZkStateReader Updated live nodes from ZooKeeper... (0) -> (1)
   [junit4]   2> 313575 INFO  (TEST-ShardSplitTest.testSplitWithChaosMonkey-seed#[E4F22928E3181647]) [n:127.0.0.1:54956_gz_    ] o.a.s.c.Overseer Overseer (id=null) closing
   [junit4]   2> 313579 INFO  (TEST-ShardSplitTest.testSplitWithChaosMonkey-seed#[E4F22928E3181647]) [n:127.0.0.1:54956_gz_    ] o.a.s.c.ZkController Register node as live in ZooKeeper:/live_nodes/127.0.0.1:54956_gz_
   [junit4]   2> 313581 INFO  (zkCallback-316-thread-1) [    ] o.a.s.c.c.ZkStateReader Updated live nodes from ZooKeeper... (1) -> (2)
   [junit4]   2> 313582 INFO  (zkCallback-322-thread-1-processing-n:127.0.0.1:54956_gz_) [n:127.0.0.1:54956_gz_    ] o.a.s.c.c.ZkStateReader Updated live nodes from ZooKeeper... (1) -> (2)
   [junit4]   2> 313582 INFO  (zkCallback-312-thread-1-processing-n:127.0.0.1:54944_gz_) [n:127.0.0.1:54944_gz_    ] o.a.s.c.c.ZkStateReader Updated live nodes from ZooKeeper... (1) -> (2)
   [junit4]   2> 313698 INFO  (TEST-ShardSplitTest.testSplitWithChaosMonkey-seed#[E4F22928E3181647]) [n:127.0.0.1:54956_gz_    ] o.a.s.c.CorePropertiesLocator Found 1 core definitions underneath /Users/jenkins/workspace/Lucene-Solr-6.x-MacOSX/solr/build/solr-core/test/J1/temp/solr.cloud.ShardSplitTest_E4F22928E3181647-001/shard-1-001/cores
   [junit4]   2> 313698 INFO  (TEST-ShardSplitTest.testSplitWithChaosMonkey-seed#[E4F22928E3181647]) [n:127.0.0.1:54956_gz_    ] o.a.s.c.CorePropertiesLocator Cores are: [collection1]
   [junit4]   2> 313701 INFO  (OverseerStateUpdate-97651977091350532-127.0.0.1:54944_gz_-n_0000000000) [n:127.0.0.1:54944_gz_    ] o.a.s.c.o.ReplicaMutator Assigning new node to shard shard=shard2
   [junit4]   2> 313810 INFO  (zkCallback-322-thread-1-processing-n:127.0.0.1:54956_gz_) [n:127.0.0.1:54956_gz_    ] o.a.s.c.c.ZkStateReader A cluster state change: [WatchedEvent state:SyncConnected type:NodeDataChanged path:/collections/collection1/state.json] for collection [collection1] has occurred - updating... (live nodes size: [2])
   [junit4]   2> 314724 WARN  (coreLoadExecutor-876-thread-1-processing-n:127.0.0.1:54956_gz_) [n:127.0.0.1:54956_gz_ c:collection1   x:collection1] o.a.s.c.Config Beginning with Solr 5.5, <mergePolicy> is deprecated, use <mergePolicyFactory> instead.
   [junit4]   2> 314725 INFO  (coreLoadExecutor-876-thread-1-processing-n:127.0.0.1:54956_gz_) [n:127.0.0.1:54956_gz_ c:collection1   x:collection1] o.a.s.c.SolrConfig Using Lucene MatchVersion: 6.6.0
   [junit4]   2> 314746 INFO  (coreLoadExecutor-876-thread-1-processing-n:127.0.0.1:54956_gz_) [n:127.0.0.1:54956_gz_ c:collection1   x:collection1] o.a.s.s.IndexSchema [collection1] Schema name=test
   [junit4]   2> 314827 WARN  (coreLoadExecutor-876-thread-1-processing-n:127.0.0.1:54956_gz_) [n:127.0.0.1:54956_gz_ c:collection1   x:collection1] o.a.s.s.IndexSchema [collection1] default search field in schema is text. WARNING: Deprecated, please use 'df' on request instead.
   [junit4]   2> 314828 INFO  (coreLoadExecutor-876-thread-1-processing-n:127.0.0.1:54956_gz_) [n:127.0.0.1:54956_gz_ c:collection1   x:collection1] o.a.s.s.IndexSchema Loaded schema test/1.6 with uniqueid field id
   [junit4]   2> 314861 INFO  (coreLoadExecutor-876-thread-1-processing-n:127.0.0.1:54956_gz_) [n:127.0.0.1:54956_gz_ c:collection1   x:collection1] o.a.s.c.CoreContainer Creating SolrCore 'collection1' using configuration from collection collection1
   [junit4]   2> 314861 INFO  (coreLoadExecutor-876-thread-1-processing-n:127.0.0.1:54956_gz_) [n:127.0.0.1:54956_gz_ c:collection1   x:collection1] o.a.s.c.SolrCore solr.RecoveryStrategy.Builder
   [junit4]   2> 314861 INFO  (coreLoadExecutor-876-thread-1-processing-n:127.0.0.1:54956_gz_) [n:127.0.0.1:54956_gz_ c:collection1   x:collection1] o.a.s.c.SolrCore [[collection1] ] Opening new SolrCore at [/Users/jenkins/workspace/Lucene-Solr-6.x-MacOSX/solr/build/solr-core/test/J1/temp/solr.cloud.ShardSplitTest_E4F22928E3181647-001/shard-1-001/cores/collection1], dataDir=[/Users/jenkins/workspace/Lucene-Solr-6.x-MacOSX/solr/build/solr-core/test/J1/temp/solr.cloud.ShardSplitTest_E4F22928E3181647-001/shard-1-001/cores/collection1/data/]
   [junit4]   2> 314861 INFO  (coreLoadExecutor-876-thread-1-processing-n:127.0.0.1:54956_gz_) [n:127.0.0.1:54956_gz_ c:collection1   x:collection1] o.a.s.c.JmxMonitoredMap JMX monitoring is enabled. Adding Solr mbeans to JMX Server: com.sun.jmx.mbeanserver.JmxMBeanServer@74bf5860
   [junit4]   2> 314864 INFO  (coreLoadExecutor-876-thread-1-processing-n:127.0.0.1:54956_gz_) [n:127.0.0.1:54956_gz_ c:collection1   x:collection1] o.a.s.u.RandomMergePolicy RandomMergePolicy wrapping class org.apache.lucene.index.TieredMergePolicy: [TieredMergePolicy: maxMergeAtOnce=24, maxMergeAtOnceExplicit=26, maxMergedSegmentMB=78.09765625, floorSegmentMB=1.1435546875, forceMergeDeletesPctAllowed=28.739950130920136, segmentsPerTier=30.0, maxCFSSegmentSizeMB=8.796093022207999E12, noCFSRatio=0.0
   [junit4]   2> 314887 WARN  (coreLoadExecutor-876-thread-1-processing-n:127.0.0.1:54956_gz_) [n:127.0.0.1:54956_gz_ c:collection1   x:collection1] o.a.s.c.RequestHandlers INVALID paramSet a in requestHandler {type = requestHandler,name = /dump,class = DumpRequestHandler,attributes = {initParams=a, name=/dump, class=DumpRequestHandler},args = {defaults={a=A,b=B}}}
   [junit4]   2> 314969 INFO  (coreLoadExecutor-876-thread-1-processing-n:127.0.0.1:54956_gz_) [n:127.0.0.1:54956_gz_ c:collection1   x:collection1] o.a.s.u.UpdateHandler Using UpdateLog implementation: org.apache.solr.update.UpdateLog
   [junit4]   2> 314969 INFO  (coreLoadExecutor-876-thread-1-processing-n:127.0.0.1:54956_gz_) [n:127.0.0.1:54956_gz_ c:collection1   x:collection1] o.a.s.u.UpdateLog Initializing UpdateLog: dataDir= defaultSyncLevel=FLUSH numRecordsToKeep=100 maxNumLogsToKeep=10 numVersionBuckets=65536
   [junit4]   2> 314970 INFO  (coreLoadExecutor-876-thread-1-processing-n:127.0.0.1:54956_gz_) [n:127.0.0.1:54956_gz_ c:collection1   x:collection1] o.a.s.u.CommitTracker Hard AutoCommit: disabled
   [junit4]   2> 314970 INFO  (coreLoadExecutor-876-thread-1-processing-n:127.0.0.1:54956_gz_) [n:127.0.0.1:54956_gz_ c:collection1   x:collection1] o.a.s.u.CommitTracker Soft AutoCommit: disabled
   [junit4]   2> 314972 INFO  (coreLoadExecutor-876-thread-1-processing-n:127.0.0.1:54956_gz_) [n:127.0.0.1:54956_gz_ c:collection1   x:collection1] o.a.s.u.RandomMergePolicy RandomMergePolicy wrapping class org.apache.lucene.index.AlcoholicMergePolicy: [AlcoholicMergePolicy: minMergeSize=0, mergeFactor=10, maxMergeSize=1934337337, maxMergeSizeForForcedMerge=9223372036854775807, calibrateSizeByDeletes=true, maxMergeDocs=2147483647, maxCFSSegmentSizeMB=8.796093022207999E12, noCFSRatio=0.1]
   [junit4]   2> 314973 INFO  (coreLoadExecutor-876-thread-1-processing-n:127.0.0.1:54956_gz_) [n:127.0.0.1:54956_gz_ c:collection1   x:collection1] o.a.s.s.SolrIndexSearcher Opening [Searcher@7e710d6a[collection1] main]
   [junit4]   2> 314974 INFO  (coreLoadExecutor-876-thread-1-processing-n:127.0.0.1:54956_gz_) [n:127.0.0.1:54956_gz_ c:collection1   x:collection1] o.a.s.r.ManagedResourceStorage Configured ZooKeeperStorageIO with znodeBase: /configs/conf1
   [junit4]   2> 314975 INFO  (coreLoadExecutor-876-thread-1-processing-n:127.0.0.1:54956_gz_) [n:127.0.0.1:54956_gz_ c:collection1   x:collection1] o.a.s.r.ManagedResourceStorage Loaded null at path _rest_managed.json using ZooKeeperStorageIO:path=/configs/conf1
   [junit4]   2> 314975 INFO  (coreLoadExecutor-876-thread-1-processing-n:127.0.0.1:54956_gz_) [n:127.0.0.1:54956_gz_ c:collection1   x:collection1] o.a.s.h.ReplicationHandler Commits will be reserved for  10000
   [junit4]   2> 314977 INFO  (searcherExecutor-877-thread-1-processing-n:127.0.0.1:54956_gz_ x:collection1 c:collection1) [n:127.0.0.1:54956_gz_ c:collection1   x:collection1] o.a.s.c.SolrCore [collection1] Registered new searcher Searcher@7e710d6a[collection1] main{ExitableDirectoryReader(UninvertingDirectoryReader())}
   [junit4]   2> 314978 INFO  (coreLoadExecutor-876-thread-1-processing-n:127.0.0.1:54956_gz_) [n:127.0.0.1:54956_gz_ c:collection1   x:collection1] o.a.s.u.UpdateLog Could not find max version in index or recent updates, using new clock 1562431637731409920
   [junit4]   2> 314990 INFO  (coreZkRegister-871-thread-1-processing-n:127.0.0.1:54956_gz_ x:collection1 c:collection1) [n:127.0.0.1:54956_gz_ c:collection1 s:shard2 r:core_node1 x:collection1] o.a.s.c.ShardLeaderElectionContext Enough replicas found to continue.
   [junit4]   2> 314990 INFO  (coreZkRegister-871-thread-1-processing-n:127.0.0.1:54956_gz_ x:collection1 c:collection1) [n:127.0.0.1:54956_gz_ c:collection1 s:shard2 r:core_node1 x:collection1] o.a.s.c.ShardLeaderElectionContext I may be the new leader - try and sync
   [junit4]   2> 314990 INFO  (coreZkRegister-871-thread-1-processing-n:127.0.0.1:54956_gz_ x:collection1 c:collection1) [n:127.0.0.1:54956_gz_ c:collection1 s:shard2 r:core_node1 x:collection1] o.a.s.c.SyncStrategy Sync replicas to http://127.0.0.1:54956/gz_/collection1/
   [junit4]   2> 314990 INFO  (coreZkRegister-871-thread-1-processing-n:127.0.0.1:54956_gz_ x:collection1 c:collection1) [n:127.0.0.1:54956_gz_ c:collection1 s:shard2 r:core_node1 x:collection1] o.a.s.c.SyncStrategy Sync Success - now sync replicas to me
   [junit4]   2> 314990 INFO  (coreZkRegister-871-thread-1-processing-n:127.0.0.1:54956_gz_ x:collection1 c:collection1) [n:127.0.0.1:54956_gz_ c:collection1 s:shard2 r:core_node1 x:collection1] o.a.s.c.SyncStrategy http://127.0.0.1:54956/gz_/collection1/ has no replicas
   [junit4]   2> 314990 INFO  (coreZkRegister-871-thread-1-processing-n:127.0.0.1:54956_gz_ x:collection1 c:collection1) [n:127.0.0.1:54956_gz_ c:collection1 s:shard2 r:core_node1 x:collection1] o.a.s.c.ShardLeaderElectionContext Found all replicas participating in election, clear LIR
   [junit4]   2> 315000 INFO  (coreZkRegister-871-thread-1-processing-n:127.0.0.1:54956_gz_ x:collection1 c:collection1) [n:127.0.0.1:54956_gz_ c:collection1 s:shard2 r:core_node1 x:collection1] o.a.s.c.ShardLeaderElectionContext I am the new leader: http://127.0.0.1:54956/gz_/collection1/ shard2
   [junit4]   2> 315110 INFO  (zkCallback-322-thread-1-processing-n:127.0.0.1:54956_gz_) [n:127.0.0.1:54956_gz_    ] o.a.s.c.c.ZkStateReader A cluster state change: [WatchedEvent state:SyncConnected type:NodeDataChanged path:/collections/collection1/state.json] for collection [collection1] has occurred - updating... (live nodes size: [2])
   [junit4]   2> 315162 INFO  (coreZkRegister-871-thread-1-processing-n:127.0.0.1:54956_gz_ x:collection1 c:collection1) [n:127.0.0.1:54956_gz_ c:collection1 s:shard2 r:core_node1 x:collection1] o.a.s.c.ZkController I am the leader, no recovery necessary
   [junit4]   2> 315271 INFO  (zkCallback-322-thread-1-processing-n:127.0.0.1:54956_gz_) [n:127.0.0.1:54956_gz_    ] o.a.s.c.c.ZkStateReader A cluster state change: [WatchedEvent state:SyncConnected type:NodeDataChanged path:/collections/collection1/state.json] for collection [collection1] has occurred - updating... (live nodes size: [2])
   [junit4]   2> 315576 INFO  (TEST-ShardSplitTest.testSplitWithChaosMonkey-seed#[E4F22928E3181647]) [    ] o.a.s.SolrTestCaseJ4 Writing core.properties file to /Users/jenkins/workspace/Lucene-Solr-6.x-MacOSX/solr/build/solr-core/test/J1/temp/solr.cloud.ShardSplitTest_E4F22928E3181647-001/shard-2-001/cores/collection1
   [junit4]   2> 315578 INFO  (TEST-ShardSplitTest.testSplitWithChaosMonkey-seed#[E4F22928E3181647]) [    ] o.a.s.c.AbstractFullDistribZkTestBase create jetty 2 in directory /Users/jenkins/workspace/Lucene-Solr-6.x-MacOSX/solr/build/solr-core/test/J1/temp/solr.cloud.ShardSplitTest_E4F22928E3181647-001/shard-2-001
   [junit4]   2> 315578 INFO  (TEST-ShardSplitTest.testSplitWithChaosMonkey-seed#[E4F22928E3181647]) [    ] o.e.j.s.Server jetty-9.3.14.v20161028
   [junit4]   2> 315582 INFO  (TEST-ShardSplitTest.testSplitWithChaosMonkey-seed#[E4F22928E3181647]) [    ] o.e.j.s.h.ContextHandler Started o.e.j.s.ServletContextHandler@10fd1bf7{/gz_,null,AVAILABLE}
   [junit4]   2> 315582 INFO  (TEST-ShardSplitTest.testSplitWithChaosMonkey-seed#[E4F22928E3181647]) [    ] o.e.j.s.AbstractConnector Started ServerConnector@3efcdc3b{HTTP/1.1,[http/1.1]}{127.0.0.1:54961}
   [junit4]   2> 315582 INFO  (TEST-ShardSplitTest.testSplitWithChaosMonkey-seed#[E4F22928E3181647]) [    ] o.e.j.s.Server Started @320938ms
   [junit4]   2> 315582 INFO  (TEST-ShardSplitTest.testSplitWithChaosMonkey-seed#[E4F22928E3181647]) [    ] o.a.s.c.s.e.JettySolrRunner Jetty properties: {solr.data.dir=/Users/jenkins/workspace/Lucene-Solr-6.x-MacOSX/solr/build/solr-core/test/J1/temp/solr.cloud.ShardSplitTest_E4F22928E3181647-001/tempDir-001/jetty2, solrconfig=solrconfig.xml, hostContext=/gz_, hostPort=54961, coreRootDirectory=/Users/jenkins/workspace/Lucene-Solr-6.x-MacOSX/solr/build/solr-core/test/J1/temp/solr.cloud.ShardSplitTest_E4F22928E3181647-001/shard-2-001/cores}
   [junit4]   2> 315583 ERROR (TEST-ShardSplitTest.testSplitWithChaosMonkey-seed#[E4F22928E3181647]) [    ] o.a.s.s.StartupLoggingUtils Missing Java Option solr.log.dir. Logging may be missing or incomplete.
   [junit4]   2> 315584 INFO  (TEST-ShardSplitTest.testSplitWithChaosMonkey-seed#[E4F22928E3181647]) [    ] o.a.s.s.SolrDispatchFilter  ___      _       Welcome to Apache Solr™ version 6.6.0
   [junit4]   2> 315584 INFO  (TEST-ShardSplitTest.testSplitWithChaosMonkey-seed#[E4F22928E3181647]) [    ] o.a.s.s.SolrDispatchFilter / __| ___| |_ _   Starting in cloud mode on port null
   [junit4]   2> 315584 INFO  (TEST-ShardSplitTest.testSplitWithChaosMonkey-seed#[E4F22928E3181647]) [    ] o.a.s.s.SolrDispatchFilter \__ \/ _ \ | '_|  Install dir: null
   [junit4]   2> 315584 INFO  (TEST-ShardSplitTest.testSplitWithChaosMonkey-seed#[E4F22928E3181647]) [    ] o.a.s.s.SolrDispatchFilter |___/\___/_|_|    Start time: 2017-03-20T23:02:04.651Z
   [junit4]   2> 315589 INFO  (TEST-ShardSplitTest.testSplitWithChaosMonkey-seed#[E4F22928E3181647]) [    ] o.a.s.s.SolrDispatchFilter Loading solr.xml from SolrHome (not found in ZooKeeper)
   [junit4]   2> 315589 INFO  (TEST-ShardSplitTest.testSplitWithChaosMonkey-seed#[E4F22928E3181647]) [    ] o.a.s.c.SolrXmlConfig Loading container configuration from /Users/jenkins/workspace/Lucene-Solr-6.x-MacOSX/solr/build/solr-core/test/J1/temp/solr.cloud.ShardSplitTest_E4F22928E3181647-001/shard-2-001/solr.xml
   [junit4]   2> 315617 INFO  (TEST-ShardSplitTest.testSplitWithChaosMonkey-seed#[E4F22928E3181647]) [    ] o.a.s.u.UpdateShardHandler Creating UpdateShardHandler HTTP client with params: socketTimeout=340000&connTimeout=45000&retry=true
   [junit4]   2> 315618 INFO  (TEST-ShardSplitTest.testSplitWithChaosMonkey-seed#[E4F22928E3181647]) [    ] o.a.s.c.ZkContainer Zookeeper client=127.0.0.1:54941/solr
   [junit4]   2> 315636 INFO  (TEST-ShardSplitTest.testSplitWithChaosMonkey-seed#[E4F22928E3181647]) [n:127.0.0.1:54961_gz_    ] o.a.s.c.c.ZkStateReader Updated live nodes from ZooKeeper... (0) -> (2)
   [junit4]   2> 315642 INFO  (TEST-ShardSplitTest.testSplitWithChaosMonkey-seed#[E4F22928E3181647]) [n:127.0.0.1:54961_gz_    ] o.a.s.c.Overseer Overseer (id=null) closing
   [junit4]   2> 315647 INFO  (TEST-ShardSplitTest.testSplitWithChaosMonkey-seed#[E4F22928E3181647]) [n:127.0.0.1:54961_gz_    ] o.a.s.c.ZkController Register node as live in ZooKeeper:/live_nodes/127.0.0.1:54961_gz_
   [junit4]   2> 315650 INFO  (zkCallback-312-thread-1-processing-n:127.0.0.1:54944_gz_) [n:127.0.0.1:54944_gz_    ] o.a.s.c.c.ZkStateReader Updated live nodes from ZooKeeper... (2) -> (3)
   [junit4]   2> 315651 INFO  (zkCallback-316-thread-1) [    ] o.a.s.c.c.ZkStateReader Updated live nodes from ZooKeeper... (2) -> (3)
   [junit4]   2> 315651 INFO  (zkCallback-322-thread-1-processing-n:127.0.0.1:54956_gz_) [n:127.0.0.1:54956_gz_    ] o.a.s.c.c.ZkStateReader Updated live nodes from ZooKeeper... (2) -> (3)
   [junit4]   2> 315651 INFO  (zkCallback-328-thread-1-processing-n:127.0.0.1:54961_gz_) [n:127.0.0.1:54961_gz_    ] o.a.s.c.c.ZkStateReader Updated live nodes from ZooKeeper... (2) -> (3)
   [junit4]   2> 315768 INFO  (TEST-ShardSplitTest.testSplitWithChaosMonkey-seed#[E4F22928E3181647]) [n:127.0.0.1:54961_gz_    ] o.a.s.c.CorePropertiesLocator Found 1 core definitions underneath /Users/jenkins/workspace/Lucene-Solr-6.x-MacOSX/solr/build/solr-core/test/J1/temp/solr.cloud.ShardSplitTest_E4F22928E3181647-001/shard-2-001/cores
   [junit4]   2> 315768 INFO  (TEST-ShardSplitTest.testSplitWithChaosMonkey-seed#[E4F22928E3181647]) [n:127.0.0.1:54961_gz_    ] o.a.s.c.CorePropertiesLocator Cores are: [collection1]
   [junit4]   2> 315783 INFO  (zkCallback-322-thread-1-processing-n:127.0.0.1:54956_gz_) [n:127.0.0.1:54956_gz_    ] o.a.s.c.c.ZkStateReader A cluster state change: [WatchedEvent state:SyncConnected type:NodeDataChanged path:/collections/collection1/state.json] for collection [collection1] has occurred - updating... (live nodes size: [3])
   [junit4]   2> 315788 INFO  (OverseerStateUpdate-97651977091350532-127.0.0.1:54944_gz_-n_0000000000) [n:127.0.0.1:54944_gz_    ] o.a.s.c.o.ReplicaMutator Assigning new node to shard shard=shard1
   [junit4]   2> 315897 INFO  (zkCallback-328-thread-1-processing-n:127.0.0.1:54961_gz_) [n:127.0.0.1:54961_gz_    ] o.a.s.c.c.ZkStateReader A cluster state change: [WatchedEvent state:SyncConnected type:NodeDataChanged path:/collections/collection1/state.json] for collection [collection1] has occurred - updating... (live nodes size: [3])
   [junit4]   2> 315897 INFO  (zkCallback-322-thread-1-processing-n:127.0.0.1:54956_gz_) [n:127.0.0.1:54956_gz_    ] o.a.s.c.c.ZkStateReader A cluster state change: [WatchedEvent state:SyncConnected type:NodeDataChanged path:/collections/collection1/state.json] for collection [collection1] has occurred - updating... (live nodes size: [3])
   [junit4]   2> 316811 WARN  (coreLoadExecutor-887-thread-1-processing-n:127.0.0.1:54961_gz_) [n:127.0.0.1:54961_gz_ c:collection1   x:collection1] o.a.s.c.Config Beginning with Solr 5.5, <mergePolicy> is deprecated, use <mergePolicyFactory> instead.
   [junit4]   2> 316812 INFO  (coreLoadExecutor-887-thread-1-processing-n:127.0.0.1:54961_gz_) [n:127.0.0.1:54961_gz_ c:collection1   x:collection1] o.a.s.c.SolrConfig Using Lucene MatchVersion: 6.6.0
   [junit4]   2> 316917 INFO  (coreLoadExecutor-887-thread-1-processing-n:127.0.0.1:54961_gz_) [n:127.0.0.1:54961_gz_ c:collection1   x:collection1] o.a.s.s.IndexSchema [collection1] Schema name=test
   [junit4]   2> 316987 WARN  (coreLoadExecutor-887-thread-1-processing-n:127.0.0.1:54961_gz_) [n:127.0.0.1:54961_gz_ c:collection1   x:collection1] o.a.s.s.IndexSchema [collection1] default search field in schema is text. WARNING: Deprecated, please use 'df' on request instead.
   [junit4]   2> 316991 INFO  (coreLoadExecutor-887-thread-1-processing-n:127.0.0.1:54961_gz_) [n:127.0.0.1:54961_gz_ c:collection1   x:collection1] o.a.s.s.IndexSchema Loaded schema test/1.6 with uniqueid field id
   [junit4]   2> 317018 INFO  (coreLoadExecutor-887-thread-1-processing-n:127.0.0.1:54961_gz_) [n:127.0.0.1:54961_gz_ c:collection1   x:collection1] o.a.s.c.CoreContainer Creating SolrCore 'collection1' using configuration from collection collection1
   [junit4]   2> 317018 INFO  (coreLoadExecutor-887-thread-1-processing-n:127.0.0.1:54961_gz_) [n:127.0.0.1:54961_gz_ c:collection1   x:collection1] o.a.s.c.SolrCore solr.RecoveryStrategy.Builder
   [junit4]   2> 317018 INFO  (coreLoadExecutor-887-thread-1-processing-n:127.0.0.1:54961_gz_) [n:127.0.0.1:54961_gz_ c:collection1   x:collection1] o.a.s.c.SolrCore [[collection1] ] Opening new SolrCore at [/Users/jenkins/workspace/Lucene-Solr-6.x-MacOSX/solr/build/solr-core/test/J1/temp/solr.cloud.ShardSplitTest_E4F22928E3181647-001/shard-2-001/cores/collection1], dataDir=[/Users/jenkins/workspace/Lucene-Solr-6.x-MacOSX/solr/build/solr-core/test/J1/temp/solr.cloud.ShardSplitTest_E4F22928E3181647-001/shard-2-001/cores/collection1/data/]
   [junit4]   2> 317019 INFO  (coreLoadExecutor-887-thread-1-processing-n:127.0.0.1:54961_gz_) [n:127.0.0.1:54961_gz_ c:collection1   x:collection1] o.a.s.c.JmxMonitoredMap JMX monitoring is enabled. Adding Solr mbeans to JMX Server: com.sun.jmx.mbeanserver.JmxMBeanServer@74bf5860
   [junit4]   2> 317021 INFO  (coreLoadExecutor-887-thread-1-processing-n:127.0.0.1:54961_gz_) [n:127.0.0.1:54961_gz_ c:collection1   x:collection1] o.a.s.u.RandomMergePolicy RandomMergePolicy wrapping class org.apache.lucene.index.TieredMergePolicy: [TieredMergePolicy: maxMergeAtOnce=24, maxMergeAtOnceExplicit=26, maxMergedSegmentMB=78.09765625, floorSegmentMB=1.1435546875, forceMergeDeletesPctAllowed=28.739950130920136, segmentsPerTier=30.0, maxCFSSegmentSizeMB=8.796093022207999E12, noCFSRatio=0.0
   [junit4]   2> 317032 WARN  (coreLoadExecutor-887-thread-1-processing-n:127.0.0.1:54961_gz_) [n:127.0.0.1:54961_gz_ c:collection1   x:collection1] o.a.s.c.RequestHandlers INVALID paramSet a in requestHandler {type = requestHandler,name = /dump,class = DumpRequestHandler,attributes = {initParams=a, name=/dump, class=DumpRequestHandler},args = {defaults={a=A,b=B}}}
   [junit4]   2> 317108 INFO  (coreLoadExecutor-887-thread-1-processing-n:127.0.0.1:54961_gz_) [n:127.0.0.1:54961_gz_ c:collection1   x:collection1] o.a.s.u.UpdateHandler Using UpdateLog implementation: org.apache.solr.update.UpdateLog
   [junit4]   2> 317108 INFO  (coreLoadExecutor-887-thread-1-processing-n:127.0.0.1:54961_gz_) [n:127.0.0.1:54961_gz_ c:collection1   x:collection1] o.a.s.u.UpdateLog Initializing UpdateLog: dataDir= defaultSyncLevel=FLUSH numRecordsToKeep=100 maxNumLogsToKeep=10 numVersionBuckets=65536
   [junit4]   2> 317109 INFO  (coreLoadExecutor-887-thread-1-processing-n:127.0.0.1:54961_gz_) [n:127.0.0.1:54961_gz_ c:collection1   x:collection1] o.a.s.u.CommitTracker Hard AutoCommit: disabled
   [junit4]   2> 317109 INFO  (coreLoadExecutor-887-thread-1-processing-n:127.0.0.1:54961_gz_) [n:127.0.0.1:54961_gz_ c:collection1   x:collection1] o.a.s.u.CommitTracker Soft AutoCommit: disabled
   [junit4]   2> 317110 INFO  (coreLoadExecutor-887-thread-1-processing-n:127.0.0.1:54961_gz_) [n:127.0.0.1:54961_gz_ c:collection1   x:collection1] o.a.s.u.RandomMergePolicy RandomMergePolicy wrapping class org.apache.lucene.index.AlcoholicMergePolicy: [AlcoholicMergePolicy: minMergeSize=0, mergeFactor=10, maxMergeSize=1934337337, maxMergeSizeForForcedMerge=9223372036854775807, calibrateSizeByDeletes=true, maxMergeDocs=2147483647, maxCFSSegmentSizeMB=8.796093022207999E12, noCFSRatio=0.1]
   [junit4]   2> 317111 INFO  (coreLoadExecutor-887-thread-1-processing-n:127.0.0.1:54961_gz_) [n:127.0.0.1:54961_gz_ c:collection1   x:collection1] o.a.s.s.SolrIndexSearcher Opening [Searcher@1ebf3326[collection1] main]
   [junit4]   2> 317113 INFO  (coreLoadExecutor-887-thread-1-processing-n:127.0.0.1:54961_gz_) [n:127.0.0.1:54961_gz_ c:collection1   x:collection1] o.a.s.r.ManagedResourceStorage Configured ZooKeeperStorageIO with znodeBase: /configs/conf1
   [junit4]   2> 317113 INFO  (coreLoadExecutor-887-thread-1-processing-n:127.0.0.1:54961_gz_) [n:127.0.0.1:54961_gz_ c:collection1   x:collection1] o.a.s.r.ManagedResourceStorage Loaded null at path _rest_managed.json using ZooKeeperStorageIO:path=/configs/conf1
   [junit4]   2> 317114 INFO  (coreLoadExecutor-887-thread-1-processing-n:127.0.0.1:54961_gz_) [n:127.0.0.1:54961_gz_ c:collection1   x:collection1] o.a.s.h.ReplicationHandler Commits will be reserved for  10000
   [junit4]   2> 317115 INFO  (searcherExecutor-888-thread-1-processing-n:127.0.0.1:54961_gz_ x:collection1 c:collection1) [n:127.0.0.1:54961_gz_ c:collection1   x:collection1] o.a.s.c.SolrCore [collection1] Registered new searcher Searcher@1ebf3326[collection1] main{ExitableDirectoryReader(UninvertingDirectoryReader())}
   [junit4]   2> 317116 INFO  (coreLoadExecutor-887-thread-1-processing-n:127.0.0.1:54961_gz_) [n:127.0.0.1:54961_gz_ c:collection1   x:collection1] o.a.s.u.UpdateLog Could not find max version in index or recent updates, using new clock 1562431639973265408
   [junit4]   2> 317125 INFO  (coreZkRegister-882-thread-1-processing-n:127.0.0.1:54961_gz_ x:collection1 c:collection1) [n:127.0.0.1:54961_gz_ c:collection1 s:shard1 r:core_node2 x:collection1] o.a.s.c.ShardLeaderElectionContext Enough replicas found to continue.
   [junit4]   2> 317125 INFO  (coreZkRegister-882-thread-1-processing-n:127.0.0.1:54961_gz_ x:collection1 c:collection1) [n:127.0.0.1:54961_gz_ c:collection1 s:shard1 r:core_node2 x:collection1] o.a.s.c.ShardLeaderElectionContext I may be the new leader - try and sync
   [junit4]   2> 317125 INFO  (coreZkRegister-882-thread-1-processing-n:127.0.0.1:54961_gz_ x:collection1 c:collection1) [n:127.0.0.1:54961_gz_ c:collection1 s:shard1 r:core_node2 x:collection1] o.a.s.c.SyncStrategy Sync replicas to http://127.0.0.1:54961/gz_/collection1/
   [junit4]   2> 317125 INFO  (coreZkRegister-882-thread-1-processing-n:127.0.0.1:54961_gz_ x:collection1 c:collection1) [n:127.0.0.1:54961_gz_ c:collection1 s:shard1 r:core_node2 x:collection1] o.a.s.c.SyncStrategy Sync Success - now sync replicas to me
   [junit4]   2> 317126 INFO  (coreZkRegister-882-thread-1-processing-n:127.0.0.1:54961_gz_ x:collection1 c:collection1) [n:127.0.0.1:54961_gz_ c:collection1 s:shard1 r:core_node2 x:collection1] o.a.s.c.SyncStrategy http://127.0.0.1:54961/gz_/collection1/ has no replicas
   [junit4]   2> 317126 INFO  (coreZkRegister-882-thread-1-processing-n:127.0.0.1:54961_gz_ x:collection1 c:collection1) [n:127.0.0.1:54961_gz_ c:collection1 s:shard1 r:core_node2 x:collection1] o.a.s.c.ShardLeaderElectionContext Found all replicas participating in election, clear LIR
   [junit4]   2> 317131 INFO  (coreZkRegister-882-thread-1-processing-n:127.0.0.1:54961_gz_ x:collection1 c:collection1) [n:127.0.0.1:54961_gz_ c:collection1 s:shard1 r:core_node2 x:collection1] o.a.s.c.ShardLeaderElectionContext I am the new leader: http://127.0.0.1:54961/gz_/collection1/ shard1
   [junit4]   2> 317242 INFO  (zkCallback-328-thread-1-processing-n:127.0.0.1:54961_gz_) [n:127.0.0.1:54961_gz_    ] o.a.s.c.c.ZkStateReader A cluster state change: [WatchedEvent state:SyncConnected type:NodeDataChanged path:/collections/collection1/state.json] for collection [collection1] has occurred - updating... (live nodes size: [3])
   [junit4]   2> 317242 INFO  (zkCallback-322-thread-1-processing-n:127.0.0.1:54956_gz_) [n:127.0.0.1:54956_gz_    ] o.a.s.c.c.ZkStateReader A cluster state change: [WatchedEvent state:SyncConnected type:NodeDataChanged path:/collections/collection1/state.json] for collection [collection1] has occurred - updating... (live nodes size: [3])
   [junit4]   2> 317290 INFO  (coreZkRegister-882-thread-1-processing-n:127.0.0.1:54961_gz_ x:collection1 c:collection1) [n:127.0.0.1:54961_gz_ c:collection1 s:shard1 r:core_node2 x:collection1] o.a.s.c.ZkController I am the leader, no recovery necessary
   [junit4]   2> 317402 INFO  (zkCallback-328-thread-1-processing-n:127.0.0.1:54961_gz_) [n:127.0.0.1:54961_gz_    ] o.a.s.c.c.ZkStateReader A cluster state change: [WatchedEvent state:SyncConnected type:NodeDataChanged path:/collections/collection1/state.json] for collection [collection1] has occurred - updating... (live nodes size: [3])
   [junit4]   2> 317402 INFO  (zkCallback-322-thread-1-processing-n:127.0.0.1:54956_gz_) [n:127.0.0.1:54956_gz_    ] o.a.s.c.c.ZkStateReader A cluster state change: [WatchedEvent state:SyncConnected type:NodeDataChanged path:/collections/collection1/state.json] for collection [collection1] has occurred - updating... (live nodes size: [3])
   [junit4]   2> 317672 INFO  (TEST-ShardSplitTest.testSplitWithChaosMonkey-seed#[E4F22928E3181647]) [    ] o.a.s.SolrTestCaseJ4 Writing core.properties file to /Users/jenkins/workspace/Lucene-Solr-6.x-MacOSX/solr/build/solr-core/test/J1/temp/solr.cloud.ShardSplitTest_E4F22928E3181647-001/shard-3-001/cores/collection1
   [junit4]   2> 317673 INFO  (TEST-ShardSplitTest.testSplitWithChaosMonkey-seed#[E4F22928E3181647]) [    ] o.a.s.c.AbstractFullDistribZkTestBase create jetty 3 in directory /Users/jenkins/workspace/Lucene-Solr-6.x-MacOSX/solr/build/solr-core/test/J1/temp/solr.cloud.ShardSplitTest_E4F22928E3181647-001/shard-3-001
   [junit4]   2> 317674 INFO  (TEST-ShardSplitTest.testSplitWithChaosMonkey-seed#[E4F22928E3181647]) [    ] o.e.j.s.Server jetty-9.3.14.v20161028
   [junit4]   2> 317676 INFO  (TEST-ShardSplitTest.testSplitWithChaosMonkey-seed#[E4F22928E3181647]) [    ] o.e.j.s.h.ContextHandler Started o.e.j.s.ServletContextHandler@37dd8f0e{/gz_,null,AVAILABLE}
   [junit4]   2> 317676 INFO  (TEST-ShardSplitTest.testSplitWithChaosMonkey-seed#[E4F22928E3181647]) [    ] o.e.j.s.AbstractConnector Started ServerConnector@7b0da7ab{HTTP/1.1,[http/1.1]}{127.0.0.1:54966}
   [junit4]   2> 317677 INFO  (TEST-ShardSplitTest.testSplitWithChaosMonkey-seed#[E4F22928E3181647]) [    ] o.e.j.s.Server Started @323032ms
   [junit4]   2> 317677 INFO  (TEST-ShardSplitTest.testSplitWithChaosMonkey-seed#[E4F22928E3181647]) [    ] o.a.s.c.s.e.JettySolrRunner Jetty properties: {solr.data.dir=/Users/jenkins/workspace/Lucene-Solr-6.x-MacOSX/solr/build/solr-core/test/J1/temp/solr.cloud.ShardSplitTest_E4F22928E3181647-001/tempDir-001/jetty3, solrconfig=solrconfig.xml, hostContext=/gz_, hostPort=54966, coreRootDirectory=/Users/jenkins/workspace/Lucene-Solr-6.x-MacOSX/solr/build/solr-core/test/J1/../../../../../../../../../Users/jenkins/workspace/Lucene-Solr-6.x-MacOSX/solr/build/solr-core/test/J1/temp/solr.cloud.ShardSplitTest_E4F22928E3181647-001/shard-3-001/cores}
   [junit4]   2> 317678 ERROR (TEST-ShardSplitTest.testSplitWithChaosMonkey-seed#[E4F22928E3181647]) [    ] o.a.s.s.StartupLoggingUtils Missing Java Option solr.log.dir. Logging may be missing or incomplete.
   [junit4]   2> 317678 INFO  (TEST-ShardSplitTest.testSplitWithChaosMonkey-seed#[E4F22928E3181647]) [    ] o.a.s.s.SolrDispatchFilter  ___      _       Welcome to Apache Solr™ version 6.6.0
   [junit4]   2> 317678 INFO  (TEST-ShardSplitTest.testSplitWithChaosMonkey-seed#[E4F22928E3181647]) [    ] o.a.s.s.SolrDispatchFilter / __| ___| |_ _   Starting in cloud mode on port null
   [junit4]   2> 317678 INFO  (TEST-ShardSplitTest.testSplitWithChaosMonkey-seed#[E4F22928E3181647]) [    ] o.a.s.s.SolrDispatchFilter \__ \/ _ \ | '_|  Install dir: null
   [junit4]   2> 317678 INFO  (TEST-ShardSplitTest.testSplitWithChaosMonkey-seed#[E4F22928E3181647]) [    ] o.a.s.s.SolrDispatchFilter |___/\___/_|_|    Start time: 2017-03-20T23:02:06.745Z
   [junit4]   2> 317685 INFO  (TEST-ShardSplitTest.testSplitWithChaosMonkey-seed#[E4F22928E3181647]) [    ] o.a.s.s.SolrDispatchFilter Loading solr.xml from SolrHome (not found in ZooKeeper)
   [junit4]   2> 317685 INFO  (TEST-ShardSplitTest.testSplitWithChaosMonkey-seed#[E4F22928E3181647]) [    ] o.a.s.c.SolrXmlConfig Loading container configuration from /Users/jenkins/workspace/Lucene-Solr-6.x-MacOSX/solr/build/solr-core/test/J1/temp/solr.cloud.ShardSplitTest_E4F22928E3181647-001/shard-3-001/solr.xml
   [junit4]   2> 317711 INFO  (TEST-ShardSplitTest.testSplitWithChaosMonkey-seed#[E4F22928E3181647]) [    ] o.a.s.u.UpdateShardHandler Creating UpdateShardHandler HTTP client with params: socketTimeout=340000&connTimeout=45000&retry=true
   [junit4]   2> 317712 INFO  (TEST-ShardSplitTest.testSplitWithChaosMonkey-seed#[E4F22928E3181647]) [    ] o.a.s.c.ZkContainer Zookeeper client=127.0.0.1:54941/solr
   [junit4]   2> 317731 INFO  (TEST-ShardSplitTest.testSplitWithChaosMonkey-seed#[E4F22928E3181647]) [n:127.0.0.1:54966_gz_    ] o.a.s.c.c.ZkStateReader Updated live nodes from ZooKeeper... (0) -> (3)
   [junit4]   2> 317736 INFO  (TEST-ShardSplitTest.testSplitWithChaosMonkey-seed#[E4F22928E3181647]) [n:127.0.0.1:54966_gz_    ] o.a.s.c.Overseer Overseer (id=null) closing
   [junit4]   2> 317740 INFO  (TEST-ShardSplitTest.testSplitWithChaosMonkey-seed#[E4F22928E3181647]) [n:127.0.0.1:54966_gz_    ] o.a.s.c.ZkController Register node as live in ZooKeeper:/live_nodes/127.0.0.1:54966_gz_
   [junit4]   2> 317743 INFO  (zkCallback-312-thread-3-processing-n:127.0.0.1:54944_gz_) [n:127.0.0.1:54944_gz_    ] o.a.s.c.c.ZkStateReader Updated live nodes from ZooKeeper... (3) -> (4)
   [junit4]   2> 317744 INFO  (zkCallback-328-thread-1-processing-n:127.0.0.1:54961_gz_) [n:127.0.0.1:54961_gz_    ] o.a.s.c.c.ZkStateReader Updated live nodes from ZooKeeper... (3) -> (4)
   [junit4]   2> 317744 INFO  (zkCallback-322-thread-1-processing-n:127.0.0.1:54956_gz_) [n:127.0.0.1:54956_gz_    ] o.a.s.c.c.ZkStateReader Updated live nodes from ZooKeeper... (3) -> (4)
   [junit4]   2> 317745 INFO  (zkCallback-316-thread-1) [    ] o.a.s.c.c.ZkStateReader Updated live nodes from ZooKeeper... (3) -> (4)
   [junit4]   2> 317745 INFO  (zkCallback-334-thread-1-processing-n:127.0.0.1:54966_gz_) [n:127.0.0.1:54966_gz_    ] o.a.s.c.c.ZkStateReader Updated live nodes from ZooKeeper... (3) -> (4)
   [junit4]   2> 317862 INFO  (zkCallback-322-thread-1-processing-n:127.0.0.1:54956_gz_) [n:127.0.0.1:54956_gz_    ] o.a.s.c.c.ZkStateReader A cluster state change: [WatchedEvent state:SyncConnected type:NodeDataChanged path:/collections/collection1/state.json] for collection [collection1] has occurred - updating... (live nodes size: [4])
   [junit4]   2> 317862 INFO  (zkCallback-328-thread-1-processing-n:127.0.0.1:54961_gz_) [n:127.0.0.1:54961_gz_    ] o.a.s.c.c.ZkStateReader A cluster state change: [WatchedEvent state:SyncConnected type:NodeDataChanged path:/collections/collection1/state.json] for collection [collection1] has occurred - updating... (live nodes size: [4])
   [junit4]   2> 317866 INFO  (TEST-ShardSplitTest.testSplitWithChaosMonkey-seed#[E4F22928E3181647]) [n:127.0.0.1:54966_gz_    ] o.a.s.c.CorePropertiesLocator Found 1 core definitions underneath /Users/jenkins/workspace/Lucene-Solr-6.x-MacOSX/solr/build/solr-core/test/J1/../../../../../../../../../Users/jenkins/workspace/Lucene-Solr-6.x-MacOSX/solr/build/solr-core/test/J1/temp/solr.cloud.ShardSplitTest_E4F22928E3181647-001/shard-3-001/cores
   [junit4]   2> 317867 INFO  (TEST-ShardSplitTest.testSplitWithChaosMonkey-seed#[E4F22928E3181647]) [n:127.0.0.1:54966_gz_    ] o.a.s.c.CorePropertiesLocator Cores are: [collection1]
   [junit4]   2> 317870 INFO  (OverseerStateUpdate-97651977091350532-127.0.0.1:54944_gz_-n_0000000000) [n:127.0.0.1:54944_gz_    ] o.a.s.c.o.ReplicaMutator Assigning new node to shard shard=shard2
   [junit4]   2> 317980 INFO  (zkCallback-334-thread-1-processing-n:127.0.0.1:54966_gz_) [n:127.0.0.1:54966_gz_    ] o.a.s.c.c.ZkStateReader A cluster state change: [WatchedEvent state:SyncConnected type:NodeDataChanged path:/collections/collection1/state.json] for collection [collection1] has occurred - updating... (live nodes size: [4])
   [junit4]   2> 317980 INFO  (zkCallback-328-thread-1-processing-n:127.0.0.1:54961_gz_) [n:127.0.0.1:54961_gz_    ] o.a.s.c.c.ZkStateReader A cluster state change: [WatchedEvent state:SyncConnected type:NodeDataChanged path:/collections/collection1/state.json] for collection [collection1] has occurred - updating... (live nodes size: [4])
   [junit4]   2> 317981 INFO  (zkCallback-322-thread-1-processing-n:127.0.0.1:54956_gz_) [n:127.0.0.1:54956_gz_    ] o.a.s.c.c.ZkStateReader A cluster state change: [WatchedEvent state:SyncConnected type:NodeDataChanged path:/collections/collection1/state.json] for collection [collection1] has occurred - updating... (live nodes size: [4])
   [junit4]   2> 318892 WARN  (coreLoadExecutor-898-thread-1-processing-n:127.0.0.1:54966_gz_) [n:127.0.0.1:54966_gz_ c:collection1   x:collection1] o.a.s.c.Config Beginning with Solr 5.5, <mergePolicy> is deprecated, use <mergePolicyFactory> instead.
   [junit4]   2> 318893 INFO  (coreLoadExecutor-898-thread-1-processing-n:127.0.0.1:54966_gz_) [n:127.0.0.1:54966_gz_ c:collection1   x:collection1] o.a.s.c.SolrConfig Using Lucene MatchVersion: 6.6.0
   [junit4]   2> 318912 INFO  (coreLoadExecutor-898-thread-1-processing-n:127.0.0.1:54966_gz_) [n:127.0.0.1:54966_gz_ c:collection1   x:collection1] o.a.s.s.IndexSchema [collection1] Schema name=test
   [junit4]   2> 318984 WARN  (coreLoadExecutor-898-thread-1-processing-n:127.0.0.1:54966_gz_) [n:127.0.0.1:54966_gz_ c:collection1   x:collection1] o.a.s.s.IndexSchema [collection1] default search field in schema is text. WARNING: Deprecated, please use 'df' on request instead.
   [junit4]   2> 318985 INFO  (coreLoadExecutor-898-thread-1-processing-n:127.0.0.1:54966_gz_) [n:127.0.0.1:54966_gz_ c:collection1   x:collection1] o.a.s.s.IndexSchema Loaded schema test/1.6 with uniqueid field id
   [junit4]   2> 319015 INFO  (coreLoadExecutor-898-thread-1-processing-n:127.0.0.1:54966_gz_) [n:127.0.0.1:54966_gz_ c:collection1   x:collection1] o.a.s.c.CoreContainer Creating SolrCore 'collection1' using configuration from collection collection1
   [junit4]   2> 319016 INFO  (coreLoadExecutor-898-thread-1-processing-n:127.0.0.1:54966_gz_) [n:127.0.0.1:54966_gz_ c:collection1   x:collection1] o.a.s.c.SolrCore solr.RecoveryStrategy.Builder
   [junit4]   2> 319016 INFO  (coreLoadExecutor-898-thread-1-processing-n:127.0.0.1:54966_gz_) [n:127.0.0.1:54966_gz_ c:collection1   x:collection1] o.a.s.c.SolrCore [[collection1] ] Opening new SolrCore at [/Users/jenkins/workspace/Lucene-Solr-6.x-MacOSX/solr/build/solr-core/test/J1/temp/solr.cloud.ShardSplitTest_E4F22928E3181647-001/shard-3-001/cores/collection1], dataDir=[/Users/jenkins/workspace/Lucene-Solr-6.x-MacOSX/solr/build/solr-core/test/J1/../../../../../../../../../Users/jenkins/workspace/Lucene-Solr-6.x-MacOSX/solr/build/solr-core/test/J1/temp/solr.cloud.ShardSplitTest_E4F22928E3181647-001/shard-3-001/cores/collection1/data/]
   [junit4]   2> 319016 INFO  (coreLoadExecutor-898-thread-1-processing-n:127.0.0.1:54966_gz_) [n:127.0.0.1:54966_gz_ c:collection1   x:collection1] o.a.s.c.JmxMonitoredMap JMX monitoring is enabled. Adding Solr mbeans to JMX Server: com.sun.jmx.mbeanserver.JmxMBeanServer@74bf5860
   [junit4]   2> 319019 INFO  (coreLoadExecutor-898-thread-1-processing-n:127.0.0.1:54966_gz_) [n:127.0.0.1:54966_gz_ c:collection1   x:collection1] o.a.s.u.RandomMergePolicy RandomMergePolicy wrapping class org.apache.lucene.index.TieredMergePolicy: [TieredMergePolicy: maxMergeAtOnce=24, maxMergeAtOnceExplicit=26, maxMergedSegmentMB=78.09765625, floorSegmentMB=1.1435546875, forceMergeDeletesPctAllowed=28.739950130920136, segmentsPerTier=30.0, maxCFSSegmentSizeMB=8.796093022207999E12, noCFSRatio=0.0
   [junit4]   2> 319039 WARN  (coreLoadExecutor-898-thread-1-processing-n:127.0.0.1:54966_gz_) [n:127.0.0.1:54966_gz_ c:collection1   x:collection1] o.a.s.c.RequestHandlers INVALID paramSet a in requestHandler {type = requestHandler,name = /dump,class = DumpRequestHandler,attributes = {initParams=a, name=/dump, class=DumpRequestHandler},args = {defaults={a=A,b=B}}}
   [junit4]   2> 319118 INFO  (coreLoadExecutor-898-thread-1-processing-n:127.0.0.1:54966_gz_) [n:127.0.0.1:54966_gz_ c:collection1   x:collection1] o.a.s.u.UpdateHandler Using UpdateLog implementation: org.apache.solr.update.UpdateLog
   [junit4]   2> 319118 INFO  (coreLoadExecutor-898-thread-1-processing-n:127.0.0.1:54966_gz_) [n:127.0.0.1:54966_gz_ c:collection1   x:collection1] o.a.s.u.UpdateLog Initializing UpdateLog: dataDir= defaultSyncLevel=FLUSH numRecordsToKeep=100 maxNumLogsToKeep=10 numVersionBuckets=65536
   [junit4]   2> 319119 INFO  (coreLoadExecutor-898-thread-1-processing-n:127.0.0.1:54966_gz_) [n:127.0.0.1:54966_gz_ c:collection1   x:collection1] o.a.s.u.CommitTracker Hard AutoCommit: disabled
   [junit4]   2> 319120 INFO  (coreLoadExecutor-898-thread-1-processing-n:127.0.0.1:54966_gz_) [n:127.0.0.1:54966_gz_ c:collection1   x:collection1] o.a.s.u.CommitTracker Soft AutoCommit: disabled
   [junit4]   2> 319121 INFO  (coreLoadExecutor-898-thread-1-processing-n:127.0.0.1:54966_gz_) [n:127.0.0.1:54966_gz_ c:collection1   x:collection1] o.a.s.u.RandomMergePolicy RandomMergePolicy wrapping class org.apache.lucene.index.AlcoholicMergePolicy: [AlcoholicMergePolicy: minMergeSize=0, mergeFactor=10, maxMergeSize=1934337337, maxMergeSizeForForcedMerge=9223372036854775807, calibrateSizeByDeletes=true, maxMergeDocs=2147483647, maxCFSSegmentSizeMB=8.796093022207999E12, noCFSRatio=0.1]
   [junit4]   2> 319122 INFO  (coreLoadExecutor-898-thread-1-processing-n:127.0.0.1:54966_gz_) [n:127.0.0.1:54966_gz_ c:collection1   x:collection1] o.a.s.s.SolrIndexSearcher Opening [Searcher@7194d7d5[collection1] main]
   [junit4]   2> 319123 INFO  (coreLoadExecutor-898-thread-1-processing-n:127.0.0.1:54966_gz_) [n:127.0.0.1:54966_gz_ c:collection1   x:collection1] o.a.s.r.ManagedResourceStorage Configured ZooKeeperStorageIO with znodeBase: /configs/conf1
   [junit4]   2> 319124 INFO  (coreLoadExecutor-898-thread-1-processing-n:127.0.0.1:54966_gz_) [n:127.0.0.1:54966_gz_ c:collection1   x:collection1] o.a.s.r.ManagedResourceStorage Loaded null at path _rest_managed.json using ZooKeeperStorageIO:path=/configs/conf1
   [junit4]   2> 319124 INFO  (coreLoadExecutor-898-thread-1-processing-n:127.0.0.1:54966_gz_) [n:127.0.0.1:54966_gz_ c:collection1   x:collection1] o.a.s.h.ReplicationHandler Commits will be reserved for  10000
   [junit4]   2> 319126 INFO  (searcherExecutor-899-thread-1-processing-n:127.0.0.1:54966_gz_ x:collection1 c:collection1) [n:127.0.0.1:54966_gz_ c:collection1   x:collection1] o.a.s.c.SolrCore [collection1] Registered new searcher Searcher@7194d7d5[collection1] main{ExitableDirectoryReader(UninvertingDirectoryReader())}
   [junit4]   2> 319127 INFO  (coreLoadExecutor-898-thread-1-processing-n:127.0.0.1:54966_gz_) [n:127.0.0.1:54966_gz_ c:collection1   x:collection1] o.a.s.u.UpdateLog Could not find max version in index or recent updates, using new clock 1562431642081951744
   [junit4]   2> 319133 INFO  (coreZkRegister-893-thread-1-processing-n:127.0.0.1:54966_gz_ x:collection1 c:collection1) [n:127.0.0.1:54966_gz_ c:collection1 s:shard2 r:core_node3 x:collection1] o.a.s.c.ZkController Core needs to recover:collection1
   [junit4]   2> 319134 INFO  (updateExecutor-331-thread-1-processing-n:127.0.0.1:54966_gz_ x:collection1 s:shard2 c:collection1 r:core_node3) [n:127.0.0.1:54966_gz_ c:collection1 s:shard2 r:core_node3 x:collection1] o.a.s.u.DefaultSolrCoreState Running recovery
   [junit4]   2> 319134 INFO  (recoveryExecutor-332-thread-1-processing-n:127.0.0.1:54966_gz_ x:collection1 s:shard2 c:collection1 r:core_node3) [n:127.0.0.1:54966_gz_ c:collection1 s:shard2 r:core_node3 x:collection1] o.a.s.c.RecoveryStrategy Starting recovery process. recoveringAfterStartup=true
   [junit4]   2> 319135 INFO  (recoveryExecutor-332-thread-1-processing-n:127.0.0.1:54966_gz_ x:collection1 s:shard2 c:collection1 r:core_node3) [n:127.0.0.1:54966_gz_ c:collection1 s:shard2 r:core_node3 x:collection1] o.a.s.c.RecoveryStrategy ###### startupVersions=[[]]
   [junit4]   2> 319135 INFO  (recoveryExecutor-332-thread-1-processing-n:127.0.0.1:54966_gz_ x:collection1 s:shard2 c:collection1 r:core_node3) [n:127.0.0.1:54966_gz_ c:collection1 s:shard2 r:core_node3 x:collection1] o.a.s.c.RecoveryStrategy Begin buffering updates. core=[collection1]
   [junit4]   2> 319135 INFO  (recoveryExecutor-332-thread-1-processing-n:127.0.0.1:54966_gz_ x:collection1 s:shard2 c:collection1 r:core_node3) [n:127.0.0.1:54966_gz_ c:collection1 s:shard2 r:core_node3 x:collection1] o.a.s.u.UpdateLog Starting to buffer updates. FSUpdateLog{state=ACTIVE, tlog=null}
   [junit4]   2> 319135 INFO  (recoveryExecutor-332-thread-1-processing-n:127.0.0.1:54966_gz_ x:collection1 s:shard2 c:collection1 r:core_node3) [n:127.0.0.1:54966_gz_ c:collection1 s:shard2 r:core_node3 x:collection1] o.a.s.c.RecoveryStrategy Publishing state of core [collection1] as recovering, leader is [http://127.0.0.1:54956/gz_/collection1/] and I am [http://127.0.0.1:54966/gz_/collection1/]
   [junit4]   2> 319140 INFO  (recoveryExecutor-332-thread-1-processing-n:127.0.0.1:54966_gz_ x:collection1 s:shard2 c:collection1 r:core_node3) [n:127.0.0.1:54966_gz_ c:collection1 s:shard2 r:core_node3 x:collection1] o.a.s.c.RecoveryStrategy Sending prep recovery command to [http://127.0.0.1:54956/gz_]; [WaitForState: action=PREPRECOVERY&core=collection1&nodeName=127.0.0.1:54966_gz_&coreNodeName=core_node3&state=recovering&checkLive=true&onlyIfLeader=true&onlyIfLeaderActive=true]
   [junit4]   2> 319147 INFO  (qtp1094578963-1789) [n:127.0.0.1:54956_gz_    ] o.a.s.h.a.PrepRecoveryOp Going to wait for coreNodeName: core_node3, state: recovering, checkLive: true, onlyIfLeader: true, onlyIfLeaderActive: true
   [junit4]   2> 319148 INFO  (qtp1094578963-1789) [n:127.0.0.1:54956_gz_    ] o.a.s.h.a.PrepRecoveryOp Will wait a max of 183 seconds to see collection1 (shard2 of collection1) have state: recovering
   [junit4]   2> 319148 INFO  (qtp1094578963-1789) [n:127.0.0.1:54956_gz_    ] o.a.s.h.a.PrepRecoveryOp In WaitForState(recovering): collection=collection1, shard=shard2, thisCore=collection1, leaderDoesNotNeedRecovery=false, isLeader? true, live=true, checkLive=true, currentState=down, localState=active, nodeName=127.0.0.1:54966_gz_, coreNodeName=core_node3, onlyIfActiveCheckResult=false, nodeProps: core_node3:{"core":"collection1","base_url":"http://127.0.0.1:54966/gz_","node_name":"127.0.0.1:54966_gz_","state":"down"}
   [junit4]   2> 319248 INFO  (zkCallback-334-thread-1-processing-n:127.0.0.1:54966_gz_) [n:127.0.0.1:54966_gz_    ] o.a.s.c.c.ZkStateReader A cluster state change: [WatchedEvent state:SyncConnected type:NodeDataChanged path:/collections/collection1/state.json] for collection [collection1] has occurred - updating... (live nodes size: [4])
   [junit4]   2> 319248 INFO  (zkCallback-328-thread-1-processing-n:127.0.0.1:54961_gz_) [n:127.0.0.1:54961_gz_    ] o.a.s.c.c.ZkStateReader A cluster state change: [WatchedEvent state:SyncConnected type:NodeDataChanged path:/collections/collection1/state.json] for collection [collection1] has occurred - updating... (live nodes size: [4])
   [junit4]   2> 319248 INFO  (zkCallback-322-thread-1-processing-n:127.0.0.1:54956_gz_) [n:127.0.0.1:54956_gz_    ] o.a.s.c.c.ZkStateReader A cluster state change: [WatchedEvent state:SyncConnected type:NodeDataChanged path:/collections/collection1/state.json] for collection [collection1] has occurred - updating... (live nodes size: [4])
   [junit4]   2> 319892 INFO  (TEST-ShardSplitTest.testSplitWithChaosMonkey-seed#[E4F22928E3181647]) [    ] o.a.s.SolrTestCaseJ4 Writing core.properties file to /Users/jenkins/workspace/Lucene-Solr-6.x-MacOSX/solr/build/solr-core/test/J1/temp/solr.cloud.ShardSplitTest_E4F22928E3181647-001/shard-4-001/cores/collection1
   [junit4]   2> 319894 INFO  (TEST-ShardSplitTest.testSplitWithChaosMonkey-seed#[E4F22928E3181647]) [    ] o.a.s.c.AbstractFullDistribZkTestBase create jetty 4 in directory /Users/jenkins/workspace/Lucene-Solr-6.x-MacOSX/solr/build/solr-core/test/J1/temp/solr.cloud.ShardSplitTest_E4F22928E3181647-001/shard-4-001
   [junit4]   2> 319894 INFO  (TEST-ShardSplitTest.testSplitWithChaosMonkey-seed#[E4F22928E3181647]) [    ] o.e.j.s.Server jetty-9.3.14.v20161028
   [junit4]   2> 319896 INFO  (TEST-ShardSplitTest.testSplitWithChaosMonkey-seed#[E4F22928E3181647]) [    ] o.e.j.s.h.ContextHandler Started o.e.j.s.ServletContextHandler@30ee7f56{/gz_,null,AVAILABLE}
   [junit4]   2> 319897 INFO  (TEST-ShardSplitTest.testSplitWithChaosMonkey-seed#[E4F22928E3181647]) [    ] o.e.j.s.AbstractConnector Started ServerConnector@5225b1d2{HTTP/1.1,[http/1.1]}{127.0.0.1:54972}
   [junit4]   2> 319897 INFO  (TEST-ShardSplitTest.testSplitWithChaosMonkey-seed#[E4F22928E3181647]) [    ] o.e.j.s.Server Started @325252ms
   [junit4]   2> 319897 INFO  (TEST-ShardSplitTest.testSplitWithChaosMonkey-seed#[E4F22928E3181647]) [    ] o.a.s.c.s.e.JettySolrRunner Jetty properties: {solr.data.dir=/Users/jenkins/workspace/Lucene-Solr-6.x-MacOSX/solr/build/solr-core/test/J1/temp/solr.cloud.ShardSplitTest_E4F22928E3181647-001/tempDir-001/jetty4, solrconfig=solrconfig.xml, hostContext=/gz_, hostPort=54972, coreRootDirectory=/Users/jenkins/workspace/Lucene-Solr-6.x-MacOSX/solr/build/solr-core/test/J1/temp/solr.cloud.ShardSplitTest_E4F22928E3181647-001/shard-4-001/cores}
   [junit4]   2> 319898 ERROR (TEST-ShardSplitTest.testSplitWithChaosMonkey-seed#[E4F22928E3181647]) [    ] o.a.s.s.StartupLoggingUtils Missing Java Option solr.log.dir. Logging may be missing or incomplete.
   [junit4]   2> 319899 INFO  (TEST-ShardSplitTest.testSplitWithChaosMonkey-seed#[E4F22928E3181647]) [    ] o.a.s.s.SolrDispatchFilter  ___      _       Welcome to Apache Solr™ version 6.6.0
   [junit4]   2> 319899 INFO  (TEST-ShardSplitTest.testSplitWithChaosMonkey-seed#[E4F22928E3181647]) [    ] o.a.s.s.SolrDispatchFilter / __| ___| |_ _   Starting in cloud mode on port null
   [junit4]   2> 319899 INFO  (TEST-ShardSplitTest.testSplitWithChaosMonkey-seed#[E4F22928E3181647]) [    ] o.a.s.s.SolrDispatchFilter \__ \/ _ \ | '_|  Install dir: null
   [junit4]   2> 319899 INFO  (TEST-ShardSplitTest.testSplitWithChaosMonkey-seed#[E4F22928E3181647]) [    ] o.a.s.s.SolrDispatchFilter |___/\___/_|_|    Start time: 2017-03-20T23:02:08.966Z
   [junit4]   2> 319904 INFO  (TEST-ShardSplitTest.testSplitWithChaosMonkey-seed#[E4F22928E3181647]) [    ] o.a.s.s.SolrDispatchFilter Loading solr.xml from SolrHome (not found in ZooKeeper)
   [junit4]   2> 319904 INFO  (TEST-ShardSplitTest.testSplitWithChaosMonkey-seed#[E4F22928E3181647]) [    ] o.a.s.c.SolrXmlConfig Loading container configuration from /Users/jenkins/workspace/Lucene-Solr-6.x-MacOSX/solr/build/solr-core/test/J1/temp/solr.cloud.ShardSplitTest_E4F22928E3181647-001/shard-4-001/solr.xml
   [junit4]   2> 319939 INFO  (TEST-ShardSplitTest.testSplitWithChaosMonkey-seed#[E4F22928E3181647]) [    ] o.a.s.u.UpdateShardHandler Creating UpdateShardHandler HTTP client with params: socketTimeout=340000&connTimeout=45000&retry=true
   [junit4]   2> 319940 INFO  (TEST-ShardSplitTest.testSplitWithChaosMonkey-seed#[E4F22928E3181647]) [    ] o.a.s.c.ZkContainer Zookeeper client=127.0.0.1:54941/solr
   [junit4]   2> 319959 INFO  (TEST-ShardSplitTest.testSplitWithChaosMonkey-seed#[E4F22928E3181647]) [n:127.0.0.1:54972_gz_    ] o.a.s.c.c.ZkStateReader Updated live nodes from ZooKeeper... (0) -> (4)
   [junit4]   2> 319964 INFO  (TEST-ShardSplitTest.testSplitWithChaosMonkey-seed#[E4F22928E3181647]) [n:127.0.0.1:54972_gz_    ] o.a.s.c.Overseer Overseer (id=null) closing
   [junit4]   2> 319968 INFO  (TEST-ShardSplitTest.testSplitWithChaosMonkey-seed#[E4F22928E3181647]) [n:127.0.0.1:54972_gz_    ] o.a.s.c.ZkController Register node as live in ZooKeeper:/live_nodes/127.0.0.1:54972_gz_
   [junit4]   2> 319971 INFO  (zkCallback-312-thread-3-processing-n:127.0.0.1:54944_gz_) [n:127.0.0.1:54944_gz_    ] o.a.s.c.c.ZkStateReader Updated live nodes from ZooKeeper... (4) -> (5)
   [junit4]   2> 319973 INFO  (zkCallback-341-thread-1-processing-n:127.0.0.1:54972_gz_) [n:127.0.0.1:54972_gz_    ] o.a.s.c.c.ZkStateReader Updated live nodes from ZooKeeper... (4) -> (5)
   [junit4]   2> 319971 INFO  (zkCallback-334-thread-1-processing-n:127.0.0.1:54966_gz_) [n:127.0.0.1:54966_gz_    ] o.a.s.c.c.ZkStateReader Updated live nodes from ZooKeeper... (4) -> (5)
   [junit4]   2> 319971 INFO  (zkCallback-316-thread-1) [    ] o.a.s.c.c.ZkStateReader Updated live nodes from ZooKeeper... (4) -> (5)
   [junit4]   2> 319973 INFO  (zkCallback-328-thread-1-processing-n:127.0.0.1:54961_gz_) [n:127.0.0.1:54961_gz_    ] o.a.s.c.c.ZkStateReader Updated live nodes from ZooKeeper... (4) -> (5)
   [junit4]   2> 319974 INFO  (zkCallback-322-thread-1-processing-n:127.0.0.1:54956_gz_) [n:127.0.0.1:54956_gz_    ] o.a.s.c.c.ZkStateReader Updated live nodes from ZooKeeper... (4) -> (5)
   [junit4]   2> 320089 INFO  (zkCallback-334-thread-1-processing-n:127.0.0.1:54966_gz_) [n:127.0.0.1:54966_gz_    ] o.a.s.c.c.ZkStateReader A cluster state change: [WatchedEvent state:SyncConnected type:NodeDataChanged path:/collections/collection1/state.json] for collection [collection1] has occurred - updating... (live nodes size: [5])
   [junit4]   2> 320089 INFO  (zkCallback-322-thread-1-processing-n:127.0.0.1:54956_gz_) [n:127.0.0.1:54956_gz_    ] o.a.s.c.c.ZkStateReader A cluster state change: [WatchedEvent state:SyncConnected type:NodeDataChanged path:/collections/collection1/state.json] for collection [collection1] has occurred - updating... (live nodes size: [5])
   [junit4]   2> 320090 INFO  (zkCallback-328-thread-1-processing-n:127.0.0.1:54961_gz_) [n:127.0.0.1:54961_gz_    ] o.a.s.c.c.ZkStateReader A cluster state change: [WatchedEvent state:SyncConnected type:NodeDataChanged path:/collections/collection1/state.json] for collection [collection1] has occurred - updating... (live nodes size: [5])
   [junit4]   2> 320105 INFO  (TEST-ShardSplitTest.testSplitWithChaosMonkey-seed#[E4F22928E3181647]) [n:127.0.0.1:54972_gz_    ] o.a.s.c.CorePropertiesLocator Found 1 core definitions underneath /Users/jenkins/workspace/Lucene-Solr-6.x-MacOSX/solr/build/solr-core/test/J1/temp/solr.cloud.ShardSplitTest_E4F22928E3181647-001/shard-4-001/cores
   [junit4]   2> 320106 INFO  (TEST-ShardSplitTest.testSplitWithChaosMonkey-seed#[E4F22928E3181647]) [n:127.0.0.1:54972_gz_    ] o.a.s.c.CorePropertiesLocator Cores are: [collection1]
   [junit4]   2> 320110 INFO  (OverseerStateUpdate-97651977091350532-127.0.0.1:54944_gz_-n_0000000000) [n:127.0.0.1:54944_gz_    ] o.a.s.c.o.ReplicaMutator Assigning new node to shard shard=shard1
   [junit4]   2> 320154 INFO  (qtp1094578963-1789) [n:127.0.0.1:54956_gz_    ] o.a.s.h.a.PrepRecoveryOp In WaitForState(recovering): collection=collection1, shard=shard2, thisCore=collection1, leaderDoesNotNeedRecovery=false, isLeader? true, live=true, checkLive=true, currentState=recovering, localState=active, nodeName=127.0.0.1:54966_gz_, coreNodeName=core_node3, onlyIfActiveCheckResult=false, nodeProps: core_node3:{"core":"collection1","base_url":"http://127.0.0.1:54966/gz_","node_name":"127.0.0.1:54966_gz_","state":"recovering"}
   [junit4]   2> 320155 INFO  (qtp1094578963-1789) [n:127.0.0.1:54956_gz_    ] o.a.s.h.a.PrepRecoveryOp Waited coreNodeName: core_node3, state: recovering, checkLive: true, onlyIfLeader: true for: 1 seconds.
   [junit4]   2> 320155 INFO  (qtp1094578963-1789) [n:127.0.0.1:54956_gz_    ] o.a.s.s.HttpSolrCall [admin] webapp=null path=/admin/cores params={nodeName=127.0.0.1:54966_gz_&onlyIfLeaderActive=true&core=collection1&coreNodeName=core_node3&action=PREPRECOVERY&checkLive=true&state=recovering&onlyIfLeader=true&wt=javabin&version=2} status=0 QTime=1008
   [junit4]   2> 320215 INFO  (zkCallback-341-thread-1-processing-n:127.0.0.1:54972_gz_) [n:127.0.0.1:54972_gz_    ] o.a.s.c.c.ZkStateReader A cluster state change: [WatchedEvent state:SyncConnected type:NodeDataChanged path:/collections/collection1/state.json] for collection [collection1] has occurred - updating... (live nodes size: [5])
   [junit4]   2> 320215 INFO  (zkCallback-334-thread-1-processing-n:127.0.0.1:54966_gz_) [n:127.0.0.1:54966_gz_    ] o.a.s.c.c.ZkStateReader A cluster state change: [WatchedEvent state:SyncConnected type:NodeDataChanged path:/collections/collection1/state.json] for collection [collection1] has occurred - updating... (live nodes size: [5])
   [junit4]   2> 320215 INFO  (zkCallback-328-thread-1-processing-n:127.0.0.1:54961_gz_) [n:127.0.0.1:54961_gz_    ] o.a.s.c.c.ZkStateReader A cluster state change: [WatchedEvent state:SyncConnected type:NodeDataChanged path:/collections/collection1/state.json] for collection [collection1] has occurred - updating... (live nodes size: [5])
   [junit4]   2> 320215 INFO  (zkCallback-322-thread-1-processing-n:127.0.0.1:54956_gz_) [n:127.0.0.1:54956_gz_    ] o.a.s.c.c.ZkStateReader A cluster state change: [WatchedEvent state:SyncConnected type:NodeDataChanged path:/collections/collection1/state.json] for collection [collection1] has occurred - updating... (live nodes size: [5])
   [junit4]   2> 320660 INFO  (recoveryExecutor-332-thread-1-processing-n:127.0.0.1:54966_gz_ x:collection1 s:shard2 c:collection1 r:core_node3) [n:127.0.0.1:54966_gz_ c:collection1 s:shard2 r:core_node3 x:collection1] o.a.s.c.RecoveryStrategy Attempting to PeerSync from [http://127.0.0.1:54956/gz_/collection1/] - recoveringAfterStartup=[true]
   [junit4]   2> 320660 INFO  (recoveryExecutor-332-thread-1-processing-n:127.0.0.1:54966_gz_ x:collection1 s:shard2 c:collection1 r:core_node3) [n:127.0.0.1:54966_gz_ c:collection1 s:shard2 r:core_node3 x:collection1] o.a.s.u.PeerSync PeerSync: core=collection1 url=http://127.0.0.1:54966/gz_ START replicas=[http://127.0.0.1:54956/gz_/collection1/] nUpdates=100
   [junit4]   2> 320664 INFO  (qtp1094578963-1793) [n:127.0.0.1:54956_gz_ c:collection1 s:shard2 r:core_node1 x:collection1] o.a.s.u.IndexFingerprint IndexFingerprint millis:0.0 result:{maxVersionSpecified=9223372036854775807, maxVersionEncountered=0, maxInHash=0, versionsHash=0, numVersions=0, numDocs=0, maxDoc=0}
   [junit4]   2> 320665 INFO  (qtp1094578963-1793) [n:127.0.0.1:54956_gz_ c:collection1 s:shard2 r:core_node1 x:collection1] o.a.s.c.S.Request [collection1]  webapp=/gz_ path=/get params={distrib=false&qt=/get&getFingerprint=9223372036854775807&wt=javabin&version=2} status=0 QTime=1
   [junit4]   2> 320666 INFO  (recoveryExecutor-332-thread-1-processing-n:127.0.0.1:54966_gz_ x:collection1 s:shard2 c:collection1 r:core_node3) [n:127.0.0.1:54966_gz_ c:collection1 s:shard2 r:core_node3 x:collection1] o.a.s.u.IndexFingerprint IndexFingerprint millis:1.0 result:{maxVersionSpecified=9223372036854775807, maxVersionEncountered=0, maxInHash=0, versionsHash=0, numVersions=0, numDocs=0, maxDoc=0}
   [junit4]   2> 320666 INFO  (recoveryExecutor-332-thread-1-processing-n:127.0.0.1:54966_gz_ x:collection1 s:shard2 c:collection1 r:core_node3) [n:127.0.0.1:54966_gz_ c:collection1 s:shard2 r:core_node3 x:collection1] o.a.s.u.PeerSync We are already in sync. No need to do a PeerSync
   [junit4]   2> 320666 INFO  (recoveryExecutor-332-thread-1-processing-n:127.0.0.1:54966_gz_ x:collection1 s:shard2 c:collection1 r:core_node3) [n:127.0.0.1:54966_gz_ c:collection1 s:shard2 r:core_node3 x:collection1] o.a.s.u.DirectUpdateHandler2 start commit{,optimize=false,openSearcher=true,waitSearcher=true,expungeDeletes=false,softCommit=false,prepareCommit=false}
   [junit4]   2> 320666 INFO  (recoveryExecutor-332-thread-1-processing-n:127.0.0.1:54966_gz_ x:collection1 s:shard2 c:collection1 r:core_node3) [n:127.0.0.1:54966_gz_ c:collection1 s:shard2 r:core_node3 x:collection1] o.a.s.u.DirectUpdateHandler2 No uncommitted changes. Skipping IW.commit.
   [junit4]   2> 320667 INFO  (recoveryExecutor-332-thread-1-processing-n:127.0.0.1:54966_gz_ x:collection1 s:shard2 c:collection1 r:core_node3) [n:127.0.0.1:54966_gz_ c:collection1 s:shard2 r:core_node3 x:collection1] o.a.s.u.DirectUpdateHandler2 end_commit_flush
   [junit4]   2> 320667 INFO  (recoveryExecutor-332-thread-1-processing-n:127.0.0.1:54966_gz_ x:collection1 s:shard2 c:collection1 r:core_node3) [n:127.0.0.1:54966_gz_ c:collection1 s:shard2 r:core_node3 x:collection1] o.a.s.c.RecoveryStrategy PeerSync stage of recovery was successful.
   [junit4]   2> 320667 INFO  (recoveryExecutor-332-thread-1-processing-n:127.0.0.1:54966_gz_ x:collection1 s:shard2 c:collection1 r:core_node3) [n:127.0.0.1:54966_gz_ c:collection1 s:shard2 r:core_node3 x:collection1] o.a.s.c.RecoveryStrategy Replaying updates buffered during PeerSync.
   [junit4]   2> 320668 INFO  (recoveryExecutor-332-thread-1-processing-n:127.0.0.1:54966_gz_ x:collection1 s:shard2 c:collection1 r:core_node3) [n:127.0.0.1:54966_gz_ c:collection1 s:shard2 r:core_node3 x:collection1] o.a.s.c.RecoveryStrategy No replay needed.
   [junit4]   2> 320668 INFO  (recoveryExecutor-332-thread-1-processing-n:127.0.0.1:54966_gz_ x:collection1 s:shard2 c:collection1 r:core_node3) [n:127.0.0.1:54966_gz_ c:collection1 s:shard2 r:core_node3 x:collection1] o.a.s.c.RecoveryStrategy Registering as Active after recovery.
   [junit4]   2> 320777 INFO  (zkCallback-341-thread-1-processing-n:127.0.0.1:54972_gz_) [n:127.0.0.1:54972_gz_    ] o.a.s.c.c.ZkStateReader A cluster state change: [WatchedEvent state:SyncConnected type:NodeDataChanged path:/collections/collection1/state.json] for collection [collection1] has occurred - updating... (live nodes size: [5])
   [junit4]   2> 320777 INFO  (zkCallback-334-thread-1-processing-n:127.0.0.1:54966_gz_) [n:127.0.0.1:54966_gz_    ] o.a.s.c.c.ZkStateReader A cluster state change: [WatchedEvent state:SyncConnected type:NodeDataChanged path:/collections/collection1/state.json] for collection [collection1] has occurred - updating... (live nodes size: [5])
   [junit4]   2> 320777 INFO  (zkCallback-328-thread-1-processing-n:127.0.0.1:54961_gz_) [n:127.0.0.1:54961_gz_    ] o.a.s.c.c.ZkStateReader A cluster state change: [WatchedEvent state:SyncConnected type:NodeDataChanged path:/collections/collection1/state.json] for collection [collection1] has occurred - updating... (live nodes size: [5])
   [junit4]   2> 320777 INFO  (zkCallback-322-thread-1-processing-n:127.0.0.1:54956_gz_) [n:127.0.0.1:54956_gz_    ] o.a.s.c.c.ZkStateReader A cluster state change: [WatchedEvent state:SyncConnected type:NodeDataChanged path:/collections/collection1/state.json] for collection [collection1] has occurred - updating... (live nodes size: [5])
   [junit4]   2> 321130 WARN  (coreLoadExecutor-909-thread-1-processing-n:127.0.0.1:54972_gz_) [n:127.0.0.1:54972_gz_ c:collection1   x:collection1] o.a.s.c.Config Beginning with Solr 5.5, <mergePolicy> is deprecated, use <mergePolicyFactory> instead.
   [junit4]   2> 321130 INFO  (coreLoadExecutor-909-thread-1-processing-n:127.0.0.1:54972_gz_) [n:127.0.0.1:54972_gz_ c:collection1   x:collection1] o.a.s.c.SolrConfig Using Lucene MatchVersion: 6.6.0
   [junit4]   2> 321143 INFO  (cor

[...truncated too long message...]

] has occurred - updating... (live nodes size: [1])
   [junit4]   2> 992244 INFO  (zkCallback-529-thread-1-processing-n:127.0.0.1:56323_gz_) [n:127.0.0.1:56323_gz_    ] o.a.s.c.c.ZkStateReader A cluster state change: [WatchedEvent state:SyncConnected type:NodeDataChanged path:/collections/collection1/state.json] for collection [collection1] has occurred - updating... (live nodes size: [1])
   [junit4]   2> 992247 INFO  (zkCallback-529-thread-1-processing-n:127.0.0.1:56323_gz_) [n:127.0.0.1:56323_gz_    ] o.a.s.c.c.ZkStateReader A cluster state change: [WatchedEvent state:SyncConnected type:NodeDataChanged path:/collections/collection1/state.json] for collection [collection1] has occurred - updating... (live nodes size: [1])
   [junit4]   2> 992256 INFO  (zkCallback-529-thread-3-processing-n:127.0.0.1:56323_gz_) [n:127.0.0.1:56323_gz_    ] o.a.s.c.c.ZkStateReader A cluster state change: [WatchedEvent state:SyncConnected type:NodeDataChanged path:/collections/shardSplitWithRule/state.json] for collection [shardSplitWithRule] has occurred - updating... (live nodes size: [1])
   [junit4]   2> 992256 INFO  (zkCallback-529-thread-1-processing-n:127.0.0.1:56323_gz_) [n:127.0.0.1:56323_gz_    ] o.a.s.c.c.ZkStateReader A cluster state change: [WatchedEvent state:SyncConnected type:NodeDataChanged path:/collections/shardSplitWithRule/state.json] for collection [shardSplitWithRule] has occurred - updating... (live nodes size: [1])
   [junit4]   2> 992264 WARN  (OverseerStateUpdate-97652019625459730-127.0.0.1:56323_gz_-n_0000000004) [n:127.0.0.1:56323_gz_    ] o.a.s.c.Overseer Bad version writing to ZK using compare-and-set, will force refresh cluster state: KeeperErrorCode = BadVersion for /collections/shardSplitWithRule/state.json
   [junit4]   2> 992271 INFO  (zkCallback-529-thread-1-processing-n:127.0.0.1:56323_gz_) [n:127.0.0.1:56323_gz_    ] o.a.s.c.c.ZkStateReader A cluster state change: [WatchedEvent state:SyncConnected type:NodeDataChanged path:/collections/shardSplitWithRule/state.json] for collection [shardSplitWithRule] has occurred - updating... (live nodes size: [1])
   [junit4]   2> 992271 INFO  (zkCallback-529-thread-3-processing-n:127.0.0.1:56323_gz_) [n:127.0.0.1:56323_gz_    ] o.a.s.c.c.ZkStateReader A cluster state change: [WatchedEvent state:SyncConnected type:NodeDataChanged path:/collections/shardSplitWithRule/state.json] for collection [shardSplitWithRule] has occurred - updating... (live nodes size: [1])
   [junit4]   2> 992272 INFO  (zkCallback-529-thread-3-processing-n:127.0.0.1:56323_gz_) [n:127.0.0.1:56323_gz_    ] o.a.s.c.c.ZkStateReader A cluster state change: [WatchedEvent state:SyncConnected type:NodeDataChanged path:/collections/collection1/state.json] for collection [collection1] has occurred - updating... (live nodes size: [1])
   [junit4]   2> 992280 INFO  (zkCallback-529-thread-3-processing-n:127.0.0.1:56323_gz_) [n:127.0.0.1:56323_gz_    ] o.a.s.c.c.ZkStateReader A cluster state change: [WatchedEvent state:SyncConnected type:NodeDataChanged path:/collections/shardSplitWithRule/state.json] for collection [shardSplitWithRule] has occurred - updating... (live nodes size: [1])
   [junit4]   2> 992280 INFO  (zkCallback-529-thread-1-processing-n:127.0.0.1:56323_gz_) [n:127.0.0.1:56323_gz_    ] o.a.s.c.c.ZkStateReader A cluster state change: [WatchedEvent state:SyncConnected type:NodeDataChanged path:/collections/shardSplitWithRule/state.json] for collection [shardSplitWithRule] has occurred - updating... (live nodes size: [1])
   [junit4]   2> 992393 INFO  (zkCallback-529-thread-1-processing-n:127.0.0.1:56323_gz_) [n:127.0.0.1:56323_gz_    ] o.a.s.c.c.ZkStateReader A cluster state change: [WatchedEvent state:SyncConnected type:NodeDataChanged path:/collections/collection1/state.json] for collection [collection1] has occurred - updating... (live nodes size: [1])
   [junit4]   2> 997087 INFO  (recoveryExecutor-527-thread-1-processing-n:127.0.0.1:56323_gz_ x:shardSplitWithRule_shard1_1_replica0 s:shard1_1 c:shardSplitWithRule r:core_node5) [n:127.0.0.1:56323_gz_ c:shardSplitWithRule s:shard1_1 r:core_node5 x:shardSplitWithRule_shard1_1_replica0] o.a.s.c.RecoveryStrategy Finished recovery process, successful=[false]
   [junit4]   2> 997087 WARN  (updateExecutor-526-thread-2-processing-n:127.0.0.1:56323_gz_ x:shardSplitWithRule_shard1_1_replica0 s:shard1_1 c:shardSplitWithRule r:core_node5) [n:127.0.0.1:56323_gz_ c:shardSplitWithRule s:shard1_1 r:core_node5 x:shardSplitWithRule_shard1_1_replica0] o.a.s.u.DefaultSolrCoreState Skipping recovery because Solr is shutdown
   [junit4]   2> 997088 INFO  (TEST-ShardSplitTest.testSplitShardWithRule-seed#[E4F22928E3181647]) [    ] o.a.s.c.Overseer Overseer (id=97652019625459730-127.0.0.1:56323_gz_-n_0000000004) closing
   [junit4]   2> 997088 INFO  (OverseerStateUpdate-97652019625459730-127.0.0.1:56323_gz_-n_0000000004) [n:127.0.0.1:56323_gz_    ] o.a.s.c.Overseer Overseer Loop exiting : 127.0.0.1:56323_gz_
   [junit4]   2> 997094 INFO  (zkCallback-504-thread-1) [    ] o.a.s.c.c.ZkStateReader Updated live nodes from ZooKeeper... (1) -> (0)
   [junit4]   2> 998595 INFO  (zkCallback-529-thread-2-processing-n:127.0.0.1:56323_gz_) [n:127.0.0.1:56323_gz_ c:shardSplitWithRule s:shard1_1 r:core_node5 x:shardSplitWithRule_shard1_1_replica0] o.a.s.c.SolrCore [shardSplitWithRule_shard1_1_replica0]  CLOSING SolrCore org.apache.solr.core.SolrCore@5a771887
   [junit4]   2> 998597 WARN  (zkCallback-529-thread-2-processing-n:127.0.0.1:56323_gz_) [n:127.0.0.1:56323_gz_ c:shardSplitWithRule s:shard1_1 r:core_node5 x:shardSplitWithRule_shard1_1_replica0] o.a.s.c.RecoveryStrategy Stopping recovery for core=[shardSplitWithRule_shard1_1_replica0] coreNodeName=[core_node5]
   [junit4]   2> 998638 INFO  (zkCallback-529-thread-2-processing-n:127.0.0.1:56323_gz_) [n:127.0.0.1:56323_gz_ c:shardSplitWithRule s:shard1_1 r:core_node5 x:shardSplitWithRule_shard1_1_replica0] o.a.s.m.SolrMetricManager Closing metric reporters for: solr.core.shardSplitWithRule.shard1_1.replica0
   [junit4]   2> 998638 INFO  (TEST-ShardSplitTest.testSplitShardWithRule-seed#[E4F22928E3181647]) [    ] o.a.s.m.SolrMetricManager Closing metric reporters for: solr.node
   [junit4]   2> 998639 INFO  (TEST-ShardSplitTest.testSplitShardWithRule-seed#[E4F22928E3181647]) [    ] o.e.j.s.AbstractConnector Stopped ServerConnector@2f77b62e{HTTP/1.1,[http/1.1]}{127.0.0.1:0}
   [junit4]   2> 998640 INFO  (TEST-ShardSplitTest.testSplitShardWithRule-seed#[E4F22928E3181647]) [    ] o.e.j.s.h.ContextHandler Stopped o.e.j.s.ServletContextHandler@227d291d{/gz_,null,UNAVAILABLE}
   [junit4]   2> 998651 INFO  (TEST-ShardSplitTest.testSplitShardWithRule-seed#[E4F22928E3181647]) [    ] o.a.s.c.ChaosMonkey monkey: stop shard! 56298
   [junit4]   2> 998652 INFO  (TEST-ShardSplitTest.testSplitShardWithRule-seed#[E4F22928E3181647]) [    ] o.a.s.c.ZkTestServer connecting to 127.0.0.1:56295 56295
   [junit4]   2> 998697 INFO  (Thread-683) [    ] o.a.s.c.ZkTestServer connecting to 127.0.0.1:56295 56295
   [junit4]   2> 1002489 WARN  (Thread-683) [    ] o.a.s.c.ZkTestServer Watch limit violations:
   [junit4]   2> Maximum concurrent create/delete watches above limit:
   [junit4]   2>
   [junit4]   2> 6 /solr/aliases.json
   [junit4]   2> 6 /solr/clusterprops.json
   [junit4]   2> 5 /solr/security.json
   [junit4]   2> 5 /solr/configs/conf1
   [junit4]   2>
   [junit4]   2> Maximum concurrent data watches above limit:
   [junit4]   2>
   [junit4]   2> 72 /solr/collections/shardSplitWithRule/state.json
   [junit4]   2> 6 /solr/clusterprops.json
   [junit4]   2> 6 /solr/clusterstate.json
   [junit4]   2> 4 /solr/collections/collection1/state.json
   [junit4]   2>
   [junit4]   2> Maximum concurrent children watches above limit:
   [junit4]   2>
   [junit4]   2> 86 /solr/overseer/queue
   [junit4]   2> 22 /solr/overseer/collection-queue-work
   [junit4]   2> 16 /solr/overseer/queue-work
   [junit4]   2> 6 /solr/live_nodes
   [junit4]   2> 6 /solr/collections
   [junit4]   2>
   [junit4]   2> 1002490 INFO  (SUITE-ShardSplitTest-seed#[E4F22928E3181647]-worker) [    ] o.a.s.SolrTestCaseJ4 ###deleteCore
   [junit4]   2> NOTE: leaving temporary files on disk at: /Users/jenkins/workspace/Lucene-Solr-6.x-MacOSX/solr/build/solr-core/test/J1/temp/solr.cloud.ShardSplitTest_E4F22928E3181647-001
   [junit4]   2> NOTE: test params are: codec=Asserting(Lucene62): {rnd_b=FST50, shard_s=Lucene50(blocksize=128), n_ti=Lucene50(blocksize=128), a_t=Lucene50(blocksize=128), a_i=FST50, id=FST50}, docValues:{rnd_b=DocValuesFormat(name=Asserting), shard_s=DocValuesFormat(name=Direct), _version_=DocValuesFormat(name=Direct), n_ti=DocValuesFormat(name=Direct), a_t=DocValuesFormat(name=Direct), a_i=DocValuesFormat(name=Asserting), id=DocValuesFormat(name=Asserting)}, maxPointsInLeafNode=1324, maxMBSortInHeap=7.874445397488696, sim=RandomSimilarity(queryNorm=true,coord=no): {}, locale=lv-LV, timezone=America/Santa_Isabel
   [junit4]   2> NOTE: Mac OS X 10.11.6 x86_64/Oracle Corporation 1.8.0_121 (64-bit)/cpus=3,threads=1,free=90215120,total=233164800
   [junit4]   2> NOTE: All tests run in this JVM: [TestDFISimilarityFactory, TriLevelCompositeIdRoutingTest, TestEmbeddedSolrServerSchemaAPI, TestPerFieldSimilarityClassic, TestSizeLimitedDistributedMap, TermVectorComponentDistributedTest, EnumFieldTest, DirectoryFactoryTest, TestHdfsBackupRestoreCore, MBeansHandlerTest, WordBreakSolrSpellCheckerTest, TestClassNameShortening, TestIndexSearcher, TestInitParams, BasicFunctionalityTest, TestCollectionAPI, TestDistributedGrouping, TestExportWriter, ZkStateReaderTest, DistributedQueryComponentCustomSortTest, TestBlobHandler, SolrIndexMetricsTest, TestFuzzyAnalyzedSuggestions, TestIndexingPerformance, DistribCursorPagingTest, FullHLLTest, ClassificationUpdateProcessorTest, ConjunctionSolrSpellCheckerTest, BadIndexSchemaTest, ShardSplitTest]
   [junit4] Completed [166/700 (1!)] on J1 in 691.62s, 5 tests, 1 failure <<< FAILURES!

[...truncated 64472 lines...]



---------------------------------------------------------------------
To unsubscribe, e-mail: [hidden email]
For additional commands, e-mail: [hidden email]
Loading...