[JENKINS] Lucene-Solr-6.x-Windows (32bit/jdk1.8.0_121) - Build # 849 - Unstable!

Previous Topic Next Topic
 
classic Classic list List threaded Threaded
1 message Options
Reply | Threaded
Open this post in threaded view
|

[JENKINS] Lucene-Solr-6.x-Windows (32bit/jdk1.8.0_121) - Build # 849 - Unstable!

Policeman Jenkins Server-2
Build: https://jenkins.thetaphi.de/job/Lucene-Solr-6.x-Windows/849/
Java: 32bit/jdk1.8.0_121 -client -XX:+UseConcMarkSweepGC

1 tests failed.
FAILED:  org.apache.solr.cloud.TestLockTree.testLocks

Error Message:
expected:<2> but was:<3>

Stack Trace:
java.lang.AssertionError: expected:<2> but was:<3>
        at __randomizedtesting.SeedInfo.seed([2D103AF41A1377B3:54DA400D12C39C58]:0)
        at org.junit.Assert.fail(Assert.java:93)
        at org.junit.Assert.failNotEquals(Assert.java:647)
        at org.junit.Assert.assertEquals(Assert.java:128)
        at org.junit.Assert.assertEquals(Assert.java:472)
        at org.junit.Assert.assertEquals(Assert.java:456)
        at org.apache.solr.cloud.TestLockTree.testLocks(TestLockTree.java:99)
        at sun.reflect.NativeMethodAccessorImpl.invoke0(Native Method)
        at sun.reflect.NativeMethodAccessorImpl.invoke(NativeMethodAccessorImpl.java:62)
        at sun.reflect.DelegatingMethodAccessorImpl.invoke(DelegatingMethodAccessorImpl.java:43)
        at java.lang.reflect.Method.invoke(Method.java:498)
        at com.carrotsearch.randomizedtesting.RandomizedRunner.invoke(RandomizedRunner.java:1713)
        at com.carrotsearch.randomizedtesting.RandomizedRunner$8.evaluate(RandomizedRunner.java:907)
        at com.carrotsearch.randomizedtesting.RandomizedRunner$9.evaluate(RandomizedRunner.java:943)
        at com.carrotsearch.randomizedtesting.RandomizedRunner$10.evaluate(RandomizedRunner.java:957)
        at com.carrotsearch.randomizedtesting.rules.SystemPropertiesRestoreRule$1.evaluate(SystemPropertiesRestoreRule.java:57)
        at org.apache.lucene.util.TestRuleSetupTeardownChained$1.evaluate(TestRuleSetupTeardownChained.java:49)
        at org.apache.lucene.util.AbstractBeforeAfterRule$1.evaluate(AbstractBeforeAfterRule.java:45)
        at org.apache.lucene.util.TestRuleThreadAndTestName$1.evaluate(TestRuleThreadAndTestName.java:48)
        at org.apache.lucene.util.TestRuleIgnoreAfterMaxFailures$1.evaluate(TestRuleIgnoreAfterMaxFailures.java:64)
        at org.apache.lucene.util.TestRuleMarkFailure$1.evaluate(TestRuleMarkFailure.java:47)
        at com.carrotsearch.randomizedtesting.rules.StatementAdapter.evaluate(StatementAdapter.java:36)
        at com.carrotsearch.randomizedtesting.ThreadLeakControl$StatementRunner.run(ThreadLeakControl.java:368)
        at com.carrotsearch.randomizedtesting.ThreadLeakControl.forkTimeoutingTask(ThreadLeakControl.java:817)
        at com.carrotsearch.randomizedtesting.ThreadLeakControl$3.evaluate(ThreadLeakControl.java:468)
        at com.carrotsearch.randomizedtesting.RandomizedRunner.runSingleTest(RandomizedRunner.java:916)
        at com.carrotsearch.randomizedtesting.RandomizedRunner$5.evaluate(RandomizedRunner.java:802)
        at com.carrotsearch.randomizedtesting.RandomizedRunner$6.evaluate(RandomizedRunner.java:852)
        at com.carrotsearch.randomizedtesting.RandomizedRunner$7.evaluate(RandomizedRunner.java:863)
        at com.carrotsearch.randomizedtesting.rules.StatementAdapter.evaluate(StatementAdapter.java:36)
        at com.carrotsearch.randomizedtesting.rules.SystemPropertiesRestoreRule$1.evaluate(SystemPropertiesRestoreRule.java:57)
        at org.apache.lucene.util.AbstractBeforeAfterRule$1.evaluate(AbstractBeforeAfterRule.java:45)
        at com.carrotsearch.randomizedtesting.rules.StatementAdapter.evaluate(StatementAdapter.java:36)
        at org.apache.lucene.util.TestRuleStoreClassName$1.evaluate(TestRuleStoreClassName.java:41)
        at com.carrotsearch.randomizedtesting.rules.NoShadowingOrOverridesOnMethodsRule$1.evaluate(NoShadowingOrOverridesOnMethodsRule.java:40)
        at com.carrotsearch.randomizedtesting.rules.NoShadowingOrOverridesOnMethodsRule$1.evaluate(NoShadowingOrOverridesOnMethodsRule.java:40)
        at com.carrotsearch.randomizedtesting.rules.StatementAdapter.evaluate(StatementAdapter.java:36)
        at com.carrotsearch.randomizedtesting.rules.StatementAdapter.evaluate(StatementAdapter.java:36)
        at com.carrotsearch.randomizedtesting.rules.StatementAdapter.evaluate(StatementAdapter.java:36)
        at org.apache.lucene.util.TestRuleAssertionsRequired$1.evaluate(TestRuleAssertionsRequired.java:53)
        at org.apache.lucene.util.TestRuleMarkFailure$1.evaluate(TestRuleMarkFailure.java:47)
        at org.apache.lucene.util.TestRuleIgnoreAfterMaxFailures$1.evaluate(TestRuleIgnoreAfterMaxFailures.java:64)
        at org.apache.lucene.util.TestRuleIgnoreTestSuites$1.evaluate(TestRuleIgnoreTestSuites.java:54)
        at com.carrotsearch.randomizedtesting.rules.StatementAdapter.evaluate(StatementAdapter.java:36)
        at com.carrotsearch.randomizedtesting.ThreadLeakControl$StatementRunner.run(ThreadLeakControl.java:368)
        at java.lang.Thread.run(Thread.java:745)




Build Log:
[...truncated 12774 lines...]
   [junit4] Suite: org.apache.solr.cloud.TestLockTree
   [junit4]   2> Creating dataDir: C:\Users\jenkins\workspace\Lucene-Solr-6.x-Windows\solr\build\solr-core\test\J1\temp\solr.cloud.TestLockTree_2D103AF41A1377B3-001\init-core-data-001
   [junit4]   2> 3266206 INFO  (SUITE-TestLockTree-seed#[2D103AF41A1377B3]-worker) [    ] o.a.s.SolrTestCaseJ4 Using TrieFields
   [junit4]   2> 3266219 INFO  (SUITE-TestLockTree-seed#[2D103AF41A1377B3]-worker) [    ] o.a.s.SolrTestCaseJ4 Randomized ssl (false) and clientAuth (true) via: @org.apache.solr.util.RandomizeSSL(reason=, value=NaN, ssl=NaN, clientAuth=NaN)
   [junit4]   2> 3266234 INFO  (TEST-TestLockTree.testLocks-seed#[2D103AF41A1377B3]) [    ] o.a.s.SolrTestCaseJ4 ###Starting testLocks
   [junit4]   2> 3266251 INFO  (TEST-TestLockTree.testLocks-seed#[2D103AF41A1377B3]) [    ] o.a.s.c.TestLockTree counter : 0 , expected : [coll1/shard1/core_node2, coll2/shard2], actual : [coll1/shard1/core_node2, coll2/shard2, coll1]
   [junit4]   2> 3266251 INFO  (TEST-TestLockTree.testLocks-seed#[2D103AF41A1377B3]) [    ] o.a.s.SolrTestCaseJ4 ###Ending testLocks
   [junit4]   2> NOTE: reproduce with: ant test  -Dtestcase=TestLockTree -Dtests.method=testLocks -Dtests.seed=2D103AF41A1377B3 -Dtests.slow=true -Dtests.locale=vi-VN -Dtests.timezone=Asia/Novosibirsk -Dtests.asserts=true -Dtests.file.encoding=ISO-8859-1
   [junit4] FAILURE 0.04s J1 | TestLockTree.testLocks <<<
   [junit4]    > Throwable #1: java.lang.AssertionError: expected:<2> but was:<3>
   [junit4]    > at __randomizedtesting.SeedInfo.seed([2D103AF41A1377B3:54DA400D12C39C58]:0)
   [junit4]    > at org.apache.solr.cloud.TestLockTree.testLocks(TestLockTree.java:99)
   [junit4]    > at java.lang.Thread.run(Thread.java:745)
   [junit4]   2> 3266257 INFO  (SUITE-TestLockTree-seed#[2D103AF41A1377B3]-worker) [    ] o.a.s.SolrTestCaseJ4 ###deleteCore
   [junit4]   2> NOTE: leaving temporary files on disk at: C:\Users\jenkins\workspace\Lucene-Solr-6.x-Windows\solr\build\solr-core\test\J1\temp\solr.cloud.TestLockTree_2D103AF41A1377B3-001
   [junit4]   2> NOTE: test params are: codec=CheapBastard, sim=RandomSimilarity(queryNorm=true,coord=yes): {}, locale=vi-VN, timezone=Asia/Novosibirsk
   [junit4]   2> NOTE: Windows 10 10.0 x86/Oracle Corporation 1.8.0_121 (32-bit)/cpus=3,threads=1,free=146086296,total=508821504
   [junit4]   2> NOTE: All tests run in this JVM: [TestCollectionAPIs, DistribJoinFromCollectionTest, ConnectionReuseTest, TestJsonFacets, TestImplicitCoreProperties, TestQueryUtils, TestDocSet, RegexBoostProcessorTest, TestAtomicUpdateErrorCases, BadIndexSchemaTest, HLLUtilTest, SolrCmdDistributorTest, TriLevelCompositeIdRoutingTest, ClusterStateTest, NoCacheHeaderTest, TestManagedSchemaThreadSafety, TestRequestStatusCollectionAPI, TestFastWriter, HighlighterMaxOffsetTest, BinaryUpdateRequestHandlerTest, OverseerTaskQueueTest, TestConfigSetImmutable, TestBadConfig, TestExclusionRuleCollectionAccess, SpatialRPTFieldTypeTest, MBeansHandlerTest, TestSolrXml, HdfsBasicDistributedZk2Test, ChangedSchemaMergeTest, TestEmbeddedSolrServerSchemaAPI, BlockJoinFacetRandomTest, DistribCursorPagingTest, TestSolrQueryResponse, CollectionReloadTest, ReplaceNodeTest, TestDelegationWithHadoopAuth, TestAuthorizationFramework, ShardRoutingCustomTest, TestSizeLimitedDistributedMap, ShardSplitTest, TestDistributedMissingSort, TestSolrCloudWithKerberosAlt, TestJavabinTupleStreamParser, TestRandomRequestDistribution, ClassificationUpdateProcessorTest, TestLeaderInitiatedRecoveryThread, TestInPlaceUpdatesDistrib, FullHLLTest, SubstringBytesRefFilterTest, UUIDUpdateProcessorFallbackTest, TestOnReconnectListenerSupport, TestSystemIdResolver, StatsReloadRaceTest, TestSegmentSorting, BasicZkTest, MergeStrategyTest, TestCryptoKeys, DateMathParserTest, SuggesterTSTTest, CloudMLTQParserTest, MissingSegmentRecoveryTest, DistributedQueryComponentOptimizationTest, TestExceedMaxTermLength, UpdateParamsTest, TestBlobHandler, MetricUtilsTest, TestCustomStream, SolrIndexMetricsTest, FieldAnalysisRequestHandlerTest, CacheHeaderTest, TestCodecSupport, SortByFunctionTest, BlockCacheTest, TestNamedUpdateProcessors, TestSolrDeletionPolicy2, BigEndianAscendingWordDeserializerTest, TestSubQueryTransformerDistrib, BasicDistributedZk2Test, TestConfigSetsAPIExclusivity, TestRuleBasedAuthorizationPlugin, BufferStoreTest, TestValueSourceCache, HdfsChaosMonkeyNothingIsSafeTest, TestQueryTypes, RAMDirectoryFactoryTest, TestSearchPerf, TestReversedWildcardFilterFactory, TestCollapseQParserPlugin, RulesTest, AutoCommitTest, HdfsRestartWhileUpdatingTest, SearchHandlerTest, JsonValidatorTest, HdfsUnloadDistributedZkTest, OverseerRolesTest, TestStressCloudBlindAtomicUpdates, TestCloudPivotFacet, SharedFSAutoReplicaFailoverUtilsTest, TestIntervalFaceting, ShowFileRequestHandlerTest, TestUninvertingReader, TestQuerySenderNoQuery, TestSuggestSpellingConverter, SuggestComponentTest, DebugComponentTest, JvmMetricsTest, TestCloudDeleteByQuery, OutOfBoxZkACLAndCredentialsProvidersTest, HighlighterConfigTest, TestIndexingPerformance, DistributedFacetPivotLargeTest, TestTrie, TestUtils, CoreMergeIndexesAdminHandlerTest, TestFieldCollectionResource, MinimalSchemaTest, TestCoreAdminApis, FileBasedSpellCheckerTest, CdcrBootstrapTest, TestJoin, TestRTimerTree, TermVectorComponentTest, TestOrdValues, TestSystemCollAutoCreate, TestRandomFaceting, SmileWriterTest, TestTolerantUpdateProcessorRandomCloud, SignatureUpdateProcessorFactoryTest, CollectionsAPISolrJTest, TestCopyFieldCollectionResource, CreateCollectionCleanupTest, TestPerFieldSimilarityWithDefaultOverride, AsyncCallRequestStatusResponseTest, ManagedSchemaRoundRobinCloudTest, TestFreeTextSuggestions, DirectUpdateHandlerOptimizeTest, SolrCoreCheckLockOnStartupTest, TestRangeQuery, QueryParsingTest, DistributedTermsComponentTest, TestLRUStatsCache, SolrSlf4jReporterTest, TestSmileRequest, TestFiltering, TestTestInjection, TestExpandComponent, TestSolrQueryParserResource, TestSchemaSimilarityResource, TestStressLiveNodes, TestSchemaManager, TestWriterPerf, TestZkChroot, URLClassifyProcessorTest, FacetPivotSmallTest, ConvertedLegacyTest, NotRequiredUniqueKeyTest, HdfsCollectionsAPIDistributedZkTest, CdcrReplicationHandlerTest, TermVectorComponentDistributedTest, TestScoreJoinQPScore, SpatialHeatmapFacetsTest, StatsComponentTest, TestFieldSortValues, MultiThreadedOCPTest, SpellingQueryConverterTest, TestReqParamsAPI, DeleteShardTest, TestReloadAndDeleteDocs, TestDynamicFieldCollectionResource, CoreAdminCreateDiscoverTest, LeaderElectionIntegrationTest, TestReplicationHandler, ZkCLITest, TestDistributedGrouping, TestHashPartitioner, TestRealTimeGet, TestStressReorder, TestReload, SpellCheckComponentTest, TestGroupingSearch, PeerSyncTest, SolrIndexSplitterTest, TestExtendedDismaxParser, SpellCheckCollatorTest, CoreAdminHandlerTest, SuggesterWFSTTest, PolyFieldTest, SchemaVersionSpecificBehaviorTest, DistanceFunctionTest, SolrInfoMBeanTest, TestSurroundQueryParser, StandardRequestHandlerTest, DocumentAnalysisRequestHandlerTest, PrimitiveFieldTypeTest, TestOmitPositions, RequestHandlersTest, RequiredFieldsTest, FastVectorHighlighterTest, IndexSchemaTest, UpdateRequestProcessorFactoryTest, TestCSVResponseWriter, TestPartialUpdateDeduplication, CSVRequestHandlerTest, TestBinaryResponseWriter, TestQuerySenderListener, TestSolrIndexConfig, SolrIndexConfigTest, SampleTest, TestBinaryField, NumericFieldsTest, TestElisionMultitermQuery, TestConfig, ExternalFileFieldSortTest, TestSolrCoreProperties, TestLuceneMatchVersion, SynonymTokenizerTest, TestSweetSpotSimilarityFactory, TestPerFieldSimilarity, TestLMJelinekMercerSimilarityFactory, TestJmxMonitoredMap, TestFastOutputStream, TestFastLRUCache, PrimUtilsTest, DateFieldTest, TestDocumentBuilder, SliceStateTest, CircularListTest, DistributedIntervalFacetingTest, CollectionTooManyReplicasTest, ConcurrentDeleteAndCreateCollectionTest, ConfigSetsAPITest, ConnectionManagerTest, DeleteInactiveReplicaTest, DeleteLastCustomShardedReplicaTest, DeleteReplicaTest, DistributedVersionInfoTest, LeaderElectionContextKeyTest, LeaderFailureAfterFreshStartTest, LeaderInitiatedRecoveryOnShardRestartTest, MigrateRouteKeyTest, OverseerCollectionConfigSetProcessorTest, OverseerStatusTest, PeerSyncReplicationTest, RecoveryAfterSoftCommitTest, SSLMigrationTest, SaslZkACLProviderTest, SolrCLIZkUtilsTest, SolrXmlInZkTest, TestAuthenticationFramework, TestClusterProperties, TestCollectionAPI, TestConfigSetsAPIZkFailure, TestDeleteCollectionOnDownNodes, TestDistribDocBasedVersion, TestDownShardTolerantSearch, TestLeaderElectionWithEmptyReplica, TestLeaderElectionZkExpiry, TestLockTree]
   [junit4] Completed [534/704 (1!)] on J1 in 0.12s, 1 test, 1 failure <<< FAILURES!

[...truncated 39952 lines...]



---------------------------------------------------------------------
To unsubscribe, e-mail: [hidden email]
For additional commands, e-mail: [hidden email]