[JENKINS] Lucene-Solr-7.0-Linux (64bit/jdk1.8.0_144) - Build # 198 - Unstable!

Previous Topic Next Topic
 
classic Classic list List threaded Threaded
1 message Options
Reply | Threaded
Open this post in threaded view
|

[JENKINS] Lucene-Solr-7.0-Linux (64bit/jdk1.8.0_144) - Build # 198 - Unstable!

Policeman Jenkins Server-2
Build: https://jenkins.thetaphi.de/job/Lucene-Solr-7.0-Linux/198/
Java: 64bit/jdk1.8.0_144 -XX:+UseCompressedOops -XX:+UseParallelGC

2 tests failed.
FAILED:  junit.framework.TestSuite.org.apache.solr.cloud.TestSolrCloudWithSecureImpersonation

Error Message:
3 threads leaked from SUITE scope at org.apache.solr.cloud.TestSolrCloudWithSecureImpersonation:     1) Thread[id=13337, name=jetty-launcher-1065-thread-1-SendThread(127.0.0.1:36777), state=TIMED_WAITING, group=TGRP-TestSolrCloudWithSecureImpersonation]         at java.lang.Thread.sleep(Native Method)         at org.apache.zookeeper.client.StaticHostProvider.next(StaticHostProvider.java:101)         at org.apache.zookeeper.ClientCnxn$SendThread.startConnect(ClientCnxn.java:997)         at org.apache.zookeeper.ClientCnxn$SendThread.run(ClientCnxn.java:1060)    2) Thread[id=13275, name=jetty-launcher-1065-thread-2-EventThread, state=TIMED_WAITING, group=TGRP-TestSolrCloudWithSecureImpersonation]         at sun.misc.Unsafe.park(Native Method)         at java.util.concurrent.locks.LockSupport.parkNanos(LockSupport.java:215)         at java.util.concurrent.locks.AbstractQueuedSynchronizer.doAcquireSharedNanos(AbstractQueuedSynchronizer.java:1037)         at java.util.concurrent.locks.AbstractQueuedSynchronizer.tryAcquireSharedNanos(AbstractQueuedSynchronizer.java:1328)         at java.util.concurrent.CountDownLatch.await(CountDownLatch.java:277)         at org.apache.curator.CuratorZookeeperClient.internalBlockUntilConnectedOrTimedOut(CuratorZookeeperClient.java:323)         at org.apache.curator.RetryLoop.callWithRetry(RetryLoop.java:105)         at org.apache.curator.framework.imps.GetDataBuilderImpl.pathInForeground(GetDataBuilderImpl.java:288)         at org.apache.curator.framework.imps.GetDataBuilderImpl.forPath(GetDataBuilderImpl.java:279)         at org.apache.curator.framework.imps.GetDataBuilderImpl.forPath(GetDataBuilderImpl.java:41)         at org.apache.curator.framework.recipes.shared.SharedValue.readValue(SharedValue.java:244)         at org.apache.curator.framework.recipes.shared.SharedValue.access$100(SharedValue.java:44)         at org.apache.curator.framework.recipes.shared.SharedValue$1.process(SharedValue.java:61)         at org.apache.curator.framework.imps.NamespaceWatcher.process(NamespaceWatcher.java:67)         at org.apache.zookeeper.ClientCnxn$EventThread.processEvent(ClientCnxn.java:530)         at org.apache.zookeeper.ClientCnxn$EventThread.run(ClientCnxn.java:505)    3) Thread[id=13338, name=jetty-launcher-1065-thread-1-EventThread, state=WAITING, group=TGRP-TestSolrCloudWithSecureImpersonation]         at sun.misc.Unsafe.park(Native Method)         at java.util.concurrent.locks.LockSupport.park(LockSupport.java:175)         at java.util.concurrent.locks.AbstractQueuedSynchronizer$ConditionObject.await(AbstractQueuedSynchronizer.java:2039)         at java.util.concurrent.LinkedBlockingQueue.take(LinkedBlockingQueue.java:442)         at org.apache.zookeeper.ClientCnxn$EventThread.run(ClientCnxn.java:501)

Stack Trace:
com.carrotsearch.randomizedtesting.ThreadLeakError: 3 threads leaked from SUITE scope at org.apache.solr.cloud.TestSolrCloudWithSecureImpersonation:
   1) Thread[id=13337, name=jetty-launcher-1065-thread-1-SendThread(127.0.0.1:36777), state=TIMED_WAITING, group=TGRP-TestSolrCloudWithSecureImpersonation]
        at java.lang.Thread.sleep(Native Method)
        at org.apache.zookeeper.client.StaticHostProvider.next(StaticHostProvider.java:101)
        at org.apache.zookeeper.ClientCnxn$SendThread.startConnect(ClientCnxn.java:997)
        at org.apache.zookeeper.ClientCnxn$SendThread.run(ClientCnxn.java:1060)
   2) Thread[id=13275, name=jetty-launcher-1065-thread-2-EventThread, state=TIMED_WAITING, group=TGRP-TestSolrCloudWithSecureImpersonation]
        at sun.misc.Unsafe.park(Native Method)
        at java.util.concurrent.locks.LockSupport.parkNanos(LockSupport.java:215)
        at java.util.concurrent.locks.AbstractQueuedSynchronizer.doAcquireSharedNanos(AbstractQueuedSynchronizer.java:1037)
        at java.util.concurrent.locks.AbstractQueuedSynchronizer.tryAcquireSharedNanos(AbstractQueuedSynchronizer.java:1328)
        at java.util.concurrent.CountDownLatch.await(CountDownLatch.java:277)
        at org.apache.curator.CuratorZookeeperClient.internalBlockUntilConnectedOrTimedOut(CuratorZookeeperClient.java:323)
        at org.apache.curator.RetryLoop.callWithRetry(RetryLoop.java:105)
        at org.apache.curator.framework.imps.GetDataBuilderImpl.pathInForeground(GetDataBuilderImpl.java:288)
        at org.apache.curator.framework.imps.GetDataBuilderImpl.forPath(GetDataBuilderImpl.java:279)
        at org.apache.curator.framework.imps.GetDataBuilderImpl.forPath(GetDataBuilderImpl.java:41)
        at org.apache.curator.framework.recipes.shared.SharedValue.readValue(SharedValue.java:244)
        at org.apache.curator.framework.recipes.shared.SharedValue.access$100(SharedValue.java:44)
        at org.apache.curator.framework.recipes.shared.SharedValue$1.process(SharedValue.java:61)
        at org.apache.curator.framework.imps.NamespaceWatcher.process(NamespaceWatcher.java:67)
        at org.apache.zookeeper.ClientCnxn$EventThread.processEvent(ClientCnxn.java:530)
        at org.apache.zookeeper.ClientCnxn$EventThread.run(ClientCnxn.java:505)
   3) Thread[id=13338, name=jetty-launcher-1065-thread-1-EventThread, state=WAITING, group=TGRP-TestSolrCloudWithSecureImpersonation]
        at sun.misc.Unsafe.park(Native Method)
        at java.util.concurrent.locks.LockSupport.park(LockSupport.java:175)
        at java.util.concurrent.locks.AbstractQueuedSynchronizer$ConditionObject.await(AbstractQueuedSynchronizer.java:2039)
        at java.util.concurrent.LinkedBlockingQueue.take(LinkedBlockingQueue.java:442)
        at org.apache.zookeeper.ClientCnxn$EventThread.run(ClientCnxn.java:501)
        at __randomizedtesting.SeedInfo.seed([46E75060D157BDBF]:0)


FAILED:  junit.framework.TestSuite.org.apache.solr.cloud.TestSolrCloudWithSecureImpersonation

Error Message:
There are still zombie threads that couldn't be terminated:    1) Thread[id=13337, name=jetty-launcher-1065-thread-1-SendThread(127.0.0.1:36777), state=TIMED_WAITING, group=TGRP-TestSolrCloudWithSecureImpersonation]         at java.lang.Thread.sleep(Native Method)         at org.apache.zookeeper.client.StaticHostProvider.next(StaticHostProvider.java:101)         at org.apache.zookeeper.ClientCnxn$SendThread.startConnect(ClientCnxn.java:997)         at org.apache.zookeeper.ClientCnxn$SendThread.run(ClientCnxn.java:1060)

Stack Trace:
com.carrotsearch.randomizedtesting.ThreadLeakError: There are still zombie threads that couldn't be terminated:
   1) Thread[id=13337, name=jetty-launcher-1065-thread-1-SendThread(127.0.0.1:36777), state=TIMED_WAITING, group=TGRP-TestSolrCloudWithSecureImpersonation]
        at java.lang.Thread.sleep(Native Method)
        at org.apache.zookeeper.client.StaticHostProvider.next(StaticHostProvider.java:101)
        at org.apache.zookeeper.ClientCnxn$SendThread.startConnect(ClientCnxn.java:997)
        at org.apache.zookeeper.ClientCnxn$SendThread.run(ClientCnxn.java:1060)
        at __randomizedtesting.SeedInfo.seed([46E75060D157BDBF]:0)




Build Log:
[...truncated 12599 lines...]
   [junit4] Suite: org.apache.solr.cloud.TestSolrCloudWithSecureImpersonation
   [junit4]   2> Creating dataDir: /home/jenkins/workspace/Lucene-Solr-7.0-Linux/solr/build/solr-core/test/J0/temp/solr.cloud.TestSolrCloudWithSecureImpersonation_46E75060D157BDBF-001/init-core-data-001
   [junit4]   2> 2316339 WARN  (SUITE-TestSolrCloudWithSecureImpersonation-seed#[46E75060D157BDBF]-worker) [    ] o.a.s.SolrTestCaseJ4 startTrackingSearchers: numOpens=7 numCloses=7
   [junit4]   2> 2316339 INFO  (SUITE-TestSolrCloudWithSecureImpersonation-seed#[46E75060D157BDBF]-worker) [    ] o.a.s.SolrTestCaseJ4 Using PointFields (NUMERIC_POINTS_SYSPROP=true) w/NUMERIC_DOCVALUES_SYSPROP=true
   [junit4]   2> 2316340 INFO  (SUITE-TestSolrCloudWithSecureImpersonation-seed#[46E75060D157BDBF]-worker) [    ] o.a.s.SolrTestCaseJ4 Randomized ssl (true) and clientAuth (true) via: @org.apache.solr.util.RandomizeSSL(reason=, ssl=NaN, value=NaN, clientAuth=NaN)
   [junit4]   2> 2316365 INFO  (SUITE-TestSolrCloudWithSecureImpersonation-seed#[46E75060D157BDBF]-worker) [    ] o.a.s.c.MiniSolrCloudCluster Starting cluster of 2 servers in /home/jenkins/workspace/Lucene-Solr-7.0-Linux/solr/build/solr-core/test/J0/temp/solr.cloud.TestSolrCloudWithSecureImpersonation_46E75060D157BDBF-001/tempDir-001
   [junit4]   2> 2316365 INFO  (SUITE-TestSolrCloudWithSecureImpersonation-seed#[46E75060D157BDBF]-worker) [    ] o.a.s.c.ZkTestServer STARTING ZK TEST SERVER
   [junit4]   2> 2316365 INFO  (Thread-2053) [    ] o.a.s.c.ZkTestServer client port:0.0.0.0/0.0.0.0:0
   [junit4]   2> 2316365 INFO  (Thread-2053) [    ] o.a.s.c.ZkTestServer Starting server
   [junit4]   2> 2316368 ERROR (Thread-2053) [    ] o.a.z.s.ZooKeeperServer ZKShutdownHandler is not registered, so ZooKeeper server won't take any action on ERROR or SHUTDOWN server state changes
   [junit4]   2> 2316465 INFO  (SUITE-TestSolrCloudWithSecureImpersonation-seed#[46E75060D157BDBF]-worker) [    ] o.a.s.c.ZkTestServer start zk server on port:36777
   [junit4]   2> 2316470 INFO  (jetty-launcher-1065-thread-2) [    ] o.e.j.s.Server jetty-9.3.14.v20161028
   [junit4]   2> 2316470 INFO  (jetty-launcher-1065-thread-1) [    ] o.e.j.s.Server jetty-9.3.14.v20161028
   [junit4]   2> 2316479 INFO  (jetty-launcher-1065-thread-1) [    ] o.e.j.s.h.ContextHandler Started o.e.j.s.ServletContextHandler@6c963657{/solr,null,AVAILABLE}
   [junit4]   2> 2316479 INFO  (jetty-launcher-1065-thread-2) [    ] o.e.j.s.h.ContextHandler Started o.e.j.s.ServletContextHandler@5f9097ce{/solr,null,AVAILABLE}
   [junit4]   2> 2316479 INFO  (jetty-launcher-1065-thread-1) [    ] o.e.j.s.AbstractConnector Started ServerConnector@14abbc0c{SSL,[ssl, http/1.1]}{127.0.0.1:39617}
   [junit4]   2> 2316479 INFO  (jetty-launcher-1065-thread-1) [    ] o.e.j.s.Server Started @2318243ms
   [junit4]   2> 2316479 INFO  (jetty-launcher-1065-thread-2) [    ] o.e.j.s.AbstractConnector Started ServerConnector@1561252e{SSL,[ssl, http/1.1]}{127.0.0.1:44023}
   [junit4]   2> 2316479 INFO  (jetty-launcher-1065-thread-1) [    ] o.a.s.c.s.e.JettySolrRunner Jetty properties: {hostContext=/solr, hostPort=39617}
   [junit4]   2> 2316479 INFO  (jetty-launcher-1065-thread-2) [    ] o.e.j.s.Server Started @2318243ms
   [junit4]   2> 2316480 INFO  (jetty-launcher-1065-thread-2) [    ] o.a.s.c.s.e.JettySolrRunner Jetty properties: {hostContext=/solr, hostPort=44023}
   [junit4]   2> 2316480 ERROR (jetty-launcher-1065-thread-1) [    ] o.a.s.s.StartupLoggingUtils Missing Java Option solr.log.dir. Logging may be missing or incomplete.
   [junit4]   2> 2316480 ERROR (jetty-launcher-1065-thread-2) [    ] o.a.s.s.StartupLoggingUtils Missing Java Option solr.log.dir. Logging may be missing or incomplete.
   [junit4]   2> 2316480 INFO  (jetty-launcher-1065-thread-1) [    ] o.a.s.s.SolrDispatchFilter  ___      _       Welcome to Apache Solr™ version 7.0.0
   [junit4]   2> 2316480 INFO  (jetty-launcher-1065-thread-2) [    ] o.a.s.s.SolrDispatchFilter  ___      _       Welcome to Apache Solr™ version 7.0.0
   [junit4]   2> 2316480 INFO  (jetty-launcher-1065-thread-1) [    ] o.a.s.s.SolrDispatchFilter / __| ___| |_ _   Starting in cloud mode on port null
   [junit4]   2> 2316480 INFO  (jetty-launcher-1065-thread-2) [    ] o.a.s.s.SolrDispatchFilter / __| ___| |_ _   Starting in cloud mode on port null
   [junit4]   2> 2316480 INFO  (jetty-launcher-1065-thread-1) [    ] o.a.s.s.SolrDispatchFilter \__ \/ _ \ | '_|  Install dir: null, Default config dir: null
   [junit4]   2> 2316480 INFO  (jetty-launcher-1065-thread-2) [    ] o.a.s.s.SolrDispatchFilter \__ \/ _ \ | '_|  Install dir: null, Default config dir: null
   [junit4]   2> 2316480 INFO  (jetty-launcher-1065-thread-1) [    ] o.a.s.s.SolrDispatchFilter |___/\___/_|_|    Start time: 2017-08-14T00:00:52.800Z
   [junit4]   2> 2316480 INFO  (jetty-launcher-1065-thread-2) [    ] o.a.s.s.SolrDispatchFilter |___/\___/_|_|    Start time: 2017-08-14T00:00:52.800Z
   [junit4]   2> 2316481 INFO  (jetty-launcher-1065-thread-2) [    ] o.a.s.s.SolrDispatchFilter solr.xml found in ZooKeeper. Loading...
   [junit4]   2> 2316482 INFO  (jetty-launcher-1065-thread-1) [    ] o.a.s.s.SolrDispatchFilter solr.xml found in ZooKeeper. Loading...
   [junit4]   2> 2316495 INFO  (jetty-launcher-1065-thread-2) [    ] o.a.s.c.ZkContainer Zookeeper client=127.0.0.1:36777/solr
   [junit4]   2> 2316496 INFO  (jetty-launcher-1065-thread-1) [    ] o.a.s.c.ZkContainer Zookeeper client=127.0.0.1:36777/solr
   [junit4]   2> 2316523 INFO  (jetty-launcher-1065-thread-2) [n:127.0.0.1:44023_solr    ] o.a.s.c.Overseer Overseer (id=null) closing
   [junit4]   2> 2316524 INFO  (jetty-launcher-1065-thread-2) [n:127.0.0.1:44023_solr    ] o.a.s.c.OverseerElectionContext I am going to be the leader 127.0.0.1:44023_solr
   [junit4]   2> 2316524 INFO  (jetty-launcher-1065-thread-1) [n:127.0.0.1:39617_solr    ] o.a.s.c.Overseer Overseer (id=null) closing
   [junit4]   2> 2316524 INFO  (jetty-launcher-1065-thread-2) [n:127.0.0.1:44023_solr    ] o.a.s.c.Overseer Overseer (id=98478905929629701-127.0.0.1:44023_solr-n_0000000000) starting
   [junit4]   2> 2316524 INFO  (jetty-launcher-1065-thread-1) [n:127.0.0.1:39617_solr    ] o.a.s.c.ZkController Register node as live in ZooKeeper:/live_nodes/127.0.0.1:39617_solr
   [junit4]   2> 2316525 INFO  (zkCallback-1076-thread-1-processing-n:127.0.0.1:44023_solr) [n:127.0.0.1:44023_solr    ] o.a.s.c.c.ZkStateReader Updated live nodes from ZooKeeper... (0) -> (1)
   [junit4]   2> 2316528 INFO  (zkCallback-1077-thread-1-processing-n:127.0.0.1:39617_solr) [n:127.0.0.1:39617_solr    ] o.a.s.c.c.ZkStateReader Updated live nodes from ZooKeeper... (0) -> (1)
   [junit4]   2> 2316539 INFO  (jetty-launcher-1065-thread-2) [n:127.0.0.1:44023_solr    ] o.a.s.c.ZkController Register node as live in ZooKeeper:/live_nodes/127.0.0.1:44023_solr
   [junit4]   2> 2316539 INFO  (zkCallback-1076-thread-1-processing-n:127.0.0.1:44023_solr) [n:127.0.0.1:44023_solr    ] o.a.s.c.c.ZkStateReader Updated live nodes from ZooKeeper... (1) -> (2)
   [junit4]   2> 2316545 INFO  (zkCallback-1077-thread-1-processing-n:127.0.0.1:39617_solr) [n:127.0.0.1:39617_solr    ] o.a.s.c.c.ZkStateReader Updated live nodes from ZooKeeper... (1) -> (2)
   [junit4]   2> 2316562 INFO  (jetty-launcher-1065-thread-1) [n:127.0.0.1:39617_solr    ] o.a.s.c.CoreContainer Initializing authentication plugin: org.apache.solr.security.HttpParamDelegationTokenPlugin
   [junit4]   2> 2316566 WARN  (jetty-launcher-1065-thread-1) [n:127.0.0.1:39617_solr    ] o.a.s.c.s.i.Krb5HttpClientBuilder org.apache.solr.client.solrj.impl.Krb5HttpClientBuilder is configured without specifying system property 'java.security.auth.login.config'
   [junit4]   2> 2316570 INFO  (jetty-launcher-1065-thread-1) [n:127.0.0.1:39617_solr    ] o.a.s.s.KerberosPlugin Params: {solr.kerberos.impersonator.user.noGroups.hosts=*, solr.kerberos.impersonator.user.bogusGroup.groups=__some_bogus_group, token.valid=30, cookie.domain=127.0.0.1, solr.kerberos.impersonator.user.anyHostAnyUser.groups=*, solr.kerberos.impersonator.user.bogusGroup.hosts=*, solr.kerberos.impersonator.user.anyHostAnyUser.hosts=*, token.validity=36000, solr.kerberos.impersonator.user.noHosts.groups=*, type=kerberos, solr.kerberos.impersonator.user.localHostAnyGroup.groups=*, delegation-token.token-kind=solr-dt, solr.kerberos.impersonator.user.wrongHost.hosts=1.1.1.1.1.1, cookie.path=/, zk-dt-secret-manager.znodeWorkingPath=solr/security/zkdtsm, solr.kerberos.impersonator.user.localHostAnyGroup.hosts=localhost.localdomain,localhost,127.0.0.1, signer.secret.provider.zookeeper.path=/token, solr.kerberos.impersonator.user.anyHostUsersGroup.groups=jenkins, zk-dt-secret-manager.enable=true, solr.kerberos.impersonator.user.wrongHost.groups=*, kerberos.name.rules=DEFAULT, signer.secret.provider=zookeeper, solr.kerberos.impersonator.user.anyHostUsersGroup.hosts=*}
   [junit4]   2> 2316577 INFO  (jetty-launcher-1065-thread-2) [n:127.0.0.1:44023_solr    ] o.a.s.c.CoreContainer Initializing authentication plugin: org.apache.solr.security.HttpParamDelegationTokenPlugin
   [junit4]   2> 2316577 WARN  (jetty-launcher-1065-thread-2) [n:127.0.0.1:44023_solr    ] o.a.s.c.s.i.Krb5HttpClientBuilder org.apache.solr.client.solrj.impl.Krb5HttpClientBuilder is configured without specifying system property 'java.security.auth.login.config'
   [junit4]   2> 2316578 INFO  (jetty-launcher-1065-thread-2) [n:127.0.0.1:44023_solr    ] o.a.s.s.KerberosPlugin Params: {solr.kerberos.impersonator.user.noGroups.hosts=*, solr.kerberos.impersonator.user.bogusGroup.groups=__some_bogus_group, token.valid=30, cookie.domain=127.0.0.1, solr.kerberos.impersonator.user.anyHostAnyUser.groups=*, solr.kerberos.impersonator.user.bogusGroup.hosts=*, solr.kerberos.impersonator.user.anyHostAnyUser.hosts=*, token.validity=36000, solr.kerberos.impersonator.user.noHosts.groups=*, type=kerberos, solr.kerberos.impersonator.user.localHostAnyGroup.groups=*, delegation-token.token-kind=solr-dt, solr.kerberos.impersonator.user.wrongHost.hosts=1.1.1.1.1.1, cookie.path=/, zk-dt-secret-manager.znodeWorkingPath=solr/security/zkdtsm, solr.kerberos.impersonator.user.localHostAnyGroup.hosts=localhost.localdomain,localhost,127.0.0.1, signer.secret.provider.zookeeper.path=/token, solr.kerberos.impersonator.user.anyHostUsersGroup.groups=jenkins, zk-dt-secret-manager.enable=true, solr.kerberos.impersonator.user.wrongHost.groups=*, kerberos.name.rules=DEFAULT, signer.secret.provider=zookeeper, solr.kerberos.impersonator.user.anyHostUsersGroup.hosts=*}
   [junit4]   2> 2316620 INFO  (jetty-launcher-1065-thread-1) [n:127.0.0.1:39617_solr    ] o.a.c.f.i.CuratorFrameworkImpl Starting
   [junit4]   2> 2316620 INFO  (jetty-launcher-1065-thread-2) [n:127.0.0.1:44023_solr    ] o.a.c.f.i.CuratorFrameworkImpl Starting
   [junit4]   2> 2316637 INFO  (jetty-launcher-1065-thread-2-EventThread) [n:127.0.0.1:44023_solr    ] o.a.c.f.s.ConnectionStateManager State change: CONNECTED
   [junit4]   2> 2316637 INFO  (jetty-launcher-1065-thread-1-EventThread) [n:127.0.0.1:39617_solr    ] o.a.c.f.s.ConnectionStateManager State change: CONNECTED
   [junit4]   2> 2316723 WARN  (jetty-launcher-1065-thread-2) [n:127.0.0.1:44023_solr    ] o.a.s.c.s.i.Krb5HttpClientBuilder org.apache.solr.client.solrj.impl.Krb5HttpClientBuilder is configured without specifying system property 'java.security.auth.login.config'
   [junit4]   2> 2316723 WARN  (jetty-launcher-1065-thread-1) [n:127.0.0.1:39617_solr    ] o.a.s.c.s.i.Krb5HttpClientBuilder org.apache.solr.client.solrj.impl.Krb5HttpClientBuilder is configured without specifying system property 'java.security.auth.login.config'
   [junit4]   2> 2316748 INFO  (jetty-launcher-1065-thread-1) [n:127.0.0.1:39617_solr    ] o.a.s.m.r.SolrJmxReporter JMX monitoring for 'solr_39617.solr.node' (registry 'solr.node') enabled at server: com.sun.jmx.mbeanserver.JmxMBeanServer@5ad6c962
   [junit4]   2> 2316748 INFO  (jetty-launcher-1065-thread-2) [n:127.0.0.1:44023_solr    ] o.a.s.m.r.SolrJmxReporter JMX monitoring for 'solr_44023.solr.node' (registry 'solr.node') enabled at server: com.sun.jmx.mbeanserver.JmxMBeanServer@5ad6c962
   [junit4]   2> 2316751 INFO  (jetty-launcher-1065-thread-1) [n:127.0.0.1:39617_solr    ] o.a.s.m.r.SolrJmxReporter JMX monitoring for 'solr_39617.solr.jvm' (registry 'solr.jvm') enabled at server: com.sun.jmx.mbeanserver.JmxMBeanServer@5ad6c962
   [junit4]   2> 2316751 INFO  (jetty-launcher-1065-thread-1) [n:127.0.0.1:39617_solr    ] o.a.s.m.r.SolrJmxReporter JMX monitoring for 'solr_39617.solr.jetty' (registry 'solr.jetty') enabled at server: com.sun.jmx.mbeanserver.JmxMBeanServer@5ad6c962
   [junit4]   2> 2316752 INFO  (jetty-launcher-1065-thread-2) [n:127.0.0.1:44023_solr    ] o.a.s.m.r.SolrJmxReporter JMX monitoring for 'solr_44023.solr.jvm' (registry 'solr.jvm') enabled at server: com.sun.jmx.mbeanserver.JmxMBeanServer@5ad6c962
   [junit4]   2> 2316752 INFO  (jetty-launcher-1065-thread-1) [n:127.0.0.1:39617_solr    ] o.a.s.c.CorePropertiesLocator Found 0 core definitions underneath /home/jenkins/workspace/Lucene-Solr-7.0-Linux/solr/build/solr-core/test/J0/temp/solr.cloud.TestSolrCloudWithSecureImpersonation_46E75060D157BDBF-001/tempDir-001/node1/.
   [junit4]   2> 2316752 INFO  (jetty-launcher-1065-thread-2) [n:127.0.0.1:44023_solr    ] o.a.s.m.r.SolrJmxReporter JMX monitoring for 'solr_44023.solr.jetty' (registry 'solr.jetty') enabled at server: com.sun.jmx.mbeanserver.JmxMBeanServer@5ad6c962
   [junit4]   2> 2316753 INFO  (jetty-launcher-1065-thread-2) [n:127.0.0.1:44023_solr    ] o.a.s.c.CorePropertiesLocator Found 0 core definitions underneath /home/jenkins/workspace/Lucene-Solr-7.0-Linux/solr/build/solr-core/test/J0/temp/solr.cloud.TestSolrCloudWithSecureImpersonation_46E75060D157BDBF-001/tempDir-001/node2/.
   [junit4]   2> 2316795 INFO  (TEST-TestSolrCloudWithSecureImpersonation.testProxyInvalidRemote-seed#[46E75060D157BDBF]) [    ] o.a.s.SolrTestCaseJ4 ###Starting testProxyInvalidRemote
   [junit4]   2> 2316857 WARN  (TEST-TestSolrCloudWithSecureImpersonation.testProxyInvalidRemote-seed#[46E75060D157BDBF]) [    ] o.a.h.c.p.ResponseProcessCookies Invalid cookie header: "Set-Cookie: hadoop.auth="u=localHostAnyGroup&p=localHostAnyGroup&t=test&e=1502704853143&s=BUPCgj5W62jt1O6hDVtzfQ0YlNQ="; Path=/; Domain=127.0.0.1; Expires=pon, 14-avg-2017 10:00:53 GMT; Secure; HttpOnly". Invalid 'expires' attribute: pon, 14-avg-2017 10:00:53 GMT
   [junit4]   2> 2316857 INFO  (TEST-TestSolrCloudWithSecureImpersonation.testProxyInvalidRemote-seed#[46E75060D157BDBF]) [    ] o.a.s.SolrTestCaseJ4 ###Ending testProxyInvalidRemote
   [junit4]   2> 2316880 INFO  (TEST-TestSolrCloudWithSecureImpersonation.testProxyInvalidGroup-seed#[46E75060D157BDBF]) [    ] o.a.s.SolrTestCaseJ4 ###Starting testProxyInvalidGroup
   [junit4]   2> 2316887 WARN  (qtp174355551-13239) [    ] o.a.h.s.ShellBasedUnixGroupsMapping got exception trying to get groups for user bar: id: ‘bar’: no such user
   [junit4]   2>
   [junit4]   2> 2316888 WARN  (qtp174355551-13239) [    ] o.a.h.s.UserGroupInformation No groups available for user bar
   [junit4]   2> 2316893 WARN  (TEST-TestSolrCloudWithSecureImpersonation.testProxyInvalidGroup-seed#[46E75060D157BDBF]) [    ] o.a.h.c.p.ResponseProcessCookies Invalid cookie header: "Set-Cookie: hadoop.auth="u=bogusGroup&p=bogusGroup&t=test&e=1502704853201&s=2sE8H4ZElleeVIqgWVF7Ur3F1E0="; Path=/; Domain=127.0.0.1; Expires=pon, 14-avg-2017 10:00:53 GMT; Secure; HttpOnly". Invalid 'expires' attribute: pon, 14-avg-2017 10:00:53 GMT
   [junit4]   2> 2316893 INFO  (TEST-TestSolrCloudWithSecureImpersonation.testProxyInvalidGroup-seed#[46E75060D157BDBF]) [    ] o.a.s.SolrTestCaseJ4 ###Ending testProxyInvalidGroup
   [junit4]   2> 2316911 INFO  (TEST-TestSolrCloudWithSecureImpersonation.testProxyUnknownRemote-seed#[46E75060D157BDBF]) [    ] o.a.s.SolrTestCaseJ4 ###Starting testProxyUnknownRemote
   [junit4]   2> 2333453 WARN  (jetty-launcher-1065-thread-1-SendThread(127.0.0.1:36777)) [n:127.0.0.1:39617_solr    ] o.a.z.ClientCnxn Client session timed out, have not heard from server in 16701ms for sessionid 0x15dde0b0dce0006
   [junit4]   2> 2333453 WARN  (jetty-launcher-1065-thread-2-SendThread(127.0.0.1:36777)) [n:127.0.0.1:44023_solr    ] o.a.z.ClientCnxn Client session timed out, have not heard from server in 16721ms for sessionid 0x15dde0b0dce0007
   [junit4]   2> 2333454 WARN  (jetty-launcher-1065-thread-2-SendThread(127.0.0.1:36777)) [n:127.0.0.1:44023_solr    ] o.a.z.ClientCnxn Client session timed out, have not heard from server in 16687ms for sessionid 0x15dde0b0dce0005
   [junit4]   2> 2333453 WARN  (jetty-launcher-1065-thread-1-SendThread(127.0.0.1:36777)) [n:127.0.0.1:39617_solr    ] o.a.z.ClientCnxn Client session timed out, have not heard from server in 16721ms for sessionid 0x15dde0b0dce0008
   [junit4]   2> 2333454 WARN  (NIOServerCxn.Factory:0.0.0.0/0.0.0.0:0) [    ] o.a.z.s.NIOServerCnxn caught end of stream exception
   [junit4]   2> EndOfStreamException: Unable to read additional data from client sessionid 0x15dde0b0dce0006, likely client has closed socket
   [junit4]   2> at org.apache.zookeeper.server.NIOServerCnxn.doIO(NIOServerCnxn.java:239)
   [junit4]   2> at org.apache.zookeeper.server.NIOServerCnxnFactory.run(NIOServerCnxnFactory.java:203)
   [junit4]   2> at java.lang.Thread.run(Thread.java:748)
   [junit4]   2> 2333455 WARN  (NIOServerCxn.Factory:0.0.0.0/0.0.0.0:0) [    ] o.a.z.s.NIOServerCnxn caught end of stream exception
   [junit4]   2> EndOfStreamException: Unable to read additional data from client sessionid 0x15dde0b0dce0007, likely client has closed socket
   [junit4]   2> at org.apache.zookeeper.server.NIOServerCnxn.doIO(NIOServerCnxn.java:239)
   [junit4]   2> at org.apache.zookeeper.server.NIOServerCnxnFactory.run(NIOServerCnxnFactory.java:203)
   [junit4]   2> at java.lang.Thread.run(Thread.java:748)
   [junit4]   2> 2333456 WARN  (NIOServerCxn.Factory:0.0.0.0/0.0.0.0:0) [    ] o.a.z.s.NIOServerCnxn caught end of stream exception
   [junit4]   2> EndOfStreamException: Unable to read additional data from client sessionid 0x15dde0b0dce0005, likely client has closed socket
   [junit4]   2> at org.apache.zookeeper.server.NIOServerCnxn.doIO(NIOServerCnxn.java:239)
   [junit4]   2> at org.apache.zookeeper.server.NIOServerCnxnFactory.run(NIOServerCnxnFactory.java:203)
   [junit4]   2> at java.lang.Thread.run(Thread.java:748)
   [junit4]   2> 2333456 WARN  (NIOServerCxn.Factory:0.0.0.0/0.0.0.0:0) [    ] o.a.z.s.NIOServerCnxn caught end of stream exception
   [junit4]   2> EndOfStreamException: Unable to read additional data from client sessionid 0x15dde0b0dce0008, likely client has closed socket
   [junit4]   2> at org.apache.zookeeper.server.NIOServerCnxn.doIO(NIOServerCnxn.java:239)
   [junit4]   2> at org.apache.zookeeper.server.NIOServerCnxnFactory.run(NIOServerCnxnFactory.java:203)
   [junit4]   2> at java.lang.Thread.run(Thread.java:748)
   [junit4]   2> 2333460 WARN  (TEST-TestSolrCloudWithSecureImpersonation.testProxyUnknownRemote-seed#[46E75060D157BDBF]) [    ] o.a.h.c.p.ResponseProcessCookies Invalid cookie header: "Set-Cookie: hadoop.auth="u=localHostAnyGroup&p=localHostAnyGroup&t=test&e=1502704853231&s=WfFdXwGtmcDysympSox/G4HLDPU="; Path=/; Domain=127.0.0.1; Expires=pon, 14-avg-2017 10:00:53 GMT; Secure; HttpOnly". Invalid 'expires' attribute: pon, 14-avg-2017 10:00:53 GMT
   [junit4]   2> 2333461 INFO  (TEST-TestSolrCloudWithSecureImpersonation.testProxyUnknownRemote-seed#[46E75060D157BDBF]) [    ] o.a.s.SolrTestCaseJ4 ###Ending testProxyUnknownRemote
   [junit4]   2> 2333488 INFO  (TEST-TestSolrCloudWithSecureImpersonation.testProxyNoConfigGroups-seed#[46E75060D157BDBF]) [    ] o.a.s.SolrTestCaseJ4 ###Starting testProxyNoConfigGroups
   [junit4]   2> 2333490 WARN  (TEST-TestSolrCloudWithSecureImpersonation.testProxyNoConfigGroups-seed#[46E75060D157BDBF]) [    ] o.a.h.c.p.ResponseProcessCookies Invalid cookie header: "Set-Cookie: hadoop.auth="u=noGroups&p=noGroups&t=test&e=1502704869808&s=ECJTabpMseeJeEZRQpEPg5S8yyc="; Path=/; Domain=127.0.0.1; Expires=pon, 14-avg-2017 10:01:09 GMT; Secure; HttpOnly". Invalid 'expires' attribute: pon, 14-avg-2017 10:01:09 GMT
   [junit4]   2> 2333491 INFO  (TEST-TestSolrCloudWithSecureImpersonation.testProxyNoConfigGroups-seed#[46E75060D157BDBF]) [    ] o.a.s.SolrTestCaseJ4 ###Ending testProxyNoConfigGroups
   [junit4]   2> 2333512 INFO  (TEST-TestSolrCloudWithSecureImpersonation.testProxyWrongHost-seed#[46E75060D157BDBF]) [    ] o.a.s.SolrTestCaseJ4 ###Starting testProxyWrongHost
   [junit4]   2> 2333555 WARN  (zkCallback-1077-thread-2-processing-n:127.0.0.1:39617_solr) [n:127.0.0.1:39617_solr    ] o.a.s.c.c.ConnectionManager Watcher org.apache.solr.common.cloud.ConnectionManager@16ab8538 name: ZooKeeperConnection Watcher:127.0.0.1:36777/solr got event WatchedEvent state:Disconnected type:None path:null path: null type: None
   [junit4]   2> 2333555 WARN  (zkCallback-1077-thread-2-processing-n:127.0.0.1:39617_solr) [n:127.0.0.1:39617_solr    ] o.a.s.c.c.ConnectionManager zkClient has disconnected
   [junit4]   2> 2333555 WARN  (zkCallback-1076-thread-2-processing-n:127.0.0.1:44023_solr) [n:127.0.0.1:44023_solr    ] o.a.s.c.c.ConnectionManager Watcher org.apache.solr.common.cloud.ConnectionManager@77541b17 name: ZooKeeperConnection Watcher:127.0.0.1:36777/solr got event WatchedEvent state:Disconnected type:None path:null path: null type: None
   [junit4]   2> 2333556 WARN  (zkCallback-1076-thread-2-processing-n:127.0.0.1:44023_solr) [n:127.0.0.1:44023_solr    ] o.a.s.c.c.ConnectionManager zkClient has disconnected
   [junit4]   2> 2333556 INFO  (jetty-launcher-1065-thread-1-EventThread) [n:127.0.0.1:39617_solr    ] o.a.c.f.s.ConnectionStateManager State change: SUSPENDED
   [junit4]   2> 2338536 WARN  (jetty-launcher-1065-thread-2-SendThread(127.0.0.1:36777)) [n:127.0.0.1:44023_solr    ] o.a.z.ClientCnxn Unable to reconnect to ZooKeeper service, session 0x15dde0b0dce0007 has expired
   [junit4]   2> 2338536 WARN  (jetty-launcher-1065-thread-1-SendThread(127.0.0.1:36777)) [n:127.0.0.1:39617_solr    ] o.a.z.ClientCnxn Unable to reconnect to ZooKeeper service, session 0x15dde0b0dce0008 has expired
   [junit4]   2> 2338536 WARN  (jetty-launcher-1065-thread-1-SendThread(127.0.0.1:36777)) [n:127.0.0.1:39617_solr    ] o.a.z.ClientCnxn Unable to reconnect to ZooKeeper service, session 0x15dde0b0dce0006 has expired
   [junit4]   2> 2338536 WARN  (TEST-TestSolrCloudWithSecureImpersonation.testProxyWrongHost-seed#[46E75060D157BDBF]) [    ] o.a.h.c.p.ResponseProcessCookies Invalid cookie header: "Set-Cookie: hadoop.auth="u=wrongHost&p=wrongHost&t=test&e=1502704869832&s=UfKIjtpl5S9mXvOIZ8ZCFQqDXtM="; Path=/; Domain=127.0.0.1; Expires=pon, 14-avg-2017 10:01:09 GMT; Secure; HttpOnly". Invalid 'expires' attribute: pon, 14-avg-2017 10:01:09 GMT
   [junit4]   2> 2338536 WARN  (zkCallback-1077-thread-2-processing-n:127.0.0.1:39617_solr) [n:127.0.0.1:39617_solr    ] o.a.s.c.c.ConnectionManager Watcher org.apache.solr.common.cloud.ConnectionManager@16ab8538 name: ZooKeeperConnection Watcher:127.0.0.1:36777/solr got event WatchedEvent state:Expired type:None path:null path: null type: None
   [junit4]   2> 2338537 WARN  (zkCallback-1077-thread-2-processing-n:127.0.0.1:39617_solr) [n:127.0.0.1:39617_solr    ] o.a.s.c.c.ConnectionManager Our previous ZooKeeper session was expired. Attempting to reconnect to recover relationship with ZooKeeper...
   [junit4]   2> 2338537 INFO  (TEST-TestSolrCloudWithSecureImpersonation.testProxyWrongHost-seed#[46E75060D157BDBF]) [    ] o.a.s.SolrTestCaseJ4 ###Ending testProxyWrongHost
   [junit4]   2> 2338537 INFO  (zkCallback-1077-thread-2-processing-n:127.0.0.1:39617_solr) [n:127.0.0.1:39617_solr    ] o.a.s.c.TransientSolrCoreCacheDefault Allocating transient cache for 2147483647 transient cores
   [junit4]   2> 2338537 WARN  (zkCallback-1077-thread-2-processing-n:127.0.0.1:39617_solr) [n:127.0.0.1:39617_solr    ] o.a.s.c.c.DefaultConnectionStrategy Connection expired - starting a new one...
   [junit4]   2> 2338538 INFO  (zkCallback-1076-thread-6-processing-n:127.0.0.1:44023_solr) [n:127.0.0.1:44023_solr    ] o.a.s.c.c.ZkStateReader Updated live nodes from ZooKeeper... (2) -> (1)
   [junit4]   2> 2338541 INFO  (zkCallback-1077-thread-2-processing-n:127.0.0.1:39617_solr) [n:127.0.0.1:39617_solr    ] o.a.s.c.c.ConnectionManager Connection with ZooKeeper reestablished.
   [junit4]   2> 2338542 INFO  (zkCallback-1077-thread-2-processing-n:127.0.0.1:39617_solr) [n:127.0.0.1:39617_solr    ] o.a.s.c.ZkController ZooKeeper session re-connected ... refreshing core states after session expiration.
   [junit4]   2> 2338543 INFO  (zkCallback-1077-thread-2-processing-n:127.0.0.1:39617_solr) [n:127.0.0.1:39617_solr    ] o.a.s.c.c.ZkStateReader Updated live nodes from ZooKeeper... (2) -> (1)
   [junit4]   2> 2338554 INFO  (TEST-TestSolrCloudWithSecureImpersonation.testForwarding-seed#[46E75060D157BDBF]) [    ] o.a.s.SolrTestCaseJ4 ###Starting testForwarding
   [junit4]   2> 2338554 INFO  (zkCallback-1077-thread-2-processing-n:127.0.0.1:39617_solr) [n:127.0.0.1:39617_solr    ] o.a.s.c.ZkController Register node as live in ZooKeeper:/live_nodes/127.0.0.1:39617_solr
   [junit4]   2> 2338555 INFO  (zkCallback-1077-thread-4-processing-n:127.0.0.1:39617_solr) [n:127.0.0.1:39617_solr    ] o.a.s.c.c.ZkStateReader Updated live nodes from ZooKeeper... (1) -> (2)
   [junit4]   2> 2338556 INFO  (zkCallback-1077-thread-2-processing-n:127.0.0.1:39617_solr) [n:127.0.0.1:39617_solr    ] o.a.s.c.c.DefaultConnectionStrategy Reconnected to ZooKeeper
   [junit4]   2> 2338556 INFO  (zkCallback-1077-thread-2-processing-n:127.0.0.1:39617_solr) [n:127.0.0.1:39617_solr    ] o.a.s.c.c.ConnectionManager Connected:true
   [junit4]   2> 2338559 INFO  (zkCallback-1076-thread-6-processing-n:127.0.0.1:44023_solr) [n:127.0.0.1:44023_solr    ] o.a.s.c.c.ZkStateReader Updated live nodes from ZooKeeper... (1) -> (2)
   [junit4]   2> 2338661 INFO  (TEST-TestSolrCloudWithSecureImpersonation.testForwarding-seed#[46E75060D157BDBF]) [    ] o.a.s.c.c.ZkStateReader Updated live nodes from ZooKeeper... (0) -> (2)
   [junit4]   2> 2338661 INFO  (TEST-TestSolrCloudWithSecureImpersonation.testForwarding-seed#[46E75060D157BDBF]) [    ] o.a.s.c.s.i.ZkClientClusterStateProvider Cluster at 127.0.0.1:36777/solr ready
   [junit4]   2> 2338665 INFO  (qtp174355551-13229) [n:127.0.0.1:39617_solr    ] o.a.s.h.a.CollectionsHandler Invoked Collection Action :create with params pullReplicas=0&replicationFactor=1&collection.configName=conf1&maxShardsPerNode=1&name=forwardingCollection&nrtReplicas=1&action=CREATE&numShards=1&tlogReplicas=0&wt=javabin&version=2 and sendToOCPQueue=true
   [junit4]   2> 2338666 INFO  (OverseerThreadFactory-4105-thread-1-processing-n:127.0.0.1:44023_solr) [n:127.0.0.1:44023_solr    ] o.a.s.c.CreateCollectionCmd Create collection forwardingCollection
   [junit4]   2> 2338770 INFO  (OverseerStateUpdate-98478905929629701-127.0.0.1:44023_solr-n_0000000000) [n:127.0.0.1:44023_solr    ] o.a.s.c.o.SliceMutator createReplica() {
   [junit4]   2>   "operation":"ADDREPLICA",
   [junit4]   2>   "collection":"forwardingCollection",
   [junit4]   2>   "shard":"shard1",
   [junit4]   2>   "core":"forwardingCollection_shard1_replica_n1",
   [junit4]   2>   "state":"down",
   [junit4]   2>   "base_url":"https://127.0.0.1:44023/solr",
   [junit4]   2>   "type":"NRT"}
   [junit4]   2> 2338999 INFO  (qtp1066359522-13228) [n:127.0.0.1:44023_solr    ] o.a.s.h.a.CoreAdminOperation core create command qt=/admin/cores&coreNodeName=core_node1&collection.configName=conf1&newCollection=true&name=forwardingCollection_shard1_replica_n1&action=CREATE&numShards=1&collection=forwardingCollection&shard=shard1&wt=javabin&version=2&replicaType=NRT
   [junit4]   2> 2338999 INFO  (qtp1066359522-13228) [n:127.0.0.1:44023_solr    ] o.a.s.c.TransientSolrCoreCacheDefault Allocating transient cache for 2147483647 transient cores
   [junit4]   2> 2339103 INFO  (zkCallback-1076-thread-6-processing-n:127.0.0.1:44023_solr) [n:127.0.0.1:44023_solr    ] o.a.s.c.c.ZkStateReader A cluster state change: [WatchedEvent state:SyncConnected type:NodeDataChanged path:/collections/forwardingCollection/state.json] for collection [forwardingCollection] has occurred - updating... (live nodes size: [2])
   [junit4]   2> 2339103 INFO  (zkCallback-1076-thread-3-processing-n:127.0.0.1:44023_solr) [n:127.0.0.1:44023_solr    ] o.a.s.c.c.ZkStateReader A cluster state change: [WatchedEvent state:SyncConnected type:NodeDataChanged path:/collections/forwardingCollection/state.json] for collection [forwardingCollection] has occurred - updating... (live nodes size: [2])
   [junit4]   2> 2340019 INFO  (qtp1066359522-13228) [n:127.0.0.1:44023_solr c:forwardingCollection s:shard1 r:core_node1 x:forwardingCollection_shard1_replica_n1] o.a.s.c.SolrConfig Using Lucene MatchVersion: 7.0.0
   [junit4]   2> 2340030 INFO  (qtp1066359522-13228) [n:127.0.0.1:44023_solr c:forwardingCollection s:shard1 r:core_node1 x:forwardingCollection_shard1_replica_n1] o.a.s.s.IndexSchema [forwardingCollection_shard1_replica_n1] Schema name=test
   [junit4]   2> 2340079 INFO  (qtp1066359522-13228) [n:127.0.0.1:44023_solr c:forwardingCollection s:shard1 r:core_node1 x:forwardingCollection_shard1_replica_n1] o.a.s.s.IndexSchema Loaded schema test/1.0 with uniqueid field id
   [junit4]   2> 2340085 INFO  (qtp1066359522-13228) [n:127.0.0.1:44023_solr c:forwardingCollection s:shard1 r:core_node1 x:forwardingCollection_shard1_replica_n1] o.a.s.c.CoreContainer Creating SolrCore 'forwardingCollection_shard1_replica_n1' using configuration from collection forwardingCollection, trusted=true
   [junit4]   2> 2340085 INFO  (qtp1066359522-13228) [n:127.0.0.1:44023_solr c:forwardingCollection s:shard1 r:core_node1 x:forwardingCollection_shard1_replica_n1] o.a.s.m.r.SolrJmxReporter JMX monitoring for 'solr_44023.solr.core.forwardingCollection.shard1.replica_n1' (registry 'solr.core.forwardingCollection.shard1.replica_n1') enabled at server: com.sun.jmx.mbeanserver.JmxMBeanServer@5ad6c962
   [junit4]   2> 2340085 INFO  (qtp1066359522-13228) [n:127.0.0.1:44023_solr c:forwardingCollection s:shard1 r:core_node1 x:forwardingCollection_shard1_replica_n1] o.a.s.c.SolrCore solr.RecoveryStrategy.Builder
   [junit4]   2> 2340085 INFO  (qtp1066359522-13228) [n:127.0.0.1:44023_solr c:forwardingCollection s:shard1 r:core_node1 x:forwardingCollection_shard1_replica_n1] o.a.s.c.SolrCore [[forwardingCollection_shard1_replica_n1] ] Opening new SolrCore at [/home/jenkins/workspace/Lucene-Solr-7.0-Linux/solr/build/solr-core/test/J0/temp/solr.cloud.TestSolrCloudWithSecureImpersonation_46E75060D157BDBF-001/tempDir-001/node2/forwardingCollection_shard1_replica_n1], dataDir=[/home/jenkins/workspace/Lucene-Solr-7.0-Linux/solr/build/solr-core/test/J0/temp/solr.cloud.TestSolrCloudWithSecureImpersonation_46E75060D157BDBF-001/tempDir-001/node2/./forwardingCollection_shard1_replica_n1/data/]
   [junit4]   2> 2340087 INFO  (qtp1066359522-13228) [n:127.0.0.1:44023_solr c:forwardingCollection s:shard1 r:core_node1 x:forwardingCollection_shard1_replica_n1] o.a.s.u.RandomMergePolicy RandomMergePolicy wrapping class org.apache.lucene.index.TieredMergePolicy: [TieredMergePolicy: maxMergeAtOnce=26, maxMergeAtOnceExplicit=44, maxMergedSegmentMB=63.9189453125, floorSegmentMB=0.7060546875, forceMergeDeletesPctAllowed=10.938306676794568, segmentsPerTier=19.0, maxCFSSegmentSizeMB=8.796093022207999E12, noCFSRatio=0.5951419802178491
   [junit4]   2> 2340122 INFO  (qtp1066359522-13228) [n:127.0.0.1:44023_solr c:forwardingCollection s:shard1 r:core_node1 x:forwardingCollection_shard1_replica_n1] o.a.s.u.UpdateHandler Using UpdateLog implementation: org.apache.solr.update.UpdateLog
   [junit4]   2> 2340122 INFO  (qtp1066359522-13228) [n:127.0.0.1:44023_solr c:forwardingCollection s:shard1 r:core_node1 x:forwardingCollection_shard1_replica_n1] o.a.s.u.UpdateLog Initializing UpdateLog: dataDir= defaultSyncLevel=FLUSH numRecordsToKeep=100 maxNumLogsToKeep=10 numVersionBuckets=65536
   [junit4]   2> 2340123 INFO  (qtp1066359522-13228) [n:127.0.0.1:44023_solr c:forwardingCollection s:shard1 r:core_node1 x:forwardingCollection_shard1_replica_n1] o.a.s.u.CommitTracker Hard AutoCommit: disabled
   [junit4]   2> 2340123 INFO  (qtp1066359522-13228) [n:127.0.0.1:44023_solr c:forwardingCollection s:shard1 r:core_node1 x:forwardingCollection_shard1_replica_n1] o.a.s.u.CommitTracker Soft AutoCommit: disabled
   [junit4]   2> 2340124 INFO  (qtp1066359522-13228) [n:127.0.0.1:44023_solr c:forwardingCollection s:shard1 r:core_node1 x:forwardingCollection_shard1_replica_n1] o.a.s.u.RandomMergePolicy RandomMergePolicy wrapping class org.apache.lucene.index.TieredMergePolicy: [TieredMergePolicy: maxMergeAtOnce=37, maxMergeAtOnceExplicit=47, maxMergedSegmentMB=51.33203125, floorSegmentMB=2.0732421875, forceMergeDeletesPctAllowed=17.653714058516567, segmentsPerTier=40.0, maxCFSSegmentSizeMB=8.796093022207999E12, noCFSRatio=0.19929113316801175
   [junit4]   2> 2340125 INFO  (qtp1066359522-13228) [n:127.0.0.1:44023_solr c:forwardingCollection s:shard1 r:core_node1 x:forwardingCollection_shard1_replica_n1] o.a.s.s.SolrIndexSearcher Opening [Searcher@4d95a874[forwardingCollection_shard1_replica_n1] main]
   [junit4]   2> 2340126 INFO  (qtp1066359522-13228) [n:127.0.0.1:44023_solr c:forwardingCollection s:shard1 r:core_node1 x:forwardingCollection_shard1_replica_n1] o.a.s.h.c.SpellCheckComponent Initializing spell checkers
   [junit4]   2> 2340143 INFO  (qtp1066359522-13228) [n:127.0.0.1:44023_solr c:forwardingCollection s:shard1 r:core_node1 x:forwardingCollection_shard1_replica_n1] o.a.s.s.DirectSolrSpellChecker init: {name=direct,classname=DirectSolrSpellChecker,field=lowerfilt,minQueryLength=3}
   [junit4]   2> 2340199 INFO  (qtp1066359522-13228) [n:127.0.0.1:44023_solr c:forwardingCollection s:shard1 r:core_node1 x:forwardingCollection_shard1_replica_n1] o.a.s.h.ReplicationHandler Commits will be reserved for  10000
   [junit4]   2> 2340200 INFO  (searcherExecutor-4110-thread-1-processing-n:127.0.0.1:44023_solr x:forwardingCollection_shard1_replica_n1 s:shard1 c:forwardingCollection r:core_node1) [n:127.0.0.1:44023_solr c:forwardingCollection s:shard1 r:core_node1 x:forwardingCollection_shard1_replica_n1] o.a.s.h.c.SpellCheckComponent Loading spell index for spellchecker: default
   [junit4]   2> 2340200 INFO  (qtp1066359522-13228) [n:127.0.0.1:44023_solr c:forwardingCollection s:shard1 r:core_node1 x:forwardingCollection_shard1_replica_n1] o.a.s.u.UpdateLog Could not find max version in index or recent updates, using new clock 1575662519865835520
   [junit4]   2> 2340200 INFO  (searcherExecutor-4110-thread-1-processing-n:127.0.0.1:44023_solr x:forwardingCollection_shard1_replica_n1 s:shard1 c:forwardingCollection r:core_node1) [n:127.0.0.1:44023_solr c:forwardingCollection s:shard1 r:core_node1 x:forwardingCollection_shard1_replica_n1] o.a.s.h.c.SpellCheckComponent Loading spell index for spellchecker: direct
   [junit4]   2> 2340200 INFO  (searcherExecutor-4110-thread-1-processing-n:127.0.0.1:44023_solr x:forwardingCollection_shard1_replica_n1 s:shard1 c:forwardingCollection r:core_node1) [n:127.0.0.1:44023_solr c:forwardingCollection s:shard1 r:core_node1 x:forwardingCollection_shard1_replica_n1] o.a.s.h.c.SpellCheckComponent Loading spell index for spellchecker: wordbreak
   [junit4]   2> 2340200 INFO  (searcherExecutor-4110-thread-1-processing-n:127.0.0.1:44023_solr x:forwardingCollection_shard1_replica_n1 s:shard1 c:forwardingCollection r:core_node1) [n:127.0.0.1:44023_solr c:forwardingCollection s:shard1 r:core_node1 x:forwardingCollection_shard1_replica_n1] o.a.s.h.c.SpellCheckComponent Loading spell index for spellchecker: multipleFields
   [junit4]   2> 2340200 INFO  (searcherExecutor-4110-thread-1-processing-n:127.0.0.1:44023_solr x:forwardingCollection_shard1_replica_n1 s:shard1 c:forwardingCollection r:core_node1) [n:127.0.0.1:44023_solr c:forwardingCollection s:shard1 r:core_node1 x:forwardingCollection_shard1_replica_n1] o.a.s.h.c.SpellCheckComponent Loading spell index for spellchecker: jarowinkler
   [junit4]   2> 2340200 INFO  (searcherExecutor-4110-thread-1-processing-n:127.0.0.1:44023_solr x:forwardingCollection_shard1_replica_n1 s:shard1 c:forwardingCollection r:core_node1) [n:127.0.0.1:44023_solr c:forwardingCollection s:shard1 r:core_node1 x:forwardingCollection_shard1_replica_n1] o.a.s.h.c.SpellCheckComponent Loading spell index for spellchecker: external
   [junit4]   2> 2340201 INFO  (searcherExecutor-4110-thread-1-processing-n:127.0.0.1:44023_solr x:forwardingCollection_shard1_replica_n1 s:shard1 c:forwardingCollection r:core_node1) [n:127.0.0.1:44023_solr c:forwardingCollection s:shard1 r:core_node1 x:forwardingCollection_shard1_replica_n1] o.a.s.h.c.SpellCheckComponent Loading spell index for spellchecker: freq
   [junit4]   2> 2340201 INFO  (searcherExecutor-4110-thread-1-processing-n:127.0.0.1:44023_solr x:forwardingCollection_shard1_replica_n1 s:shard1 c:forwardingCollection r:core_node1) [n:127.0.0.1:44023_solr c:forwardingCollection s:shard1 r:core_node1 x:forwardingCollection_shard1_replica_n1] o.a.s.h.c.SpellCheckComponent Loading spell index for spellchecker: fqcn
   [junit4]   2> 2340201 INFO  (searcherExecutor-4110-thread-1-processing-n:127.0.0.1:44023_solr x:forwardingCollection_shard1_replica_n1 s:shard1 c:forwardingCollection r:core_node1) [n:127.0.0.1:44023_solr c:forwardingCollection s:shard1 r:core_node1 x:forwardingCollection_shard1_replica_n1] o.a.s.h.c.SpellCheckComponent Loading spell index for spellchecker: perDict
   [junit4]   2> 2340203 INFO  (searcherExecutor-4110-thread-1-processing-n:127.0.0.1:44023_solr x:forwardingCollection_shard1_replica_n1 s:shard1 c:forwardingCollection r:core_node1) [n:127.0.0.1:44023_solr c:forwardingCollection s:shard1 r:core_node1 x:forwardingCollection_shard1_replica_n1] o.a.s.c.SolrCore [forwardingCollection_shard1_replica_n1] Registered new searcher Searcher@4d95a874[forwardingCollection_shard1_replica_n1] main{ExitableDirectoryReader(UninvertingDirectoryReader())}
   [junit4]   2> 2340204 INFO  (qtp1066359522-13228) [n:127.0.0.1:44023_solr c:forwardingCollection s:shard1 r:core_node1 x:forwardingCollection_shard1_replica_n1] o.a.s.c.ShardLeaderElectionContext Enough replicas found to continue.
   [junit4]   2> 2340204 INFO  (qtp1066359522-13228) [n:127.0.0.1:44023_solr c:forwardingCollection s:shard1 r:core_node1 x:forwardingCollection_shard1_replica_n1] o.a.s.c.ShardLeaderElectionContext I may be the new leader - try and sync
   [junit4]   2> 2340204 INFO  (qtp1066359522-13228) [n:127.0.0.1:44023_solr c:forwardingCollection s:shard1 r:core_node1 x:forwardingCollection_shard1_replica_n1] o.a.s.c.SyncStrategy Sync replicas to https://127.0.0.1:44023/solr/forwardingCollection_shard1_replica_n1/
   [junit4]   2> 2340204 INFO  (qtp1066359522-13228) [n:127.0.0.1:44023_solr c:forwardingCollection s:shard1 r:core_node1 x:forwardingCollection_shard1_replica_n1] o.a.s.c.SyncStrategy Sync Success - now sync replicas to me
   [junit4]   2> 2340204 INFO  (qtp1066359522-13228) [n:127.0.0.1:44023_solr c:forwardingCollection s:shard1 r:core_node1 x:forwardingCollection_shard1_replica_n1] o.a.s.c.SyncStrategy https://127.0.0.1:44023/solr/forwardingCollection_shard1_replica_n1/ has no replicas
   [junit4]   2> 2340204 INFO  (qtp1066359522-13228) [n:127.0.0.1:44023_solr c:forwardingCollection s:shard1 r:core_node1 x:forwardingCollection_shard1_replica_n1] o.a.s.c.ShardLeaderElectionContext Found all replicas participating in election, clear LIR
   [junit4]   2> 2340206 INFO  (qtp1066359522-13228) [n:127.0.0.1:44023_solr c:forwardingCollection s:shard1 r:core_node1 x:forwardingCollection_shard1_replica_n1] o.a.s.c.ShardLeaderElectionContext I am the new leader: https://127.0.0.1:44023/solr/forwardingCollection_shard1_replica_n1/ shard1
   [junit4]   2> 2340307 INFO  (zkCallback-1076-thread-3-processing-n:127.0.0.1:44023_solr) [n:127.0.0.1:44023_solr    ] o.a.s.c.c.ZkStateReader A cluster state change: [WatchedEvent state:SyncConnected type:NodeDataChanged path:/collections/forwardingCollection/state.json] for collection [forwardingCollection] has occurred - updating... (live nodes size: [2])
   [junit4]   2> 2340307 INFO  (zkCallback-1076-thread-6-processing-n:127.0.0.1:44023_solr) [n:127.0.0.1:44023_solr    ] o.a.s.c.c.ZkStateReader A cluster state change: [WatchedEvent state:SyncConnected type:NodeDataChanged path:/collections/forwardingCollection/state.json] for collection [forwardingCollection] has occurred - updating... (live nodes size: [2])
   [junit4]   2> 2340356 INFO  (qtp1066359522-13228) [n:127.0.0.1:44023_solr c:forwardingCollection s:shard1 r:core_node1 x:forwardingCollection_shard1_replica_n1] o.a.s.c.ZkController I am the leader, no recovery necessary
   [junit4]   2> 2340358 INFO  (qtp1066359522-13228) [n:127.0.0.1:44023_solr c:forwardingCollection s:shard1 r:core_node1 x:forwardingCollection_shard1_replica_n1] o.a.s.s.HttpSolrCall [admin] webapp=null path=/admin/cores params={qt=/admin/cores&coreNodeName=core_node1&collection.configName=conf1&newCollection=true&name=forwardingCollection_shard1_replica_n1&action=CREATE&numShards=1&collection=forwardingCollection&shard=shard1&wt=javabin&version=2&replicaType=NRT} status=0 QTime=1358
   [junit4]   2> 2340358 WARN  (httpShardExecutor-4099-thread-1-processing-n:127.0.0.1:44023_solr [https:////127.0.0.1:44023//solr] https:////127.0.0.1:44023//solr) [n:127.0.0.1:44023_solr    ] o.a.h.c.p.ResponseProcessCookies Invalid cookie header: "Set-Cookie: hadoop.auth="u=$&p=$&t=test&e=1502704875319&s=A2u0h7Q7kB7zNTJX1hIwH/jUJ80="; Path=/; Domain=127.0.0.1; Expires=pon, 14-avg-2017 10:01:15 GMT; Secure; HttpOnly". Invalid 'expires' attribute: pon, 14-avg-2017 10:01:15 GMT
   [junit4]   2> 2340362 INFO  (qtp174355551-13229) [n:127.0.0.1:39617_solr    ] o.a.s.h.a.CollectionsHandler Wait for new collection to be active for at most 30 seconds. Check all shard replicas
   [junit4]   2> 2340459 INFO  (zkCallback-1076-thread-6-processing-n:127.0.0.1:44023_solr) [n:127.0.0.1:44023_solr    ] o.a.s.c.c.ZkStateReader A cluster state change: [WatchedEvent state:SyncConnected type:NodeDataChanged path:/collections/forwardingCollection/state.json] for collection [forwardingCollection] has occurred - updating... (live nodes size: [2])
   [junit4]   2> 2340459 INFO  (zkCallback-1076-thread-3-processing-n:127.0.0.1:44023_solr) [n:127.0.0.1:44023_solr    ] o.a.s.c.c.ZkStateReader A cluster state change: [WatchedEvent state:SyncConnected type:NodeDataChanged path:/collections/forwardingCollection/state.json] for collection [forwardingCollection] has occurred - updating... (live nodes size: [2])
   [junit4]   2> 2340668 INFO  (OverseerCollectionConfigSetProcessor-98478905929629701-127.0.0.1:44023_solr-n_0000000000) [n:127.0.0.1:44023_solr    ] o.a.s.c.OverseerTaskQueue Response ZK path: /overseer/collection-queue-work/qnr-0000000000 doesn't exist.  Requestor may have disconnected from ZooKeeper
   [junit4]   2> 2341362 INFO  (qtp174355551-13229) [n:127.0.0.1:39617_solr    ] o.a.s.s.HttpSolrCall [admin] webapp=null path=/admin/collections params={pullReplicas=0&replicationFactor=1&collection.configName=conf1&maxShardsPerNode=1&name=forwardingCollection&nrtReplicas=1&action=CREATE&numShards=1&tlogReplicas=0&wt=javabin&version=2} status=0 QTime=2697
   [junit4]   2> 2341363 WARN  (TEST-TestSolrCloudWithSecureImpersonation.testForwarding-seed#[46E75060D157BDBF]) [    ] o.a.h.c.p.ResponseProcessCookies Invalid cookie header: "Set-Cookie: hadoop.auth="u=user&p=user&t=test&e=1502704874983&s=axHvi4OlasHlQ8KVAZNmyfCBw7U="; Path=/; Domain=127.0.0.1; Expires=pon, 14-avg-2017 10:01:14 GMT; Secure; HttpOnly". Invalid 'expires' attribute: pon, 14-avg-2017 10:01:14 GMT
   [junit4]   2> 2341363 INFO  (TEST-TestSolrCloudWithSecureImpersonation.testForwarding-seed#[46E75060D157BDBF]) [    ] o.a.s.c.AbstractDistribZkTestBase Wait for recoveries to finish - collection: forwardingCollection failOnTimeout:true timeout (sec):100
   [junit4]   2> 2341363 INFO  (TEST-TestSolrCloudWithSecureImpersonation.testForwarding-seed#[46E75060D157BDBF]) [    ] o.a.s.c.AbstractDistribZkTestBase Recoveries finished - collection: forwardingCollection
   [junit4]   2> 2341374 INFO  (qtp1066359522-13228) [n:127.0.0.1:44023_solr c:forwardingCollection s:shard1 r:core_node1 x:forwardingCollection_shard1_replica_n1] o.a.s.c.S.Request [forwardingCollection_shard1_replica_n1]  webapp=/solr path=/select params={q=*:*&wt=javabin&version=2} hits=0 status=0 QTime=0
   [junit4]   2> 2341375 WARN  (qtp174355551-13233) [n:127.0.0.1:39617_solr    ] o.a.h.c.p.ResponseProcessCookies Invalid cookie header: "Set-Cookie: hadoop.auth="u=$&p=$&t=test&e=1502704877694&s=tmHMw4S/MpTGYmqGiS67UejENPA="; Path=/; Domain=127.0.0.1; Expires=pon, 14-avg-2017 10:01:17 GMT; Secure; HttpOnly". Invalid 'expires' attribute: pon, 14-avg-2017 10:01:17 GMT
   [junit4]   2> 2341378 WARN  (TEST-TestSolrCloudWithSecureImpersonation.testForwarding-seed#[46E75060D157BDBF]) [    ] o.a.h.c.p.ResponseProcessCookies Invalid cookie header: "Set-Cookie: hadoop.auth="u=user&p=user&t=test&e=1502704877686&s=/QkwMWht9vLpBMkTqPq9thBK9Es="; Path=/; Domain=127.0.0.1; Expires=pon, 14-avg-2017 10:01:17 GMT; Secure; HttpOnly". Invalid 'expires' attribute: pon, 14-avg-2017 10:01:17 GMT
   [junit4]   2> 2341378 WARN  (TEST-TestSolrCloudWithSecureImpersonation.testForwarding-seed#[46E75060D157BDBF]) [    ] o.a.h.c.p.ResponseProcessCookies Invalid cookie header: "Set-Cookie: hadoop.auth="u=$&p=$&t=test&e=1502704877694&s=tmHMw4S/MpTGYmqGiS67UejENPA="; Path=/; Domain=127.0.0.1; Expires=pon, 14-avg-2017 10:01:17 GMT; Secure; HttpOnly". Invalid 'expires' attribute: pon, 14-avg-2017 10:01:17 GMT
   [junit4]   2> 2341383 INFO  (qtp1066359522-13242) [n:127.0.0.1:44023_solr c:forwardingCollection s:shard1 r:core_node1 x:forwardingCollection_shard1_replica_n1] o.a.s.c.S.Request [forwardingCollection_shard1_replica_n1]  webapp=/solr path=/select params={q=*:*&wt=javabin&version=2} hits=0 status=0 QTime=0
   [junit4]   2> 2341383 WARN  (TEST-TestSolrCloudWithSecureImpersonation.testForwarding-seed#[46E75060D157BDBF]) [    ] o.a.h.c.p.ResponseProcessCookies Invalid cookie header: "Set-Cookie: hadoop.auth="u=user&p=user&t=test&e=1502704877702&s=O6PR0bDiHYIpeyRZr6CzVi23QrA="; Path=/; Domain=127.0.0.1; Expires=pon, 14-avg-2017 10:01:17 GMT; Secure; HttpOnly". Invalid 'expires' attribute: pon, 14-avg-2017 10:01:17 GMT
   [junit4]   2> 2341383 INFO  (TEST-TestSolrCloudWithSecureImpersonation.testForwarding-seed#[46E75060D157BDBF]) [    ] o.a.s.SolrTestCaseJ4 ###Ending testForwarding
   [junit4]   2> 2341413 INFO  (TEST-TestSolrCloudWithSecureImpersonation.testProxyValidateGroup-seed#[46E75060D157BDBF]) [    ] o.a.s.SolrTestCaseJ4 ###Starting testProxyValidateGroup
   [junit4]   2> 2341432 INFO  (qtp174355551-13239) [n:127.0.0.1:39617_solr    ] o.a.s.h.a.CollectionsHandler Invoked Collection Action :list with params doAs=jenkins&action=LIST&wt=javabin&version=2 and sendToOCPQueue=true
   [junit4]   2> 2341432 INFO  (qtp174355551-13239) [n:127.0.0.1:39617_solr    ] o.a.s.s.HttpSolrCall [admin] webapp=null path=/admin/collections params={doAs=jenkins&action=LIST&wt=javabin&version=2} status=0 QTime=0
   [junit4]   2> 2341433 WARN  (TEST-TestSolrCloudWithSecureImpersonation.testProxyValidateGroup-seed#[46E75060D157BDBF]) [    ] o.a.h.c.p.ResponseProcessCookies Invalid cookie header: "Set-Cookie: hadoop.auth="u=anyHostUsersGroup&p=anyHostUsersGroup&t=test&e=1502704877733&s=CZUsc0ZjKzcRU3k0/wJQxpq7I00="; Path=/; Domain=127.0.0.1; Expires=pon, 14-avg-2017 10:01:17 GMT; Secure; HttpOnly". Invalid 'expires' attribute: pon, 14-avg-2017 10:01:17 GMT
   [junit4]   2> 2341433 INFO  (TEST-TestSolrCloudWithSecureImpersonation.testProxyValidateGroup-seed#[46E75060D157BDBF]) [    ] o.a.s.SolrTestCaseJ4 ###Ending testProxyValidateGroup
   [junit4]   2> 2341466 INFO  (TEST-TestSolrCloudWithSecureImpersonation.testProxyValidateHost-seed#[46E75060D157BDBF]) [    ] o.a.s.SolrTestCaseJ4 ###Starting testProxyValidateHost
   [junit4]   2> 2341469 INFO  (qtp174355551-13229) [n:127.0.0.1:39617_solr    ] o.a.s.h.a.CollectionsHandler Invoked Collection Action :list with params doAs=bar&action=LIST&wt=javabin&version=2 and sendToOCPQueue=true
   [junit4]   2> 2341470 INFO  (qtp174355551-13229) [n:127.0.0.1:39617_solr    ] o.a.s.s.HttpSolrCall [admin] webapp=null path=/admin/collections params={doAs=bar&action=LIST&wt=javabin&version=2} status=0 QTime=1
   [junit4]   2> 2341471 WARN  (TEST-TestSolrCloudWithSecureImpersonation.testProxyValidateHost-seed#[46E75060D157BDBF]) [    ] o.a.h.c.p.ResponseProcessCookies Invalid cookie header: "Set-Cookie: hadoop.auth="u=localHostAnyGroup&p=localHostAnyGroup&t=test&e=1502704877789&s=Nhp2BsJSQsqCMIG/Cx4oGTLJ1fA="; Path=/; Domain=127.0.0.1; Expires=pon, 14-avg-2017 10:01:17 GMT; Secure; HttpOnly". Invalid 'expires' attribute: pon, 14-avg-2017 10:01:17 GMT
   [junit4]   2> 2341471 INFO  (TEST-TestSolrCloudWithSecureImpersonation.testProxyValidateHost-seed#[46E75060D157BDBF]) [    ] o.a.s.SolrTestCaseJ4 ###Ending testProxyValidateHost
   [junit4]   2> 2341504 INFO  (TEST-TestSolrCloudWithSecureImpersonation.testProxyValidateAnyHostAnyUser-seed#[46E75060D157BDBF]) [    ] o.a.s.SolrTestCaseJ4 ###Starting testProxyValidateAnyHostAnyUser
   [junit4]   2> 2341505 INFO  (qtp174355551-13233) [n:127.0.0.1:39617_solr    ] o.a.s.h.a.CollectionsHandler Invoked Collection Action :list with params doAs=bar&action=LIST&wt=javabin&version=2 and sendToOCPQueue=true
   [junit4]   2> 2341506 INFO  (qtp174355551-13233) [n:127.0.0.1:39617_solr    ] o.a.s.s.HttpSolrCall [admin] webapp=null path=/admin/collections params={doAs=bar&action=LIST&wt=javabin&version=2} status=0 QTime=0
   [junit4]   2> 2341506 WARN  (TEST-TestSolrCloudWithSecureImpersonation.testProxyValidateAnyHostAnyUser-seed#[46E75060D157BDBF]) [    ] o.a.h.c.p.ResponseProcessCookies Invalid cookie header: "Set-Cookie: hadoop.auth="u=anyHostAnyUser&p=anyHostAnyUser&t=test&e=1502704877825&s=EJDIUxyr1iFrRitK6ZydekXYwXw="; Path=/; Domain=127.0.0.1; Expires=pon, 14-avg-2017 10:01:17 GMT; Secure; HttpOnly". Invalid 'expires' attribute: pon, 14-avg-2017 10:01:17 GMT
   [junit4]   2> 2341506 INFO  (TEST-TestSolrCloudWithSecureImpersonation.testProxyValidateAnyHostAnyUser-seed#[46E75060D157BDBF]) [    ] o.a.s.SolrTestCaseJ4 ###Ending testProxyValidateAnyHostAnyUser
   [junit4]   2> 2341543 INFO  (TEST-TestSolrCloudWithSecureImpersonation.testProxyNoConfigHosts-seed#[46E75060D157BDBF]) [    ] o.a.s.SolrTestCaseJ4 ###Starting testProxyNoConfigHosts
   [junit4]   2> 2341546 WARN  (TEST-TestSolrCloudWithSecureImpersonation.testProxyNoConfigHosts-seed#[46E75060D157BDBF]) [    ] o.a.h.c.p.ResponseProcessCookies Invalid cookie header: "Set-Cookie: hadoop.auth="u=noHosts&p=noHosts&t=test&e=1502704877863&s=OjfMY0ndcZBsNjeA24xwO5/xtEA="; Path=/; Domain=127.0.0.1; Expires=pon, 14-avg-2017 10:01:17 GMT; Secure; HttpOnly". Invalid 'expires' attribute: pon, 14-avg-2017 10:01:17 GMT
   [junit4]   2> 2341546 INFO  (TEST-TestSolrCloudWithSecureImpersonation.testProxyNoConfigHosts-seed#[46E75060D157BDBF]) [    ] o.a.s.SolrTestCaseJ4 ###Ending testProxyNoConfigHosts
   [junit4]   2> 2341581 INFO  (TEST-TestSolrCloudWithSecureImpersonation.testProxyInvalidProxyUser-seed#[46E75060D157BDBF]) [    ] o.a.s.SolrTestCaseJ4 ###Starting testProxyInvalidProxyUser
   [junit4]   2> 2341584 WARN  (TEST-TestSolrCloudWithSecureImpersonation.testProxyInvalidProxyUser-seed#[46E75060D157BDBF]) [    ] o.a.h.c.p.ResponseProcessCookies Invalid cookie header: "Set-Cookie: hadoop.auth="u=bar&p=bar&t=test&e=1502704877902&s=ORCWq1Af0n/0Ru9RT9qYF3FOMtg="; Path=/; Domain=127.0.0.1; Expires=pon, 14-avg-2017 10:01:17 GMT; Secure; HttpOnly". Invalid 'expires' attribute: pon, 14-avg-2017 10:01:17 GMT
   [junit4]   2> 2341584 INFO  (TEST-TestSolrCloudWithSecureImpersonation.testProxyInvalidProxyUser-seed#[46E75060D157BDBF]) [    ] o.a.s.SolrTestCaseJ4 ###Ending testProxyInvalidProxyUser
   [junit4]   2> 2341616 INFO  (TEST-TestSolrCloudWithSecureImpersonation.testProxyNullProxyUser-seed#[46E75060D157BDBF]) [    ] o.a.s.SolrTestCaseJ4 ###Starting testProxyNullProxyUser
   [junit4]   2> 2341617 INFO  (qtp174355551-13239) [n:127.0.0.1:39617_solr    ] o.a.s.s.SolrDispatchFilter Error authenticating
   [junit4]   2> java.lang.IllegalArgumentException: userName is NULL, empty or contains a '&'
   [junit4]   2> at org.apache.hadoop.security.authentication.util.AuthToken.checkForIllegalArgument(AuthToken.java:87)
   [junit4]   2> at org.apache.hadoop.security.authentication.util.AuthToken.<init>(AuthToken.java:70)
   [junit4]   2> at org.apache.hadoop.security.authentication.server.AuthenticationToken.<init>(AuthenticationToken.java:58)
   [junit4]   2> at org.apache.solr.security.HttpParamDelegationTokenPlugin$HttpParamDelegationTokenAuthenticationHandler$HttpParamAuthenticationHandler.authenticate(HttpParamDelegationTokenPlugin.java:213)
   [junit4]   2> at org.apache.hadoop.security.token.delegation.web.DelegationTokenAuthenticationHandler.authenticate(DelegationTokenAuthenticationHandler.java:348)
   [junit4]   2> at org.apache.solr.security.RequestContinuesRecorderAuthenticationHandler.authenticate(RequestContinuesRecorderAuthenticationHandler.java:69)
   [junit4]   2> at org.apache.hadoop.security.authentication.server.AuthenticationFilter.doFilter(AuthenticationFilter.java:519)
   [junit4]   2> at org.apache.solr.security.DelegationTokenKerberosFilter.doFilter(DelegationTokenKerberosFilter.java:134)
   [junit4]   2> at org.apache.solr.security.HttpParamDelegationTokenPlugin$HttpParamToRequestFilter.doFilter(HttpParamDelegationTokenPlugin.java:245)
   [junit4]   2> at org.apache.solr.security.KerberosPlugin.doAuthenticate(KerberosPlugin.java:243)
   [junit4]   2> at org.apache.solr.servlet.SolrDispatchFilter.authenticateRequest(SolrDispatchFilter.java:447)
   [junit4]   2> at org.apache.solr.servlet.SolrDispatchFilter.doFilter(SolrDispatchFilter.java:343)
   [junit4]   2> at org.apache.solr.servlet.SolrDispatchFilter.doFilter(SolrDispatchFilter.java:322)
   [junit4]   2> at org.eclipse.jetty.servlet.ServletHandler$CachedChain.doFilter(ServletHandler.java:1699)
   [junit4]   2> at org.apache.solr.client.solrj.embedded.JettySolrRunner$DebugFilter.doFilter(JettySolrRunner.java:139)
   [junit4]   2> at org.eclipse.jetty.servlet.ServletHandler$CachedChain.doFilter(ServletHandler.java:1699)
   [junit4]   2> at org.eclipse.jetty.servlet.ServletHandler.doHandle(ServletHandler.java:582)
   [junit4]   2> at org.eclipse.jetty.server.session.SessionHandler.doHandle(SessionHandler.java:224)
   [junit4]   2> at org.eclipse.jetty.server.handler.ContextHandler.doHandle(ContextHandler.java:1180)
   [junit4]   2> at org.eclipse.jetty.servlet.ServletHandler.doScope(ServletHandler.java:512)
   [junit4]   2> at org.eclipse.jetty.server.session.SessionHandler.doScope(SessionHandler.java:185)
   [junit4]   2> at org.eclipse.jetty.server.handler.ContextHandler.doScope(ContextHandler.java:1112)
   [junit4]   2> at org.eclipse.jetty.server.handler.ScopedHandler.handle(ScopedHandler.java:141)
   [junit4]   2> at org.eclipse.jetty.server.handler.gzip.GzipHandler.handle(GzipHandler.java:462)
   [junit4]   2> at org.eclipse.jetty.server.handler.HandlerWrapper.handle(HandlerWrapper.java:134)
   [junit4]   2> at org.eclipse.jetty.server.Server.handle(Server.java:534)
   [junit4]   2> at org.eclipse.jetty.server.HttpChannel.handle(HttpChannel.java:320)
   [junit4]   2> at org.eclipse.jetty.server.HttpConnection.onFillable(HttpConnection.java:251)
   [junit4]   2> at org.eclipse.jetty.io.AbstractConnection$ReadCallback.succeeded(AbstractConnection.java:273)
   [junit4]   2> at org.eclipse.jetty.io.FillInterest.fillable(FillInterest.java:95)
   [junit4]   2> at org.eclipse.jetty.io.ssl.SslConnection.onFillable(SslConnection.java:202)
   [junit4]   2> at org.eclipse.jetty.io.AbstractConnection$ReadCallback.succeeded(AbstractConnection.java:273)
   [junit4]   2> at org.eclipse.jetty.io.FillInterest.fillable(FillInterest.java:95)
   [junit4]   2> at org.eclipse.jetty.io.SelectChannelEndPoint$2.run(SelectChannelEndPoint.java:93)
   [junit4]   2> at org.eclipse.jetty.util.thread.strategy.ExecuteProduceConsume.executeProduceConsume(ExecuteProduceConsume.java:303)
   [junit4]   2> at org.eclipse.jetty.util.thread.strategy.ExecuteProduceConsume.produceConsume(ExecuteProduceConsume.java:148)
   [junit4]   2> at org.eclipse.jetty.util.thread.strategy.ExecuteProduceConsume.run(ExecuteProduceConsume.java:136)
   [junit4]   2> at org.eclipse.jetty.util.thread.QueuedThreadPool.runJob(QueuedThreadPool.java:671)
   [junit4]   2> at org.eclipse.jetty.util.thread.QueuedThreadPool$2.run(QueuedThreadPool.java:589)
   [junit4]   2> at java.lang.Thread.run(Thread.java:748)
   [junit4]   2> 2341617 WARN  (qtp174355551-13239) [n:127.0.0.1:39617_solr    ] o.e.j.s.ServletHandler /solr/admin/collections
   [junit4]   2> org.apache.solr.common.SolrException: Error during request authentication,
   [junit4]   2> at org.apache.solr.servlet.SolrDispatchFilter.authenticateRequest(SolrDispatchFilter.java:453)
   [junit4]   2> at org.apache.solr.servlet.SolrDispatchFilter.doFilter(SolrDispatchFilter.java:343)
   [junit4]   2> at org.apache.solr.servlet.SolrDispatchFilter.doFilter(SolrDispatchFilter.java:322)
   [junit4]   2> at org.eclipse.jetty.servlet.ServletHandler$CachedChain.doFilter(ServletHandler.java:1699)
   [junit4]   2> at org.apache.solr.client.solrj.embedded.JettySolrRunner$DebugFilter.doFilter(JettySolrRunner.java:139)
   [junit4]   2> at org.eclipse.jetty.servlet.ServletHandler$CachedChain.doFilter(ServletHandler.java:1699)
   [junit4]   2> at org.eclipse.jetty.servlet.ServletHandler.doHandle(ServletHandler.java:582)
   [junit4]   2> at org.eclipse.jetty.server.session.SessionHandler.doHandle(SessionHandler.java:224)
   [junit4]   2> at org.eclipse.jetty.server.handler.ContextHandler.doHandle(ContextHandler.java:1180)
   [junit4]   2> at org.eclipse.jetty.servlet.ServletHandler.doScope(ServletHandler.java:512)
   [junit4]   2> at org.eclipse.jetty.server.session.SessionHandler.doScope(SessionHandler.java:185)
   [junit4]   2> at org.eclipse.jetty.server.handler.ContextHandler.doScope(ContextHandler.java:1112)
   [junit4]   2> at org.eclipse.jetty.server.handler.ScopedHandler.handle(ScopedHandler.java:141)
   [junit4]   2> at org.eclipse.jetty.server.handler.gzip.GzipHandler.handle(GzipHandler.java:462)
   [junit4]   2> at org.eclipse.jetty.server.handler.HandlerWrapper.handle(HandlerWrapper.java:134)
   [junit4]   2> at org.eclipse.jetty.server.Server.handle(Server.java:534)
   [junit4]   2> at org.eclipse.jetty.server.HttpChannel.handle(HttpChannel.java:320)
   [junit4]   2> at org.eclipse.jetty.server.HttpConnection.onFillable(HttpConnection.java:251)
   [junit4]   2> at org.eclipse.jetty.io.AbstractConnection$ReadCallback.succeeded(AbstractConnection.java:273)
   [junit4]   2> at org.eclipse.jetty.io.FillInterest.fillable(FillInterest.java:95)
   [junit4]   2> at org.eclipse.jetty.io.ssl.SslConnection.onFillable(SslConnection.java:202)
   [junit4]   2> at org.eclipse.jetty.io.AbstractConnection$ReadCallback.succeeded(AbstractConnection.java:273)
   [junit4]   2> at org.eclipse.jetty.io.FillInterest.fillable(FillInterest.java:95)
   [junit4]   2> at org.eclipse.jetty.io.SelectChannelEndPoint$2.run(SelectChannelEndPoint.java:93)
   [junit4]   2> at org.eclipse.jetty.util.thread.strategy.ExecuteProduceConsume.executeProduceConsume(ExecuteProduceConsume.java:303)
   [junit4]   2> at org.eclipse.jetty.util.thread.strategy.ExecuteProduceConsume.produceConsume(ExecuteProduceConsume.java:148)
   [junit4]   2> at org.eclipse.jetty.util.thread.strategy.ExecuteProduceConsume.run(ExecuteProduceConsume.java:136)
   [junit4]   2> at org.eclipse.jetty.util.thread.QueuedThreadPool.runJob(QueuedThreadPool.java:671)
   [junit4]   2> at org.eclipse.jetty.util.thread.QueuedThreadPool$2.run(QueuedThreadPool.java:589)
   [junit4]   2> at java.lang.Thread.run(Thread.java:748)
   [junit4]   2> Caused by: java.lang.IllegalArgumentException: userName is NULL, empty or contains a '&'
   [junit4]   2> at org.apache.hadoop.security.authentication.util.AuthToken.checkForIllegalArgument(AuthToken.java:87)
   [junit4]   2> at org.apache.hadoop.security.authentication.util.AuthToken.<init>(AuthToken.java:70)
   [junit4]   2> at org.apache.hadoop.security.authentication.server.AuthenticationToken.<init>(AuthenticationToken.java:58)
   [junit4]   2> at org.apache.solr.security.HttpParamDelegationTokenPlugin$HttpParamDelegationTokenAuthenticationHandler$HttpParamAuthenticationHandler.authenticate(HttpParamDelegationTokenPlugin.java:213)
   [junit4]   2> at org.apache.hadoop.security.token.delegation.web.DelegationTokenAuthenticationHandler.authenticate(DelegationTokenAuthenticationHandler.java:348)
   [junit4]   2> at org.apache.solr.security.RequestContinuesRecorderAuthenticationHandler.authenticate(RequestContinuesRecorderAuthenticationHandler.java:69)
   [junit4]   2> at org.apache.hadoop.security.authentication.server.AuthenticationFilter.doFilter(AuthenticationFilter.java:519)
   [junit4]   2> at org.apache.solr.security.DelegationTokenKerberosFilter.doFilter(DelegationTokenKerberosFilter.java:134)
   [junit4]   2> at org.apache.solr.security.HttpParamDelegationTokenPlugin$HttpParamToRequestFilter.doFilter(HttpParamDelegationTokenPlugin.java:245)
   [junit4]   2> at org.apache.solr.security.KerberosPlugin.doAuthenticate(KerberosPlugin.java:243)
   [junit4]   2> at org.apache.solr.servlet.SolrDispatchFilter.authenticateRequest(SolrDispatchFilter.java:447)
   [junit4]   2> ... 29 more
   [junit4]   2> 2341618 INFO  (TEST-TestSolrCloudWithSecureImpersonation.testProxyNullProxyUser-seed#[46E75060D157BDBF]) [    ] o.a.s.SolrTestCaseJ4 ###Ending testProxyNullProxyUser
   [junit4]   2> 2341620 INFO  (jetty-closer-1066-thread-1) [    ] o.e.j.s.AbstractConnector Stopped ServerConnector@14abbc0c{SSL,[ssl, http/1.1]}{127.0.0.1:0}
   [junit4]   2> 2341621 INFO  (jetty-closer-1066-thread-1) [    ] o.a.s.c.CoreContainer Shutting down CoreContainer instance=390872851
   [junit4]   2> 2341624 INFO  (jetty-closer-1066-thread-1) [    ] o.a.s.m.SolrMetricManager Closing metric reporters for registry=solr.node, tag=null
   [junit4]   2> 2341626 INFO  (jetty-closer-1066-thread-1) [    ] o.a.s.m.SolrMetricManager Closing metric reporters for registry=solr.jvm, tag=null
   [junit4]   2> 2341627 INFO  (jetty-closer-1066-thread-1) [    ] o.a.s.m.SolrMetricManager Closing metric reporters for registry=solr.jetty, tag=null
   [junit4]   2> 2341628 INFO  (jetty-closer-1066-thread-1) [    ] o.a.s.m.SolrMetricManager Closing metric reporters for registry=solr.cluster, tag=null
   [junit4]   2> 2341636 WARN  (zkCallback-1077-thread-2-processing-n:127.0.0.1:39617_solr) [n:127.0.0.1:39617_solr    ] o.a.s.c.c.ZkStateReader ZooKeeper watch triggered, but Solr cannot talk to ZK: [KeeperErrorCode = Session expired for /live_nodes]
   [junit4]   2> 2341640 INFO  (zkCallback-1076-thread-6-processing-n:127.0.0.1:44023_solr) [n:127.0.0.1:44023_solr    ] o.a.s.c.c.ZkStateReader Updated live nodes from ZooKeeper... (2) -> (1)
   [junit4]   2> 2341641 INFO  (jetty-closer-1066-thread-2) [    ] o.e.j.s.AbstractConnector Stopped ServerConnector@1561252e{SSL,[ssl, http/1.1]}{127.0.0.1:0}
   [junit4]   2> 2341642 INFO  (jetty-closer-1066-thread-2) [    ] o.a.s.c.CoreContainer Shutting down CoreContainer instance=3805165
   [junit4]   2> 2341642 ERROR (Thread[Thread-2071,5,TGRP-TestSolrCloudWithSecureImpersonation]) [n:127.0.0.1:39617_solr    ] o.a.h.s.t.d.AbstractDelegationTokenSecretManager ExpiredTokenRemover received java.lang.InterruptedException: sleep interrupted
   [junit4]   2> 2341642 INFO  (jetty-closer-1066-thread-2) [    ] o.a.s.m.SolrMetricManager Closing metric reporters for registry=solr.node, tag=null
   [junit4]   2> 2341644 INFO  (jetty-closer-1066-thread-2) [    ] o.a.s.m.SolrMetricManager Closing metric reporters for registry=solr.jvm, tag=null
   [junit4]   2> 2341646 INFO  (jetty-closer-1066-thread-2) [    ] o.a.s.m.SolrMetricManager Closing metric reporters for registry=solr.jetty, tag=null
   [junit4]   2> 2341647 INFO  (jetty-closer-1066-thread-2) [    ] o.a.s.m.SolrMetricManager Closing metric reporters for registry=solr.cluster, tag=null
   [junit4]   2> 2341653 INFO  (coreCloseExecutor-4116-thread-1) [n:127.0.0.1:44023_solr c:forwardingCollection s:shard1 r:core_node1 x:forwardingCollection_shard1_replica_n1] o.a.s.c.SolrCore [forwardingCollection_shard1_replica_n1]  CLOSING SolrCore org.apache.solr.core.SolrCore@18650378
   [junit4]   2> 2341653 INFO  (jetty-closer-1066-thread-1) [    ] o.e.j.s.h.ContextHandler Stopped o.e.j.s.ServletContextHandler@6c963657{/solr,null,UNAVAILABLE}
   [junit4]   2> 2341656 INFO  (coreCloseExecutor-4116-thread-1) [n:127.0.0.1:44023_solr c:forwardingCollection s:shard1 r:core_node1 x:forwardingCollection_shard1_replica_n1] o.a.s.m.SolrMetricManager Closing metric reporters for registry=solr.core.forwardingCollection.shard1.replica_n1, tag=409273208
   [junit4]   2> 2341661 INFO  (coreCloseExecutor-4116-thread-1) [n:127.0.0.1:44023_solr c:forwardingCollection s:shard1 r:core_node1 x:forwardingCollection_shard1_replica_n1] o.a.s.m.SolrMetricManager Closing metric reporters for registry=solr.collection.forwardingCollection.shard1.leader, tag=409273208
   [junit4]   2> 2341663 INFO  (jetty-closer-1066-thread-2) [    ] o.a.s.c.Overseer Overseer (id=98478905929629701-127.0.0.1:44023_solr-n_0000000000) closing
   [junit4]   2> 2341664 INFO  (OverseerStateUpdate-98478905929629701-127.0.0.1:44023_solr-n_0000000000) [n:127.0.0.1:44023_solr    ] o.a.s.c.Overseer Overseer Loop exiting : 127.0.0.1:44023_solr
   [junit4]   2> 2343165 WARN  (zkCallback-1076-thread-6-processing-n:127.0.0.1:44023_solr) [n:127.0.0.1:44023_solr    ] o.a.s.c.c.ZkStateReader ZooKeeper watch triggered, but Solr cannot talk to ZK: [KeeperErrorCode = Session expired for /live_nodes]
   [junit4]   2> 2343165 ERROR (Thread[Thread-2070,5,TGRP-TestSolrCloudWithSecureImpersonation]) [n:127.0.0.1:44023_solr    ] o.a.h.s.t.d.AbstractDelegationTokenSecretManager ExpiredTokenRemover received java.lang.InterruptedException: sleep interrupted
   [junit4]   2> 2343166 INFO  (jetty-closer-1066-thread-2) [    ] o.e.j.s.h.ContextHandler Stopped o.e.j.s.ServletContextHandler@5f9097ce{/solr,null,UNAVAILABLE}
   [junit4]   2> 2343166 ERROR (SUITE-TestSolrCloudWithSecureImpersonation-seed#[46E75060D157BDBF]-worker) [    ] o.a.z.s.ZooKeeperServer ZKShutdownHandler is not registered, so ZooKeeper server won't take any action on ERROR or SHUTDOWN server state changes
   [junit4]   2> 2343166 INFO  (SUITE-TestSolrCloudWithSecureImpersonation-seed#[46E75060D157BDBF]-worker) [    ] o.a.s.c.ZkTestServer connecting to 127.0.0.1:36777 36777
   [junit4]   2> 2348197 INFO  (Thread-2053) [    ] o.a.s.c.ZkTestServer connecting to 127.0.0.1:36777 36777
   [junit4]   2> 2348198 WARN  (Thread-2053) [    ] o.a.s.c.ZkTestServer Watch limit violations:
   [junit4]   2> Maximum concurrent create/delete watches above limit:
   [junit4]   2>
   [junit4]   2> 4 /solr/aliases.json
   [junit4]   2> 3 /solr/security.json
   [junit4]   2>
   [junit4]   2> Maximum concurrent data watches above limit:
   [junit4]   2>
   [junit4]   2> 5 /solr/collections/forwardingCollection/state.json
   [junit4]   2> 4 /solr/security/zkdtsm/ZKDTSMRoot/ZKDTSMKeyIdRoot
   [junit4]   2> 4 /solr/clusterstate.json
   [junit4]   2> 4 /solr/clusterprops.json
   [junit4]   2> 2 /solr/overseer_elect/election/98478905929629701-127.0.0.1:44023_solr-n_0000000000
   [junit4]   2> 2 /solr/security/zkdtsm/ZKDTSMRoot/ZKDTSMMasterKeyRoot/DK_1
   [junit4]   2> 2 /solr/security/zkdtsm/ZKDTSMRoot/ZKDTSMMasterKeyRoot/DK_3
   [junit4]   2> 2 /solr/security/zkdtsm/ZKDTSMRoot/ZKDTSMMasterKeyRoot/DK_2
   [junit4]   2> 2 /solr/security/zkdtsm/ZKDTSMRoot/ZKDTSMMasterKeyRoot/DK_4
   [junit4]   2> 2 /solr/security/zkdtsm/ZKDTSMRoot/ZKDTSMSeqNumRoot
   [junit4]   2>
   [junit4]   2> Maximum concurrent children watches above limit:
   [junit4]   2>
   [junit4]   2> 4 /solr/live_nodes
   [junit4]   2> 4 /solr/collections
   [junit4]   2> 2 /solr/security/zkdtsm/ZKDTSMRoot/ZKDTSMMasterKeyRoot
   [junit4]   2> 2 /solr/security/zkdtsm/ZKDTSMRoot/ZKDTSMTokensRoot
   [junit4]   2>
   [junit4]   2> 2348214 INFO  (SUITE-TestSolrCloudWithSecureImpersonation-seed#[46E75060D157BDBF]-worker) [    ] o.a.s.SolrTestCaseJ4 ------------------------------------------------------- Done waiting for tracked resources to be released
   [junit4]   2> Aug 14, 2017 12:01:24 AM com.carrotsearch.randomizedtesting.ThreadLeakControl checkThreadLeaks
   [junit4]   2> WARNING: Will linger awaiting termination of 2 leaked thread(s).
   [junit4]   2> 2363564 ERROR (jetty-launcher-1065-thread-1-EventThread) [n:127.0.0.1:39617_solr    ] o.a.c.f.i.CuratorFrameworkImpl Watcher exception
   [junit4]   2> java.lang.IllegalStateException: Client is not started
   [junit4]   2> at com.google.common.base.Preconditions.checkState(Preconditions.java:149)
   [junit4]   2> at org.apache.curator.CuratorZookeeperClient.getZooKeeper(CuratorZookeeperClient.java:113)
   [junit4]   2> at org.apache.curator.framework.imps.CuratorFrameworkImpl.getZooKeeper(CuratorFrameworkImpl.java:477)
   [junit4]   2> at org.apache.curator.framework.imps.NamespaceFacade.getZooKeeper(NamespaceFacade.java:112)
   [junit4]   2> at org.apache.curator.framework.imps.GetDataBuilderImpl$4.call(GetDataBuilderImpl.java:302)
   [junit4]   2> at org.apache.curator.framework.imps.GetDataBuilderImpl$4.call(GetDataBuilderImpl.java:291)
   [junit4]   2> at org.apache.curator.RetryLoop.callWithRetry(RetryLoop.java:107)
   [junit4]   2> at org.apache.curator.framework.imps.GetDataBuilderImpl.pathInForeground(GetDataBuilderImpl.java:288)
   [junit4]   2> at org.apache.curator.framework.imps.GetDataBuilderImpl.forPath(GetDataBuilderImpl.java:279)
   [junit4]   2> at org.apache.curator.framework.imps.GetDataBuilderImpl.forPath(GetDataBuilderImpl.java:41)
   [junit4]   2> at org.apache.curator.framework.recipes.shared.SharedValue.readValue(SharedValue.java:244)
   [junit4]   2> at org.apache.curator.framework.recipes.shared.SharedValue.access$100(SharedValue.java:44)
   [junit4]   2> at org.apache.curator.framework.recipes.shared.SharedValue$1.process(SharedValue.java:61)
   [junit4]   2> at org.apache.curator.framework.imps.NamespaceWatcher.process(NamespaceWatcher.java:67)
   [junit4]   2> at org.apache.zookeeper.ClientCnxn$EventThread.processEvent(ClientCnxn.java:530)
   [junit4]   2> at org.apache.zookeeper.ClientCnxn$EventThread.run(ClientCnxn.java:505)
   [junit4]   2> 2363565 WARN  (jetty-launcher-1065-thread-1-EventThread) [n:127.0.0.1:39617_solr    ] o.a.c.ConnectionState Session expired event received
   [junit4]   2> 2363566 WARN  (jetty-launcher-1065-thread-1-SendThread(127.0.0.1:36777)) [n:127.0.0.1:39617_solr    ] o.a.z.ClientCnxn Session 0x0 for server null, unexpected error, closing socket connection and attempting reconnect
   [junit4]   2> java.net.ConnectException: Connection refused
   [junit4]   2> at sun.nio.ch.SocketChannelImpl.checkConnect(Native Method)
   [junit4]   2> at sun.nio.ch.SocketChannelImpl.finishConnect(SocketChannelImpl.java:717)
   [junit4]   2> at org.apache.zookeeper.ClientCnxnSocketNIO.doTransport(ClientCnxnSocketNIO.java:361)
   [junit4]   2> at org.apache.zookeeper.ClientCnxn$SendThread.run(ClientCnxn.java:1141)
   [junit4]   2> 2364666 WARN  (jetty-launcher-1065-thread-1-SendThread(127.0.0.1:36777)) [n:127.0.0.1:39617_solr    ] o.a.z.ClientCnxn Session 0x0 for server null, unexpected error, closing socket connection and attempting reconnect
   [junit4]   2> java.net.ConnectException: Connection refused
   [junit4]   2> at sun.nio.ch.SocketChannelImpl.checkConnect(Native Method)
   [junit4]   2> at sun.nio.ch.SocketChannelImpl.finishConnect(SocketChannelImpl.java:717)
   [junit4]   2> at org.apache.zookeeper.ClientCnxnSocketNIO.doTransport(ClientCnxnSocketNIO.java:361)
   [junit4]   2> at org.apache.zookeeper.ClientCnxn$SendThread.run(ClientCnxn.java:1141)
   [junit4]   2> 2365767 WARN  (jetty-launcher-1065-thread-1-SendThread(127.0.0.1:36777)) [n:127.0.0.1:39617_solr    ] o.a.z.ClientCnxn Session 0x0 for server null, unexpected error, closing socket connection and attempting reconnect
   [junit4]   2> java.net.ConnectException: Connection refused
   [junit4]   2> at sun.nio.ch.SocketChannelImpl.checkConnect(Native Method)
   [junit4]   2> at sun.nio.ch.SocketChannelImpl.finishConnect(SocketChannelImpl.java:717)
   [junit4]   2> at org.apache.zookeeper.ClientCnxnSocketNIO.doTransport(ClientCnxnSocketNIO.java:361)
   [junit4]   2> at org.apache.zookeeper.ClientCnxn$SendThread.run(ClientCnxn.java:1141)
   [junit4]   2> 2366867 WARN  (jetty-launcher-1065-thread-1-SendThread(127.0.0.1:36777)) [n:127.0.0.1:39617_solr    ] o.a.z.ClientCnxn Session 0x0 for server null, unexpected error, closing socket connection and attempting reconnect
   [junit4]   2> java.net.ConnectException: Connection refused
   [junit4]   2> at sun.nio.ch.SocketChannelImpl.checkConnect(Native Method)
   [junit4]   2> at sun.nio.ch.SocketChannelImpl.finishConnect(SocketChannelImpl.java:717)
   [junit4]   2> at org.apache.zookeeper.ClientCnxnSocketNIO.doTransport(ClientCnxnSocketNIO.java:361)
   [junit4]   2> at org.apache.zookeeper.ClientCnxn$SendThread.run(ClientCnxn.java:1141)
   [junit4]   2> 2367968 WARN  (jetty-launcher-1065-thread-1-SendThread(127.0.0.1:36777)) [n:127.0.0.1:39617_solr    ] o.a.z.ClientCnxn Session 0x0 for server null, unexpected error, closing socket connection and attempting reconnect
   [junit4]   2> java.net.ConnectException: Connection refused
   [junit4]   2> at sun.nio.ch.SocketChannelImpl.checkConnect(Native Method)
   [junit4]   2> at sun.nio.ch.SocketChannelImpl.finishConnect(SocketChannelImpl.java:717)
   [junit4]   2> at org.apache.zookeeper.ClientCnxnSocketNIO.doTransport(ClientCnxnSocketNIO.java:361)
   [junit4]   2> at org.apache.zookeeper.ClientCnxn$SendThread.run(ClientCnxn.java:1141)
   [junit4]   2> Aug 14, 2017 12:01:44 AM com.carrotsearch.randomizedtesting.ThreadLeakControl checkThreadLeaks
   [junit4]   2> SEVERE: 3 threads leaked from SUITE scope at org.apache.solr.cloud.TestSolrCloudWithSecureImpersonation:
   [junit4]   2>    1) Thread[id=13337, name=jetty-launcher-1065-thread-1-SendThread(127.0.0.1:36777), state=TIMED_WAITING, group=TGRP-TestSolrCloudWithSecureImpersonation]
   [junit4]   2>         at java.lang.Thread.sleep(Native Method)
   [junit4]   2>         at org.apache.zookeeper.client.StaticHostProvider.next(StaticHostProvider.java:101)
   [junit4]   2>         at org.apache.zookeeper.ClientCnxn$SendThread.startConnect(ClientCnxn.java:997)
   [junit4]   2>         at org.apache.zookeeper.ClientCnxn$SendThread.run(ClientCnxn.java:1060)
   [junit4]   2>    2) Thread[id=13275, name=jetty-launcher-1065-thread-2-EventThread, state=TIMED_WAITING, group=TGRP-TestSolrCloudWithSecureImpersonation]
   [junit4]   2>         at sun.misc.Unsafe.park(Native Method)
   [junit4]   2>         at java.util.concurrent.locks.LockSupport.parkNanos(LockSupport.java:215)
   [junit4]   2>         at java.util.concurrent.locks.AbstractQueuedSynchronizer.doAcquireSharedNanos(AbstractQueuedSynchronizer.java:1037)
   [junit4]   2>         at java.util.concurrent.locks.AbstractQueuedSynchronizer.tryAcquireSharedNanos(AbstractQueuedSynchronizer.java:1328)
   [junit4]   2>         at java.util.concurrent.CountDownLatch.await(CountDownLatch.java:277)
   [junit4]   2>         at org.apache.curator.CuratorZookeeperClient.internalBlockUntilConnectedOrTimedOut(CuratorZookeeperClient.java:323)
   [junit4]   2>         at org.apache.curator.RetryLoop.callWithRetry(RetryLoop.java:105)
   [junit4]   2>         at org.apache.curator.framework.imps.GetDataBuilderImpl.pathInForeground(GetDataBuilderImpl.java:288)
   [junit4]   2>         at org.apache.curator.framework.imps.GetDataBuilderImpl.forPath(GetDataBuilderImpl.java:279)
   [junit4]   2>         at org.apache.curator.framework.imps.GetDataBuilderImpl.forPath(GetDataBuilderImpl.java:41)
   [junit4]   2>         at org.apache.curator.framework.recipes.shared.SharedValue.readValue(SharedValue.java:244)
   [junit4]   2>         at org.apache.curator.framework.recipes.shared.SharedValue.access$100(SharedValue.java:44)
   [junit4]   2>         at org.apache.curator.framework.recipes.shared.SharedValue$1.process(SharedValue.java:61)
   [junit4]   2>         at org.apache.curator.framework.imps.NamespaceWatcher.process(NamespaceWatcher.java:67)
   [junit4]   2>         at org.apache.zookeeper.ClientCnxn$EventThread.processEvent(ClientCnxn.java:530)
   [junit4]   2>         at org.apache.zookeeper.ClientCnxn$EventThread.run(ClientCnxn.java:505)
   [junit4]   2>    3) Thread[id=13338, name=jetty-launcher-1065-thread-1-EventThread, state=WAITING, group=TGRP-TestSolrCloudWithSecureImpersonation]
   [junit4]   2>         at sun.misc.Unsafe.park(Native Method)
   [junit4]   2>         at java.util.concurrent.locks.LockSupport.park(LockSupport.java:175)
   [junit4]   2>         at java.util.concurrent.locks.AbstractQueuedSynchronizer$ConditionObject.await(AbstractQueuedSynchronizer.java:2039)
   [junit4]   2>         at java.util.concurrent.LinkedBlockingQueue.take(LinkedBlockingQueue.java:442)
   [junit4]   2>         at org.apache.zookeeper.ClientCnxn$EventThread.run(ClientCnxn.java:501)
   [junit4]   2> Aug 14, 2017 12:01:44 AM com.carrotsearch.randomizedtesting.ThreadLeakControl tryToInterruptAll
   [junit4]   2> INFO: Starting to interrupt leaked threads:
   [junit4]   2>    1) Thread[id=13337, name=jetty-launcher-1065-thread-1-SendThread(127.0.0.1:36777), state=TIMED_WAITING, group=TGRP-TestSolrCloudWithSecureImpersonation]
   [junit4]   2>    2) Thread[id=13275, name=jetty-launcher-1065-thread-2-EventThread, state=TIMED_WAITING, group=TGRP-TestSolrCloudWithSecureImpersonation]
   [junit4]   2>    3) Thread[id=13338, name=jetty-launcher-1065-thread-1-EventThread, state=WAITING, group=TGRP-TestSolrCloudWithSecureImpersonation]
   [junit4]   2> 2368329 ERROR (jetty-launcher-1065-thread-1-EventThread) [n:127.0.0.1:39617_solr    ] o.a.z.ClientCnxn Event thread exiting due to interruption
   [junit4]   2> java.lang.InterruptedException
   [junit4]   2> at java.util.concurrent.locks.AbstractQueuedSynchronizer$ConditionObject.reportInterruptAfterWait(AbstractQueuedSynchronizer.java:2014)
   [junit4]   2> at java.util.concurrent.locks.AbstractQueuedSynchronizer$ConditionObject.await(AbstractQueuedSynchronizer.java:2048)
   [junit4]   2> at java.util.concurrent.LinkedBlockingQueue.take(LinkedBlockingQueue.java:442)
   [junit4]   2> at org.apache.zookeeper.ClientCnxn$EventThread.run(ClientCnxn.java:501)
   [junit4]   2> 2368329 ERROR (jetty-launcher-1065-thread-2-EventThread) [n:127.0.0.1:44023_solr    ] o.a.c.f.i.CuratorFrameworkImpl Watcher exception
   [junit4]   2> java.lang.InterruptedException
   [junit4]   2> at java.util.concurrent.locks.AbstractQueuedSynchronizer.doAcquireSharedNanos(AbstractQueuedSynchronizer.java:1039)
   [junit4]   2> at java.util.concurrent.locks.AbstractQueuedSynchronizer.tryAcquireSharedNanos(AbstractQueuedSynchronizer.java:1328)
   [junit4]   2> at java.util.concurrent.CountDownLatch.await(CountDownLatch.java:277)
   [junit4]   2> at org.apache.curator.CuratorZookeeperClient.internalBlockUntilConnectedOrTimedOut(CuratorZookeeperClient.java:323)
   [junit4]   2> at org.apache.curator.RetryLoop.callWithRetry(RetryLoop.java:105)
   [junit4]   2> at org.apache.curator.framework.imps.GetDataBuilderImpl.pathInForeground(GetDataBuilderImpl.java:288)
   [junit4]   2> at org.apache.curator.framework.imps.GetDataBuilderImpl.forPath(GetDataBuilderImpl.java:279)
   [junit4]   2> at org.apache.curator.framework.imps.GetDataBuilderImpl.forPath(GetDataBuilderImpl.java:41)
   [junit4]   2> at org.apache.curator.framework.recipes.shared.SharedValue.readValue(SharedValue.java:244)
   [junit4]   2> at org.apache.curator.framework.recipes.shared.SharedValue.access$100(SharedValue.java:44)
   [junit4]   2> at org.apache.curator.framework.recipes.shared.SharedValue$1.process(SharedValue.java:61)
   [junit4]   2> at org.apache.curator.framework.imps.NamespaceWatcher.process(NamespaceWatcher.java:67)
   [junit4]   2> at org.apache.zookeeper.ClientCnxn$EventThread.processEvent(ClientCnxn.java:530)
   [junit4]   2> at org.apache.zookeeper.ClientCnxn$EventThread.run(ClientCnxn.java:505)
   [junit4]   2> 2368329 WARN  (jetty-launcher-1065-thread-1-SendThread(127.0.0.1:36777)) [n:127.0.0.1:39617_solr    ] o.a.z.c.StaticHostProvider Unexpected exception
   [junit4]   2> java.lang.InterruptedException: sleep interrupted
   [junit4]   2> at java.lang.Thread.sleep(Native Method)
   [junit4]   2> at org.apache.zookeeper.client.StaticHostProvider.next(StaticHostProvider.java:101)
   [junit4]   2> at org.apache.zookeeper.ClientCnxn$SendThread.startConnect(ClientCnxn.java:997)
   [junit4]   2> at org.apache.zookeeper.ClientCnxn$SendThread.run(ClientCnxn.java:1060)
   [junit4]   2> 2368329 WARN  (jetty-launcher-1065-thread-2-EventThread) [n:127.0.0.1:44023_solr    ] o.a.c.ConnectionState Session expired event received
   [junit4]   2> 2368330 WARN  (jetty-launcher-1065-thread-1-SendThread(127.0.0.1:36777)) [n:127.0.0.1:39617_solr    ] o.a.z.ClientCnxn Session 0x0 for server null, unexpected error, closing socket connection and attempting reconnect
   [junit4]   2> java.net.ConnectException: Connection refused
   [junit4]   2> at sun.nio.ch.SocketChannelImpl.checkConnect(Native Method)
   [junit4]   2> at sun.nio.ch.SocketChannelImpl.finishConnect(SocketChannelImpl.java:717)
   [junit4]   2> at org.apache.zookeeper.ClientCnxnSocketNIO.doTransport(ClientCnxnSocketNIO.java:361)
   [junit4]   2> at org.apache.zookeeper.ClientCnxn$SendThread.run(ClientCnxn.java:1141)
   [junit4]   2> 2368331 WARN  (jetty-launcher-1065-thread-2-SendThread(127.0.0.1:36777)) [n:127.0.0.1:44023_solr    ] o.a.z.ClientCnxn Session 0x0 for server null, unexpected error, closing socket connection and attempting reconnect
   [junit4]   2> java.net.ConnectException: Connection refused
   [junit4]   2> at sun.nio.ch.SocketChannelImpl.checkConnect(Native Method)


[...truncated too long message...]

ClientCnxn Session 0x0 for server null, unexpected error, closing socket connection and attempting reconnect
   [junit4]   2> java.net.ConnectException: Connection refused
   [junit4]   2> at sun.nio.ch.SocketChannelImpl.checkConnect(Native Method)
   [junit4]   2> at sun.nio.ch.SocketChannelImpl.finishConnect(SocketChannelImpl.java:717)
   [junit4]   2> at org.apache.zookeeper.ClientCnxnSocketNIO.doTransport(ClientCnxnSocketNIO.java:361)
   [junit4]   2> at org.apache.zookeeper.ClientCnxn$SendThread.run(ClientCnxn.java:1141)
   [junit4]   2> 2370829 WARN  (jetty-launcher-1065-thread-1-SendThread(127.0.0.1:36777)) [n:127.0.0.1:39617_solr    ] o.a.z.c.StaticHostProvider Unexpected exception
   [junit4]   2> java.lang.InterruptedException: sleep interrupted
   [junit4]   2> at java.lang.Thread.sleep(Native Method)
   [junit4]   2> at org.apache.zookeeper.client.StaticHostProvider.next(StaticHostProvider.java:101)
   [junit4]   2> at org.apache.zookeeper.ClientCnxn$SendThread.startConnect(ClientCnxn.java:997)
   [junit4]   2> at org.apache.zookeeper.ClientCnxn$SendThread.run(ClientCnxn.java:1060)
   [junit4]   2> 2370830 WARN  (jetty-launcher-1065-thread-1-SendThread(127.0.0.1:36777)) [n:127.0.0.1:39617_solr    ] o.a.z.ClientCnxn Session 0x0 for server null, unexpected error, closing socket connection and attempting reconnect
   [junit4]   2> java.net.ConnectException: Connection refused
   [junit4]   2> at sun.nio.ch.SocketChannelImpl.checkConnect(Native Method)
   [junit4]   2> at sun.nio.ch.SocketChannelImpl.finishConnect(SocketChannelImpl.java:717)
   [junit4]   2> at org.apache.zookeeper.ClientCnxnSocketNIO.doTransport(ClientCnxnSocketNIO.java:361)
   [junit4]   2> at org.apache.zookeeper.ClientCnxn$SendThread.run(ClientCnxn.java:1141)
   [junit4]   2> Aug 14, 2017 12:01:47 AM com.carrotsearch.randomizedtesting.ThreadLeakControl tryToInterruptAll
   [junit4]   2> SEVERE: There are still zombie threads that couldn't be terminated:
   [junit4]   2>    1) Thread[id=13337, name=jetty-launcher-1065-thread-1-SendThread(127.0.0.1:36777), state=TIMED_WAITING, group=TGRP-TestSolrCloudWithSecureImpersonation]
   [junit4]   2>         at java.lang.Thread.sleep(Native Method)
   [junit4]   2>         at org.apache.zookeeper.client.StaticHostProvider.next(StaticHostProvider.java:101)
   [junit4]   2>         at org.apache.zookeeper.ClientCnxn$SendThread.startConnect(ClientCnxn.java:997)
   [junit4]   2>         at org.apache.zookeeper.ClientCnxn$SendThread.run(ClientCnxn.java:1060)
   [junit4]   2> NOTE: test params are: codec=Lucene70, sim=RandomSimilarity(queryNorm=true): {}, locale=sr-Latn, timezone=Australia/Lindeman
   [junit4]   2> NOTE: Linux 4.10.0-27-generic amd64/Oracle Corporation 1.8.0_144 (64-bit)/cpus=8,threads=4,free=173777360,total=523763712
   [junit4]   2> NOTE: All tests run in this JVM: [TestCSVLoader, TestManagedResourceStorage, ConnectionReuseTest, AssignTest, SharedFSAutoReplicaFailoverTest, LeaderFailureAfterFreshStartTest, TestConfigSetsAPI, SolrRequestParserTest, TestDocBasedVersionConstraints, TestOmitPositions, TestMultiValuedNumericRangeQuery, SSLMigrationTest, TestBadConfig, SpellCheckCollatorTest, ExitableDirectoryReaderTest, TestBinaryResponseWriter, PropertiesRequestHandlerTest, HdfsRecoverLeaseTest, QueryElevationComponentTest, TestHashQParserPlugin, TestLegacyFieldReuse, HdfsUnloadDistributedZkTest, TestFieldTypeCollectionResource, SyncSliceTest, TestJsonFacetRefinement, TestSizeLimitedDistributedMap, OverseerCollectionConfigSetProcessorTest, TestRandomFlRTGCloud, BasicDistributedZkTest, DeleteShardTest, TestReloadAndDeleteDocs, TolerantUpdateProcessorTest, CloudExitableDirectoryReaderTest, ZkNodePropsTest, IgnoreCommitOptimizeUpdateProcessorFactoryTest, TestBackupRepositoryFactory, TestRemoteStreaming, ChaosMonkeySafeLeaderWithPullReplicasTest, TestAuthenticationFramework, TestSerializedLuceneMatchVersion, TestJoin, TestMaxTokenLenTokenizer, OutputWriterTest, BlockDirectoryTest, TestMergePolicyConfig, TestComponentsName, SolrIndexConfigTest, UUIDFieldTest, PeerSyncTest, TestPushWriter, TestSchemalessBufferedUpdates, BlobRepositoryCloudTest, TestDownShardTolerantSearch, TestCustomStream, TestOrdValues, TestReplicationHandler, MigrateRouteKeyTest, TestMacros, HdfsBasicDistributedZk2Test, RAMDirectoryFactoryTest, TestCollationField, TestRandomFaceting, BasicAuthIntegrationTest, TestHighlightDedupGrouping, HLLSerializationTest, TestPrepRecovery, HdfsSyncSliceTest, TestSubQueryTransformerCrossCore, DistributedFacetPivotLongTailTest, TestPhraseSuggestions, TestFastOutputStream, RequestHandlersTest, TestReplicationHandlerBackup, TestConfigSetProperties, TestLazyCores, TestIBSimilarityFactory, DistributedFacetPivotWhiteBoxTest, BitVectorTest, WrapperMergePolicyFactoryTest, RecoveryAfterSoftCommitTest, TestSolrDeletionPolicy1, TestFunctionQuery, ResponseHeaderTest, TestAnalyzeInfixSuggestions, ImplicitSnitchTest, VersionInfoTest, CreateCollectionCleanupTest, AnalyticsMergeStrategyTest, SolrPluginUtilsTest, BlockJoinFacetDistribTest, HighlighterConfigTest, TestCSVResponseWriter, TestSolrConfigHandler, TestClusterStateMutator, CoreMergeIndexesAdminHandlerTest, TestExpandComponent, TestExtendedDismaxParser, TestNoOpRegenerator, DistributedExpandComponentTest, DistribDocExpirationUpdateProcessorTest, TestSolrCloudWithSecureImpersonation]
   [junit4]   2> NOTE: reproduce with: ant test  -Dtestcase=TestSolrCloudWithSecureImpersonation -Dtests.seed=46E75060D157BDBF -Dtests.multiplier=3 -Dtests.slow=true -Dtests.locale=sr-Latn -Dtests.timezone=Australia/Lindeman -Dtests.asserts=true -Dtests.file.encoding=UTF-8
   [junit4] ERROR   0.00s J0 | TestSolrCloudWithSecureImpersonation (suite) <<<
   [junit4]    > Throwable #1: com.carrotsearch.randomizedtesting.ThreadLeakError: 3 threads leaked from SUITE scope at org.apache.solr.cloud.TestSolrCloudWithSecureImpersonation:
   [junit4]    >    1) Thread[id=13337, name=jetty-launcher-1065-thread-1-SendThread(127.0.0.1:36777), state=TIMED_WAITING, group=TGRP-TestSolrCloudWithSecureImpersonation]
   [junit4]    >         at java.lang.Thread.sleep(Native Method)
   [junit4]    >         at org.apache.zookeeper.client.StaticHostProvider.next(StaticHostProvider.java:101)
   [junit4]    >         at org.apache.zookeeper.ClientCnxn$SendThread.startConnect(ClientCnxn.java:997)
   [junit4]    >         at org.apache.zookeeper.ClientCnxn$SendThread.run(ClientCnxn.java:1060)
   [junit4]    >    2) Thread[id=13275, name=jetty-launcher-1065-thread-2-EventThread, state=TIMED_WAITING, group=TGRP-TestSolrCloudWithSecureImpersonation]
   [junit4]    >         at sun.misc.Unsafe.park(Native Method)
   [junit4]    >         at java.util.concurrent.locks.LockSupport.parkNanos(LockSupport.java:215)
   [junit4]    >         at java.util.concurrent.locks.AbstractQueuedSynchronizer.doAcquireSharedNanos(AbstractQueuedSynchronizer.java:1037)
   [junit4]    >         at java.util.concurrent.locks.AbstractQueuedSynchronizer.tryAcquireSharedNanos(AbstractQueuedSynchronizer.java:1328)
   [junit4]    >         at java.util.concurrent.CountDownLatch.await(CountDownLatch.java:277)
   [junit4]    >         at org.apache.curator.CuratorZookeeperClient.internalBlockUntilConnectedOrTimedOut(CuratorZookeeperClient.java:323)
   [junit4]    >         at org.apache.curator.RetryLoop.callWithRetry(RetryLoop.java:105)
   [junit4]    >         at org.apache.curator.framework.imps.GetDataBuilderImpl.pathInForeground(GetDataBuilderImpl.java:288)
   [junit4]    >         at org.apache.curator.framework.imps.GetDataBuilderImpl.forPath(GetDataBuilderImpl.java:279)
   [junit4]    >         at org.apache.curator.framework.imps.GetDataBuilderImpl.forPath(GetDataBuilderImpl.java:41)
   [junit4]    >         at org.apache.curator.framework.recipes.shared.SharedValue.readValue(SharedValue.java:244)
   [junit4]    >         at org.apache.curator.framework.recipes.shared.SharedValue.access$100(SharedValue.java:44)
   [junit4]    >         at org.apache.curator.framework.recipes.shared.SharedValue$1.process(SharedValue.java:61)
   [junit4]    >         at org.apache.curator.framework.imps.NamespaceWatcher.process(NamespaceWatcher.java:67)
   [junit4]    >         at org.apache.zookeeper.ClientCnxn$EventThread.processEvent(ClientCnxn.java:530)
   [junit4]    >         at org.apache.zookeeper.ClientCnxn$EventThread.run(ClientCnxn.java:505)
   [junit4]    >    3) Thread[id=13338, name=jetty-launcher-1065-thread-1-EventThread, state=WAITING, group=TGRP-TestSolrCloudWithSecureImpersonation]
   [junit4]    >         at sun.misc.Unsafe.park(Native Method)
   [junit4]    >         at java.util.concurrent.locks.LockSupport.park(LockSupport.java:175)
   [junit4]    >         at java.util.concurrent.locks.AbstractQueuedSynchronizer$ConditionObject.await(AbstractQueuedSynchronizer.java:2039)
   [junit4]    >         at java.util.concurrent.LinkedBlockingQueue.take(LinkedBlockingQueue.java:442)
   [junit4]    >         at org.apache.zookeeper.ClientCnxn$EventThread.run(ClientCnxn.java:501)
   [junit4]    > at __randomizedtesting.SeedInfo.seed([46E75060D157BDBF]:0)Throwable #2: com.carrotsearch.randomizedtesting.ThreadLeakError: There are still zombie threads that couldn't be terminated:
   [junit4]    >    1) Thread[id=13337, name=jetty-launcher-1065-thread-1-SendThread(127.0.0.1:36777), state=TIMED_WAITING, group=TGRP-TestSolrCloudWithSecureImpersonation]
   [junit4]    >         at java.lang.Thread.sleep(Native Method)
   [junit4]    >         at org.apache.zookeeper.client.StaticHostProvider.next(StaticHostProvider.java:101)
   [junit4]    >         at org.apache.zookeeper.ClientCnxn$SendThread.startConnect(ClientCnxn.java:997)
   [junit4]    >         at org.apache.zookeeper.ClientCnxn$SendThread.run(ClientCnxn.java:1060)
   [junit4]    > at __randomizedtesting.SeedInfo.seed([46E75060D157BDBF]:0)
   [junit4] Completed [532/728 (1!)] on J0 in 55.02s, 12 tests, 2 errors <<< FAILURES!

[...truncated 43931 lines...]


---------------------------------------------------------------------
To unsubscribe, e-mail: [hidden email]
For additional commands, e-mail: [hidden email]