[JENKINS] Lucene-Solr-7.0-Windows (32bit/jdk1.8.0_144) - Build # 156 - Unstable!

Previous Topic Next Topic
 
classic Classic list List threaded Threaded
2 messages Options
Reply | Threaded
Open this post in threaded view
|

[JENKINS] Lucene-Solr-7.0-Windows (32bit/jdk1.8.0_144) - Build # 156 - Unstable!

Policeman Jenkins Server-2
Build: https://jenkins.thetaphi.de/job/Lucene-Solr-7.0-Windows/156/
Java: 32bit/jdk1.8.0_144 -client -XX:+UseParallelGC

4 tests failed.
FAILED:  org.apache.solr.cloud.ActionThrottleTest.testAZeroNanoTimeReturnInWait

Error Message:
993ms

Stack Trace:
java.lang.AssertionError: 993ms
        at __randomizedtesting.SeedInfo.seed([3D76EB8A24EEF9E2:FE1D10B890AF0401]:0)
        at org.junit.Assert.fail(Assert.java:93)
        at org.junit.Assert.assertTrue(Assert.java:43)
        at org.apache.solr.cloud.ActionThrottleTest.testAZeroNanoTimeReturnInWait(ActionThrottleTest.java:89)
        at sun.reflect.NativeMethodAccessorImpl.invoke0(Native Method)
        at sun.reflect.NativeMethodAccessorImpl.invoke(NativeMethodAccessorImpl.java:62)
        at sun.reflect.DelegatingMethodAccessorImpl.invoke(DelegatingMethodAccessorImpl.java:43)
        at java.lang.reflect.Method.invoke(Method.java:498)
        at com.carrotsearch.randomizedtesting.RandomizedRunner.invoke(RandomizedRunner.java:1713)
        at com.carrotsearch.randomizedtesting.RandomizedRunner$8.evaluate(RandomizedRunner.java:907)
        at com.carrotsearch.randomizedtesting.RandomizedRunner$9.evaluate(RandomizedRunner.java:943)
        at com.carrotsearch.randomizedtesting.RandomizedRunner$10.evaluate(RandomizedRunner.java:957)
        at com.carrotsearch.randomizedtesting.rules.SystemPropertiesRestoreRule$1.evaluate(SystemPropertiesRestoreRule.java:57)
        at org.apache.lucene.util.TestRuleSetupTeardownChained$1.evaluate(TestRuleSetupTeardownChained.java:49)
        at org.apache.lucene.util.AbstractBeforeAfterRule$1.evaluate(AbstractBeforeAfterRule.java:45)
        at org.apache.lucene.util.TestRuleThreadAndTestName$1.evaluate(TestRuleThreadAndTestName.java:48)
        at org.apache.lucene.util.TestRuleIgnoreAfterMaxFailures$1.evaluate(TestRuleIgnoreAfterMaxFailures.java:64)
        at org.apache.lucene.util.TestRuleMarkFailure$1.evaluate(TestRuleMarkFailure.java:47)
        at com.carrotsearch.randomizedtesting.rules.StatementAdapter.evaluate(StatementAdapter.java:36)
        at com.carrotsearch.randomizedtesting.ThreadLeakControl$StatementRunner.run(ThreadLeakControl.java:368)
        at com.carrotsearch.randomizedtesting.ThreadLeakControl.forkTimeoutingTask(ThreadLeakControl.java:817)
        at com.carrotsearch.randomizedtesting.ThreadLeakControl$3.evaluate(ThreadLeakControl.java:468)
        at com.carrotsearch.randomizedtesting.RandomizedRunner.runSingleTest(RandomizedRunner.java:916)
        at com.carrotsearch.randomizedtesting.RandomizedRunner$5.evaluate(RandomizedRunner.java:802)
        at com.carrotsearch.randomizedtesting.RandomizedRunner$6.evaluate(RandomizedRunner.java:852)
        at com.carrotsearch.randomizedtesting.RandomizedRunner$7.evaluate(RandomizedRunner.java:863)
        at com.carrotsearch.randomizedtesting.rules.StatementAdapter.evaluate(StatementAdapter.java:36)
        at com.carrotsearch.randomizedtesting.rules.SystemPropertiesRestoreRule$1.evaluate(SystemPropertiesRestoreRule.java:57)
        at org.apache.lucene.util.AbstractBeforeAfterRule$1.evaluate(AbstractBeforeAfterRule.java:45)
        at com.carrotsearch.randomizedtesting.rules.StatementAdapter.evaluate(StatementAdapter.java:36)
        at org.apache.lucene.util.TestRuleStoreClassName$1.evaluate(TestRuleStoreClassName.java:41)
        at com.carrotsearch.randomizedtesting.rules.NoShadowingOrOverridesOnMethodsRule$1.evaluate(NoShadowingOrOverridesOnMethodsRule.java:40)
        at com.carrotsearch.randomizedtesting.rules.NoShadowingOrOverridesOnMethodsRule$1.evaluate(NoShadowingOrOverridesOnMethodsRule.java:40)
        at com.carrotsearch.randomizedtesting.rules.StatementAdapter.evaluate(StatementAdapter.java:36)
        at com.carrotsearch.randomizedtesting.rules.StatementAdapter.evaluate(StatementAdapter.java:36)
        at com.carrotsearch.randomizedtesting.rules.StatementAdapter.evaluate(StatementAdapter.java:36)
        at org.apache.lucene.util.TestRuleAssertionsRequired$1.evaluate(TestRuleAssertionsRequired.java:53)
        at org.apache.lucene.util.TestRuleMarkFailure$1.evaluate(TestRuleMarkFailure.java:47)
        at org.apache.lucene.util.TestRuleIgnoreAfterMaxFailures$1.evaluate(TestRuleIgnoreAfterMaxFailures.java:64)
        at org.apache.lucene.util.TestRuleIgnoreTestSuites$1.evaluate(TestRuleIgnoreTestSuites.java:54)
        at com.carrotsearch.randomizedtesting.rules.StatementAdapter.evaluate(StatementAdapter.java:36)
        at com.carrotsearch.randomizedtesting.ThreadLeakControl$StatementRunner.run(ThreadLeakControl.java:368)
        at java.lang.Thread.run(Thread.java:748)


FAILED:  org.apache.solr.cloud.ChaosMonkeyNothingIsSafeTest.test

Error Message:
Timeout occured while waiting response from server at: http://127.0.0.1:54628/joq/fh/collection1

Stack Trace:
org.apache.solr.client.solrj.SolrServerException: Timeout occured while waiting response from server at: http://127.0.0.1:54628/joq/fh/collection1
        at __randomizedtesting.SeedInfo.seed([3D76EB8A24EEF9E2:B522D4508A12941A]:0)
        at org.apache.solr.client.solrj.impl.HttpSolrClient.executeMethod(HttpSolrClient.java:638)
        at org.apache.solr.client.solrj.impl.HttpSolrClient.request(HttpSolrClient.java:253)
        at org.apache.solr.client.solrj.impl.HttpSolrClient.request(HttpSolrClient.java:242)
        at org.apache.solr.client.solrj.impl.LBHttpSolrClient.doRequest(LBHttpSolrClient.java:483)
        at org.apache.solr.client.solrj.impl.LBHttpSolrClient.request(LBHttpSolrClient.java:413)
        at org.apache.solr.client.solrj.impl.CloudSolrClient.sendRequest(CloudSolrClient.java:1121)
        at org.apache.solr.client.solrj.impl.CloudSolrClient.requestWithRetryOnStaleState(CloudSolrClient.java:862)
        at org.apache.solr.client.solrj.impl.CloudSolrClient.request(CloudSolrClient.java:793)
        at org.apache.solr.client.solrj.SolrRequest.process(SolrRequest.java:178)
        at org.apache.solr.client.solrj.SolrClient.commit(SolrClient.java:484)
        at org.apache.solr.client.solrj.SolrClient.commit(SolrClient.java:463)
        at org.apache.solr.cloud.AbstractFullDistribZkTestBase.commit(AbstractFullDistribZkTestBase.java:1583)
        at org.apache.solr.cloud.ChaosMonkeyNothingIsSafeTest.test(ChaosMonkeyNothingIsSafeTest.java:213)
        at sun.reflect.NativeMethodAccessorImpl.invoke0(Native Method)
        at sun.reflect.NativeMethodAccessorImpl.invoke(NativeMethodAccessorImpl.java:62)
        at sun.reflect.DelegatingMethodAccessorImpl.invoke(DelegatingMethodAccessorImpl.java:43)
        at java.lang.reflect.Method.invoke(Method.java:498)
        at com.carrotsearch.randomizedtesting.RandomizedRunner.invoke(RandomizedRunner.java:1713)
        at com.carrotsearch.randomizedtesting.RandomizedRunner$8.evaluate(RandomizedRunner.java:907)
        at com.carrotsearch.randomizedtesting.RandomizedRunner$9.evaluate(RandomizedRunner.java:943)
        at com.carrotsearch.randomizedtesting.RandomizedRunner$10.evaluate(RandomizedRunner.java:957)
        at org.apache.solr.BaseDistributedSearchTestCase$ShardsRepeatRule$ShardsFixedStatement.callStatement(BaseDistributedSearchTestCase.java:993)
        at org.apache.solr.BaseDistributedSearchTestCase$ShardsRepeatRule$ShardsStatement.evaluate(BaseDistributedSearchTestCase.java:968)
        at com.carrotsearch.randomizedtesting.rules.SystemPropertiesRestoreRule$1.evaluate(SystemPropertiesRestoreRule.java:57)
        at org.apache.lucene.util.TestRuleSetupTeardownChained$1.evaluate(TestRuleSetupTeardownChained.java:49)
        at org.apache.lucene.util.AbstractBeforeAfterRule$1.evaluate(AbstractBeforeAfterRule.java:45)
        at org.apache.lucene.util.TestRuleThreadAndTestName$1.evaluate(TestRuleThreadAndTestName.java:48)
        at org.apache.lucene.util.TestRuleIgnoreAfterMaxFailures$1.evaluate(TestRuleIgnoreAfterMaxFailures.java:64)
        at org.apache.lucene.util.TestRuleMarkFailure$1.evaluate(TestRuleMarkFailure.java:47)
        at com.carrotsearch.randomizedtesting.rules.StatementAdapter.evaluate(StatementAdapter.java:36)
        at com.carrotsearch.randomizedtesting.ThreadLeakControl$StatementRunner.run(ThreadLeakControl.java:368)
        at com.carrotsearch.randomizedtesting.ThreadLeakControl.forkTimeoutingTask(ThreadLeakControl.java:817)
        at com.carrotsearch.randomizedtesting.ThreadLeakControl$3.evaluate(ThreadLeakControl.java:468)
        at com.carrotsearch.randomizedtesting.RandomizedRunner.runSingleTest(RandomizedRunner.java:916)
        at com.carrotsearch.randomizedtesting.RandomizedRunner$5.evaluate(RandomizedRunner.java:802)
        at com.carrotsearch.randomizedtesting.RandomizedRunner$6.evaluate(RandomizedRunner.java:852)
        at com.carrotsearch.randomizedtesting.RandomizedRunner$7.evaluate(RandomizedRunner.java:863)
        at com.carrotsearch.randomizedtesting.rules.StatementAdapter.evaluate(StatementAdapter.java:36)
        at com.carrotsearch.randomizedtesting.rules.SystemPropertiesRestoreRule$1.evaluate(SystemPropertiesRestoreRule.java:57)
        at org.apache.lucene.util.AbstractBeforeAfterRule$1.evaluate(AbstractBeforeAfterRule.java:45)
        at com.carrotsearch.randomizedtesting.rules.StatementAdapter.evaluate(StatementAdapter.java:36)
        at org.apache.lucene.util.TestRuleStoreClassName$1.evaluate(TestRuleStoreClassName.java:41)
        at com.carrotsearch.randomizedtesting.rules.NoShadowingOrOverridesOnMethodsRule$1.evaluate(NoShadowingOrOverridesOnMethodsRule.java:40)
        at com.carrotsearch.randomizedtesting.rules.NoShadowingOrOverridesOnMethodsRule$1.evaluate(NoShadowingOrOverridesOnMethodsRule.java:40)
        at com.carrotsearch.randomizedtesting.rules.StatementAdapter.evaluate(StatementAdapter.java:36)
        at com.carrotsearch.randomizedtesting.rules.StatementAdapter.evaluate(StatementAdapter.java:36)
        at com.carrotsearch.randomizedtesting.rules.StatementAdapter.evaluate(StatementAdapter.java:36)
        at org.apache.lucene.util.TestRuleAssertionsRequired$1.evaluate(TestRuleAssertionsRequired.java:53)
        at org.apache.lucene.util.TestRuleMarkFailure$1.evaluate(TestRuleMarkFailure.java:47)
        at org.apache.lucene.util.TestRuleIgnoreAfterMaxFailures$1.evaluate(TestRuleIgnoreAfterMaxFailures.java:64)
        at org.apache.lucene.util.TestRuleIgnoreTestSuites$1.evaluate(TestRuleIgnoreTestSuites.java:54)
        at com.carrotsearch.randomizedtesting.rules.StatementAdapter.evaluate(StatementAdapter.java:36)
        at com.carrotsearch.randomizedtesting.ThreadLeakControl$StatementRunner.run(ThreadLeakControl.java:368)
        at java.lang.Thread.run(Thread.java:748)
Caused by: java.net.SocketTimeoutException: Read timed out
        at java.net.SocketInputStream.socketRead0(Native Method)
        at java.net.SocketInputStream.socketRead(SocketInputStream.java:116)
        at java.net.SocketInputStream.read(SocketInputStream.java:171)
        at java.net.SocketInputStream.read(SocketInputStream.java:141)
        at org.apache.http.impl.io.SessionInputBufferImpl.streamRead(SessionInputBufferImpl.java:139)
        at org.apache.http.impl.io.SessionInputBufferImpl.fillBuffer(SessionInputBufferImpl.java:155)
        at org.apache.http.impl.io.SessionInputBufferImpl.readLine(SessionInputBufferImpl.java:284)
        at org.apache.http.impl.conn.DefaultHttpResponseParser.parseHead(DefaultHttpResponseParser.java:140)
        at org.apache.http.impl.conn.DefaultHttpResponseParser.parseHead(DefaultHttpResponseParser.java:57)
        at org.apache.http.impl.io.AbstractMessageParser.parse(AbstractMessageParser.java:261)
        at org.apache.http.impl.DefaultBHttpClientConnection.receiveResponseHeader(DefaultBHttpClientConnection.java:165)
        at org.apache.http.impl.conn.CPoolProxy.receiveResponseHeader(CPoolProxy.java:167)
        at org.apache.http.protocol.HttpRequestExecutor.doReceiveResponse(HttpRequestExecutor.java:272)
        at org.apache.http.protocol.HttpRequestExecutor.execute(HttpRequestExecutor.java:124)
        at org.apache.http.impl.execchain.MainClientExec.execute(MainClientExec.java:271)
        at org.apache.http.impl.execchain.ProtocolExec.execute(ProtocolExec.java:184)
        at org.apache.http.impl.execchain.RetryExec.execute(RetryExec.java:88)
        at org.apache.http.impl.execchain.RedirectExec.execute(RedirectExec.java:110)
        at org.apache.http.impl.client.InternalHttpClient.doExecute(InternalHttpClient.java:184)
        at org.apache.http.impl.client.CloseableHttpClient.execute(CloseableHttpClient.java:82)
        at org.apache.http.impl.client.CloseableHttpClient.execute(CloseableHttpClient.java:55)
        at org.apache.solr.client.solrj.impl.HttpSolrClient.executeMethod(HttpSolrClient.java:526)
        ... 53 more


FAILED:  junit.framework.TestSuite.org.apache.solr.cloud.ChaosMonkeyNothingIsSafeTest

Error Message:
9 threads leaked from SUITE scope at org.apache.solr.cloud.ChaosMonkeyNothingIsSafeTest:     1) Thread[id=23253, name=zkCallback-4312-thread-5, state=TIMED_WAITING, group=TGRP-ChaosMonkeyNothingIsSafeTest]         at sun.misc.Unsafe.park(Native Method)         at java.util.concurrent.locks.LockSupport.parkNanos(LockSupport.java:215)         at java.util.concurrent.SynchronousQueue$TransferStack.awaitFulfill(SynchronousQueue.java:460)         at java.util.concurrent.SynchronousQueue$TransferStack.transfer(SynchronousQueue.java:362)         at java.util.concurrent.SynchronousQueue.poll(SynchronousQueue.java:941)         at java.util.concurrent.ThreadPoolExecutor.getTask(ThreadPoolExecutor.java:1073)         at java.util.concurrent.ThreadPoolExecutor.runWorker(ThreadPoolExecutor.java:1134)         at java.util.concurrent.ThreadPoolExecutor$Worker.run(ThreadPoolExecutor.java:624)         at java.lang.Thread.run(Thread.java:748)    2) Thread[id=23254, name=zkCallback-4312-thread-6, state=TIMED_WAITING, group=TGRP-ChaosMonkeyNothingIsSafeTest]         at sun.misc.Unsafe.park(Native Method)         at java.util.concurrent.locks.LockSupport.parkNanos(LockSupport.java:215)         at java.util.concurrent.SynchronousQueue$TransferStack.awaitFulfill(SynchronousQueue.java:460)         at java.util.concurrent.SynchronousQueue$TransferStack.transfer(SynchronousQueue.java:362)         at java.util.concurrent.SynchronousQueue.poll(SynchronousQueue.java:941)         at java.util.concurrent.ThreadPoolExecutor.getTask(ThreadPoolExecutor.java:1073)         at java.util.concurrent.ThreadPoolExecutor.runWorker(ThreadPoolExecutor.java:1134)         at java.util.concurrent.ThreadPoolExecutor$Worker.run(ThreadPoolExecutor.java:624)         at java.lang.Thread.run(Thread.java:748)    3) Thread[id=23093, name=TEST-ChaosMonkeyNothingIsSafeTest.test-seed#[3D76EB8A24EEF9E2]-EventThread, state=WAITING, group=TGRP-ChaosMonkeyNothingIsSafeTest]         at sun.misc.Unsafe.park(Native Method)         at java.util.concurrent.locks.LockSupport.park(LockSupport.java:175)         at java.util.concurrent.locks.AbstractQueuedSynchronizer$ConditionObject.await(AbstractQueuedSynchronizer.java:2039)         at java.util.concurrent.LinkedBlockingQueue.take(LinkedBlockingQueue.java:442)         at org.apache.zookeeper.ClientCnxn$EventThread.run(ClientCnxn.java:501)    4) Thread[id=23252, name=zkCallback-4312-thread-4, state=TIMED_WAITING, group=TGRP-ChaosMonkeyNothingIsSafeTest]         at sun.misc.Unsafe.park(Native Method)         at java.util.concurrent.locks.LockSupport.parkNanos(LockSupport.java:215)         at java.util.concurrent.SynchronousQueue$TransferStack.awaitFulfill(SynchronousQueue.java:460)         at java.util.concurrent.SynchronousQueue$TransferStack.transfer(SynchronousQueue.java:362)         at java.util.concurrent.SynchronousQueue.poll(SynchronousQueue.java:941)         at java.util.concurrent.ThreadPoolExecutor.getTask(ThreadPoolExecutor.java:1073)         at java.util.concurrent.ThreadPoolExecutor.runWorker(ThreadPoolExecutor.java:1134)         at java.util.concurrent.ThreadPoolExecutor$Worker.run(ThreadPoolExecutor.java:624)         at java.lang.Thread.run(Thread.java:748)    5) Thread[id=23251, name=zkCallback-4312-thread-3, state=TIMED_WAITING, group=TGRP-ChaosMonkeyNothingIsSafeTest]         at sun.misc.Unsafe.park(Native Method)         at java.util.concurrent.locks.LockSupport.parkNanos(LockSupport.java:215)         at java.util.concurrent.SynchronousQueue$TransferStack.awaitFulfill(SynchronousQueue.java:460)         at java.util.concurrent.SynchronousQueue$TransferStack.transfer(SynchronousQueue.java:362)         at java.util.concurrent.SynchronousQueue.poll(SynchronousQueue.java:941)         at java.util.concurrent.ThreadPoolExecutor.getTask(ThreadPoolExecutor.java:1073)         at java.util.concurrent.ThreadPoolExecutor.runWorker(ThreadPoolExecutor.java:1134)         at java.util.concurrent.ThreadPoolExecutor$Worker.run(ThreadPoolExecutor.java:624)         at java.lang.Thread.run(Thread.java:748)    6) Thread[id=23091, name=Connection evictor, state=TIMED_WAITING, group=TGRP-ChaosMonkeyNothingIsSafeTest]         at java.lang.Thread.sleep(Native Method)         at org.apache.http.impl.client.IdleConnectionEvictor$1.run(IdleConnectionEvictor.java:66)         at java.lang.Thread.run(Thread.java:748)    7) Thread[id=23250, name=zkCallback-4312-thread-2, state=TIMED_WAITING, group=TGRP-ChaosMonkeyNothingIsSafeTest]         at sun.misc.Unsafe.park(Native Method)         at java.util.concurrent.locks.LockSupport.parkNanos(LockSupport.java:215)         at java.util.concurrent.SynchronousQueue$TransferStack.awaitFulfill(SynchronousQueue.java:460)         at java.util.concurrent.SynchronousQueue$TransferStack.transfer(SynchronousQueue.java:362)         at java.util.concurrent.SynchronousQueue.poll(SynchronousQueue.java:941)         at java.util.concurrent.ThreadPoolExecutor.getTask(ThreadPoolExecutor.java:1073)         at java.util.concurrent.ThreadPoolExecutor.runWorker(ThreadPoolExecutor.java:1134)         at java.util.concurrent.ThreadPoolExecutor$Worker.run(ThreadPoolExecutor.java:624)         at java.lang.Thread.run(Thread.java:748)    8) Thread[id=23094, name=zkCallback-4312-thread-1, state=TIMED_WAITING, group=TGRP-ChaosMonkeyNothingIsSafeTest]         at sun.misc.Unsafe.park(Native Method)         at java.util.concurrent.locks.LockSupport.parkNanos(LockSupport.java:215)         at java.util.concurrent.SynchronousQueue$TransferStack.awaitFulfill(SynchronousQueue.java:460)         at java.util.concurrent.SynchronousQueue$TransferStack.transfer(SynchronousQueue.java:362)         at java.util.concurrent.SynchronousQueue.poll(SynchronousQueue.java:941)         at java.util.concurrent.ThreadPoolExecutor.getTask(ThreadPoolExecutor.java:1073)         at java.util.concurrent.ThreadPoolExecutor.runWorker(ThreadPoolExecutor.java:1134)         at java.util.concurrent.ThreadPoolExecutor$Worker.run(ThreadPoolExecutor.java:624)         at java.lang.Thread.run(Thread.java:748)    9) Thread[id=23092, name=TEST-ChaosMonkeyNothingIsSafeTest.test-seed#[3D76EB8A24EEF9E2]-SendThread(127.0.0.1:54581), state=TIMED_WAITING, group=TGRP-ChaosMonkeyNothingIsSafeTest]         at java.lang.Thread.sleep(Native Method)         at org.apache.zookeeper.ClientCnxn$SendThread.run(ClientCnxn.java:1051)

Stack Trace:
com.carrotsearch.randomizedtesting.ThreadLeakError: 9 threads leaked from SUITE scope at org.apache.solr.cloud.ChaosMonkeyNothingIsSafeTest:
   1) Thread[id=23253, name=zkCallback-4312-thread-5, state=TIMED_WAITING, group=TGRP-ChaosMonkeyNothingIsSafeTest]
        at sun.misc.Unsafe.park(Native Method)
        at java.util.concurrent.locks.LockSupport.parkNanos(LockSupport.java:215)
        at java.util.concurrent.SynchronousQueue$TransferStack.awaitFulfill(SynchronousQueue.java:460)
        at java.util.concurrent.SynchronousQueue$TransferStack.transfer(SynchronousQueue.java:362)
        at java.util.concurrent.SynchronousQueue.poll(SynchronousQueue.java:941)
        at java.util.concurrent.ThreadPoolExecutor.getTask(ThreadPoolExecutor.java:1073)
        at java.util.concurrent.ThreadPoolExecutor.runWorker(ThreadPoolExecutor.java:1134)
        at java.util.concurrent.ThreadPoolExecutor$Worker.run(ThreadPoolExecutor.java:624)
        at java.lang.Thread.run(Thread.java:748)
   2) Thread[id=23254, name=zkCallback-4312-thread-6, state=TIMED_WAITING, group=TGRP-ChaosMonkeyNothingIsSafeTest]
        at sun.misc.Unsafe.park(Native Method)
        at java.util.concurrent.locks.LockSupport.parkNanos(LockSupport.java:215)
        at java.util.concurrent.SynchronousQueue$TransferStack.awaitFulfill(SynchronousQueue.java:460)
        at java.util.concurrent.SynchronousQueue$TransferStack.transfer(SynchronousQueue.java:362)
        at java.util.concurrent.SynchronousQueue.poll(SynchronousQueue.java:941)
        at java.util.concurrent.ThreadPoolExecutor.getTask(ThreadPoolExecutor.java:1073)
        at java.util.concurrent.ThreadPoolExecutor.runWorker(ThreadPoolExecutor.java:1134)
        at java.util.concurrent.ThreadPoolExecutor$Worker.run(ThreadPoolExecutor.java:624)
        at java.lang.Thread.run(Thread.java:748)
   3) Thread[id=23093, name=TEST-ChaosMonkeyNothingIsSafeTest.test-seed#[3D76EB8A24EEF9E2]-EventThread, state=WAITING, group=TGRP-ChaosMonkeyNothingIsSafeTest]
        at sun.misc.Unsafe.park(Native Method)
        at java.util.concurrent.locks.LockSupport.park(LockSupport.java:175)
        at java.util.concurrent.locks.AbstractQueuedSynchronizer$ConditionObject.await(AbstractQueuedSynchronizer.java:2039)
        at java.util.concurrent.LinkedBlockingQueue.take(LinkedBlockingQueue.java:442)
        at org.apache.zookeeper.ClientCnxn$EventThread.run(ClientCnxn.java:501)
   4) Thread[id=23252, name=zkCallback-4312-thread-4, state=TIMED_WAITING, group=TGRP-ChaosMonkeyNothingIsSafeTest]
        at sun.misc.Unsafe.park(Native Method)
        at java.util.concurrent.locks.LockSupport.parkNanos(LockSupport.java:215)
        at java.util.concurrent.SynchronousQueue$TransferStack.awaitFulfill(SynchronousQueue.java:460)
        at java.util.concurrent.SynchronousQueue$TransferStack.transfer(SynchronousQueue.java:362)
        at java.util.concurrent.SynchronousQueue.poll(SynchronousQueue.java:941)
        at java.util.concurrent.ThreadPoolExecutor.getTask(ThreadPoolExecutor.java:1073)
        at java.util.concurrent.ThreadPoolExecutor.runWorker(ThreadPoolExecutor.java:1134)
        at java.util.concurrent.ThreadPoolExecutor$Worker.run(ThreadPoolExecutor.java:624)
        at java.lang.Thread.run(Thread.java:748)
   5) Thread[id=23251, name=zkCallback-4312-thread-3, state=TIMED_WAITING, group=TGRP-ChaosMonkeyNothingIsSafeTest]
        at sun.misc.Unsafe.park(Native Method)
        at java.util.concurrent.locks.LockSupport.parkNanos(LockSupport.java:215)
        at java.util.concurrent.SynchronousQueue$TransferStack.awaitFulfill(SynchronousQueue.java:460)
        at java.util.concurrent.SynchronousQueue$TransferStack.transfer(SynchronousQueue.java:362)
        at java.util.concurrent.SynchronousQueue.poll(SynchronousQueue.java:941)
        at java.util.concurrent.ThreadPoolExecutor.getTask(ThreadPoolExecutor.java:1073)
        at java.util.concurrent.ThreadPoolExecutor.runWorker(ThreadPoolExecutor.java:1134)
        at java.util.concurrent.ThreadPoolExecutor$Worker.run(ThreadPoolExecutor.java:624)
        at java.lang.Thread.run(Thread.java:748)
   6) Thread[id=23091, name=Connection evictor, state=TIMED_WAITING, group=TGRP-ChaosMonkeyNothingIsSafeTest]
        at java.lang.Thread.sleep(Native Method)
        at org.apache.http.impl.client.IdleConnectionEvictor$1.run(IdleConnectionEvictor.java:66)
        at java.lang.Thread.run(Thread.java:748)
   7) Thread[id=23250, name=zkCallback-4312-thread-2, state=TIMED_WAITING, group=TGRP-ChaosMonkeyNothingIsSafeTest]
        at sun.misc.Unsafe.park(Native Method)
        at java.util.concurrent.locks.LockSupport.parkNanos(LockSupport.java:215)
        at java.util.concurrent.SynchronousQueue$TransferStack.awaitFulfill(SynchronousQueue.java:460)
        at java.util.concurrent.SynchronousQueue$TransferStack.transfer(SynchronousQueue.java:362)
        at java.util.concurrent.SynchronousQueue.poll(SynchronousQueue.java:941)
        at java.util.concurrent.ThreadPoolExecutor.getTask(ThreadPoolExecutor.java:1073)
        at java.util.concurrent.ThreadPoolExecutor.runWorker(ThreadPoolExecutor.java:1134)
        at java.util.concurrent.ThreadPoolExecutor$Worker.run(ThreadPoolExecutor.java:624)
        at java.lang.Thread.run(Thread.java:748)
   8) Thread[id=23094, name=zkCallback-4312-thread-1, state=TIMED_WAITING, group=TGRP-ChaosMonkeyNothingIsSafeTest]
        at sun.misc.Unsafe.park(Native Method)
        at java.util.concurrent.locks.LockSupport.parkNanos(LockSupport.java:215)
        at java.util.concurrent.SynchronousQueue$TransferStack.awaitFulfill(SynchronousQueue.java:460)
        at java.util.concurrent.SynchronousQueue$TransferStack.transfer(SynchronousQueue.java:362)
        at java.util.concurrent.SynchronousQueue.poll(SynchronousQueue.java:941)
        at java.util.concurrent.ThreadPoolExecutor.getTask(ThreadPoolExecutor.java:1073)
        at java.util.concurrent.ThreadPoolExecutor.runWorker(ThreadPoolExecutor.java:1134)
        at java.util.concurrent.ThreadPoolExecutor$Worker.run(ThreadPoolExecutor.java:624)
        at java.lang.Thread.run(Thread.java:748)
   9) Thread[id=23092, name=TEST-ChaosMonkeyNothingIsSafeTest.test-seed#[3D76EB8A24EEF9E2]-SendThread(127.0.0.1:54581), state=TIMED_WAITING, group=TGRP-ChaosMonkeyNothingIsSafeTest]
        at java.lang.Thread.sleep(Native Method)
        at org.apache.zookeeper.ClientCnxn$SendThread.run(ClientCnxn.java:1051)
        at __randomizedtesting.SeedInfo.seed([3D76EB8A24EEF9E2]:0)


FAILED:  junit.framework.TestSuite.org.apache.solr.cloud.ChaosMonkeyNothingIsSafeTest

Error Message:
There are still zombie threads that couldn't be terminated:    1) Thread[id=23253, name=zkCallback-4312-thread-5, state=TIMED_WAITING, group=TGRP-ChaosMonkeyNothingIsSafeTest]         at sun.misc.Unsafe.park(Native Method)         at java.util.concurrent.locks.LockSupport.parkNanos(LockSupport.java:215)         at java.util.concurrent.SynchronousQueue$TransferStack.awaitFulfill(SynchronousQueue.java:460)         at java.util.concurrent.SynchronousQueue$TransferStack.transfer(SynchronousQueue.java:362)         at java.util.concurrent.SynchronousQueue.poll(SynchronousQueue.java:941)         at java.util.concurrent.ThreadPoolExecutor.getTask(ThreadPoolExecutor.java:1073)         at java.util.concurrent.ThreadPoolExecutor.runWorker(ThreadPoolExecutor.java:1134)         at java.util.concurrent.ThreadPoolExecutor$Worker.run(ThreadPoolExecutor.java:624)         at java.lang.Thread.run(Thread.java:748)    2) Thread[id=23254, name=zkCallback-4312-thread-6, state=TIMED_WAITING, group=TGRP-ChaosMonkeyNothingIsSafeTest]         at sun.misc.Unsafe.park(Native Method)         at java.util.concurrent.locks.LockSupport.parkNanos(LockSupport.java:215)         at java.util.concurrent.SynchronousQueue$TransferStack.awaitFulfill(SynchronousQueue.java:460)         at java.util.concurrent.SynchronousQueue$TransferStack.transfer(SynchronousQueue.java:362)         at java.util.concurrent.SynchronousQueue.poll(SynchronousQueue.java:941)         at java.util.concurrent.ThreadPoolExecutor.getTask(ThreadPoolExecutor.java:1073)         at java.util.concurrent.ThreadPoolExecutor.runWorker(ThreadPoolExecutor.java:1134)         at java.util.concurrent.ThreadPoolExecutor$Worker.run(ThreadPoolExecutor.java:624)         at java.lang.Thread.run(Thread.java:748)    3) Thread[id=23252, name=zkCallback-4312-thread-4, state=TIMED_WAITING, group=TGRP-ChaosMonkeyNothingIsSafeTest]         at sun.misc.Unsafe.park(Native Method)         at java.util.concurrent.locks.LockSupport.parkNanos(LockSupport.java:215)         at java.util.concurrent.SynchronousQueue$TransferStack.awaitFulfill(SynchronousQueue.java:460)         at java.util.concurrent.SynchronousQueue$TransferStack.transfer(SynchronousQueue.java:362)         at java.util.concurrent.SynchronousQueue.poll(SynchronousQueue.java:941)         at java.util.concurrent.ThreadPoolExecutor.getTask(ThreadPoolExecutor.java:1073)         at java.util.concurrent.ThreadPoolExecutor.runWorker(ThreadPoolExecutor.java:1134)         at java.util.concurrent.ThreadPoolExecutor$Worker.run(ThreadPoolExecutor.java:624)         at java.lang.Thread.run(Thread.java:748)    4) Thread[id=23251, name=zkCallback-4312-thread-3, state=TIMED_WAITING, group=TGRP-ChaosMonkeyNothingIsSafeTest]         at sun.misc.Unsafe.park(Native Method)         at java.util.concurrent.locks.LockSupport.parkNanos(LockSupport.java:215)         at java.util.concurrent.SynchronousQueue$TransferStack.awaitFulfill(SynchronousQueue.java:460)         at java.util.concurrent.SynchronousQueue$TransferStack.transfer(SynchronousQueue.java:362)         at java.util.concurrent.SynchronousQueue.poll(SynchronousQueue.java:941)         at java.util.concurrent.ThreadPoolExecutor.getTask(ThreadPoolExecutor.java:1073)         at java.util.concurrent.ThreadPoolExecutor.runWorker(ThreadPoolExecutor.java:1134)         at java.util.concurrent.ThreadPoolExecutor$Worker.run(ThreadPoolExecutor.java:624)         at java.lang.Thread.run(Thread.java:748)    5) Thread[id=23250, name=zkCallback-4312-thread-2, state=TIMED_WAITING, group=TGRP-ChaosMonkeyNothingIsSafeTest]         at sun.misc.Unsafe.park(Native Method)         at java.util.concurrent.locks.LockSupport.parkNanos(LockSupport.java:215)         at java.util.concurrent.SynchronousQueue$TransferStack.awaitFulfill(SynchronousQueue.java:460)         at java.util.concurrent.SynchronousQueue$TransferStack.transfer(SynchronousQueue.java:362)         at java.util.concurrent.SynchronousQueue.poll(SynchronousQueue.java:941)         at java.util.concurrent.ThreadPoolExecutor.getTask(ThreadPoolExecutor.java:1073)         at java.util.concurrent.ThreadPoolExecutor.runWorker(ThreadPoolExecutor.java:1134)         at java.util.concurrent.ThreadPoolExecutor$Worker.run(ThreadPoolExecutor.java:624)         at java.lang.Thread.run(Thread.java:748)    6) Thread[id=23094, name=zkCallback-4312-thread-1, state=TIMED_WAITING, group=TGRP-ChaosMonkeyNothingIsSafeTest]         at sun.misc.Unsafe.park(Native Method)         at java.util.concurrent.locks.LockSupport.parkNanos(LockSupport.java:215)         at java.util.concurrent.SynchronousQueue$TransferStack.awaitFulfill(SynchronousQueue.java:460)         at java.util.concurrent.SynchronousQueue$TransferStack.transfer(SynchronousQueue.java:362)         at java.util.concurrent.SynchronousQueue.poll(SynchronousQueue.java:941)         at java.util.concurrent.ThreadPoolExecutor.getTask(ThreadPoolExecutor.java:1073)         at java.util.concurrent.ThreadPoolExecutor.runWorker(ThreadPoolExecutor.java:1134)         at java.util.concurrent.ThreadPoolExecutor$Worker.run(ThreadPoolExecutor.java:624)         at java.lang.Thread.run(Thread.java:748)    7) Thread[id=23092, name=TEST-ChaosMonkeyNothingIsSafeTest.test-seed#[3D76EB8A24EEF9E2]-SendThread(127.0.0.1:54581), state=TIMED_WAITING, group=TGRP-ChaosMonkeyNothingIsSafeTest]         at java.lang.Thread.sleep(Native Method)         at org.apache.zookeeper.ClientCnxn$SendThread.run(ClientCnxn.java:1051)

Stack Trace:
com.carrotsearch.randomizedtesting.ThreadLeakError: There are still zombie threads that couldn't be terminated:
   1) Thread[id=23253, name=zkCallback-4312-thread-5, state=TIMED_WAITING, group=TGRP-ChaosMonkeyNothingIsSafeTest]
        at sun.misc.Unsafe.park(Native Method)
        at java.util.concurrent.locks.LockSupport.parkNanos(LockSupport.java:215)
        at java.util.concurrent.SynchronousQueue$TransferStack.awaitFulfill(SynchronousQueue.java:460)
        at java.util.concurrent.SynchronousQueue$TransferStack.transfer(SynchronousQueue.java:362)
        at java.util.concurrent.SynchronousQueue.poll(SynchronousQueue.java:941)
        at java.util.concurrent.ThreadPoolExecutor.getTask(ThreadPoolExecutor.java:1073)
        at java.util.concurrent.ThreadPoolExecutor.runWorker(ThreadPoolExecutor.java:1134)
        at java.util.concurrent.ThreadPoolExecutor$Worker.run(ThreadPoolExecutor.java:624)
        at java.lang.Thread.run(Thread.java:748)
   2) Thread[id=23254, name=zkCallback-4312-thread-6, state=TIMED_WAITING, group=TGRP-ChaosMonkeyNothingIsSafeTest]
        at sun.misc.Unsafe.park(Native Method)
        at java.util.concurrent.locks.LockSupport.parkNanos(LockSupport.java:215)
        at java.util.concurrent.SynchronousQueue$TransferStack.awaitFulfill(SynchronousQueue.java:460)
        at java.util.concurrent.SynchronousQueue$TransferStack.transfer(SynchronousQueue.java:362)
        at java.util.concurrent.SynchronousQueue.poll(SynchronousQueue.java:941)
        at java.util.concurrent.ThreadPoolExecutor.getTask(ThreadPoolExecutor.java:1073)
        at java.util.concurrent.ThreadPoolExecutor.runWorker(ThreadPoolExecutor.java:1134)
        at java.util.concurrent.ThreadPoolExecutor$Worker.run(ThreadPoolExecutor.java:624)
        at java.lang.Thread.run(Thread.java:748)
   3) Thread[id=23252, name=zkCallback-4312-thread-4, state=TIMED_WAITING, group=TGRP-ChaosMonkeyNothingIsSafeTest]
        at sun.misc.Unsafe.park(Native Method)
        at java.util.concurrent.locks.LockSupport.parkNanos(LockSupport.java:215)
        at java.util.concurrent.SynchronousQueue$TransferStack.awaitFulfill(SynchronousQueue.java:460)
        at java.util.concurrent.SynchronousQueue$TransferStack.transfer(SynchronousQueue.java:362)
        at java.util.concurrent.SynchronousQueue.poll(SynchronousQueue.java:941)
        at java.util.concurrent.ThreadPoolExecutor.getTask(ThreadPoolExecutor.java:1073)
        at java.util.concurrent.ThreadPoolExecutor.runWorker(ThreadPoolExecutor.java:1134)
        at java.util.concurrent.ThreadPoolExecutor$Worker.run(ThreadPoolExecutor.java:624)
        at java.lang.Thread.run(Thread.java:748)
   4) Thread[id=23251, name=zkCallback-4312-thread-3, state=TIMED_WAITING, group=TGRP-ChaosMonkeyNothingIsSafeTest]
        at sun.misc.Unsafe.park(Native Method)
        at java.util.concurrent.locks.LockSupport.parkNanos(LockSupport.java:215)
        at java.util.concurrent.SynchronousQueue$TransferStack.awaitFulfill(SynchronousQueue.java:460)
        at java.util.concurrent.SynchronousQueue$TransferStack.transfer(SynchronousQueue.java:362)
        at java.util.concurrent.SynchronousQueue.poll(SynchronousQueue.java:941)
        at java.util.concurrent.ThreadPoolExecutor.getTask(ThreadPoolExecutor.java:1073)
        at java.util.concurrent.ThreadPoolExecutor.runWorker(ThreadPoolExecutor.java:1134)
        at java.util.concurrent.ThreadPoolExecutor$Worker.run(ThreadPoolExecutor.java:624)
        at java.lang.Thread.run(Thread.java:748)
   5) Thread[id=23250, name=zkCallback-4312-thread-2, state=TIMED_WAITING, group=TGRP-ChaosMonkeyNothingIsSafeTest]
        at sun.misc.Unsafe.park(Native Method)
        at java.util.concurrent.locks.LockSupport.parkNanos(LockSupport.java:215)
        at java.util.concurrent.SynchronousQueue$TransferStack.awaitFulfill(SynchronousQueue.java:460)
        at java.util.concurrent.SynchronousQueue$TransferStack.transfer(SynchronousQueue.java:362)
        at java.util.concurrent.SynchronousQueue.poll(SynchronousQueue.java:941)
        at java.util.concurrent.ThreadPoolExecutor.getTask(ThreadPoolExecutor.java:1073)
        at java.util.concurrent.ThreadPoolExecutor.runWorker(ThreadPoolExecutor.java:1134)
        at java.util.concurrent.ThreadPoolExecutor$Worker.run(ThreadPoolExecutor.java:624)
        at java.lang.Thread.run(Thread.java:748)
   6) Thread[id=23094, name=zkCallback-4312-thread-1, state=TIMED_WAITING, group=TGRP-ChaosMonkeyNothingIsSafeTest]
        at sun.misc.Unsafe.park(Native Method)
        at java.util.concurrent.locks.LockSupport.parkNanos(LockSupport.java:215)
        at java.util.concurrent.SynchronousQueue$TransferStack.awaitFulfill(SynchronousQueue.java:460)
        at java.util.concurrent.SynchronousQueue$TransferStack.transfer(SynchronousQueue.java:362)
        at java.util.concurrent.SynchronousQueue.poll(SynchronousQueue.java:941)
        at java.util.concurrent.ThreadPoolExecutor.getTask(ThreadPoolExecutor.java:1073)
        at java.util.concurrent.ThreadPoolExecutor.runWorker(ThreadPoolExecutor.java:1134)
        at java.util.concurrent.ThreadPoolExecutor$Worker.run(ThreadPoolExecutor.java:624)
        at java.lang.Thread.run(Thread.java:748)
   7) Thread[id=23092, name=TEST-ChaosMonkeyNothingIsSafeTest.test-seed#[3D76EB8A24EEF9E2]-SendThread(127.0.0.1:54581), state=TIMED_WAITING, group=TGRP-ChaosMonkeyNothingIsSafeTest]
        at java.lang.Thread.sleep(Native Method)
        at org.apache.zookeeper.ClientCnxn$SendThread.run(ClientCnxn.java:1051)
        at __randomizedtesting.SeedInfo.seed([3D76EB8A24EEF9E2]:0)




Build Log:
[...truncated 10974 lines...]
   [junit4] Suite: org.apache.solr.cloud.ActionThrottleTest
   [junit4]   2> Creating dataDir: C:\Users\jenkins\workspace\Lucene-Solr-7.0-Windows\solr\build\solr-core\test\J1\temp\solr.cloud.ActionThrottleTest_3D76EB8A24EEF9E2-001\init-core-data-001
   [junit4]   2> 119048 WARN  (SUITE-ActionThrottleTest-seed#[3D76EB8A24EEF9E2]-worker) [    ] o.a.s.SolrTestCaseJ4 startTrackingSearchers: numOpens=25 numCloses=25
   [junit4]   2> 119048 INFO  (SUITE-ActionThrottleTest-seed#[3D76EB8A24EEF9E2]-worker) [    ] o.a.s.SolrTestCaseJ4 Using PointFields (NUMERIC_POINTS_SYSPROP=true) w/NUMERIC_DOCVALUES_SYSPROP=true
   [junit4]   2> 119048 INFO  (SUITE-ActionThrottleTest-seed#[3D76EB8A24EEF9E2]-worker) [    ] o.a.s.SolrTestCaseJ4 Randomized ssl (false) and clientAuth (false) via: @org.apache.solr.util.RandomizeSSL(reason=, value=NaN, ssl=NaN, clientAuth=NaN)
   [junit4]   2> 119048 INFO  (TEST-ActionThrottleTest.testAZeroNanoTimeReturnInWait-seed#[3D76EB8A24EEF9E2]) [    ] o.a.s.SolrTestCaseJ4 ###Starting testAZeroNanoTimeReturnInWait
   [junit4]   2> 119048 INFO  (TEST-ActionThrottleTest.testAZeroNanoTimeReturnInWait-seed#[3D76EB8A24EEF9E2]) [    ] o.a.s.c.ActionThrottle The last test attempt started 0ms ago.
   [junit4]   2> 119048 INFO  (TEST-ActionThrottleTest.testAZeroNanoTimeReturnInWait-seed#[3D76EB8A24EEF9E2]) [    ] o.a.s.c.ActionThrottle Throttling test attempts - waiting for 1000ms
   [junit4]   2> 120049 INFO  (TEST-ActionThrottleTest.testAZeroNanoTimeReturnInWait-seed#[3D76EB8A24EEF9E2]) [    ] o.a.s.SolrTestCaseJ4 ###Ending testAZeroNanoTimeReturnInWait
   [junit4]   2> NOTE: reproduce with: ant test  -Dtestcase=ActionThrottleTest -Dtests.method=testAZeroNanoTimeReturnInWait -Dtests.seed=3D76EB8A24EEF9E2 -Dtests.slow=true -Dtests.locale=ro-RO -Dtests.timezone=Asia/Ulaanbaatar -Dtests.asserts=true -Dtests.file.encoding=ISO-8859-1
   [junit4] FAILURE 1.00s J1 | ActionThrottleTest.testAZeroNanoTimeReturnInWait <<<
   [junit4]    > Throwable #1: java.lang.AssertionError: 993ms
   [junit4]    > at __randomizedtesting.SeedInfo.seed([3D76EB8A24EEF9E2:FE1D10B890AF0401]:0)
   [junit4]    > at org.apache.solr.cloud.ActionThrottleTest.testAZeroNanoTimeReturnInWait(ActionThrottleTest.java:89)
   [junit4]    > at java.lang.Thread.run(Thread.java:748)
   [junit4]   2> 120049 INFO  (TEST-ActionThrottleTest.testBasics-seed#[3D76EB8A24EEF9E2]) [    ] o.a.s.SolrTestCaseJ4 ###Starting testBasics
   [junit4]   2> 120049 INFO  (TEST-ActionThrottleTest.testBasics-seed#[3D76EB8A24EEF9E2]) [    ] o.a.s.c.ActionThrottle The last test attempt started 0ms ago.
   [junit4]   2> 120049 INFO  (TEST-ActionThrottleTest.testBasics-seed#[3D76EB8A24EEF9E2]) [    ] o.a.s.c.ActionThrottle Throttling test attempts - waiting for 1000ms
   [junit4]   2> 121062 INFO  (TEST-ActionThrottleTest.testBasics-seed#[3D76EB8A24EEF9E2]) [    ] o.a.s.c.ActionThrottle The last test attempt started 0ms ago.
   [junit4]   2> 121062 INFO  (TEST-ActionThrottleTest.testBasics-seed#[3D76EB8A24EEF9E2]) [    ] o.a.s.c.ActionThrottle Throttling test attempts - waiting for 1000ms
   [junit4]   2> 122469 INFO  (TEST-ActionThrottleTest.testBasics-seed#[3D76EB8A24EEF9E2]) [    ] o.a.s.SolrTestCaseJ4 ###Ending testBasics
   [junit4]   2> NOTE: leaving temporary files on disk at: C:\Users\jenkins\workspace\Lucene-Solr-7.0-Windows\solr\build\solr-core\test\J1\temp\solr.cloud.ActionThrottleTest_3D76EB8A24EEF9E2-001
   [junit4]   2> NOTE: test params are: codec=CheapBastard, sim=RandomSimilarity(queryNorm=true): {}, locale=ro-RO, timezone=Asia/Ulaanbaatar
   [junit4]   2> NOTE: Windows 10 10.0 x86/Oracle Corporation 1.8.0_144 (32-bit)/cpus=3,threads=1,free=169157280,total=252444672
   [junit4]   2> NOTE: All tests run in this JVM: [AssignTest, AutoCommitTest, CoreAdminCreateDiscoverTest, SampleTest, TestCollectionAPIs, TestSolrJ, TestRTGBase, TestPerFieldSimilarityWithDefaultOverride, TestLMJelinekMercerSimilarityFactory, TestLegacyTerms, AddSchemaFieldsUpdateProcessorFactoryTest, TestLRUCache, TestManagedSchema, CustomCollectionTest, MergeStrategyTest, PolyFieldTest, TestClassNameShortening, TestDFISimilarityFactory, ZkSolrClientTest, TestPerFieldSimilarity, TestCloudNestedDocsSort, IgnoreCommitOptimizeUpdateProcessorFactoryTest, TestJsonFacetRefinement, ActionThrottleTest]
   [junit4] Completed [51/729 (1!)] on J1 in 3.44s, 2 tests, 1 failure <<< FAILURES!

[...truncated 1491 lines...]
   [junit4] Suite: org.apache.solr.cloud.ChaosMonkeyNothingIsSafeTest
   [junit4]   2> Creating dataDir: C:\Users\jenkins\workspace\Lucene-Solr-7.0-Windows\solr\build\solr-core\test\J0\temp\solr.cloud.ChaosMonkeyNothingIsSafeTest_3D76EB8A24EEF9E2-001\init-core-data-001
   [junit4]   2> 2196348 WARN  (SUITE-ChaosMonkeyNothingIsSafeTest-seed#[3D76EB8A24EEF9E2]-worker) [    ] o.a.s.SolrTestCaseJ4 startTrackingSearchers: numOpens=1 numCloses=1
   [junit4]   2> 2196348 INFO  (SUITE-ChaosMonkeyNothingIsSafeTest-seed#[3D76EB8A24EEF9E2]-worker) [    ] o.a.s.SolrTestCaseJ4 Using TrieFields (NUMERIC_POINTS_SYSPROP=false) w/NUMERIC_DOCVALUES_SYSPROP=true
   [junit4]   2> 2196352 INFO  (SUITE-ChaosMonkeyNothingIsSafeTest-seed#[3D76EB8A24EEF9E2]-worker) [    ] o.a.s.SolrTestCaseJ4 Randomized ssl (false) and clientAuth (false) via: @org.apache.solr.SolrTestCaseJ4$SuppressSSL(bugUrl=https://issues.apache.org/jira/browse/SOLR-5776)
   [junit4]   2> 2196353 INFO  (SUITE-ChaosMonkeyNothingIsSafeTest-seed#[3D76EB8A24EEF9E2]-worker) [    ] o.a.s.BaseDistributedSearchTestCase Setting hostContext system property: /joq/fh
   [junit4]   2> 2196358 INFO  (TEST-ChaosMonkeyNothingIsSafeTest.test-seed#[3D76EB8A24EEF9E2]) [    ] o.a.s.c.ZkTestServer STARTING ZK TEST SERVER
   [junit4]   2> 2196359 INFO  (Thread-4544) [    ] o.a.s.c.ZkTestServer client port:0.0.0.0/0.0.0.0:0
   [junit4]   2> 2196359 INFO  (Thread-4544) [    ] o.a.s.c.ZkTestServer Starting server
   [junit4]   2> 2196363 ERROR (Thread-4544) [    ] o.a.z.s.ZooKeeperServer ZKShutdownHandler is not registered, so ZooKeeper server won't take any action on ERROR or SHUTDOWN server state changes
   [junit4]   2> 2196460 INFO  (TEST-ChaosMonkeyNothingIsSafeTest.test-seed#[3D76EB8A24EEF9E2]) [    ] o.a.s.c.ZkTestServer start zk server on port:54581
   [junit4]   2> 2196479 WARN  (NIOServerCxn.Factory:0.0.0.0/0.0.0.0:0) [    ] o.a.z.s.NIOServerCnxn caught end of stream exception
   [junit4]   2> EndOfStreamException: Unable to read additional data from client sessionid 0x15e7e708eea0000, likely client has closed socket
   [junit4]   2> at org.apache.zookeeper.server.NIOServerCnxn.doIO(NIOServerCnxn.java:239)
   [junit4]   2> at org.apache.zookeeper.server.NIOServerCnxnFactory.run(NIOServerCnxnFactory.java:203)
   [junit4]   2> at java.lang.Thread.run(Thread.java:748)
   [junit4]   2> 2196494 INFO  (TEST-ChaosMonkeyNothingIsSafeTest.test-seed#[3D76EB8A24EEF9E2]) [    ] o.a.s.c.AbstractZkTestCase put C:\Users\jenkins\workspace\Lucene-Solr-7.0-Windows\solr\core\src\test-files\solr\collection1\conf\solrconfig-tlog.xml to /configs/conf1/solrconfig.xml
   [junit4]   2> 2196497 INFO  (TEST-ChaosMonkeyNothingIsSafeTest.test-seed#[3D76EB8A24EEF9E2]) [    ] o.a.s.c.AbstractZkTestCase put C:\Users\jenkins\workspace\Lucene-Solr-7.0-Windows\solr\core\src\test-files\solr\collection1\conf\schema15.xml to /configs/conf1/schema.xml
   [junit4]   2> 2196500 INFO  (TEST-ChaosMonkeyNothingIsSafeTest.test-seed#[3D76EB8A24EEF9E2]) [    ] o.a.s.c.AbstractZkTestCase put C:\Users\jenkins\workspace\Lucene-Solr-7.0-Windows\solr\core\src\test-files\solr\collection1\conf\solrconfig.snippet.randomindexconfig.xml to /configs/conf1/solrconfig.snippet.randomindexconfig.xml
   [junit4]   2> 2196503 INFO  (TEST-ChaosMonkeyNothingIsSafeTest.test-seed#[3D76EB8A24EEF9E2]) [    ] o.a.s.c.AbstractZkTestCase put C:\Users\jenkins\workspace\Lucene-Solr-7.0-Windows\solr\core\src\test-files\solr\collection1\conf\stopwords.txt to /configs/conf1/stopwords.txt
   [junit4]   2> 2196505 INFO  (TEST-ChaosMonkeyNothingIsSafeTest.test-seed#[3D76EB8A24EEF9E2]) [    ] o.a.s.c.AbstractZkTestCase put C:\Users\jenkins\workspace\Lucene-Solr-7.0-Windows\solr\core\src\test-files\solr\collection1\conf\protwords.txt to /configs/conf1/protwords.txt
   [junit4]   2> 2196507 INFO  (TEST-ChaosMonkeyNothingIsSafeTest.test-seed#[3D76EB8A24EEF9E2]) [    ] o.a.s.c.AbstractZkTestCase put C:\Users\jenkins\workspace\Lucene-Solr-7.0-Windows\solr\core\src\test-files\solr\collection1\conf\currency.xml to /configs/conf1/currency.xml
   [junit4]   2> 2196510 INFO  (TEST-ChaosMonkeyNothingIsSafeTest.test-seed#[3D76EB8A24EEF9E2]) [    ] o.a.s.c.AbstractZkTestCase put C:\Users\jenkins\workspace\Lucene-Solr-7.0-Windows\solr\core\src\test-files\solr\collection1\conf\enumsConfig.xml to /configs/conf1/enumsConfig.xml
   [junit4]   2> 2196512 INFO  (TEST-ChaosMonkeyNothingIsSafeTest.test-seed#[3D76EB8A24EEF9E2]) [    ] o.a.s.c.AbstractZkTestCase put C:\Users\jenkins\workspace\Lucene-Solr-7.0-Windows\solr\core\src\test-files\solr\collection1\conf\open-exchange-rates.json to /configs/conf1/open-exchange-rates.json
   [junit4]   2> 2196516 INFO  (TEST-ChaosMonkeyNothingIsSafeTest.test-seed#[3D76EB8A24EEF9E2]) [    ] o.a.s.c.AbstractZkTestCase put C:\Users\jenkins\workspace\Lucene-Solr-7.0-Windows\solr\core\src\test-files\solr\collection1\conf\mapping-ISOLatin1Accent.txt to /configs/conf1/mapping-ISOLatin1Accent.txt
   [junit4]   2> 2196518 INFO  (TEST-ChaosMonkeyNothingIsSafeTest.test-seed#[3D76EB8A24EEF9E2]) [    ] o.a.s.c.AbstractZkTestCase put C:\Users\jenkins\workspace\Lucene-Solr-7.0-Windows\solr\core\src\test-files\solr\collection1\conf\old_synonyms.txt to /configs/conf1/old_synonyms.txt
   [junit4]   2> 2196522 INFO  (TEST-ChaosMonkeyNothingIsSafeTest.test-seed#[3D76EB8A24EEF9E2]) [    ] o.a.s.c.AbstractZkTestCase put C:\Users\jenkins\workspace\Lucene-Solr-7.0-Windows\solr\core\src\test-files\solr\collection1\conf\synonyms.txt to /configs/conf1/synonyms.txt
   [junit4]   2> 2196525 INFO  (TEST-ChaosMonkeyNothingIsSafeTest.test-seed#[3D76EB8A24EEF9E2]) [    ] o.a.s.c.AbstractFullDistribZkTestBase Will use TLOG replicas unless explicitly asked otherwise
   [junit4]   2> 2196958 INFO  (TEST-ChaosMonkeyNothingIsSafeTest.test-seed#[3D76EB8A24EEF9E2]) [    ] o.e.j.s.Server jetty-9.3.14.v20161028
   [junit4]   2> 2196959 INFO  (TEST-ChaosMonkeyNothingIsSafeTest.test-seed#[3D76EB8A24EEF9E2]) [    ] o.e.j.s.h.ContextHandler Started o.e.j.s.ServletContextHandler@e93326{/joq/fh,null,AVAILABLE}
   [junit4]   2> 2196966 INFO  (TEST-ChaosMonkeyNothingIsSafeTest.test-seed#[3D76EB8A24EEF9E2]) [    ] o.e.j.s.AbstractConnector Started ServerConnector@bcf5cf{HTTP/1.1,[http/1.1]}{127.0.0.1:54588}
   [junit4]   2> 2196966 INFO  (TEST-ChaosMonkeyNothingIsSafeTest.test-seed#[3D76EB8A24EEF9E2]) [    ] o.e.j.s.Server Started @2200001ms
   [junit4]   2> 2196966 INFO  (TEST-ChaosMonkeyNothingIsSafeTest.test-seed#[3D76EB8A24EEF9E2]) [    ] o.a.s.c.s.e.JettySolrRunner Jetty properties: {solr.data.dir=C:\Users\jenkins\workspace\Lucene-Solr-7.0-Windows\solr\build\solr-core\test\J0\temp\solr.cloud.ChaosMonkeyNothingIsSafeTest_3D76EB8A24EEF9E2-001\tempDir-001/control/data, replicaType=NRT, hostContext=/joq/fh, hostPort=54588, coreRootDirectory=C:\Users\jenkins\workspace\Lucene-Solr-7.0-Windows\solr\build\solr-core\test\J0\..\..\..\..\..\..\..\..\..\Users\jenkins\workspace\Lucene-Solr-7.0-Windows\solr\build\solr-core\test\J0\temp\solr.cloud.ChaosMonkeyNothingIsSafeTest_3D76EB8A24EEF9E2-001\control-001\cores}
   [junit4]   2> 2196966 ERROR (TEST-ChaosMonkeyNothingIsSafeTest.test-seed#[3D76EB8A24EEF9E2]) [    ] o.a.s.s.StartupLoggingUtils Missing Java Option solr.log.dir. Logging may be missing or incomplete.
   [junit4]   2> 2196967 INFO  (TEST-ChaosMonkeyNothingIsSafeTest.test-seed#[3D76EB8A24EEF9E2]) [    ] o.a.s.s.SolrDispatchFilter  ___      _       Welcome to Apache Solr? version 7.0.0
   [junit4]   2> 2196967 INFO  (TEST-ChaosMonkeyNothingIsSafeTest.test-seed#[3D76EB8A24EEF9E2]) [    ] o.a.s.s.SolrDispatchFilter / __| ___| |_ _   Starting in cloud mode on port null
   [junit4]   2> 2196967 INFO  (TEST-ChaosMonkeyNothingIsSafeTest.test-seed#[3D76EB8A24EEF9E2]) [    ] o.a.s.s.SolrDispatchFilter \__ \/ _ \ | '_|  Install dir: null, Default config dir: null
   [junit4]   2> 2196967 INFO  (TEST-ChaosMonkeyNothingIsSafeTest.test-seed#[3D76EB8A24EEF9E2]) [    ] o.a.s.s.SolrDispatchFilter |___/\___/_|_|    Start time: 2017-09-14T03:31:00.039Z
   [junit4]   2> 2196971 WARN  (NIOServerCxn.Factory:0.0.0.0/0.0.0.0:0) [    ] o.a.z.s.NIOServerCnxn caught end of stream exception
   [junit4]   2> EndOfStreamException: Unable to read additional data from client sessionid 0x15e7e708eea0002, likely client has closed socket
   [junit4]   2> at org.apache.zookeeper.server.NIOServerCnxn.doIO(NIOServerCnxn.java:239)
   [junit4]   2> at org.apache.zookeeper.server.NIOServerCnxnFactory.run(NIOServerCnxnFactory.java:203)
   [junit4]   2> at java.lang.Thread.run(Thread.java:748)
   [junit4]   2> 2196972 INFO  (TEST-ChaosMonkeyNothingIsSafeTest.test-seed#[3D76EB8A24EEF9E2]) [    ] o.a.s.s.SolrDispatchFilter Loading solr.xml from SolrHome (not found in ZooKeeper)
   [junit4]   2> 2196972 INFO  (TEST-ChaosMonkeyNothingIsSafeTest.test-seed#[3D76EB8A24EEF9E2]) [    ] o.a.s.c.SolrXmlConfig Loading container configuration from C:\Users\jenkins\workspace\Lucene-Solr-7.0-Windows\solr\build\solr-core\test\J0\temp\solr.cloud.ChaosMonkeyNothingIsSafeTest_3D76EB8A24EEF9E2-001\control-001\solr.xml
   [junit4]   2> 2196981 INFO  (TEST-ChaosMonkeyNothingIsSafeTest.test-seed#[3D76EB8A24EEF9E2]) [    ] o.a.s.c.SolrXmlConfig MBean server found: com.sun.jmx.mbeanserver.JmxMBeanServer@e4df11, but no JMX reporters were configured - adding default JMX reporter.
   [junit4]   2> 2196984 INFO  (TEST-ChaosMonkeyNothingIsSafeTest.test-seed#[3D76EB8A24EEF9E2]) [    ] o.a.s.c.ZkContainer Zookeeper client=127.0.0.1:54581/solr
   [junit4]   2> 2197127 INFO  (TEST-ChaosMonkeyNothingIsSafeTest.test-seed#[3D76EB8A24EEF9E2]) [n:127.0.0.1:54588_joq%2Ffh    ] o.a.s.c.Overseer Overseer (id=null) closing
   [junit4]   2> 2197128 INFO  (TEST-ChaosMonkeyNothingIsSafeTest.test-seed#[3D76EB8A24EEF9E2]) [n:127.0.0.1:54588_joq%2Ffh    ] o.a.s.c.OverseerElectionContext I am going to be the leader 127.0.0.1:54588_joq%2Ffh
   [junit4]   2> 2197130 INFO  (TEST-ChaosMonkeyNothingIsSafeTest.test-seed#[3D76EB8A24EEF9E2]) [n:127.0.0.1:54588_joq%2Ffh    ] o.a.s.c.Overseer Overseer (id=98655263747866628-127.0.0.1:54588_joq%2Ffh-n_0000000000) starting
   [junit4]   2> 2197139 INFO  (TEST-ChaosMonkeyNothingIsSafeTest.test-seed#[3D76EB8A24EEF9E2]) [n:127.0.0.1:54588_joq%2Ffh    ] o.a.s.c.ZkController Register node as live in ZooKeeper:/live_nodes/127.0.0.1:54588_joq%2Ffh
   [junit4]   2> 2197140 INFO  (OverseerStateUpdate-98655263747866628-127.0.0.1:54588_joq%2Ffh-n_0000000000) [n:127.0.0.1:54588_joq%2Ffh    ] o.a.s.c.c.ZkStateReader Updated live nodes from ZooKeeper... (0) -> (1)
   [junit4]   2> 2197306 INFO  (TEST-ChaosMonkeyNothingIsSafeTest.test-seed#[3D76EB8A24EEF9E2]) [n:127.0.0.1:54588_joq%2Ffh    ] o.a.s.m.r.SolrJmxReporter JMX monitoring for 'solr.node' (registry 'solr.node') enabled at server: com.sun.jmx.mbeanserver.JmxMBeanServer@e4df11
   [junit4]   2> 2197316 INFO  (TEST-ChaosMonkeyNothingIsSafeTest.test-seed#[3D76EB8A24EEF9E2]) [n:127.0.0.1:54588_joq%2Ffh    ] o.a.s.m.r.SolrJmxReporter JMX monitoring for 'solr.jvm' (registry 'solr.jvm') enabled at server: com.sun.jmx.mbeanserver.JmxMBeanServer@e4df11
   [junit4]   2> 2197316 INFO  (TEST-ChaosMonkeyNothingIsSafeTest.test-seed#[3D76EB8A24EEF9E2]) [n:127.0.0.1:54588_joq%2Ffh    ] o.a.s.m.r.SolrJmxReporter JMX monitoring for 'solr.jetty' (registry 'solr.jetty') enabled at server: com.sun.jmx.mbeanserver.JmxMBeanServer@e4df11
   [junit4]   2> 2197318 INFO  (TEST-ChaosMonkeyNothingIsSafeTest.test-seed#[3D76EB8A24EEF9E2]) [n:127.0.0.1:54588_joq%2Ffh    ] o.a.s.c.CorePropertiesLocator Found 0 core definitions underneath C:\Users\jenkins\workspace\Lucene-Solr-7.0-Windows\solr\build\solr-core\test\J0\..\..\..\..\..\..\..\..\..\Users\jenkins\workspace\Lucene-Solr-7.0-Windows\solr\build\solr-core\test\J0\temp\solr.cloud.ChaosMonkeyNothingIsSafeTest_3D76EB8A24EEF9E2-001\control-001\cores
   [junit4]   2> 2197347 INFO  (TEST-ChaosMonkeyNothingIsSafeTest.test-seed#[3D76EB8A24EEF9E2]) [    ] o.a.s.c.c.ZkStateReader Updated live nodes from ZooKeeper... (0) -> (1)
   [junit4]   2> 2197349 INFO  (TEST-ChaosMonkeyNothingIsSafeTest.test-seed#[3D76EB8A24EEF9E2]) [    ] o.a.s.c.s.i.ZkClientClusterStateProvider Cluster at 127.0.0.1:54581/solr ready
   [junit4]   2> 2197356 INFO  (qtp30804410-23060) [n:127.0.0.1:54588_joq%2Ffh    ] o.a.s.h.a.CollectionsHandler Invoked Collection Action :create with params replicationFactor=1&collection.configName=conf1&name=control_collection&nrtReplicas=1&action=CREATE&numShards=1&createNodeSet=127.0.0.1:54588_joq%252Ffh&wt=javabin&version=2 and sendToOCPQueue=true
   [junit4]   2> 2197362 INFO  (OverseerThreadFactory-9941-thread-1-processing-n:127.0.0.1:54588_joq%2Ffh) [n:127.0.0.1:54588_joq%2Ffh    ] o.a.s.c.CreateCollectionCmd Create collection control_collection
   [junit4]   2> 2197474 INFO  (qtp30804410-23058) [n:127.0.0.1:54588_joq%2Ffh    ] o.a.s.h.a.CoreAdminOperation core create command qt=/admin/cores&collection.configName=conf1&newCollection=true&name=control_collection_shard1_replica_n1&action=CREATE&numShards=1&collection=control_collection&shard=shard1&wt=javabin&version=2&replicaType=NRT
   [junit4]   2> 2197478 INFO  (qtp30804410-23058) [n:127.0.0.1:54588_joq%2Ffh    ] o.a.s.c.TransientSolrCoreCacheDefault Allocating transient cache for 4 transient cores
   [junit4]   2> 2197599 INFO  (zkCallback-4305-thread-1-processing-n:127.0.0.1:54588_joq%2Ffh) [n:127.0.0.1:54588_joq%2Ffh    ] o.a.s.c.c.ZkStateReader A cluster state change: [WatchedEvent state:SyncConnected type:NodeDataChanged path:/collections/control_collection/state.json] for collection [control_collection] has occurred - updating... (live nodes size: [1])
   [junit4]   2> 2198540 INFO  (qtp30804410-23058) [n:127.0.0.1:54588_joq%2Ffh c:control_collection s:shard1  x:control_collection_shard1_replica_n1] o.a.s.c.SolrConfig Using Lucene MatchVersion: 7.0.0
   [junit4]   2> 2198559 INFO  (qtp30804410-23058) [n:127.0.0.1:54588_joq%2Ffh c:control_collection s:shard1  x:control_collection_shard1_replica_n1] o.a.s.s.IndexSchema [control_collection_shard1_replica_n1] Schema name=test
   [junit4]   2> 2198628 INFO  (qtp30804410-23058) [n:127.0.0.1:54588_joq%2Ffh c:control_collection s:shard1  x:control_collection_shard1_replica_n1] o.a.s.s.IndexSchema Loaded schema test/1.6 with uniqueid field id
   [junit4]   2> 2198654 INFO  (qtp30804410-23058) [n:127.0.0.1:54588_joq%2Ffh c:control_collection s:shard1  x:control_collection_shard1_replica_n1] o.a.s.c.CoreContainer Creating SolrCore 'control_collection_shard1_replica_n1' using configuration from collection control_collection, trusted=true
   [junit4]   2> 2198655 INFO  (qtp30804410-23058) [n:127.0.0.1:54588_joq%2Ffh c:control_collection s:shard1  x:control_collection_shard1_replica_n1] o.a.s.m.r.SolrJmxReporter JMX monitoring for 'solr.core.control_collection.shard1.replica_n1' (registry 'solr.core.control_collection.shard1.replica_n1') enabled at server: com.sun.jmx.mbeanserver.JmxMBeanServer@e4df11
   [junit4]   2> 2198655 INFO  (qtp30804410-23058) [n:127.0.0.1:54588_joq%2Ffh c:control_collection s:shard1  x:control_collection_shard1_replica_n1] o.a.s.c.SolrCore solr.RecoveryStrategy.Builder
   [junit4]   2> 2198655 INFO  (qtp30804410-23058) [n:127.0.0.1:54588_joq%2Ffh c:control_collection s:shard1  x:control_collection_shard1_replica_n1] o.a.s.c.SolrCore [[control_collection_shard1_replica_n1] ] Opening new SolrCore at [C:\Users\jenkins\workspace\Lucene-Solr-7.0-Windows\solr\build\solr-core\test\J0\temp\solr.cloud.ChaosMonkeyNothingIsSafeTest_3D76EB8A24EEF9E2-001\control-001\cores\control_collection_shard1_replica_n1], dataDir=[C:\Users\jenkins\workspace\Lucene-Solr-7.0-Windows\solr\build\solr-core\test\J0\..\..\..\..\..\..\..\..\..\Users\jenkins\workspace\Lucene-Solr-7.0-Windows\solr\build\solr-core\test\J0\temp\solr.cloud.ChaosMonkeyNothingIsSafeTest_3D76EB8A24EEF9E2-001\control-001\cores\control_collection_shard1_replica_n1\data\]
   [junit4]   2> 2198662 INFO  (qtp30804410-23058) [n:127.0.0.1:54588_joq%2Ffh c:control_collection s:shard1  x:control_collection_shard1_replica_n1] o.a.s.u.RandomMergePolicy RandomMergePolicy wrapping class org.apache.lucene.index.AlcoholicMergePolicy: [AlcoholicMergePolicy: minMergeSize=0, mergeFactor=10, maxMergeSize=633311758, maxMergeSizeForForcedMerge=9223372036854775807, calibrateSizeByDeletes=true, maxMergeDocs=2147483647, maxCFSSegmentSizeMB=8.796093022207999E12, noCFSRatio=0.1]
   [junit4]   2> 2198666 WARN  (qtp30804410-23058) [n:127.0.0.1:54588_joq%2Ffh c:control_collection s:shard1  x:control_collection_shard1_replica_n1] o.a.s.c.RequestHandlers INVALID paramSet a in requestHandler {type = requestHandler,name = /dump,class = DumpRequestHandler,attributes = {initParams=a, name=/dump, class=DumpRequestHandler},args = {defaults={a=A,b=B}}}
   [junit4]   2> 2198752 INFO  (qtp30804410-23058) [n:127.0.0.1:54588_joq%2Ffh c:control_collection s:shard1  x:control_collection_shard1_replica_n1] o.a.s.u.UpdateHandler Using UpdateLog implementation: org.apache.solr.update.UpdateLog
   [junit4]   2> 2198752 INFO  (qtp30804410-23058) [n:127.0.0.1:54588_joq%2Ffh c:control_collection s:shard1  x:control_collection_shard1_replica_n1] o.a.s.u.UpdateLog Initializing UpdateLog: dataDir= defaultSyncLevel=FLUSH numRecordsToKeep=100 maxNumLogsToKeep=10 numVersionBuckets=65536
   [junit4]   2> 2198754 INFO  (qtp30804410-23058) [n:127.0.0.1:54588_joq%2Ffh c:control_collection s:shard1  x:control_collection_shard1_replica_n1] o.a.s.u.CommitTracker Hard AutoCommit: if uncommited for 15000ms;
   [junit4]   2> 2198754 INFO  (qtp30804410-23058) [n:127.0.0.1:54588_joq%2Ffh c:control_collection s:shard1  x:control_collection_shard1_replica_n1] o.a.s.u.CommitTracker Soft AutoCommit: disabled
   [junit4]   2> 2198756 INFO  (qtp30804410-23058) [n:127.0.0.1:54588_joq%2Ffh c:control_collection s:shard1  x:control_collection_shard1_replica_n1] o.a.s.u.RandomMergePolicy RandomMergePolicy wrapping class org.apache.lucene.index.LogByteSizeMergePolicy: [LogByteSizeMergePolicy: minMergeSize=1677721, mergeFactor=42, maxMergeSize=2147483648, maxMergeSizeForForcedMerge=9223372036854775807, calibrateSizeByDeletes=false, maxMergeDocs=2147483647, maxCFSSegmentSizeMB=8.796093022207999E12, noCFSRatio=1.0]
   [junit4]   2> 2198756 INFO  (qtp30804410-23058) [n:127.0.0.1:54588_joq%2Ffh c:control_collection s:shard1  x:control_collection_shard1_replica_n1] o.a.s.s.SolrIndexSearcher Opening [Searcher@1741863[control_collection_shard1_replica_n1] main]
   [junit4]   2> 2198758 INFO  (qtp30804410-23058) [n:127.0.0.1:54588_joq%2Ffh c:control_collection s:shard1  x:control_collection_shard1_replica_n1] o.a.s.r.ManagedResourceStorage Configured ZooKeeperStorageIO with znodeBase: /configs/conf1
   [junit4]   2> 2198758 INFO  (qtp30804410-23058) [n:127.0.0.1:54588_joq%2Ffh c:control_collection s:shard1  x:control_collection_shard1_replica_n1] o.a.s.r.ManagedResourceStorage Loaded null at path _rest_managed.json using ZooKeeperStorageIO:path=/configs/conf1
   [junit4]   2> 2198759 INFO  (qtp30804410-23058) [n:127.0.0.1:54588_joq%2Ffh c:control_collection s:shard1  x:control_collection_shard1_replica_n1] o.a.s.h.ReplicationHandler Commits will be reserved for  10000
   [junit4]   2> 2198759 INFO  (qtp30804410-23058) [n:127.0.0.1:54588_joq%2Ffh c:control_collection s:shard1  x:control_collection_shard1_replica_n1] o.a.s.u.UpdateLog Could not find max version in index or recent updates, using new clock 1578484222479302656
   [junit4]   2> 2198764 INFO  (searcherExecutor-9944-thread-1-processing-n:127.0.0.1:54588_joq%2Ffh x:control_collection_shard1_replica_n1 s:shard1 c:control_collection) [n:127.0.0.1:54588_joq%2Ffh c:control_collection s:shard1  x:control_collection_shard1_replica_n1] o.a.s.c.SolrCore [control_collection_shard1_replica_n1] Registered new searcher Searcher@1741863[control_collection_shard1_replica_n1] main{ExitableDirectoryReader(UninvertingDirectoryReader())}
   [junit4]   2> 2198770 INFO  (qtp30804410-23058) [n:127.0.0.1:54588_joq%2Ffh c:control_collection s:shard1  x:control_collection_shard1_replica_n1] o.a.s.c.ShardLeaderElectionContext Enough replicas found to continue.
   [junit4]   2> 2198770 INFO  (qtp30804410-23058) [n:127.0.0.1:54588_joq%2Ffh c:control_collection s:shard1  x:control_collection_shard1_replica_n1] o.a.s.c.ShardLeaderElectionContext I may be the new leader - try and sync
   [junit4]   2> 2198770 INFO  (qtp30804410-23058) [n:127.0.0.1:54588_joq%2Ffh c:control_collection s:shard1  x:control_collection_shard1_replica_n1] o.a.s.c.SyncStrategy Sync replicas to http://127.0.0.1:54588/joq/fh/control_collection_shard1_replica_n1/
   [junit4]   2> 2198770 INFO  (qtp30804410-23058) [n:127.0.0.1:54588_joq%2Ffh c:control_collection s:shard1  x:control_collection_shard1_replica_n1] o.a.s.c.SyncStrategy Sync Success - now sync replicas to me
   [junit4]   2> 2198770 INFO  (qtp30804410-23058) [n:127.0.0.1:54588_joq%2Ffh c:control_collection s:shard1  x:control_collection_shard1_replica_n1] o.a.s.c.SyncStrategy http://127.0.0.1:54588/joq/fh/control_collection_shard1_replica_n1/ has no replicas
   [junit4]   2> 2198770 INFO  (qtp30804410-23058) [n:127.0.0.1:54588_joq%2Ffh c:control_collection s:shard1  x:control_collection_shard1_replica_n1] o.a.s.c.ShardLeaderElectionContext Found all replicas participating in election, clear LIR
   [junit4]   2> 2198774 INFO  (qtp30804410-23058) [n:127.0.0.1:54588_joq%2Ffh c:control_collection s:shard1  x:control_collection_shard1_replica_n1] o.a.s.c.ShardLeaderElectionContext I am the new leader: http://127.0.0.1:54588/joq/fh/control_collection_shard1_replica_n1/ shard1
   [junit4]   2> 2198880 INFO  (zkCallback-4305-thread-1-processing-n:127.0.0.1:54588_joq%2Ffh) [n:127.0.0.1:54588_joq%2Ffh    ] o.a.s.c.c.ZkStateReader A cluster state change: [WatchedEvent state:SyncConnected type:NodeDataChanged path:/collections/control_collection/state.json] for collection [control_collection] has occurred - updating... (live nodes size: [1])
   [junit4]   2> 2198927 INFO  (qtp30804410-23058) [n:127.0.0.1:54588_joq%2Ffh c:control_collection s:shard1  x:control_collection_shard1_replica_n1] o.a.s.c.ZkController I am the leader, no recovery necessary
   [junit4]   2> 2198932 INFO  (qtp30804410-23058) [n:127.0.0.1:54588_joq%2Ffh c:control_collection s:shard1  x:control_collection_shard1_replica_n1] o.a.s.s.HttpSolrCall [admin] webapp=null path=/admin/cores params={qt=/admin/cores&collection.configName=conf1&newCollection=true&name=control_collection_shard1_replica_n1&action=CREATE&numShards=1&collection=control_collection&shard=shard1&wt=javabin&version=2&replicaType=NRT} status=0 QTime=1458
   [junit4]   2> 2198940 INFO  (qtp30804410-23060) [n:127.0.0.1:54588_joq%2Ffh    ] o.a.s.h.a.CollectionsHandler Wait for new collection to be active for at most 30 seconds. Check all shard replicas
   [junit4]   2> 2199042 INFO  (zkCallback-4305-thread-2-processing-n:127.0.0.1:54588_joq%2Ffh) [n:127.0.0.1:54588_joq%2Ffh    ] o.a.s.c.c.ZkStateReader A cluster state change: [WatchedEvent state:SyncConnected type:NodeDataChanged path:/collections/control_collection/state.json] for collection [control_collection] has occurred - updating... (live nodes size: [1])
   [junit4]   2> 2199369 INFO  (OverseerCollectionConfigSetProcessor-98655263747866628-127.0.0.1:54588_joq%2Ffh-n_0000000000) [n:127.0.0.1:54588_joq%2Ffh    ] o.a.s.c.OverseerTaskQueue Response ZK path: /overseer/collection-queue-work/qnr-0000000000 doesn't exist.  Requestor may have disconnected from ZooKeeper
   [junit4]   2> 2199941 INFO  (qtp30804410-23060) [n:127.0.0.1:54588_joq%2Ffh    ] o.a.s.s.HttpSolrCall [admin] webapp=null path=/admin/collections params={replicationFactor=1&collection.configName=conf1&name=control_collection&nrtReplicas=1&action=CREATE&numShards=1&createNodeSet=127.0.0.1:54588_joq%252Ffh&wt=javabin&version=2} status=0 QTime=2581
   [junit4]   2> 2199950 INFO  (TEST-ChaosMonkeyNothingIsSafeTest.test-seed#[3D76EB8A24EEF9E2]) [    ] o.a.s.c.c.ZkStateReader Updated live nodes from ZooKeeper... (0) -> (1)
   [junit4]   2> 2199952 INFO  (TEST-ChaosMonkeyNothingIsSafeTest.test-seed#[3D76EB8A24EEF9E2]) [    ] o.a.s.c.s.i.ZkClientClusterStateProvider Cluster at 127.0.0.1:54581/solr ready
   [junit4]   2> 2199952 INFO  (TEST-ChaosMonkeyNothingIsSafeTest.test-seed#[3D76EB8A24EEF9E2]) [    ] o.a.s.c.ChaosMonkey monkey: init - expire sessions:false cause connection loss:false
   [junit4]   2> 2199954 INFO  (qtp30804410-23054) [n:127.0.0.1:54588_joq%2Ffh    ] o.a.s.h.a.CollectionsHandler Invoked Collection Action :create with params replicationFactor=1&collection.configName=conf1&name=collection1&nrtReplicas=1&action=CREATE&numShards=1&createNodeSet=&stateFormat=2&wt=javabin&version=2 and sendToOCPQueue=true
   [junit4]   2> 2199956 INFO  (OverseerThreadFactory-9941-thread-2-processing-n:127.0.0.1:54588_joq%2Ffh) [n:127.0.0.1:54588_joq%2Ffh    ] o.a.s.c.CreateCollectionCmd Create collection collection1
   [junit4]   2> 2199957 WARN  (OverseerThreadFactory-9941-thread-2-processing-n:127.0.0.1:54588_joq%2Ffh) [n:127.0.0.1:54588_joq%2Ffh    ] o.a.s.c.CreateCollectionCmd It is unusual to create a collection (collection1) without cores.
   [junit4]   2> 2200167 INFO  (qtp30804410-23054) [n:127.0.0.1:54588_joq%2Ffh    ] o.a.s.h.a.CollectionsHandler Wait for new collection to be active for at most 30 seconds. Check all shard replicas
   [junit4]   2> 2200168 INFO  (qtp30804410-23054) [n:127.0.0.1:54588_joq%2Ffh    ] o.a.s.s.HttpSolrCall [admin] webapp=null path=/admin/collections params={replicationFactor=1&collection.configName=conf1&name=collection1&nrtReplicas=1&action=CREATE&numShards=1&createNodeSet=&stateFormat=2&wt=javabin&version=2} status=0 QTime=214
   [junit4]   2> 2200575 INFO  (TEST-ChaosMonkeyNothingIsSafeTest.test-seed#[3D76EB8A24EEF9E2]) [    ] o.a.s.c.AbstractFullDistribZkTestBase create jetty 1 in directory C:\Users\jenkins\workspace\Lucene-Solr-7.0-Windows\solr\build\solr-core\test\J0\temp\solr.cloud.ChaosMonkeyNothingIsSafeTest_3D76EB8A24EEF9E2-001\shard-1-001 of type TLOG
   [junit4]   2> 2200575 INFO  (TEST-ChaosMonkeyNothingIsSafeTest.test-seed#[3D76EB8A24EEF9E2]) [    ] o.e.j.s.Server jetty-9.3.14.v20161028
   [junit4]   2> 2200576 INFO  (TEST-ChaosMonkeyNothingIsSafeTest.test-seed#[3D76EB8A24EEF9E2]) [    ] o.e.j.s.h.ContextHandler Started o.e.j.s.ServletContextHandler@f94f14{/joq/fh,null,AVAILABLE}
   [junit4]   2> 2200577 INFO  (TEST-ChaosMonkeyNothingIsSafeTest.test-seed#[3D76EB8A24EEF9E2]) [    ] o.e.j.s.AbstractConnector Started ServerConnector@9a2e3d{HTTP/1.1,[http/1.1]}{127.0.0.1:54609}
   [junit4]   2> 2200577 INFO  (TEST-ChaosMonkeyNothingIsSafeTest.test-seed#[3D76EB8A24EEF9E2]) [    ] o.e.j.s.Server Started @2203613ms
   [junit4]   2> 2200577 INFO  (TEST-ChaosMonkeyNothingIsSafeTest.test-seed#[3D76EB8A24EEF9E2]) [    ] o.a.s.c.s.e.JettySolrRunner Jetty properties: {solr.data.dir=C:\Users\jenkins\workspace\Lucene-Solr-7.0-Windows\solr\build\solr-core\test\J0\temp\solr.cloud.ChaosMonkeyNothingIsSafeTest_3D76EB8A24EEF9E2-001\tempDir-001/jetty1, replicaType=TLOG, solrconfig=solrconfig.xml, hostContext=/joq/fh, hostPort=54609, coreRootDirectory=C:\Users\jenkins\workspace\Lucene-Solr-7.0-Windows\solr\build\solr-core\test\J0\..\..\..\..\..\..\..\..\..\Users\jenkins\workspace\Lucene-Solr-7.0-Windows\solr\build\solr-core\test\J0\temp\solr.cloud.ChaosMonkeyNothingIsSafeTest_3D76EB8A24EEF9E2-001\shard-1-001\cores}
   [junit4]   2> 2200578 ERROR (TEST-ChaosMonkeyNothingIsSafeTest.test-seed#[3D76EB8A24EEF9E2]) [    ] o.a.s.s.StartupLoggingUtils Missing Java Option solr.log.dir. Logging may be missing or incomplete.
   [junit4]   2> 2200578 INFO  (TEST-ChaosMonkeyNothingIsSafeTest.test-seed#[3D76EB8A24EEF9E2]) [    ] o.a.s.s.SolrDispatchFilter  ___      _       Welcome to Apache Solr? version 7.0.0
   [junit4]   2> 2200578 INFO  (TEST-ChaosMonkeyNothingIsSafeTest.test-seed#[3D76EB8A24EEF9E2]) [    ] o.a.s.s.SolrDispatchFilter / __| ___| |_ _   Starting in cloud mode on port null
   [junit4]   2> 2200578 INFO  (TEST-ChaosMonkeyNothingIsSafeTest.test-seed#[3D76EB8A24EEF9E2]) [    ] o.a.s.s.SolrDispatchFilter \__ \/ _ \ | '_|  Install dir: null, Default config dir: null
   [junit4]   2> 2200578 INFO  (TEST-ChaosMonkeyNothingIsSafeTest.test-seed#[3D76EB8A24EEF9E2]) [    ] o.a.s.s.SolrDispatchFilter |___/\___/_|_|    Start time: 2017-09-14T03:31:03.650Z
   [junit4]   2> 2200583 WARN  (NIOServerCxn.Factory:0.0.0.0/0.0.0.0:0) [    ] o.a.z.s.NIOServerCnxn caught end of stream exception
   [junit4]   2> EndOfStreamException: Unable to read additional data from client sessionid 0x15e7e708eea0007, likely client has closed socket
   [junit4]   2> at org.apache.zookeeper.server.NIOServerCnxn.doIO(NIOServerCnxn.java:239)
   [junit4]   2> at org.apache.zookeeper.server.NIOServerCnxnFactory.run(NIOServerCnxnFactory.java:203)
   [junit4]   2> at java.lang.Thread.run(Thread.java:748)
   [junit4]   2> 2200583 INFO  (TEST-ChaosMonkeyNothingIsSafeTest.test-seed#[3D76EB8A24EEF9E2]) [    ] o.a.s.s.SolrDispatchFilter Loading solr.xml from SolrHome (not found in ZooKeeper)
   [junit4]   2> 2200583 INFO  (TEST-ChaosMonkeyNothingIsSafeTest.test-seed#[3D76EB8A24EEF9E2]) [    ] o.a.s.c.SolrXmlConfig Loading container configuration from C:\Users\jenkins\workspace\Lucene-Solr-7.0-Windows\solr\build\solr-core\test\J0\temp\solr.cloud.ChaosMonkeyNothingIsSafeTest_3D76EB8A24EEF9E2-001\shard-1-001\solr.xml
   [junit4]   2> 2200590 INFO  (TEST-ChaosMonkeyNothingIsSafeTest.test-seed#[3D76EB8A24EEF9E2]) [    ] o.a.s.c.SolrXmlConfig MBean server found: com.sun.jmx.mbeanserver.JmxMBeanServer@e4df11, but no JMX reporters were configured - adding default JMX reporter.
   [junit4]   2> 2200594 INFO  (TEST-ChaosMonkeyNothingIsSafeTest.test-seed#[3D76EB8A24EEF9E2]) [    ] o.a.s.c.ZkContainer Zookeeper client=127.0.0.1:54581/solr
   [junit4]   2> 2200599 WARN  (NIOServerCxn.Factory:0.0.0.0/0.0.0.0:0) [    ] o.a.z.s.NIOServerCnxn caught end of stream exception
   [junit4]   2> EndOfStreamException: Unable to read additional data from client sessionid 0x15e7e708eea0008, likely client has closed socket
   [junit4]   2> at org.apache.zookeeper.server.NIOServerCnxn.doIO(NIOServerCnxn.java:239)
   [junit4]   2> at org.apache.zookeeper.server.NIOServerCnxnFactory.run(NIOServerCnxnFactory.java:203)
   [junit4]   2> at java.lang.Thread.run(Thread.java:748)
   [junit4]   2> 2200609 INFO  (TEST-ChaosMonkeyNothingIsSafeTest.test-seed#[3D76EB8A24EEF9E2]) [n:127.0.0.1:54609_joq%2Ffh    ] o.a.s.c.c.ZkStateReader Updated live nodes from ZooKeeper... (0) -> (1)
   [junit4]   2> 2200612 INFO  (TEST-ChaosMonkeyNothingIsSafeTest.test-seed#[3D76EB8A24EEF9E2]) [n:127.0.0.1:54609_joq%2Ffh    ] o.a.s.c.Overseer Overseer (id=null) closing
   [junit4]   2> 2200615 INFO  (TEST-ChaosMonkeyNothingIsSafeTest.test-seed#[3D76EB8A24EEF9E2]) [n:127.0.0.1:54609_joq%2Ffh    ] o.a.s.c.ZkController Register node as live in ZooKeeper:/live_nodes/127.0.0.1:54609_joq%2Ffh
   [junit4]   2> 2200617 INFO  (zkCallback-4312-thread-1) [    ] o.a.s.c.c.ZkStateReader Updated live nodes from ZooKeeper... (1) -> (2)
   [junit4]   2> 2200617 INFO  (zkCallback-4317-thread-1-processing-n:127.0.0.1:54609_joq%2Ffh) [n:127.0.0.1:54609_joq%2Ffh    ] o.a.s.c.c.ZkStateReader Updated live nodes from ZooKeeper... (1) -> (2)
   [junit4]   2> 2200617 INFO  (zkCallback-4305-thread-2-processing-n:127.0.0.1:54588_joq%2Ffh) [n:127.0.0.1:54588_joq%2Ffh    ] o.a.s.c.c.ZkStateReader Updated live nodes from ZooKeeper... (1) -> (2)
   [junit4]   2> 2200828 INFO  (TEST-ChaosMonkeyNothingIsSafeTest.test-seed#[3D76EB8A24EEF9E2]) [n:127.0.0.1:54609_joq%2Ffh    ] o.a.s.m.r.SolrJmxReporter JMX monitoring for 'solr.node' (registry 'solr.node') enabled at server: com.sun.jmx.mbeanserver.JmxMBeanServer@e4df11
   [junit4]   2> 2200840 INFO  (TEST-ChaosMonkeyNothingIsSafeTest.test-seed#[3D76EB8A24EEF9E2]) [n:127.0.0.1:54609_joq%2Ffh    ] o.a.s.m.r.SolrJmxReporter JMX monitoring for 'solr.jvm' (registry 'solr.jvm') enabled at server: com.sun.jmx.mbeanserver.JmxMBeanServer@e4df11
   [junit4]   2> 2200840 INFO  (TEST-ChaosMonkeyNothingIsSafeTest.test-seed#[3D76EB8A24EEF9E2]) [n:127.0.0.1:54609_joq%2Ffh    ] o.a.s.m.r.SolrJmxReporter JMX monitoring for 'solr.jetty' (registry 'solr.jetty') enabled at server: com.sun.jmx.mbeanserver.JmxMBeanServer@e4df11
   [junit4]   2> 2200843 INFO  (TEST-ChaosMonkeyNothingIsSafeTest.test-seed#[3D76EB8A24EEF9E2]) [n:127.0.0.1:54609_joq%2Ffh    ] o.a.s.c.CorePropertiesLocator Found 0 core definitions underneath C:\Users\jenkins\workspace\Lucene-Solr-7.0-Windows\solr\build\solr-core\test\J0\..\..\..\..\..\..\..\..\..\Users\jenkins\workspace\Lucene-Solr-7.0-Windows\solr\build\solr-core\test\J0\temp\solr.cloud.ChaosMonkeyNothingIsSafeTest_3D76EB8A24EEF9E2-001\shard-1-001\cores
   [junit4]   2> 2200873 INFO  (qtp30804410-23053) [n:127.0.0.1:54588_joq%2Ffh    ] o.a.s.h.a.CollectionsHandler Invoked Collection Action :addreplica with params node=127.0.0.1:54609_joq%252Ffh&action=ADDREPLICA&collection=collection1&shard=shard1&type=TLOG&wt=javabin&version=2 and sendToOCPQueue=true
   [junit4]   2> 2200876 INFO  (OverseerCollectionConfigSetProcessor-98655263747866628-127.0.0.1:54588_joq%2Ffh-n_0000000000) [n:127.0.0.1:54588_joq%2Ffh    ] o.a.s.c.OverseerTaskQueue Response ZK path: /overseer/collection-queue-work/qnr-0000000002 doesn't exist.  Requestor may have disconnected from ZooKeeper
   [junit4]   2> 2200876 INFO  (OverseerThreadFactory-9941-thread-3-processing-n:127.0.0.1:54588_joq%2Ffh) [n:127.0.0.1:54588_joq%2Ffh    ] o.a.s.c.AddReplicaCmd Node Identified 127.0.0.1:54609_joq%2Ffh for creating new replica
   [junit4]   2> 2200881 INFO  (qtp9002431-23098) [n:127.0.0.1:54609_joq%2Ffh    ] o.a.s.h.a.CoreAdminOperation core create command qt=/admin/cores&collection.configName=conf1&name=collection1_shard1_replica_t0&action=CREATE&collection=collection1&shard=shard1&wt=javabin&version=2&replicaType=TLOG
   [junit4]   2> 2200882 INFO  (qtp9002431-23098) [n:127.0.0.1:54609_joq%2Ffh    ] o.a.s.c.TransientSolrCoreCacheDefault Allocating transient cache for 4 transient cores
   [junit4]   2> 2200989 INFO  (zkCallback-4317-thread-1-processing-n:127.0.0.1:54609_joq%2Ffh) [n:127.0.0.1:54609_joq%2Ffh    ] o.a.s.c.c.ZkStateReader A cluster state change: [WatchedEvent state:SyncConnected type:NodeDataChanged path:/collections/collection1/state.json] for collection [collection1] has occurred - updating... (live nodes size: [2])
   [junit4]   2> 2201928 INFO  (qtp9002431-23098) [n:127.0.0.1:54609_joq%2Ffh c:collection1 s:shard1  x:collection1_shard1_replica_t0] o.a.s.c.SolrConfig Using Lucene MatchVersion: 7.0.0
   [junit4]   2> 2201941 INFO  (qtp9002431-23098) [n:127.0.0.1:54609_joq%2Ffh c:collection1 s:shard1  x:collection1_shard1_replica_t0] o.a.s.s.IndexSchema [collection1_shard1_replica_t0] Schema name=test
   [junit4]   2> 2202018 INFO  (qtp9002431-23098) [n:127.0.0.1:54609_joq%2Ffh c:collection1 s:shard1  x:collection1_shard1_replica_t0] o.a.s.s.IndexSchema Loaded schema test/1.6 with uniqueid field id
   [junit4]   2> 2202042 INFO  (qtp9002431-23098) [n:127.0.0.1:54609_joq%2Ffh c:collection1 s:shard1  x:collection1_shard1_replica_t0] o.a.s.c.CoreContainer Creating SolrCore 'collection1_shard1_replica_t0' using configuration from collection collection1, trusted=true
   [junit4]   2> 2202043 INFO  (qtp9002431-23098) [n:127.0.0.1:54609_joq%2Ffh c:collection1 s:shard1  x:collection1_shard1_replica_t0] o.a.s.m.r.SolrJmxReporter JMX monitoring for 'solr.core.collection1.shard1.replica_t0' (registry 'solr.core.collection1.shard1.replica_t0') enabled at server: com.sun.jmx.mbeanserver.JmxMBeanServer@e4df11
   [junit4]   2> 2202043 INFO  (qtp9002431-23098) [n:127.0.0.1:54609_joq%2Ffh c:collection1 s:shard1  x:collection1_shard1_replica_t0] o.a.s.c.SolrCore solr.RecoveryStrategy.Builder
   [junit4]   2> 2202043 INFO  (qtp9002431-23098) [n:127.0.0.1:54609_joq%2Ffh c:collection1 s:shard1  x:collection1_shard1_replica_t0] o.a.s.c.SolrCore [[collection1_shard1_replica_t0] ] Opening new SolrCore at [C:\Users\jenkins\workspace\Lucene-Solr-7.0-Windows\solr\build\solr-core\test\J0\temp\solr.cloud.ChaosMonkeyNothingIsSafeTest_3D76EB8A24EEF9E2-001\shard-1-001\cores\collection1_shard1_replica_t0], dataDir=[C:\Users\jenkins\workspace\Lucene-Solr-7.0-Windows\solr\build\solr-core\test\J0\..\..\..\..\..\..\..\..\..\Users\jenkins\workspace\Lucene-Solr-7.0-Windows\solr\build\solr-core\test\J0\temp\solr.cloud.ChaosMonkeyNothingIsSafeTest_3D76EB8A24EEF9E2-001\shard-1-001\cores\collection1_shard1_replica_t0\data\]
   [junit4]   2> 2202050 INFO  (qtp9002431-23098) [n:127.0.0.1:54609_joq%2Ffh c:collection1 s:shard1  x:collection1_shard1_replica_t0] o.a.s.u.RandomMergePolicy RandomMergePolicy wrapping class org.apache.lucene.index.AlcoholicMergePolicy: [AlcoholicMergePolicy: minMergeSize=0, mergeFactor=10, maxMergeSize=633311758, maxMergeSizeForForcedMerge=9223372036854775807, calibrateSizeByDeletes=true, maxMergeDocs=2147483647, maxCFSSegmentSizeMB=8.796093022207999E12, noCFSRatio=0.1]
   [junit4]   2> 2202056 WARN  (qtp9002431-23098) [n:127.0.0.1:54609_joq%2Ffh c:collection1 s:shard1  x:collection1_shard1_replica_t0] o.a.s.c.RequestHandlers INVALID paramSet a in requestHandler {type = requestHandler,name = /dump,class = DumpRequestHandler,attributes = {initParams=a, name=/dump, class=DumpRequestHandler},args = {defaults={a=A,b=B}}}
   [junit4]   2> 2202132 INFO  (qtp9002431-23098) [n:127.0.0.1:54609_joq%2Ffh c:collection1 s:shard1  x:collection1_shard1_replica_t0] o.a.s.u.UpdateHandler Using UpdateLog implementation: org.apache.solr.update.UpdateLog
   [junit4]   2> 2202132 INFO  (qtp9002431-23098) [n:127.0.0.1:54609_joq%2Ffh c:collection1 s:shard1  x:collection1_shard1_replica_t0] o.a.s.u.UpdateLog Initializing UpdateLog: dataDir= defaultSyncLevel=FLUSH numRecordsToKeep=100 maxNumLogsToKeep=10 numVersionBuckets=65536
   [junit4]   2> 2202134 INFO  (qtp9002431-23098) [n:127.0.0.1:54609_joq%2Ffh c:collection1 s:shard1  x:collection1_shard1_replica_t0] o.a.s.u.CommitTracker Hard AutoCommit: if uncommited for 15000ms;
   [junit4]   2> 2202134 INFO  (qtp9002431-23098) [n:127.0.0.1:54609_joq%2Ffh c:collection1 s:shard1  x:collection1_shard1_replica_t0] o.a.s.u.CommitTracker Soft AutoCommit: disabled
   [junit4]   2> 2202135 INFO  (qtp9002431-23098) [n:127.0.0.1:54609_joq%2Ffh c:collection1 s:shard1  x:collection1_shard1_replica_t0] o.a.s.u.RandomMergePolicy RandomMergePolicy wrapping class org.apache.lucene.index.LogByteSizeMergePolicy: [LogByteSizeMergePolicy: minMergeSize=1677721, mergeFactor=42, maxMergeSize=2147483648, maxMergeSizeForForcedMerge=9223372036854775807, calibrateSizeByDeletes=false, maxMergeDocs=2147483647, maxCFSSegmentSizeMB=8.796093022207999E12, noCFSRatio=1.0]
   [junit4]   2> 2202136 INFO  (qtp9002431-23098) [n:127.0.0.1:54609_joq%2Ffh c:collection1 s:shard1  x:collection1_shard1_replica_t0] o.a.s.s.SolrIndexSearcher Opening [Searcher@1f7ebd[collection1_shard1_replica_t0] main]
   [junit4]   2> 2202137 INFO  (qtp9002431-23098) [n:127.0.0.1:54609_joq%2Ffh c:collection1 s:shard1  x:collection1_shard1_replica_t0] o.a.s.r.ManagedResourceStorage Configured ZooKeeperStorageIO with znodeBase: /configs/conf1
   [junit4]   2> 2202138 INFO  (qtp9002431-23098) [n:127.0.0.1:54609_joq%2Ffh c:collection1 s:shard1  x:collection1_shard1_replica_t0] o.a.s.r.ManagedResourceStorage Loaded null at path _rest_managed.json using ZooKeeperStorageIO:path=/configs/conf1
   [junit4]   2> 2202138 INFO  (qtp9002431-23098) [n:127.0.0.1:54609_joq%2Ffh c:collection1 s:shard1  x:collection1_shard1_replica_t0] o.a.s.h.ReplicationHandler Commits will be reserved for  10000
   [junit4]   2> 2202140 INFO  (searcherExecutor-9955-thread-1-processing-n:127.0.0.1:54609_joq%2Ffh x:collection1_shard1_replica_t0 s:shard1 c:collection1) [n:127.0.0.1:54609_joq%2Ffh c:collection1 s:shard1  x:collection1_shard1_replica_t0] o.a.s.c.SolrCore [collection1_shard1_replica_t0] Registered new searcher Searcher@1f7ebd[collection1_shard1_replica_t0] main{ExitableDirectoryReader(UninvertingDirectoryReader())}
   [junit4]   2> 2202140 INFO  (qtp9002431-23098) [n:127.0.0.1:54609_joq%2Ffh c:collection1 s:shard1  x:collection1_shard1_replica_t0] o.a.s.u.UpdateLog Could not find max version in index or recent updates, using new clock 1578484226024538112
   [junit4]   2> 2202147 INFO  (qtp9002431-23098) [n:127.0.0.1:54609_joq%2Ffh c:collection1 s:shard1  x:collection1_shard1_replica_t0] o.a.s.c.ShardLeaderElectionContext Enough replicas found to continue.
   [junit4]   2> 2202147 INFO  (qtp9002431-23098) [n:127.0.0.1:54609_joq%2Ffh c:collection1 s:shard1  x:collection1_shard1_replica_t0] o.a.s.c.ShardLeaderElectionContext I may be the new leader - try and sync
   [junit4]   2> 2202147 INFO  (qtp9002431-23098) [n:127.0.0.1:54609_joq%2Ffh c:collection1 s:shard1  x:collection1_shard1_replica_t0] o.a.s.c.SyncStrategy Sync replicas to http://127.0.0.1:54609/joq/fh/collection1_shard1_replica_t0/
   [junit4]   2> 2202148 INFO  (qtp9002431-23098) [n:127.0.0.1:54609_joq%2Ffh c:collection1 s:shard1  x:collection1_shard1_replica_t0] o.a.s.c.SyncStrategy Sync Success - now sync replicas to me
   [junit4]   2> 2202148 INFO  (qtp9002431-23098) [n:127.0.0.1:54609_joq%2Ffh c:collection1 s:shard1  x:collection1_shard1_replica_t0] o.a.s.c.SyncStrategy http://127.0.0.1:54609/joq/fh/collection1_shard1_replica_t0/ has no replicas
   [junit4]   2> 2202148 INFO  (qtp9002431-23098) [n:127.0.0.1:54609_joq%2Ffh c:collection1 s:shard1  x:collection1_shard1_replica_t0] o.a.s.c.ShardLeaderElectionContext Found all replicas participating in election, clear LIR
   [junit4]   2> 2202148 INFO  (qtp9002431-23098) [n:127.0.0.1:54609_joq%2Ffh c:collection1 s:shard1  x:collection1_shard1_replica_t0] o.a.s.c.ZkController collection1_shard1_replica_t0 stopping background replication from leader
   [junit4]   2> 2202152 INFO  (qtp9002431-23098) [n:127.0.0.1:54609_joq%2Ffh c:collection1 s:shard1  x:collection1_shard1_replica_t0] o.a.s.c.ShardLeaderElectionContext I am the new leader: http://127.0.0.1:54609/joq/fh/collection1_shard1_replica_t0/ shard1
   [junit4]   2> 2202256 INFO  (zkCallback-4317-thread-1-processing-n:127.0.0.1:54609_joq%2Ffh) [n:127.0.0.1:54609_joq%2Ffh    ] o.a.s.c.c.ZkStateReader A cluster state change: [WatchedEvent state:SyncConnected type:NodeDataChanged path:/collections/collection1/state.json] for collection [collection1] has occurred - updating... (live nodes size: [2])
   [junit4]   2> 2202306 INFO  (qtp9002431-23098) [n:127.0.0.1:54609_joq%2Ffh c:collection1 s:shard1  x:collection1_shard1_replica_t0] o.a.s.c.ZkController I am the leader, no recovery necessary
   [junit4]   2> 2202308 INFO  (qtp9002431-23098) [n:127.0.0.1:54609_joq%2Ffh c:collection1 s:shard1  x:collection1_shard1_replica_t0] o.a.s.s.HttpSolrCall [admin] webapp=null path=/admin/cores params={qt=/admin/cores&collection.configName=conf1&name=collection1_shard1_replica_t0&action=CREATE&collection=collection1&shard=shard1&wt=javabin&version=2&replicaType=TLOG} status=0 QTime=1427
   [junit4]   2> 2202312 INFO  (qtp30804410-23053) [n:127.0.0.1:54588_joq%2Ffh    ] o.a.s.s.HttpSolrCall [admin] webapp=null path=/admin/collections params={node=127.0.0.1:54609_joq%252Ffh&action=ADDREPLICA&collection=collection1&shard=shard1&type=TLOG&wt=javabin&version=2} status=0 QTime=1438
   [junit4]   2> 2202412 INFO  (zkCallback-4317-thread-1-processing-n:127.0.0.1:54609_joq%2Ffh) [n:127.0.0.1:54609_joq%2Ffh    ] o.a.s.c.c.ZkStateReader A cluster state change: [WatchedEvent state:SyncConnected type:NodeDataChanged path:/collections/collection1/state.json] for collection [collection1] has occurred - updating... (live nodes size: [2])
   [junit4]   2> 2202706 INFO  (TEST-ChaosMonkeyNothingIsSafeTest.test-seed#[3D76EB8A24EEF9E2]) [    ] o.a.s.c.AbstractFullDistribZkTestBase create jetty 2 in directory C:\Users\jenkins\workspace\Lucene-Solr-7.0-Windows\solr\build\solr-core\test\J0\temp\solr.cloud.ChaosMonkeyNothingIsSafeTest_3D76EB8A24EEF9E2-001\shard-2-001 of type TLOG
   [junit4]   2> 2202706 INFO  (TEST-ChaosMonkeyNothingIsSafeTest.test-seed#[3D76EB8A24EEF9E2]) [    ] o.e.j.s.Server jetty-9.3.14.v20161028
   [junit4]   2> 2202707 INFO  (TEST-ChaosMonkeyNothingIsSafeTest.test-seed#[3D76EB8A24EEF9E2]) [    ] o.e.j.s.h.ContextHandler Started o.e.j.s.ServletContextHandler@fa78a4{/joq/fh,null,AVAILABLE}
   [junit4]   2> 2202708 INFO  (TEST-ChaosMonkeyNothingIsSafeTest.test-seed#[3D76EB8A24EEF9E2]) [    ] o.e.j.s.AbstractConnector Started ServerConnector@15de9e0{HTTP/1.1,[http/1.1]}{127.0.0.1:54628}
   [junit4]   2> 2202709 INFO  (TEST-ChaosMonkeyNothingIsSafeTest.test-seed#[3D76EB8A24EEF9E2]) [    ] o.e.j.s.Server Started @2205744ms
   [junit4]   2> 2202709 INFO  (TEST-ChaosMonkeyNothingIsSafeTest.test-seed#[3D76EB8A24EEF9E2]) [    ] o.a.s.c.s.e.JettySolrRunner Jetty properties: {solr.data.dir=C:\Users\jenkins\workspace\Lucene-Solr-7.0-Windows\solr\build\solr-core\test\J0\temp\solr.cloud.ChaosMonkeyNothingIsSafeTest_3D76EB8A24EEF9E2-001\tempDir-001/jetty2, replicaType=TLOG, solrconfig=solrconfig.xml, hostContext=/joq/fh, hostPort=54628, coreRootDirectory=C:\Users\jenkins\workspace\Lucene-Solr-7.0-Windows\solr\build\solr-core\test\J0\temp\solr.cloud.ChaosMonkeyNothingIsSafeTest_3D76EB8A24EEF9E2-001\shard-2-001\cores}
   [junit4]   2> 2202709 ERROR (TEST-ChaosMonkeyNothingIsSafeTest.test-seed#[3D76EB8A24EEF9E2]) [    ] o.a.s.s.StartupLoggingUtils Missing Java Option solr.log.dir. Logging may be missing or incomplete.
   [junit4]   2> 2202709 INFO  (TEST-ChaosMonkeyNothingIsSafeTest.test-seed#[3D76EB8A24EEF9E2]) [    ] o.a.s.s.SolrDispatchFilter  ___      _       Welcome to Apache Solr? version 7.0.0
   [junit4]   2> 2202709 INFO  (TEST-ChaosMonkeyNothingIsSafeTest.test-seed#[3D76EB8A24EEF9E2]) [    ] o.a.s.s.SolrDispatchFilter / __| ___| |_ _   Starting in cloud mode on port null
   [junit4]   2> 2202709 INFO  (TEST-ChaosMonkeyNothingIsSafeTest.test-seed#[3D76EB8A24EEF9E2]) [    ] o.a.s.s.SolrDispatchFilter \__ \/ _ \ | '_|  Install dir: null, Default config dir: null
   [junit4]   2> 2202709 INFO  (TEST-ChaosMonkeyNothingIsSafeTest.test-seed#[3D76EB8A24EEF9E2]) [    ] o.a.s.s.SolrDispatchFilter |___/\___/_|_|    Start time: 2017-09-14T03:31:05.781Z
   [junit4]   2> 2202713 WARN  (NIOServerCxn.Factory:0.0.0.0/0.0.0.0:0) [    ] o.a.z.s.NIOServerCnxn caught end of stream exception
   [junit4]   2> EndOfStreamException: Unable to read additional data from client sessionid 0x15e7e708eea000a, likely client has closed socket
   [junit4]   2> at org.apache.zookeeper.server.NIOServerCnxn.doIO(NIOServerCnxn.java:239)
   [junit4]   2> at org.apache.zookeeper.server.NIOServerCnxnFactory.run(NIOServerCnxnFactory.java:203)
   [junit4]   2> at java.lang.Thread.run(Thread.java:748)
   [junit4]   2> 2202713 INFO  (TEST-ChaosMonkeyNothingIsSafeTest.test-seed#[3D76EB8A24EEF9E2]) [    ] o.a.s.s.SolrDispatchFilter Loading solr.xml from SolrHome (not found in ZooKeeper)
   [junit4]   2> 2202714 INFO  (TEST-ChaosMonkeyNothingIsSafeTest.test-seed#[3D76EB8A24EEF9E2]) [    ] o.a.s.c.SolrXmlConfig Loading container configuration from C:\Users\jenkins\workspace\Lucene-Solr-7.0-Windows\solr\build\solr-core\test\J0\temp\solr.cloud.ChaosMonkeyNothingIsSafeTest_3D76EB8A24EEF9E2-001\shard-2-001\solr.xml
   [junit4]   2> 2202723 INFO  (TEST-ChaosMonkeyNothingIsSafeTest.test-seed#[3D76EB8A24EEF9E2]) [    ] o.a.s.c.SolrXmlConfig MBean server found: com.sun.jmx.mbeanserver.JmxMBeanServer@e4df11, but no JMX reporters were configured - adding default JMX reporter.
   [junit4]   2> 2202727 INFO  (TEST-ChaosMonkeyNothingIsSafeTest.test-seed#[3D76EB8A24EEF9E2]) [    ] o.a.s.c.ZkContainer Zookeeper client=127.0.0.1:54581/solr
   [junit4]   2> 2202741 INFO  (TEST-ChaosMonkeyNothingIsSafeTest.test-seed#[3D76EB8A24EEF9E2]) [n:127.0.0.1:54628_joq%2Ffh    ] o.a.s.c.c.ZkStateReader Updated live nodes from ZooKeeper... (0) -> (2)
   [junit4]   2> 2202743 INFO  (TEST-ChaosMonkeyNothingIsSafeTest.test-seed#[3D76EB8A24EEF9E2]) [n:127.0.0.1:54628_joq%2Ffh    ] o.a.s.c.Overseer Overseer (id=null) closing
   [junit4]   2> 2202746 INFO  (TEST-ChaosMonkeyNothingIsSafeTest.test-seed#[3D76EB8A24EEF9E2]) [n:127.0.0.1:54628_joq%2Ffh    ] o.a.s.c.ZkController Register node as live in ZooKeeper:/live_nodes/127.0.0.1:54628_joq%2Ffh
   [junit4]   2> 2202748 INFO  (zkCallback-4305-thread-2-processing-n:127.0.0.1:54588_joq%2Ffh) [n:127.0.0.1:54588_joq%2Ffh    ] o.a.s.c.c.ZkStateReader Updated live nodes from ZooKeeper... (2) -> (3)
   [junit4]   2> 2202749 INFO  (zkCallback-4317-thread-1-processing-n:127.0.0.1:54609_joq%2Ffh) [n:127.0.0.1:54609_joq%2Ffh    ] o.a.s.c.c.ZkStateReader Updated live nodes from ZooKeeper... (2) -> (3)
   [junit4]   2> 2202749 INFO  (zkCallback-4312-thread-1) [    ] o.a.s.c.c.ZkStateReader Updated live nodes from ZooKeeper... (2) -> (3)
   [junit4]   2> 2202749 INFO  (zkCallback-4323-thread-1-processing-n:127.0.0.1:54628_joq%2Ffh) [n:127.0.0.1:54628_joq%2Ffh    ] o.a.s.c.c.ZkStateReader Updated live nodes from ZooKeeper... (2) -> (3)
   [junit4]   2> 2202878 INFO  (OverseerCollectionConfigSetProcessor-98655263747866628-127.0.0.1:54588_joq%2Ffh-n_0000000000) [n:127.0.0.1:54588_joq%2Ffh    ] o.a.s.c.OverseerTaskQueue Response ZK path: /overseer/collection-queue-work/qnr-0000000004 doesn't exist.  Reques

[...truncated too long message...]

 >         at java.util.concurrent.ThreadPoolExecutor.runWorker(ThreadPoolExecutor.java:1134)
   [junit4]    >         at java.util.concurrent.ThreadPoolExecutor$Worker.run(ThreadPoolExecutor.java:624)
   [junit4]    >         at java.lang.Thread.run(Thread.java:748)
   [junit4]    >    6) Thread[id=23091, name=Connection evictor, state=TIMED_WAITING, group=TGRP-ChaosMonkeyNothingIsSafeTest]
   [junit4]    >         at java.lang.Thread.sleep(Native Method)
   [junit4]    >         at org.apache.http.impl.client.IdleConnectionEvictor$1.run(IdleConnectionEvictor.java:66)
   [junit4]    >         at java.lang.Thread.run(Thread.java:748)
   [junit4]    >    7) Thread[id=23250, name=zkCallback-4312-thread-2, state=TIMED_WAITING, group=TGRP-ChaosMonkeyNothingIsSafeTest]
   [junit4]    >         at sun.misc.Unsafe.park(Native Method)
   [junit4]    >         at java.util.concurrent.locks.LockSupport.parkNanos(LockSupport.java:215)
   [junit4]    >         at java.util.concurrent.SynchronousQueue$TransferStack.awaitFulfill(SynchronousQueue.java:460)
   [junit4]    >         at java.util.concurrent.SynchronousQueue$TransferStack.transfer(SynchronousQueue.java:362)
   [junit4]    >         at java.util.concurrent.SynchronousQueue.poll(SynchronousQueue.java:941)
   [junit4]    >         at java.util.concurrent.ThreadPoolExecutor.getTask(ThreadPoolExecutor.java:1073)
   [junit4]    >         at java.util.concurrent.ThreadPoolExecutor.runWorker(ThreadPoolExecutor.java:1134)
   [junit4]    >         at java.util.concurrent.ThreadPoolExecutor$Worker.run(ThreadPoolExecutor.java:624)
   [junit4]    >         at java.lang.Thread.run(Thread.java:748)
   [junit4]    >    8) Thread[id=23094, name=zkCallback-4312-thread-1, state=TIMED_WAITING, group=TGRP-ChaosMonkeyNothingIsSafeTest]
   [junit4]    >         at sun.misc.Unsafe.park(Native Method)
   [junit4]    >         at java.util.concurrent.locks.LockSupport.parkNanos(LockSupport.java:215)
   [junit4]    >         at java.util.concurrent.SynchronousQueue$TransferStack.awaitFulfill(SynchronousQueue.java:460)
   [junit4]    >         at java.util.concurrent.SynchronousQueue$TransferStack.transfer(SynchronousQueue.java:362)
   [junit4]    >         at java.util.concurrent.SynchronousQueue.poll(SynchronousQueue.java:941)
   [junit4]    >         at java.util.concurrent.ThreadPoolExecutor.getTask(ThreadPoolExecutor.java:1073)
   [junit4]    >         at java.util.concurrent.ThreadPoolExecutor.runWorker(ThreadPoolExecutor.java:1134)
   [junit4]    >         at java.util.concurrent.ThreadPoolExecutor$Worker.run(ThreadPoolExecutor.java:624)
   [junit4]    >         at java.lang.Thread.run(Thread.java:748)
   [junit4]    >    9) Thread[id=23092, name=TEST-ChaosMonkeyNothingIsSafeTest.test-seed#[3D76EB8A24EEF9E2]-SendThread(127.0.0.1:54581), state=TIMED_WAITING, group=TGRP-ChaosMonkeyNothingIsSafeTest]
   [junit4]    >         at java.lang.Thread.sleep(Native Method)
   [junit4]    >         at org.apache.zookeeper.ClientCnxn$SendThread.run(ClientCnxn.java:1051)
   [junit4]    > at __randomizedtesting.SeedInfo.seed([3D76EB8A24EEF9E2]:0)Throwable #2: com.carrotsearch.randomizedtesting.ThreadLeakError: There are still zombie threads that couldn't be terminated:
   [junit4]    >    1) Thread[id=23253, name=zkCallback-4312-thread-5, state=TIMED_WAITING, group=TGRP-ChaosMonkeyNothingIsSafeTest]
   [junit4]    >         at sun.misc.Unsafe.park(Native Method)
   [junit4]    >         at java.util.concurrent.locks.LockSupport.parkNanos(LockSupport.java:215)
   [junit4]    >         at java.util.concurrent.SynchronousQueue$TransferStack.awaitFulfill(SynchronousQueue.java:460)
   [junit4]    >         at java.util.concurrent.SynchronousQueue$TransferStack.transfer(SynchronousQueue.java:362)
   [junit4]    >         at java.util.concurrent.SynchronousQueue.poll(SynchronousQueue.java:941)
   [junit4]    >         at java.util.concurrent.ThreadPoolExecutor.getTask(ThreadPoolExecutor.java:1073)
   [junit4]    >         at java.util.concurrent.ThreadPoolExecutor.runWorker(ThreadPoolExecutor.java:1134)
   [junit4]    >         at java.util.concurrent.ThreadPoolExecutor$Worker.run(ThreadPoolExecutor.java:624)
   [junit4]    >         at java.lang.Thread.run(Thread.java:748)
   [junit4]    >    2) Thread[id=23254, name=zkCallback-4312-thread-6, state=TIMED_WAITING, group=TGRP-ChaosMonkeyNothingIsSafeTest]
   [junit4]    >         at sun.misc.Unsafe.park(Native Method)
   [junit4]    >         at java.util.concurrent.locks.LockSupport.parkNanos(LockSupport.java:215)
   [junit4]    >         at java.util.concurrent.SynchronousQueue$TransferStack.awaitFulfill(SynchronousQueue.java:460)
   [junit4]    >         at java.util.concurrent.SynchronousQueue$TransferStack.transfer(SynchronousQueue.java:362)
   [junit4]    >         at java.util.concurrent.SynchronousQueue.poll(SynchronousQueue.java:941)
   [junit4]    >         at java.util.concurrent.ThreadPoolExecutor.getTask(ThreadPoolExecutor.java:1073)
   [junit4]    >         at java.util.concurrent.ThreadPoolExecutor.runWorker(ThreadPoolExecutor.java:1134)
   [junit4]    >         at java.util.concurrent.ThreadPoolExecutor$Worker.run(ThreadPoolExecutor.java:624)
   [junit4]    >         at java.lang.Thread.run(Thread.java:748)
   [junit4]    >    3) Thread[id=23252, name=zkCallback-4312-thread-4, state=TIMED_WAITING, group=TGRP-ChaosMonkeyNothingIsSafeTest]
   [junit4]    >         at sun.misc.Unsafe.park(Native Method)
   [junit4]    >         at java.util.concurrent.locks.LockSupport.parkNanos(LockSupport.java:215)
   [junit4]    >         at java.util.concurrent.SynchronousQueue$TransferStack.awaitFulfill(SynchronousQueue.java:460)
   [junit4]    >         at java.util.concurrent.SynchronousQueue$TransferStack.transfer(SynchronousQueue.java:362)
   [junit4]    >         at java.util.concurrent.SynchronousQueue.poll(SynchronousQueue.java:941)
   [junit4]    >         at java.util.concurrent.ThreadPoolExecutor.getTask(ThreadPoolExecutor.java:1073)
   [junit4]    >         at java.util.concurrent.ThreadPoolExecutor.runWorker(ThreadPoolExecutor.java:1134)
   [junit4]    >         at java.util.concurrent.ThreadPoolExecutor$Worker.run(ThreadPoolExecutor.java:624)
   [junit4]    >         at java.lang.Thread.run(Thread.java:748)
   [junit4]    >    4) Thread[id=23251, name=zkCallback-4312-thread-3, state=TIMED_WAITING, group=TGRP-ChaosMonkeyNothingIsSafeTest]
   [junit4]    >         at sun.misc.Unsafe.park(Native Method)
   [junit4]    >         at java.util.concurrent.locks.LockSupport.parkNanos(LockSupport.java:215)
   [junit4]    >         at java.util.concurrent.SynchronousQueue$TransferStack.awaitFulfill(SynchronousQueue.java:460)
   [junit4]    >         at java.util.concurrent.SynchronousQueue$TransferStack.transfer(SynchronousQueue.java:362)
   [junit4]    >         at java.util.concurrent.SynchronousQueue.poll(SynchronousQueue.java:941)
   [junit4]    >         at java.util.concurrent.ThreadPoolExecutor.getTask(ThreadPoolExecutor.java:1073)
   [junit4]    >         at java.util.concurrent.ThreadPoolExecutor.runWorker(ThreadPoolExecutor.java:1134)
   [junit4]    >         at java.util.concurrent.ThreadPoolExecutor$Worker.run(ThreadPoolExecutor.java:624)
   [junit4]    >         at java.lang.Thread.run(Thread.java:748)
   [junit4]    >    5) Thread[id=23250, name=zkCallback-4312-thread-2, state=TIMED_WAITING, group=TGRP-ChaosMonkeyNothingIsSafeTest]
   [junit4]    >         at sun.misc.Unsafe.park(Native Method)
   [junit4]    >         at java.util.concurrent.locks.LockSupport.parkNanos(LockSupport.java:215)
   [junit4]    >         at java.util.concurrent.SynchronousQueue$TransferStack.awaitFulfill(SynchronousQueue.java:460)
   [junit4]    >         at java.util.concurrent.SynchronousQueue$TransferStack.transfer(SynchronousQueue.java:362)
   [junit4]    >         at java.util.concurrent.SynchronousQueue.poll(SynchronousQueue.java:941)
   [junit4]    >         at java.util.concurrent.ThreadPoolExecutor.getTask(ThreadPoolExecutor.java:1073)
   [junit4]    >         at java.util.concurrent.ThreadPoolExecutor.runWorker(ThreadPoolExecutor.java:1134)
   [junit4]    >         at java.util.concurrent.ThreadPoolExecutor$Worker.run(ThreadPoolExecutor.java:624)
   [junit4]    >         at java.lang.Thread.run(Thread.java:748)
   [junit4]    >    6) Thread[id=23094, name=zkCallback-4312-thread-1, state=TIMED_WAITING, group=TGRP-ChaosMonkeyNothingIsSafeTest]
   [junit4]    >         at sun.misc.Unsafe.park(Native Method)
   [junit4]    >         at java.util.concurrent.locks.LockSupport.parkNanos(LockSupport.java:215)
   [junit4]    >         at java.util.concurrent.SynchronousQueue$TransferStack.awaitFulfill(SynchronousQueue.java:460)
   [junit4]    >         at java.util.concurrent.SynchronousQueue$TransferStack.transfer(SynchronousQueue.java:362)
   [junit4]    >         at java.util.concurrent.SynchronousQueue.poll(SynchronousQueue.java:941)
   [junit4]    >         at java.util.concurrent.ThreadPoolExecutor.getTask(ThreadPoolExecutor.java:1073)
   [junit4]    >         at java.util.concurrent.ThreadPoolExecutor.runWorker(ThreadPoolExecutor.java:1134)
   [junit4]    >         at java.util.concurrent.ThreadPoolExecutor$Worker.run(ThreadPoolExecutor.java:624)
   [junit4]    >         at java.lang.Thread.run(Thread.java:748)
   [junit4]    >    7) Thread[id=23092, name=TEST-ChaosMonkeyNothingIsSafeTest.test-seed#[3D76EB8A24EEF9E2]-SendThread(127.0.0.1:54581), state=TIMED_WAITING, group=TGRP-ChaosMonkeyNothingIsSafeTest]
   [junit4]    >         at java.lang.Thread.sleep(Native Method)
   [junit4]    >         at org.apache.zookeeper.ClientCnxn$SendThread.run(ClientCnxn.java:1051)
   [junit4]    > at __randomizedtesting.SeedInfo.seed([3D76EB8A24EEF9E2]:0)
   [junit4] Completed [500/729 (2!)] on J0 in 70.35s, 1 test, 3 errors <<< FAILURES!

[...truncated 40122 lines...]


---------------------------------------------------------------------
To unsubscribe, e-mail: [hidden email]
For additional commands, e-mail: [hidden email]
Reply | Threaded
Open this post in threaded view
|

[JENKINS] Lucene-Solr-7.0-Windows (64bit/jdk1.8.0_144) - Build # 157 - Still Unstable!

Policeman Jenkins Server-2
Build: https://jenkins.thetaphi.de/job/Lucene-Solr-7.0-Windows/157/
Java: 64bit/jdk1.8.0_144 -XX:+UseCompressedOops -XX:+UseParallelGC

1 tests failed.
FAILED:  org.apache.solr.handler.component.InfixSuggestersTest.testReloadDuringBuild

Error Message:
junit.framework.AssertionFailedError: Expected outer exception RuntimeException

Stack Trace:
java.util.concurrent.ExecutionException: junit.framework.AssertionFailedError: Expected outer exception RuntimeException
        at __randomizedtesting.SeedInfo.seed([CC507C6B1CD6524F:25E8541D09FFDF4E]:0)
        at java.util.concurrent.FutureTask.report(FutureTask.java:122)
        at java.util.concurrent.FutureTask.get(FutureTask.java:192)
        at org.apache.solr.handler.component.InfixSuggestersTest.testReloadDuringBuild(InfixSuggestersTest.java:109)
        at sun.reflect.NativeMethodAccessorImpl.invoke0(Native Method)
        at sun.reflect.NativeMethodAccessorImpl.invoke(NativeMethodAccessorImpl.java:62)
        at sun.reflect.DelegatingMethodAccessorImpl.invoke(DelegatingMethodAccessorImpl.java:43)
        at java.lang.reflect.Method.invoke(Method.java:498)
        at com.carrotsearch.randomizedtesting.RandomizedRunner.invoke(RandomizedRunner.java:1713)
        at com.carrotsearch.randomizedtesting.RandomizedRunner$8.evaluate(RandomizedRunner.java:907)
        at com.carrotsearch.randomizedtesting.RandomizedRunner$9.evaluate(RandomizedRunner.java:943)
        at com.carrotsearch.randomizedtesting.RandomizedRunner$10.evaluate(RandomizedRunner.java:957)
        at com.carrotsearch.randomizedtesting.rules.SystemPropertiesRestoreRule$1.evaluate(SystemPropertiesRestoreRule.java:57)
        at org.apache.lucene.util.TestRuleSetupTeardownChained$1.evaluate(TestRuleSetupTeardownChained.java:49)
        at org.apache.lucene.util.AbstractBeforeAfterRule$1.evaluate(AbstractBeforeAfterRule.java:45)
        at org.apache.lucene.util.TestRuleThreadAndTestName$1.evaluate(TestRuleThreadAndTestName.java:48)
        at org.apache.lucene.util.TestRuleIgnoreAfterMaxFailures$1.evaluate(TestRuleIgnoreAfterMaxFailures.java:64)
        at org.apache.lucene.util.TestRuleMarkFailure$1.evaluate(TestRuleMarkFailure.java:47)
        at com.carrotsearch.randomizedtesting.rules.StatementAdapter.evaluate(StatementAdapter.java:36)
        at com.carrotsearch.randomizedtesting.ThreadLeakControl$StatementRunner.run(ThreadLeakControl.java:368)
        at com.carrotsearch.randomizedtesting.ThreadLeakControl.forkTimeoutingTask(ThreadLeakControl.java:817)
        at com.carrotsearch.randomizedtesting.ThreadLeakControl$3.evaluate(ThreadLeakControl.java:468)
        at com.carrotsearch.randomizedtesting.RandomizedRunner.runSingleTest(RandomizedRunner.java:916)
        at com.carrotsearch.randomizedtesting.RandomizedRunner$5.evaluate(RandomizedRunner.java:802)
        at com.carrotsearch.randomizedtesting.RandomizedRunner$6.evaluate(RandomizedRunner.java:852)
        at com.carrotsearch.randomizedtesting.RandomizedRunner$7.evaluate(RandomizedRunner.java:863)
        at com.carrotsearch.randomizedtesting.rules.StatementAdapter.evaluate(StatementAdapter.java:36)
        at com.carrotsearch.randomizedtesting.rules.SystemPropertiesRestoreRule$1.evaluate(SystemPropertiesRestoreRule.java:57)
        at org.apache.lucene.util.AbstractBeforeAfterRule$1.evaluate(AbstractBeforeAfterRule.java:45)
        at com.carrotsearch.randomizedtesting.rules.StatementAdapter.evaluate(StatementAdapter.java:36)
        at org.apache.lucene.util.TestRuleStoreClassName$1.evaluate(TestRuleStoreClassName.java:41)
        at com.carrotsearch.randomizedtesting.rules.NoShadowingOrOverridesOnMethodsRule$1.evaluate(NoShadowingOrOverridesOnMethodsRule.java:40)
        at com.carrotsearch.randomizedtesting.rules.NoShadowingOrOverridesOnMethodsRule$1.evaluate(NoShadowingOrOverridesOnMethodsRule.java:40)
        at com.carrotsearch.randomizedtesting.rules.StatementAdapter.evaluate(StatementAdapter.java:36)
        at com.carrotsearch.randomizedtesting.rules.StatementAdapter.evaluate(StatementAdapter.java:36)
        at com.carrotsearch.randomizedtesting.rules.StatementAdapter.evaluate(StatementAdapter.java:36)
        at org.apache.lucene.util.TestRuleAssertionsRequired$1.evaluate(TestRuleAssertionsRequired.java:53)
        at org.apache.lucene.util.TestRuleMarkFailure$1.evaluate(TestRuleMarkFailure.java:47)
        at org.apache.lucene.util.TestRuleIgnoreAfterMaxFailures$1.evaluate(TestRuleIgnoreAfterMaxFailures.java:64)
        at org.apache.lucene.util.TestRuleIgnoreTestSuites$1.evaluate(TestRuleIgnoreTestSuites.java:54)
        at com.carrotsearch.randomizedtesting.rules.StatementAdapter.evaluate(StatementAdapter.java:36)
        at com.carrotsearch.randomizedtesting.ThreadLeakControl$StatementRunner.run(ThreadLeakControl.java:368)
        at java.lang.Thread.run(Thread.java:748)
Caused by: junit.framework.AssertionFailedError: Expected outer exception RuntimeException
        at org.apache.lucene.util.LuceneTestCase.expectThrows(LuceneTestCase.java:2700)
        at org.apache.solr.handler.component.InfixSuggestersTest.lambda$testReloadDuringBuild$1(InfixSuggestersTest.java:101)
        at java.util.concurrent.FutureTask.run(FutureTask.java:266)
        at org.apache.solr.common.util.ExecutorUtil$MDCAwareThreadPoolExecutor.lambda$execute$0(ExecutorUtil.java:188)
        at java.util.concurrent.ThreadPoolExecutor.runWorker(ThreadPoolExecutor.java:1149)
        at java.util.concurrent.ThreadPoolExecutor$Worker.run(ThreadPoolExecutor.java:624)
        ... 1 more




Build Log:
[...truncated 12825 lines...]
   [junit4] Suite: org.apache.solr.handler.component.InfixSuggestersTest
   [junit4]   2> Creating dataDir: C:\Users\jenkins\workspace\Lucene-Solr-7.0-Windows\solr\build\solr-core\test\J0\temp\solr.handler.component.InfixSuggestersTest_CC507C6B1CD6524F-001\init-core-data-001
   [junit4]   2> 2339838 WARN  (SUITE-InfixSuggestersTest-seed#[CC507C6B1CD6524F]-worker) [    ] o.a.s.SolrTestCaseJ4 startTrackingSearchers: numOpens=7 numCloses=7
   [junit4]   2> 2339838 INFO  (SUITE-InfixSuggestersTest-seed#[CC507C6B1CD6524F]-worker) [    ] o.a.s.SolrTestCaseJ4 Using PointFields (NUMERIC_POINTS_SYSPROP=true) w/NUMERIC_DOCVALUES_SYSPROP=false
   [junit4]   2> 2339844 INFO  (SUITE-InfixSuggestersTest-seed#[CC507C6B1CD6524F]-worker) [    ] o.a.s.SolrTestCaseJ4 Randomized ssl (false) and clientAuth (true) via: @org.apache.solr.util.RandomizeSSL(reason=, value=NaN, ssl=NaN, clientAuth=NaN)
   [junit4]   2> 2339844 INFO  (SUITE-InfixSuggestersTest-seed#[CC507C6B1CD6524F]-worker) [    ] o.a.s.SolrTestCaseJ4 ####initCore
   [junit4]   2> 2339846 INFO  (SUITE-InfixSuggestersTest-seed#[CC507C6B1CD6524F]-worker) [    ] o.a.s.c.SolrResourceLoader [null] Added 2 libs to classloader, from paths: [/C:/Users/jenkins/workspace/Lucene-Solr-7.0-Windows/solr/core/src/test-files/solr/collection1/lib, /C:/Users/jenkins/workspace/Lucene-Solr-7.0-Windows/solr/core/src/test-files/solr/collection1/lib/classes]
   [junit4]   2> 2339912 INFO  (SUITE-InfixSuggestersTest-seed#[CC507C6B1CD6524F]-worker) [    ] o.a.s.c.SolrConfig Using Lucene MatchVersion: 7.0.0
   [junit4]   2> 2339923 INFO  (SUITE-InfixSuggestersTest-seed#[CC507C6B1CD6524F]-worker) [    ] o.a.s.s.IndexSchema [null] Schema name=test
   [junit4]   2> 2340019 INFO  (SUITE-InfixSuggestersTest-seed#[CC507C6B1CD6524F]-worker) [    ] o.a.s.s.IndexSchema Loaded schema test/1.0 with uniqueid field id
   [junit4]   2> 2340183 INFO  (SUITE-InfixSuggestersTest-seed#[CC507C6B1CD6524F]-worker) [    ] o.a.s.m.r.SolrJmxReporter JMX monitoring for 'solr.node' (registry 'solr.node') enabled at server: com.sun.jmx.mbeanserver.JmxMBeanServer@2528ba64
   [junit4]   2> 2340190 INFO  (SUITE-InfixSuggestersTest-seed#[CC507C6B1CD6524F]-worker) [    ] o.a.s.m.r.SolrJmxReporter JMX monitoring for 'solr.jvm' (registry 'solr.jvm') enabled at server: com.sun.jmx.mbeanserver.JmxMBeanServer@2528ba64
   [junit4]   2> 2340191 INFO  (SUITE-InfixSuggestersTest-seed#[CC507C6B1CD6524F]-worker) [    ] o.a.s.m.r.SolrJmxReporter JMX monitoring for 'solr.jetty' (registry 'solr.jetty') enabled at server: com.sun.jmx.mbeanserver.JmxMBeanServer@2528ba64
   [junit4]   2> 2340193 INFO  (coreLoadExecutor-10374-thread-1) [    x:collection1] o.a.s.c.SolrResourceLoader [null] Added 2 libs to classloader, from paths: [/C:/Users/jenkins/workspace/Lucene-Solr-7.0-Windows/solr/core/src/test-files/solr/collection1/lib, /C:/Users/jenkins/workspace/Lucene-Solr-7.0-Windows/solr/core/src/test-files/solr/collection1/lib/classes]
   [junit4]   2> 2340277 INFO  (coreLoadExecutor-10374-thread-1) [    x:collection1] o.a.s.c.SolrConfig Using Lucene MatchVersion: 7.0.0
   [junit4]   2> 2340293 INFO  (coreLoadExecutor-10374-thread-1) [    x:collection1] o.a.s.s.IndexSchema [collection1] Schema name=test
   [junit4]   2> 2340388 INFO  (coreLoadExecutor-10374-thread-1) [    x:collection1] o.a.s.s.IndexSchema Loaded schema test/1.0 with uniqueid field id
   [junit4]   2> 2340401 INFO  (coreLoadExecutor-10374-thread-1) [    x:collection1] o.a.s.c.CoreContainer Creating SolrCore 'collection1' using configuration from instancedir C:\Users\jenkins\workspace\Lucene-Solr-7.0-Windows\solr\core\src\test-files\solr\collection1, trusted=true
   [junit4]   2> 2340401 INFO  (coreLoadExecutor-10374-thread-1) [    x:collection1] o.a.s.m.r.SolrJmxReporter JMX monitoring for 'solr.core.collection1' (registry 'solr.core.collection1') enabled at server: com.sun.jmx.mbeanserver.JmxMBeanServer@2528ba64
   [junit4]   2> 2340401 INFO  (coreLoadExecutor-10374-thread-1) [    x:collection1] o.a.s.c.SolrCore solr.RecoveryStrategy.Builder
   [junit4]   2> 2340401 INFO  (coreLoadExecutor-10374-thread-1) [    x:collection1] o.a.s.c.SolrCore [[collection1] ] Opening new SolrCore at [C:\Users\jenkins\workspace\Lucene-Solr-7.0-Windows\solr\core\src\test-files\solr\collection1], dataDir=[C:\Users\jenkins\workspace\Lucene-Solr-7.0-Windows\solr\build\solr-core\test\J0\temp\solr.handler.component.InfixSuggestersTest_CC507C6B1CD6524F-001\init-core-data-001\]
   [junit4]   2> 2340408 INFO  (coreLoadExecutor-10374-thread-1) [    x:collection1] o.a.s.u.RandomMergePolicy RandomMergePolicy wrapping class org.apache.lucene.index.TieredMergePolicy: [TieredMergePolicy: maxMergeAtOnce=44, maxMergeAtOnceExplicit=19, maxMergedSegmentMB=46.146484375, floorSegmentMB=0.5029296875, forceMergeDeletesPctAllowed=8.358981892934848, segmentsPerTier=16.0, maxCFSSegmentSizeMB=8.796093022207999E12, noCFSRatio=1.0
   [junit4]   2> 2340581 INFO  (coreLoadExecutor-10374-thread-1) [    x:collection1] o.a.s.u.CommitTracker Hard AutoCommit: disabled
   [junit4]   2> 2340582 INFO  (coreLoadExecutor-10374-thread-1) [    x:collection1] o.a.s.u.CommitTracker Soft AutoCommit: disabled
   [junit4]   2> 2340583 INFO  (coreLoadExecutor-10374-thread-1) [    x:collection1] o.a.s.u.RandomMergePolicy RandomMergePolicy wrapping class org.apache.lucene.index.AlcoholicMergePolicy: [AlcoholicMergePolicy: minMergeSize=0, mergeFactor=10, maxMergeSize=1144896267, maxMergeSizeForForcedMerge=9223372036854775807, calibrateSizeByDeletes=true, maxMergeDocs=2147483647, maxCFSSegmentSizeMB=8.796093022207999E12, noCFSRatio=0.1]
   [junit4]   2> 2340584 INFO  (coreLoadExecutor-10374-thread-1) [    x:collection1] o.a.s.s.SolrIndexSearcher Opening [Searcher@7e5e1b33[collection1] main]
   [junit4]   2> 2340585 WARN  (coreLoadExecutor-10374-thread-1) [    x:collection1] o.a.s.r.ManagedResourceStorage Cannot write to config directory C:\Users\jenkins\workspace\Lucene-Solr-7.0-Windows\solr\core\src\test-files\solr\collection1\conf; switching to use InMemory storage instead.
   [junit4]   2> 2340585 INFO  (coreLoadExecutor-10374-thread-1) [    x:collection1] o.a.s.h.c.SuggestComponent Initializing SuggestComponent
   [junit4]   2> 2340586 INFO  (coreLoadExecutor-10374-thread-1) [    x:collection1] o.a.s.s.s.SolrSuggester init: {name=shortRandomAnalyzingInfixSuggester,lookupImpl=AnalyzingInfixLookupFactory,dictionaryImpl=RandomTestDictionaryFactory,randDictMaxItems=100,indexPath=short_random_analyzing_infix_suggester,suggestAnalyzerFieldType=text,buildOnCommit=false,buildOnStartup=false}
   [junit4]   2> 2340749 INFO  (coreLoadExecutor-10374-thread-1) [    x:collection1] o.a.s.s.s.SolrSuggester Dictionary loaded with params: {name=shortRandomAnalyzingInfixSuggester,lookupImpl=AnalyzingInfixLookupFactory,dictionaryImpl=RandomTestDictionaryFactory,randDictMaxItems=100,indexPath=short_random_analyzing_infix_suggester,suggestAnalyzerFieldType=text,buildOnCommit=false,buildOnStartup=false}
   [junit4]   2> 2340749 INFO  (coreLoadExecutor-10374-thread-1) [    x:collection1] o.a.s.h.c.SuggestComponent Initializing SuggestComponent
   [junit4]   2> 2340749 INFO  (coreLoadExecutor-10374-thread-1) [    x:collection1] o.a.s.s.s.SolrSuggester init: {name=longRandomAnalyzingInfixSuggester,lookupImpl=AnalyzingInfixLookupFactory,dictionaryImpl=RandomTestDictionaryFactory,randDictMaxItems=100000,indexPath=long_random_analyzing_infix_suggester,suggestAnalyzerFieldType=text,buildOnCommit=false,buildOnStartup=false}
   [junit4]   2> 2340755 INFO  (coreLoadExecutor-10374-thread-1) [    x:collection1] o.a.s.s.s.SolrSuggester Dictionary loaded with params: {name=longRandomAnalyzingInfixSuggester,lookupImpl=AnalyzingInfixLookupFactory,dictionaryImpl=RandomTestDictionaryFactory,randDictMaxItems=100000,indexPath=long_random_analyzing_infix_suggester,suggestAnalyzerFieldType=text,buildOnCommit=false,buildOnStartup=false}
   [junit4]   2> 2340755 INFO  (coreLoadExecutor-10374-thread-1) [    x:collection1] o.a.s.h.c.SuggestComponent Initializing SuggestComponent
   [junit4]   2> 2340755 INFO  (coreLoadExecutor-10374-thread-1) [    x:collection1] o.a.s.s.s.SolrSuggester init: {name=shortRandomBlendedInfixSuggester,lookupImpl=BlendedInfixLookupFactory,dictionaryImpl=RandomTestDictionaryFactory,randDictMaxItems=100,blenderType=position_linear,suggestAnalyzerFieldType=text,indexPath=short_random_blended_infix_suggester,highlight=true,buildOnStartup=false,buildOnCommit=false}
   [junit4]   2> 2340757 INFO  (coreLoadExecutor-10374-thread-1) [    x:collection1] o.a.s.s.s.SolrSuggester Dictionary loaded with params: {name=shortRandomBlendedInfixSuggester,lookupImpl=BlendedInfixLookupFactory,dictionaryImpl=RandomTestDictionaryFactory,randDictMaxItems=100,blenderType=position_linear,suggestAnalyzerFieldType=text,indexPath=short_random_blended_infix_suggester,highlight=true,buildOnStartup=false,buildOnCommit=false}
   [junit4]   2> 2340758 INFO  (coreLoadExecutor-10374-thread-1) [    x:collection1] o.a.s.h.ReplicationHandler Commits will be reserved for  10000
   [junit4]   2> 2340758 INFO  (searcherExecutor-10375-thread-1-processing-x:collection1) [    x:collection1] o.a.s.c.SolrCore [collection1] Registered new searcher Searcher@7e5e1b33[collection1] main{ExitableDirectoryReader(UninvertingDirectoryReader())}
   [junit4]   2> 2340764 INFO  (SUITE-InfixSuggestersTest-seed#[CC507C6B1CD6524F]-worker) [    ] o.a.s.SolrTestCaseJ4 ####initCore end
   [junit4]   2> 2340772 INFO  (TEST-InfixSuggestersTest.testTwoSuggestersBuildThenReload-seed#[CC507C6B1CD6524F]) [    ] o.a.s.SolrTestCaseJ4 ###Starting testTwoSuggestersBuildThenReload
   [junit4]   2> 2340772 INFO  (TEST-InfixSuggestersTest.testTwoSuggestersBuildThenReload-seed#[CC507C6B1CD6524F]) [    ] o.a.s.h.c.SuggestComponent SuggestComponent prepare with : qt=/suggest_analyzing_infix_short_dictionary&suggest=true&suggest.buildAll=true&wt=xml&indent=off
   [junit4]   2> 2340772 INFO  (TEST-InfixSuggestersTest.testTwoSuggestersBuildThenReload-seed#[CC507C6B1CD6524F]) [    ] o.a.s.s.s.SolrSuggester SolrSuggester.build(shortRandomAnalyzingInfixSuggester)
   [junit4]   2> 2340821 INFO  (TEST-InfixSuggestersTest.testTwoSuggestersBuildThenReload-seed#[CC507C6B1CD6524F]) [    ] o.a.s.s.s.RandomTestDictionaryFactory org.apache.solr.spelling.suggest.RandomTestDictionaryFactory$RandomTestDictionary.enabled.shortRandomAnalyzingInfixSuggester disabled after emitting 100 items.
   [junit4]   2> 2341024 INFO  (TEST-InfixSuggestersTest.testTwoSuggestersBuildThenReload-seed#[CC507C6B1CD6524F]) [    ] o.a.s.h.c.SuggestComponent SuggestComponent process with : qt=/suggest_analyzing_infix_short_dictionary&suggest=true&suggest.buildAll=true&wt=xml&indent=off
   [junit4]   2> 2341024 INFO  (TEST-InfixSuggestersTest.testTwoSuggestersBuildThenReload-seed#[CC507C6B1CD6524F]) [    ] o.a.s.c.S.Request [collection1]  webapp=null path=null params={qt=/suggest_analyzing_infix_short_dictionary&suggest.buildAll=true&wt=xml} status=0 QTime=252
   [junit4]   2> 2341032 ERROR (TEST-InfixSuggestersTest.testTwoSuggestersBuildThenReload-seed#[CC507C6B1CD6524F]) [    ] o.a.s.c.CorePropertiesLocator Couldn't load core descriptor from C:\Users\jenkins\workspace\Lucene-Solr-7.0-Windows\solr\core\src\test-files\solr\collection1\core.properties:java.nio.file.NoSuchFileException: C:\Users\jenkins\workspace\Lucene-Solr-7.0-Windows\solr\core\src\test-files\solr\collection1\core.properties
   [junit4]   2> 2341033 INFO  (TEST-InfixSuggestersTest.testTwoSuggestersBuildThenReload-seed#[CC507C6B1CD6524F]) [    ] o.a.s.c.SolrResourceLoader [null] Added 2 libs to classloader, from paths: [/C:/Users/jenkins/workspace/Lucene-Solr-7.0-Windows/solr/core/src/test-files/solr/collection1/lib, /C:/Users/jenkins/workspace/Lucene-Solr-7.0-Windows/solr/core/src/test-files/solr/collection1/lib/classes]
   [junit4]   2> 2341105 INFO  (TEST-InfixSuggestersTest.testTwoSuggestersBuildThenReload-seed#[CC507C6B1CD6524F]) [    ] o.a.s.c.SolrConfig Using Lucene MatchVersion: 7.0.0
   [junit4]   2> 2341115 INFO  (TEST-InfixSuggestersTest.testTwoSuggestersBuildThenReload-seed#[CC507C6B1CD6524F]) [    ] o.a.s.s.IndexSchema [collection1] Schema name=test
   [junit4]   2> 2341200 INFO  (TEST-InfixSuggestersTest.testTwoSuggestersBuildThenReload-seed#[CC507C6B1CD6524F]) [    ] o.a.s.s.IndexSchema Loaded schema test/1.0 with uniqueid field id
   [junit4]   2> 2341217 INFO  (TEST-InfixSuggestersTest.testTwoSuggestersBuildThenReload-seed#[CC507C6B1CD6524F]) [    ] o.a.s.c.CoreContainer Reloading SolrCore 'collection1' using configuration from instancedir C:\Users\jenkins\workspace\Lucene-Solr-7.0-Windows\solr\core\src\test-files\solr\collection1
   [junit4]   2> 2341255 INFO  (TEST-InfixSuggestersTest.testTwoSuggestersBuildThenReload-seed#[CC507C6B1CD6524F]) [    x:collection1] o.a.s.m.r.SolrJmxReporter JMX monitoring for 'solr.core.collection1' (registry 'solr.core.collection1') enabled at server: com.sun.jmx.mbeanserver.JmxMBeanServer@2528ba64
   [junit4]   2> 2341255 INFO  (TEST-InfixSuggestersTest.testTwoSuggestersBuildThenReload-seed#[CC507C6B1CD6524F]) [    x:collection1] o.a.s.c.SolrCore [[collection1] ] Opening new SolrCore at [C:\Users\jenkins\workspace\Lucene-Solr-7.0-Windows\solr\core\src\test-files\solr\collection1], dataDir=[C:\Users\jenkins\workspace\Lucene-Solr-7.0-Windows\solr\build\solr-core\test\J0\temp\solr.handler.component.InfixSuggestersTest_CC507C6B1CD6524F-001\init-core-data-001\]
   [junit4]   2> 2341397 INFO  (TEST-InfixSuggestersTest.testTwoSuggestersBuildThenReload-seed#[CC507C6B1CD6524F]) [    x:collection1] o.a.s.u.CommitTracker Hard AutoCommit: disabled
   [junit4]   2> 2341397 INFO  (TEST-InfixSuggestersTest.testTwoSuggestersBuildThenReload-seed#[CC507C6B1CD6524F]) [    x:collection1] o.a.s.u.CommitTracker Soft AutoCommit: disabled
   [junit4]   2> 2341397 INFO  (TEST-InfixSuggestersTest.testTwoSuggestersBuildThenReload-seed#[CC507C6B1CD6524F]) [    x:collection1] o.a.s.s.SolrIndexSearcher Opening [Searcher@1ebf6b6[collection1] main]
   [junit4]   2> 2341397 WARN  (TEST-InfixSuggestersTest.testTwoSuggestersBuildThenReload-seed#[CC507C6B1CD6524F]) [    x:collection1] o.a.s.r.ManagedResourceStorage Cannot write to config directory C:\Users\jenkins\workspace\Lucene-Solr-7.0-Windows\solr\core\src\test-files\solr\collection1\conf; switching to use InMemory storage instead.
   [junit4]   2> 2341397 INFO  (TEST-InfixSuggestersTest.testTwoSuggestersBuildThenReload-seed#[CC507C6B1CD6524F]) [    x:collection1] o.a.s.h.c.SuggestComponent Initializing SuggestComponent
   [junit4]   2> 2341397 INFO  (TEST-InfixSuggestersTest.testTwoSuggestersBuildThenReload-seed#[CC507C6B1CD6524F]) [    x:collection1] o.a.s.s.s.SolrSuggester init: {name=shortRandomAnalyzingInfixSuggester,lookupImpl=AnalyzingInfixLookupFactory,dictionaryImpl=RandomTestDictionaryFactory,randDictMaxItems=100,indexPath=short_random_analyzing_infix_suggester,suggestAnalyzerFieldType=text,buildOnCommit=false,buildOnStartup=false}
   [junit4]   2> 2341477 INFO  (TEST-InfixSuggestersTest.testTwoSuggestersBuildThenReload-seed#[CC507C6B1CD6524F]) [    x:collection1] o.a.s.s.s.SolrSuggester Dictionary loaded with params: {name=shortRandomAnalyzingInfixSuggester,lookupImpl=AnalyzingInfixLookupFactory,dictionaryImpl=RandomTestDictionaryFactory,randDictMaxItems=100,indexPath=short_random_analyzing_infix_suggester,suggestAnalyzerFieldType=text,buildOnCommit=false,buildOnStartup=false}
   [junit4]   2> 2341479 INFO  (TEST-InfixSuggestersTest.testTwoSuggestersBuildThenReload-seed#[CC507C6B1CD6524F]) [    x:collection1] o.a.s.h.c.SuggestComponent Initializing SuggestComponent
   [junit4]   2> 2341479 INFO  (TEST-InfixSuggestersTest.testTwoSuggestersBuildThenReload-seed#[CC507C6B1CD6524F]) [    x:collection1] o.a.s.s.s.SolrSuggester init: {name=longRandomAnalyzingInfixSuggester,lookupImpl=AnalyzingInfixLookupFactory,dictionaryImpl=RandomTestDictionaryFactory,randDictMaxItems=100000,indexPath=long_random_analyzing_infix_suggester,suggestAnalyzerFieldType=text,buildOnCommit=false,buildOnStartup=false}
   [junit4]   2> 2341479 INFO  (TEST-InfixSuggestersTest.testTwoSuggestersBuildThenReload-seed#[CC507C6B1CD6524F]) [    x:collection1] o.a.s.s.s.SolrSuggester Dictionary loaded with params: {name=longRandomAnalyzingInfixSuggester,lookupImpl=AnalyzingInfixLookupFactory,dictionaryImpl=RandomTestDictionaryFactory,randDictMaxItems=100000,indexPath=long_random_analyzing_infix_suggester,suggestAnalyzerFieldType=text,buildOnCommit=false,buildOnStartup=false}
   [junit4]   2> 2341479 INFO  (TEST-InfixSuggestersTest.testTwoSuggestersBuildThenReload-seed#[CC507C6B1CD6524F]) [    x:collection1] o.a.s.h.c.SuggestComponent Initializing SuggestComponent
   [junit4]   2> 2341479 INFO  (TEST-InfixSuggestersTest.testTwoSuggestersBuildThenReload-seed#[CC507C6B1CD6524F]) [    x:collection1] o.a.s.s.s.SolrSuggester init: {name=shortRandomBlendedInfixSuggester,lookupImpl=BlendedInfixLookupFactory,dictionaryImpl=RandomTestDictionaryFactory,randDictMaxItems=100,blenderType=position_linear,suggestAnalyzerFieldType=text,indexPath=short_random_blended_infix_suggester,highlight=true,buildOnStartup=false,buildOnCommit=false}
   [junit4]   2> 2341480 INFO  (TEST-InfixSuggestersTest.testTwoSuggestersBuildThenReload-seed#[CC507C6B1CD6524F]) [    x:collection1] o.a.s.s.s.SolrSuggester Dictionary loaded with params: {name=shortRandomBlendedInfixSuggester,lookupImpl=BlendedInfixLookupFactory,dictionaryImpl=RandomTestDictionaryFactory,randDictMaxItems=100,blenderType=position_linear,suggestAnalyzerFieldType=text,indexPath=short_random_blended_infix_suggester,highlight=true,buildOnStartup=false,buildOnCommit=false}
   [junit4]   2> 2341480 INFO  (TEST-InfixSuggestersTest.testTwoSuggestersBuildThenReload-seed#[CC507C6B1CD6524F]) [    x:collection1] o.a.s.h.ReplicationHandler Commits will be reserved for  10000
   [junit4]   2> 2341527 INFO  (TEST-InfixSuggestersTest.testTwoSuggestersBuildThenReload-seed#[CC507C6B1CD6524F]) [    x:collection1] o.a.s.u.RandomMergePolicy RandomMergePolicy wrapping class org.apache.lucene.index.TieredMergePolicy: [TieredMergePolicy: maxMergeAtOnce=40, maxMergeAtOnceExplicit=15, maxMergedSegmentMB=45.5537109375, floorSegmentMB=0.2587890625, forceMergeDeletesPctAllowed=12.676412838441129, segmentsPerTier=18.0, maxCFSSegmentSizeMB=8.796093022207999E12, noCFSRatio=0.0
   [junit4]   2> 2341530 INFO  (searcherExecutor-10379-thread-1-processing-x:collection1) [    x:collection1] o.a.s.c.SolrCore [collection1] Registered new searcher Searcher@1ebf6b6[collection1] main{ExitableDirectoryReader(UninvertingDirectoryReader())}
   [junit4]   2> 2341532 INFO  (TEST-InfixSuggestersTest.testTwoSuggestersBuildThenReload-seed#[CC507C6B1CD6524F]) [    x:collection1] o.a.s.u.DefaultSolrCoreState New IndexWriter is ready to be used.
   [junit4]   2> 2341532 INFO  (TEST-InfixSuggestersTest.testTwoSuggestersBuildThenReload-seed#[CC507C6B1CD6524F]) [    x:collection1] o.a.s.s.SolrIndexSearcher Opening [Searcher@583b2a06[collection1] main]
   [junit4]   2> 2341533 INFO  (searcherExecutor-10379-thread-1-processing-x:collection1) [    x:collection1] o.a.s.c.SolrCore [collection1] Registered new searcher Searcher@583b2a06[collection1] main{ExitableDirectoryReader(UninvertingDirectoryReader())}
   [junit4]   2> 2341535 INFO  (TEST-InfixSuggestersTest.testTwoSuggestersBuildThenReload-seed#[CC507C6B1CD6524F]) [    x:collection1] o.a.s.c.SolrCore [collection1]  CLOSING SolrCore org.apache.solr.core.SolrCore@24d70092
   [junit4]   2> 2341535 INFO  (TEST-InfixSuggestersTest.testTwoSuggestersBuildThenReload-seed#[CC507C6B1CD6524F]) [    x:collection1] o.a.s.m.SolrMetricManager Closing metric reporters for registry=solr.core.collection1, tag=618070162
   [junit4]   2> 2341535 INFO  (TEST-InfixSuggestersTest.testTwoSuggestersBuildThenReload-seed#[CC507C6B1CD6524F]) [    x:collection1] o.a.s.m.r.SolrJmxReporter Closing reporter [org.apache.solr.metrics.reporters.SolrJmxReporter@637a95dc: rootName = null, domain = solr.core.collection1, service url = null, agent id = null] for registry solr.core.collection1 / com.codahale.metrics.MetricRegistry@486094e3
   [junit4]   2> 2341544 INFO  (TEST-InfixSuggestersTest.testTwoSuggestersBuildThenReload-seed#[CC507C6B1CD6524F]) [    x:collection1] o.a.s.h.c.SuggestComponent SuggestComponent prepare with : qt=/suggest_blended_infix_short_dictionary&suggest.onlyMorePopular=true&indent=off&suggest.count=10&suggest=true&suggest.collate=true&suggest.buildAll=true&suggest.dictionary=shortRandomBlendedInfixSuggester&wt=xml
   [junit4]   2> 2341544 INFO  (TEST-InfixSuggestersTest.testTwoSuggestersBuildThenReload-seed#[CC507C6B1CD6524F]) [    x:collection1] o.a.s.s.s.SolrSuggester SolrSuggester.build(shortRandomBlendedInfixSuggester)
   [junit4]   2> 2341575 INFO  (TEST-InfixSuggestersTest.testTwoSuggestersBuildThenReload-seed#[CC507C6B1CD6524F]) [    x:collection1] o.a.s.s.s.RandomTestDictionaryFactory org.apache.solr.spelling.suggest.RandomTestDictionaryFactory$RandomTestDictionary.enabled.shortRandomBlendedInfixSuggester disabled after emitting 100 items.
   [junit4]   2> 2341635 INFO  (TEST-InfixSuggestersTest.testTwoSuggestersBuildThenReload-seed#[CC507C6B1CD6524F]) [    x:collection1] o.a.s.h.c.SuggestComponent SuggestComponent process with : qt=/suggest_blended_infix_short_dictionary&suggest.onlyMorePopular=true&indent=off&suggest.count=10&suggest=true&suggest.collate=true&suggest.buildAll=true&suggest.dictionary=shortRandomBlendedInfixSuggester&wt=xml
   [junit4]   2> 2341635 INFO  (TEST-InfixSuggestersTest.testTwoSuggestersBuildThenReload-seed#[CC507C6B1CD6524F]) [    x:collection1] o.a.s.c.S.Request [collection1]  webapp=null path=null params={qt=/suggest_blended_infix_short_dictionary&suggest.buildAll=true&wt=xml} status=0 QTime=91
   [junit4]   2> 2341636 ERROR (TEST-InfixSuggestersTest.testTwoSuggestersBuildThenReload-seed#[CC507C6B1CD6524F]) [    x:collection1] o.a.s.c.CorePropertiesLocator Couldn't load core descriptor from C:\Users\jenkins\workspace\Lucene-Solr-7.0-Windows\solr\core\src\test-files\solr\collection1\core.properties:java.nio.file.NoSuchFileException: C:\Users\jenkins\workspace\Lucene-Solr-7.0-Windows\solr\core\src\test-files\solr\collection1\core.properties
   [junit4]   2> 2341638 INFO  (TEST-InfixSuggestersTest.testTwoSuggestersBuildThenReload-seed#[CC507C6B1CD6524F]) [    x:collection1] o.a.s.c.SolrResourceLoader [null] Added 2 libs to classloader, from paths: [/C:/Users/jenkins/workspace/Lucene-Solr-7.0-Windows/solr/core/src/test-files/solr/collection1/lib, /C:/Users/jenkins/workspace/Lucene-Solr-7.0-Windows/solr/core/src/test-files/solr/collection1/lib/classes]
   [junit4]   2> 2341707 INFO  (TEST-InfixSuggestersTest.testTwoSuggestersBuildThenReload-seed#[CC507C6B1CD6524F]) [    x:collection1] o.a.s.c.SolrConfig Using Lucene MatchVersion: 7.0.0
   [junit4]   2> 2341732 INFO  (TEST-InfixSuggestersTest.testTwoSuggestersBuildThenReload-seed#[CC507C6B1CD6524F]) [    x:collection1] o.a.s.s.IndexSchema [collection1] Schema name=test
   [junit4]   2> 2341830 INFO  (TEST-InfixSuggestersTest.testTwoSuggestersBuildThenReload-seed#[CC507C6B1CD6524F]) [    x:collection1] o.a.s.s.IndexSchema Loaded schema test/1.0 with uniqueid field id
   [junit4]   2> 2341845 INFO  (TEST-InfixSuggestersTest.testTwoSuggestersBuildThenReload-seed#[CC507C6B1CD6524F]) [    x:collection1] o.a.s.c.CoreContainer Reloading SolrCore 'collection1' using configuration from instancedir C:\Users\jenkins\workspace\Lucene-Solr-7.0-Windows\solr\core\src\test-files\solr\collection1
   [junit4]   2> 2341877 INFO  (TEST-InfixSuggestersTest.testTwoSuggestersBuildThenReload-seed#[CC507C6B1CD6524F]) [    x:collection1] o.a.s.m.r.SolrJmxReporter JMX monitoring for 'solr.core.collection1' (registry 'solr.core.collection1') enabled at server: com.sun.jmx.mbeanserver.JmxMBeanServer@2528ba64
   [junit4]   2> 2341877 INFO  (TEST-InfixSuggestersTest.testTwoSuggestersBuildThenReload-seed#[CC507C6B1CD6524F]) [    x:collection1] o.a.s.c.SolrCore [[collection1] ] Opening new SolrCore at [C:\Users\jenkins\workspace\Lucene-Solr-7.0-Windows\solr\core\src\test-files\solr\collection1], dataDir=[C:\Users\jenkins\workspace\Lucene-Solr-7.0-Windows\solr\build\solr-core\test\J0\temp\solr.handler.component.InfixSuggestersTest_CC507C6B1CD6524F-001\init-core-data-001\]
   [junit4]   2> 2342009 INFO  (TEST-InfixSuggestersTest.testTwoSuggestersBuildThenReload-seed#[CC507C6B1CD6524F]) [    x:collection1] o.a.s.u.CommitTracker Hard AutoCommit: disabled
   [junit4]   2> 2342009 INFO  (TEST-InfixSuggestersTest.testTwoSuggestersBuildThenReload-seed#[CC507C6B1CD6524F]) [    x:collection1] o.a.s.u.CommitTracker Soft AutoCommit: disabled
   [junit4]   2> 2342012 INFO  (TEST-InfixSuggestersTest.testTwoSuggestersBuildThenReload-seed#[CC507C6B1CD6524F]) [    x:collection1] o.a.s.s.SolrIndexSearcher Opening [Searcher@3fcad61[collection1] main]
   [junit4]   2> 2342013 WARN  (TEST-InfixSuggestersTest.testTwoSuggestersBuildThenReload-seed#[CC507C6B1CD6524F]) [    x:collection1] o.a.s.r.ManagedResourceStorage Cannot write to config directory C:\Users\jenkins\workspace\Lucene-Solr-7.0-Windows\solr\core\src\test-files\solr\collection1\conf; switching to use InMemory storage instead.
   [junit4]   2> 2342013 INFO  (TEST-InfixSuggestersTest.testTwoSuggestersBuildThenReload-seed#[CC507C6B1CD6524F]) [    x:collection1] o.a.s.h.c.SuggestComponent Initializing SuggestComponent
   [junit4]   2> 2342013 INFO  (TEST-InfixSuggestersTest.testTwoSuggestersBuildThenReload-seed#[CC507C6B1CD6524F]) [    x:collection1] o.a.s.s.s.SolrSuggester init: {name=shortRandomAnalyzingInfixSuggester,lookupImpl=AnalyzingInfixLookupFactory,dictionaryImpl=RandomTestDictionaryFactory,randDictMaxItems=100,indexPath=short_random_analyzing_infix_suggester,suggestAnalyzerFieldType=text,buildOnCommit=false,buildOnStartup=false}
   [junit4]   2> 2342018 INFO  (TEST-InfixSuggestersTest.testTwoSuggestersBuildThenReload-seed#[CC507C6B1CD6524F]) [    x:collection1] o.a.s.s.s.SolrSuggester Dictionary loaded with params: {name=shortRandomAnalyzingInfixSuggester,lookupImpl=AnalyzingInfixLookupFactory,dictionaryImpl=RandomTestDictionaryFactory,randDictMaxItems=100,indexPath=short_random_analyzing_infix_suggester,suggestAnalyzerFieldType=text,buildOnCommit=false,buildOnStartup=false}
   [junit4]   2> 2342018 INFO  (TEST-InfixSuggestersTest.testTwoSuggestersBuildThenReload-seed#[CC507C6B1CD6524F]) [    x:collection1] o.a.s.h.c.SuggestComponent Initializing SuggestComponent
   [junit4]   2> 2342018 INFO  (TEST-InfixSuggestersTest.testTwoSuggestersBuildThenReload-seed#[CC507C6B1CD6524F]) [    x:collection1] o.a.s.s.s.SolrSuggester init: {name=longRandomAnalyzingInfixSuggester,lookupImpl=AnalyzingInfixLookupFactory,dictionaryImpl=RandomTestDictionaryFactory,randDictMaxItems=100000,indexPath=long_random_analyzing_infix_suggester,suggestAnalyzerFieldType=text,buildOnCommit=false,buildOnStartup=false}
   [junit4]   2> 2342019 INFO  (TEST-InfixSuggestersTest.testTwoSuggestersBuildThenReload-seed#[CC507C6B1CD6524F]) [    x:collection1] o.a.s.s.s.SolrSuggester Dictionary loaded with params: {name=longRandomAnalyzingInfixSuggester,lookupImpl=AnalyzingInfixLookupFactory,dictionaryImpl=RandomTestDictionaryFactory,randDictMaxItems=100000,indexPath=long_random_analyzing_infix_suggester,suggestAnalyzerFieldType=text,buildOnCommit=false,buildOnStartup=false}
   [junit4]   2> 2342019 INFO  (TEST-InfixSuggestersTest.testTwoSuggestersBuildThenReload-seed#[CC507C6B1CD6524F]) [    x:collection1] o.a.s.h.c.SuggestComponent Initializing SuggestComponent
   [junit4]   2> 2342020 INFO  (TEST-InfixSuggestersTest.testTwoSuggestersBuildThenReload-seed#[CC507C6B1CD6524F]) [    x:collection1] o.a.s.s.s.SolrSuggester init: {name=shortRandomBlendedInfixSuggester,lookupImpl=BlendedInfixLookupFactory,dictionaryImpl=RandomTestDictionaryFactory,randDictMaxItems=100,blenderType=position_linear,suggestAnalyzerFieldType=text,indexPath=short_random_blended_infix_suggester,highlight=true,buildOnStartup=false,buildOnCommit=false}
   [junit4]   2> 2342023 INFO  (TEST-InfixSuggestersTest.testTwoSuggestersBuildThenReload-seed#[CC507C6B1CD6524F]) [    x:collection1] o.a.s.s.s.SolrSuggester Dictionary loaded with params: {name=shortRandomBlendedInfixSuggester,lookupImpl=BlendedInfixLookupFactory,dictionaryImpl=RandomTestDictionaryFactory,randDictMaxItems=100,blenderType=position_linear,suggestAnalyzerFieldType=text,indexPath=short_random_blended_infix_suggester,highlight=true,buildOnStartup=false,buildOnCommit=false}
   [junit4]   2> 2342023 INFO  (TEST-InfixSuggestersTest.testTwoSuggestersBuildThenReload-seed#[CC507C6B1CD6524F]) [    x:collection1] o.a.s.h.ReplicationHandler Commits will be reserved for  10000
   [junit4]   2> 2342025 INFO  (searcherExecutor-10383-thread-1-processing-x:collection1) [    x:collection1] o.a.s.c.SolrCore [collection1] Registered new searcher Searcher@3fcad61[collection1] main{ExitableDirectoryReader(UninvertingDirectoryReader())}
   [junit4]   2> 2342027 INFO  (TEST-InfixSuggestersTest.testTwoSuggestersBuildThenReload-seed#[CC507C6B1CD6524F]) [    x:collection1] o.a.s.u.RandomMergePolicy RandomMergePolicy wrapping class org.apache.lucene.index.TieredMergePolicy: [TieredMergePolicy: maxMergeAtOnce=18, maxMergeAtOnceExplicit=46, maxMergedSegmentMB=10.8193359375, floorSegmentMB=1.7265625, forceMergeDeletesPctAllowed=15.377956395394754, segmentsPerTier=41.0, maxCFSSegmentSizeMB=8.796093022207999E12, noCFSRatio=0.5181091904884237
   [junit4]   2> 2342028 INFO  (TEST-InfixSuggestersTest.testTwoSuggestersBuildThenReload-seed#[CC507C6B1CD6524F]) [    x:collection1] o.a.s.u.DefaultSolrCoreState New IndexWriter is ready to be used.
   [junit4]   2> 2342028 INFO  (TEST-InfixSuggestersTest.testTwoSuggestersBuildThenReload-seed#[CC507C6B1CD6524F]) [    x:collection1] o.a.s.s.SolrIndexSearcher Opening [Searcher@31522b98[collection1] main]
   [junit4]   2> 2342031 INFO  (searcherExecutor-10383-thread-1-processing-x:collection1) [    x:collection1] o.a.s.c.SolrCore [collection1] Registered new searcher Searcher@31522b98[collection1] main{ExitableDirectoryReader(UninvertingDirectoryReader())}
   [junit4]   2> 2342031 INFO  (TEST-InfixSuggestersTest.testTwoSuggestersBuildThenReload-seed#[CC507C6B1CD6524F]) [    x:collection1] o.a.s.c.SolrCore [collection1]  CLOSING SolrCore org.apache.solr.core.SolrCore@37825c54
   [junit4]   2> 2342031 INFO  (TEST-InfixSuggestersTest.testTwoSuggestersBuildThenReload-seed#[CC507C6B1CD6524F]) [    x:collection1] o.a.s.m.SolrMetricManager Closing metric reporters for registry=solr.core.collection1, tag=931290196
   [junit4]   2> 2342031 INFO  (TEST-InfixSuggestersTest.testTwoSuggestersBuildThenReload-seed#[CC507C6B1CD6524F]) [    x:collection1] o.a.s.m.r.SolrJmxReporter Closing reporter [org.apache.solr.metrics.reporters.SolrJmxReporter@4b47fd2d: rootName = null, domain = solr.core.collection1, service url = null, agent id = null] for registry solr.core.collection1 / com.codahale.metrics.MetricRegistry@486094e3
   [junit4]   2> 2342062 INFO  (TEST-InfixSuggestersTest.testTwoSuggestersBuildThenReload-seed#[CC507C6B1CD6524F]) [    x:collection1] o.a.s.SolrTestCaseJ4 ###Ending testTwoSuggestersBuildThenReload
   [junit4]   2> 2342103 INFO  (TEST-InfixSuggestersTest.testAnalyzingInfixSuggesterBuildThenReload-seed#[CC507C6B1CD6524F]) [    x:collection1] o.a.s.SolrTestCaseJ4 ###Starting testAnalyzingInfixSuggesterBuildThenReload
   [junit4]   2> 2342103 INFO  (TEST-InfixSuggestersTest.testAnalyzingInfixSuggesterBuildThenReload-seed#[CC507C6B1CD6524F]) [    x:collection1] o.a.s.h.c.SuggestComponent SuggestComponent prepare with : qt=/suggest_analyzing_infix_short_dictionary&suggest=true&suggest.buildAll=true&wt=xml&indent=off
   [junit4]   2> 2342103 INFO  (TEST-InfixSuggestersTest.testAnalyzingInfixSuggesterBuildThenReload-seed#[CC507C6B1CD6524F]) [    x:collection1] o.a.s.s.s.SolrSuggester SolrSuggester.build(shortRandomAnalyzingInfixSuggester)
   [junit4]   2> 2342125 INFO  (TEST-InfixSuggestersTest.testAnalyzingInfixSuggesterBuildThenReload-seed#[CC507C6B1CD6524F]) [    x:collection1] o.a.s.s.s.RandomTestDictionaryFactory org.apache.solr.spelling.suggest.RandomTestDictionaryFactory$RandomTestDictionary.enabled.shortRandomAnalyzingInfixSuggester disabled after emitting 100 items.
   [junit4]   2> 2342306 INFO  (TEST-InfixSuggestersTest.testAnalyzingInfixSuggesterBuildThenReload-seed#[CC507C6B1CD6524F]) [    x:collection1] o.a.s.h.c.SuggestComponent SuggestComponent process with : qt=/suggest_analyzing_infix_short_dictionary&suggest=true&suggest.buildAll=true&wt=xml&indent=off
   [junit4]   2> 2342306 INFO  (TEST-InfixSuggestersTest.testAnalyzingInfixSuggesterBuildThenReload-seed#[CC507C6B1CD6524F]) [    x:collection1] o.a.s.c.S.Request [collection1]  webapp=null path=null params={qt=/suggest_analyzing_infix_short_dictionary&suggest.buildAll=true&wt=xml} status=0 QTime=203
   [junit4]   2> 2342307 ERROR (TEST-InfixSuggestersTest.testAnalyzingInfixSuggesterBuildThenReload-seed#[CC507C6B1CD6524F]) [    x:collection1] o.a.s.c.CorePropertiesLocator Couldn't load core descriptor from C:\Users\jenkins\workspace\Lucene-Solr-7.0-Windows\solr\core\src\test-files\solr\collection1\core.properties:java.nio.file.NoSuchFileException: C:\Users\jenkins\workspace\Lucene-Solr-7.0-Windows\solr\core\src\test-files\solr\collection1\core.properties
   [junit4]   2> 2342308 INFO  (TEST-InfixSuggestersTest.testAnalyzingInfixSuggesterBuildThenReload-seed#[CC507C6B1CD6524F]) [    x:collection1] o.a.s.c.SolrResourceLoader [null] Added 2 libs to classloader, from paths: [/C:/Users/jenkins/workspace/Lucene-Solr-7.0-Windows/solr/core/src/test-files/solr/collection1/lib, /C:/Users/jenkins/workspace/Lucene-Solr-7.0-Windows/solr/core/src/test-files/solr/collection1/lib/classes]
   [junit4]   2> 2342443 INFO  (TEST-InfixSuggestersTest.testAnalyzingInfixSuggesterBuildThenReload-seed#[CC507C6B1CD6524F]) [    x:collection1] o.a.s.c.SolrConfig Using Lucene MatchVersion: 7.0.0
   [junit4]   2> 2342457 INFO  (TEST-InfixSuggestersTest.testAnalyzingInfixSuggesterBuildThenReload-seed#[CC507C6B1CD6524F]) [    x:collection1] o.a.s.s.IndexSchema [collection1] Schema name=test
   [junit4]   2> 2342602 INFO  (TEST-InfixSuggestersTest.testAnalyzingInfixSuggesterBuildThenReload-seed#[CC507C6B1CD6524F]) [    x:collection1] o.a.s.s.IndexSchema Loaded schema test/1.0 with uniqueid field id
   [junit4]   2> 2342619 INFO  (TEST-InfixSuggestersTest.testAnalyzingInfixSuggesterBuildThenReload-seed#[CC507C6B1CD6524F]) [    x:collection1] o.a.s.c.CoreContainer Reloading SolrCore 'collection1' using configuration from instancedir C:\Users\jenkins\workspace\Lucene-Solr-7.0-Windows\solr\core\src\test-files\solr\collection1
   [junit4]   2> 2342651 INFO  (TEST-InfixSuggestersTest.testAnalyzingInfixSuggesterBuildThenReload-seed#[CC507C6B1CD6524F]) [    x:collection1] o.a.s.m.r.SolrJmxReporter JMX monitoring for 'solr.core.collection1' (registry 'solr.core.collection1') enabled at server: com.sun.jmx.mbeanserver.JmxMBeanServer@2528ba64
   [junit4]   2> 2342651 INFO  (TEST-InfixSuggestersTest.testAnalyzingInfixSuggesterBuildThenReload-seed#[CC507C6B1CD6524F]) [    x:collection1] o.a.s.c.SolrCore [[collection1] ] Opening new SolrCore at [C:\Users\jenkins\workspace\Lucene-Solr-7.0-Windows\solr\core\src\test-files\solr\collection1], dataDir=[C:\Users\jenkins\workspace\Lucene-Solr-7.0-Windows\solr\build\solr-core\test\J0\temp\solr.handler.component.InfixSuggestersTest_CC507C6B1CD6524F-001\init-core-data-001\]
   [junit4]   2> 2342894 INFO  (TEST-InfixSuggestersTest.testAnalyzingInfixSuggesterBuildThenReload-seed#[CC507C6B1CD6524F]) [    x:collection1] o.a.s.u.CommitTracker Hard AutoCommit: disabled
   [junit4]   2> 2342895 INFO  (TEST-InfixSuggestersTest.testAnalyzingInfixSuggesterBuildThenReload-seed#[CC507C6B1CD6524F]) [    x:collection1] o.a.s.u.CommitTracker Soft AutoCommit: disabled
   [junit4]   2> 2342897 INFO  (TEST-InfixSuggestersTest.testAnalyzingInfixSuggesterBuildThenReload-seed#[CC507C6B1CD6524F]) [    x:collection1] o.a.s.s.SolrIndexSearcher Opening [Searcher@65ace6b8[collection1] main]
   [junit4]   2> 2342898 WARN  (TEST-InfixSuggestersTest.testAnalyzingInfixSuggesterBuildThenReload-seed#[CC507C6B1CD6524F]) [    x:collection1] o.a.s.r.ManagedResourceStorage Cannot write to config directory C:\Users\jenkins\workspace\Lucene-Solr-7.0-Windows\solr\core\src\test-files\solr\collection1\conf; switching to use InMemory storage instead.
   [junit4]   2> 2342898 INFO  (TEST-InfixSuggestersTest.testAnalyzingInfixSuggesterBuildThenReload-seed#[CC507C6B1CD6524F]) [    x:collection1] o.a.s.h.c.SuggestComponent Initializing SuggestComponent
   [junit4]   2> 2342898 INFO  (TEST-InfixSuggestersTest.testAnalyzingInfixSuggesterBuildThenReload-seed#[CC507C6B1CD6524F]) [    x:collection1] o.a.s.s.s.SolrSuggester init: {name=shortRandomAnalyzingInfixSuggester,lookupImpl=AnalyzingInfixLookupFactory,dictionaryImpl=RandomTestDictionaryFactory,randDictMaxItems=100,indexPath=short_random_analyzing_infix_suggester,suggestAnalyzerFieldType=text,buildOnCommit=false,buildOnStartup=false}
   [junit4]   2> 2342901 INFO  (TEST-InfixSuggestersTest.testAnalyzingInfixSuggesterBuildThenReload-seed#[CC507C6B1CD6524F]) [    x:collection1] o.a.s.s.s.SolrSuggester Dictionary loaded with params: {name=shortRandomAnalyzingInfixSuggester,lookupImpl=AnalyzingInfixLookupFactory,dictionaryImpl=RandomTestDictionaryFactory,randDictMaxItems=100,indexPath=short_random_analyzing_infix_suggester,suggestAnalyzerFieldType=text,buildOnCommit=false,buildOnStartup=false}
   [junit4]   2> 2342901 INFO  (TEST-InfixSuggestersTest.testAnalyzingInfixSuggesterBuildThenReload-seed#[CC507C6B1CD6524F]) [    x:collection1] o.a.s.h.c.SuggestComponent Initializing SuggestComponent
   [junit4]   2> 2342901 INFO  (TEST-InfixSuggestersTest.testAnalyzingInfixSuggesterBuildThenReload-seed#[CC507C6B1CD6524F]) [    x:collection1] o.a.s.s.s.SolrSuggester init: {name=longRandomAnalyzingInfixSuggester,lookupImpl=AnalyzingInfixLookupFactory,dictionaryImpl=RandomTestDictionaryFactory,randDictMaxItems=100000,indexPath=long_random_analyzing_infix_suggester,suggestAnalyzerFieldType=text,buildOnCommit=false,buildOnStartup=false}
   [junit4]   2> 2342901 INFO  (TEST-InfixSuggestersTest.testAnalyzingInfixSuggesterBuildThenReload-seed#[CC507C6B1CD6524F]) [    x:collection1] o.a.s.s.s.SolrSuggester Dictionary loaded with params: {name=longRandomAnalyzingInfixSuggester,lookupImpl=AnalyzingInfixLookupFactory,dictionaryImpl=RandomTestDictionaryFactory,randDictMaxItems=100000,indexPath=long_random_analyzing_infix_suggester,suggestAnalyzerFieldType=text,buildOnCommit=false,buildOnStartup=false}
   [junit4]   2> 2342905 INFO  (TEST-InfixSuggestersTest.testAnalyzingInfixSuggesterBuildThenReload-seed#[CC507C6B1CD6524F]) [    x:collection1] o.a.s.h.c.SuggestComponent Initializing SuggestComponent
   [junit4]   2> 2342905 INFO  (TEST-InfixSuggestersTest.testAnalyzingInfixSuggesterBuildThenReload-seed#[CC507C6B1CD6524F]) [    x:collection1] o.a.s.s.s.SolrSuggester init: {name=shortRandomBlendedInfixSuggester,lookupImpl=BlendedInfixLookupFactory,dictionaryImpl=RandomTestDictionaryFactory,randDictMaxItems=100,blenderType=position_linear,suggestAnalyzerFieldType=text,indexPath=short_random_blended_infix_suggester,highlight=true,buildOnStartup=false,buildOnCommit=false}
   [junit4]   2> 2342923 INFO  (TEST-InfixSuggestersTest.testAnalyzingInfixSuggesterBuildThenReload-seed#[CC507C6B1CD6524F]) [    x:collection1] o.a.s.s.s.SolrSuggester Dictionary loaded with params: {name=shortRandomBlendedInfixSuggester,lookupImpl=BlendedInfixLookupFactory,dictionaryImpl=RandomTestDictionaryFactory,randDictMaxItems=100,blenderType=position_linear,suggestAnalyzerFieldType=text,indexPath=short_random_blended_infix_suggester,highlight=true,buildOnStartup=false,buildOnCommit=false}
   [junit4]   2> 2342924 INFO  (TEST-InfixSuggestersTest.testAnalyzingInfixSuggesterBuildThenReload-seed#[CC507C6B1CD6524F]) [    x:collection1] o.a.s.h.ReplicationHandler Commits will be reserved for  10000
   [junit4]   2> 2342929 INFO  (TEST-InfixSuggestersTest.testAnalyzingInfixSuggesterBuildThenReload-seed#[CC507C6B1CD6524F]) [    x:collection1] o.a.s.u.RandomMergePolicy RandomMergePolicy wrapping class org.apache.lucene.index.LogByteSizeMergePolicy: [LogByteSizeMergePolicy: minMergeSize=1677721, mergeFactor=29, maxMergeSize=2147483648, maxMergeSizeForForcedMerge=9223372036854775807, calibrateSizeByDeletes=false, maxMergeDocs=2147483647, maxCFSSegmentSizeMB=8.796093022207999E12, noCFSRatio=0.3024384145344997]
   [junit4]   2> 2342939 INFO  (TEST-InfixSuggestersTest.testAnalyzingInfixSuggesterBuildThenReload-seed#[CC507C6B1CD6524F]) [    x:collection1] o.a.s.u.DefaultSolrCoreState New IndexWriter is ready to be used.
   [junit4]   2> 2342939 INFO  (searcherExecutor-10387-thread-1-processing-x:collection1) [    x:collection1] o.a.s.c.SolrCore [collection1] Registered new searcher Searcher@65ace6b8[collection1] main{ExitableDirectoryReader(UninvertingDirectoryReader())}
   [junit4]   2> 2342949 INFO  (TEST-InfixSuggestersTest.testAnalyzingInfixSuggesterBuildThenReload-seed#[CC507C6B1CD6524F]) [    x:collection1] o.a.s.s.SolrIndexSearcher Opening [Searcher@1d0150e4[collection1] main]
   [junit4]   2> 2342950 INFO  (TEST-InfixSuggestersTest.testAnalyzingInfixSuggesterBuildThenReload-seed#[CC507C6B1CD6524F]) [    x:collection1] o.a.s.c.SolrCore [collection1]  CLOSING SolrCore org.apache.solr.core.SolrCore@61dd89f5
   [junit4]   2> 2342950 INFO  (TEST-InfixSuggestersTest.testAnalyzingInfixSuggesterBuildThenReload-seed#[CC507C6B1CD6524F]) [    x:collection1] o.a.s.m.SolrMetricManager Closing metric reporters for registry=solr.core.collection1, tag=1641908725
   [junit4]   2> 2342950 INFO  (TEST-InfixSuggestersTest.testAnalyzingInfixSuggesterBuildThenReload-seed#[CC507C6B1CD6524F]) [    x:collection1] o.a.s.m.r.SolrJmxReporter Closing reporter [org.apache.solr.metrics.reporters.SolrJmxReporter@7b2dd037: rootName = null, domain = solr.core.collection1, service url = null, agent id = null] for registry solr.core.collection1 / com.codahale.metrics.MetricRegistry@486094e3
   [junit4]   2> 2342952 INFO  (searcherExecutor-10387-thread-1-processing-x:collection1) [    x:collection1] o.a.s.c.SolrCore [collection1] Registered new searcher Searcher@1d0150e4[collection1] main{ExitableDirectoryReader(UninvertingDirectoryReader())}
   [junit4]   2> 2342960 INFO  (TEST-InfixSuggestersTest.testAnalyzingInfixSuggesterBuildThenReload-seed#[CC507C6B1CD6524F]) [    x:collection1] o.a.s.SolrTestCaseJ4 ###Ending testAnalyzingInfixSuggesterBuildThenReload
   [junit4]   2> 2342960 INFO  (TEST-InfixSuggestersTest.testBlendedInfixSuggesterBuildThenReload-seed#[CC507C6B1CD6524F]) [    x:collection1] o.a.s.SolrTestCaseJ4 ###Starting testBlendedInfixSuggesterBuildThenReload
   [junit4]   2> 2342960 INFO  (TEST-InfixSuggestersTest.testBlendedInfixSuggesterBuildThenReload-seed#[CC507C6B1CD6524F]) [    x:collection1] o.a.s.h.c.SuggestComponent SuggestComponent prepare with : qt=/suggest_blended_infix_short_dictionary&suggest.onlyMorePopular=true&indent=off&suggest.count=10&suggest=true&suggest.collate=true&suggest.buildAll=true&suggest.dictionary=shortRandomBlendedInfixSuggester&wt=xml
   [junit4]   2> 2342960 INFO  (TEST-InfixSuggestersTest.testBlendedInfixSuggesterBuildThenReload-seed#[CC507C6B1CD6524F]) [    x:collection1] o.a.s.s.s.SolrSuggester SolrSuggester.build(shortRandomBlendedInfixSuggester)
   [junit4]   2> 2343058 INFO  (TEST-InfixSuggestersTest.testBlendedInfixSuggesterBuildThenReload-seed#[CC507C6B1CD6524F]) [    x:collection1] o.a.s.s.s.RandomTestDictionaryFactory org.apache.solr.spelling.suggest.RandomTestDictionaryFactory$RandomTestDictionary.enabled.shortRandomBlendedInfixSuggester disabled after emitting 100 items.
   [junit4]   2> 2343117 INFO  (TEST-InfixSuggestersTest.testBlendedInfixSuggesterBuildThenReload-seed#[CC507C6B1CD6524F]) [    x:collection1] o.a.s.h.c.SuggestComponent SuggestComponent process with : qt=/suggest_blended_infix_short_dictionary&suggest.onlyMorePopular=true&indent=off&suggest.count=10&suggest=true&suggest.collate=true&suggest.buildAll=true&suggest.dictionary=shortRandomBlendedInfixSuggester&wt=xml
   [junit4]   2> 2343117 INFO  (TEST-InfixSuggestersTest.testBlendedInfixSuggesterBuildThenReload-seed#[CC507C6B1CD6524F]) [    x:collection1] o.a.s.c.S.Request [collection1]  webapp=null path=null params={qt=/suggest_blended_infix_short_dictionary&suggest.buildAll=true&wt=xml} status=0 QTime=153
   [junit4]   2> 2343118 ERROR (TEST-InfixSuggestersTest.testBlendedInfixSuggesterBuildThenReload-seed#[CC507C6B1CD6524F]) [    x:collection1] o.a.s.c.CorePropertiesLocator Couldn't load core descriptor from C:\Users\jenkins\workspace\Lucene-Solr-7.0-Windows\solr\core\src\test-files\solr\collection1\core.properties:java.nio.file.NoSuchFileException: C:\Users\jenkins\workspace\Lucene-Solr-7.0-Windows\solr\core\src\test-files\solr\collection1\core.properties
   [junit4]   2> 2343119 INFO  (TEST-InfixSuggestersTest.testBlendedInfixSuggesterBuildThenReload-seed#[CC507C6B1CD6524F]) [    x:collection1] o.a.s.c.SolrResourceLoader [null] Added 2 libs to classloader, from paths: [/C:/Users/jenkins/workspace/Lucene-Solr-7.0-Windows/solr/core/src/test-files/solr/collection1/lib, /C:/Users/jenkins/workspace/Lucene-Solr-7.0-Windows/solr/core/src/test-files/solr/collection1/lib/classes]
   [junit4]   2> 2343297 INFO  (TEST-InfixSuggestersTest.testBlendedInfixSuggesterBuildThenReload-seed#[CC507C6B1CD6524F]) [    x:collection1] o.a.s.c.SolrConfig Using Lucene MatchVersion: 7.0.0
   [junit4]   2> 2343328 INFO  (TEST-InfixSuggestersTest.testBlendedInfixSuggesterBuildThenReload-seed#[CC507C6B1CD6524F]) [    x:collection1] o.a.s.s.IndexSchema [collection1] Schema name=test
   [junit4]   2> 2343416 INFO  (TEST-InfixSuggestersTest.testBlendedInfixSuggesterBuildThenReload-seed#[CC507C6B1CD6524F]) [    x:collection1] o.a.s.s.IndexSchema Loaded schema test/1.0 with uniqueid field id
   [junit4]   2> 2343440 INFO  (TEST-InfixSuggestersTest.testBlendedInfixSuggesterBuildThenReload-seed#[CC507C6B1CD6524F]) [    x:collection1] o.a.s.c.CoreContainer Reloading SolrCore 'collection1' using configuration from instancedir C:\Users\jenkins\workspace\Lucene-Solr-7.0-Windows\solr\core\src\test-files\solr\collection1
   [junit4]   2> 2343480 INFO  (TEST-InfixSuggestersTest.testBlendedInfixSuggesterBuildThenReload-seed#[CC507C6B1CD6524F]) [    x:collection1] o.a.s.m.r.SolrJmxReporter JMX monitoring for 'solr.core.collection1' (registry 'solr.core.collection1') enabled at server: com.sun.jmx.mbeanserver.JmxMBeanServer@2528ba64
   [junit4]   2> 2343480 INFO  (TEST-InfixSuggestersTest.testBlendedInfixSuggesterBuildThenReload-seed#[CC507C6B1CD6524F]) [    x:collection1] o.a.s.c.SolrCore [[collection1] ] Opening new SolrCore at [C:\Users\jenkins\workspace\Lucene-Solr-7.0-Windows\solr\core\src\test-files\solr\collection1], dataDir=[C:\Users\jenkins\workspace\Lucene-Solr-7.0-Windows\solr\build\solr-core\test\J0\temp\solr.handler.component.InfixSuggestersTest_CC507C6B1CD6524F-001\init-core-data-001\]
   [junit4]   2> 2343623 INFO  (TEST-InfixSuggestersTest.testBlendedInfixSuggesterBuildThenReload-seed#[CC507C6B1CD6524F]) [    x:collection1] o.a.s.u.CommitTracker Hard AutoCommit: disabled
   [junit4]   2> 2343623 INFO  (TEST-InfixSuggestersTest.testBlendedInfixSuggesterBuildThenReload-seed#[CC507C6B1CD6524F]) [    x:collection1] o.a.s.u.CommitTracker Soft AutoCommit: disabled
   [junit4]   2> 2343624 INFO  (TEST-InfixSuggestersTest.testBlendedInfixSuggesterBuildThenReload-seed#[CC507C6B1CD6524F]) [    x:collection1] o.a.s.s.SolrIndexSearcher Opening [Searcher@4012de23[collection1] main]
   [junit4]   2> 2343625 WARN  (TEST-InfixSuggestersTest.testBlendedInfixSuggesterBuildThenReload-seed#[CC507C6B1CD6524F]) [    x:collection1] o.a.s.r.ManagedResourceStorage Cannot write to config directory C:\Users\jenkins\workspace\Lucene-Solr-7.0-Windows\solr\core\src\test-files\solr\collection1\conf; switching to use InMemory storage instead.
   [junit4]   2> 2343626 INFO  (TEST-InfixSuggestersTest.testBlendedInfixSuggesterBuildThenReload-seed#[CC507C6B1CD6524F]) [    x:collection1] o.a.s.h.c.SuggestComponent Initializing SuggestComponent
   [junit4]   2> 2343626 INFO  (TEST-InfixSuggestersTest.testBlendedInfixSuggesterBuildThenReload-seed#[CC507C6B1CD6524F]) [    x:collection1] o.a.s.s.s.SolrSuggester init: {name=shortRandomAnalyzingInfixSuggester,lookupImpl=AnalyzingInfixLookupFactory,dictionaryImpl=RandomTestDictionaryFactory,randDictMaxItems=100,indexPath=short_random_analyzing_infix_suggester,suggestAnalyzerFieldType=text,buildOnCommit=false,buildOnStartup=false}
   [junit4]   2> 2343628 INFO  (TEST-InfixSuggestersTest.testBlendedInfixSuggesterBuildThenReload-seed#[CC507C6B1CD6524F]) [    x:collection1] o.a.s.s.s.SolrSuggester Dictionary loaded with params: {name=shortRandomAnalyzingInfixSuggester,lookupImpl=AnalyzingInfixLookupFactory,dictionaryImpl=RandomTestDictionaryFactory,randDictMaxItems=100,indexPath=short_random_analyzing_infix_suggester,suggestAnalyzerFieldType=text,buildOnCommit=false,buildOnStartup=false}
   [junit4]   2> 2343628 INFO  (TEST-InfixSuggestersTest.testBlendedInfixSuggesterBuildThenReload-seed#[CC507C6B1CD6524F]) [    x:collection1] o.a.s.h.c.SuggestComponent Initializing SuggestComponent
   [junit4]   2> 2343628 INFO  (TEST-InfixSuggestersTest.testBlendedInfixSuggesterBuildThenReload-seed#[CC507C6B1CD6524F]) [    x:collection1] o.a.s.s.s.SolrSuggester init: {name=longRandomAnalyzingInfixSuggester,lookupImpl=AnalyzingInfixLookupFactory,dictionaryImpl=RandomTestDictionaryFactory,randDictMaxItems=100000,indexPath=long_random_analyzing_infix_suggester,suggestAnalyzerFieldType=text,buildOnCommit=false,buildOnStartup=false}
   [junit4]   2> 2343628 INFO  (TEST-InfixSuggestersTest.testBlendedInfixSuggesterBuildThenReload-seed#[CC507C6B1CD6524F]) [    x:collection1] o.a.s.s.s.SolrSuggester Dictionary loaded with params: {name=longRandomAnalyzingInfixSuggester,lookupImpl=AnalyzingInfixLookupFactory,dictionaryImpl=RandomTestDictionaryFactory,randDictMaxItems=100000,indexPath=long_random_analyzing_infix_suggester,suggestAnalyzerFieldType=text,buildOnCommit=false,buildOnStartup=false}
   [junit4]   2> 2343628 INFO  (TEST-InfixSuggestersTest.testBlendedInfixSuggesterBuildThenReload-seed#[CC507C6B1CD6524F]) [    x:collection1] o.a.s.h.c.SuggestComponent Initializing SuggestComponent
   [junit4]   2> 2343628 INFO  (TEST-InfixSuggestersTest.testBlendedInfixSuggesterBuildThenReload-seed#[CC507C6B1CD6524F]) [    x:collection1] o.a.s.s.s.SolrSuggester init: {name=shortRandomBlendedInfixSuggester,lookupImpl=BlendedInfixLookupFactory,dictionaryImpl=RandomTestDictionaryFactory,randDictMaxItems=100,blenderType=position_linear,suggestAnalyzerFieldType=text,indexPath=short_random_blended_infix_suggester,highlight=true,buildOnStartup=false,buildOnCommit=false}
   [junit4]   2> 2343630 INFO  (TEST-InfixSuggestersTest.testBlendedInfixSuggesterBuildThenReload-seed#[CC507C6B1CD6524F]) [    x:collection1] o.a.s.s.s.SolrSuggester Dictionary loaded with params: {name=shortRandomBlendedInfixSuggester,lookupImpl=BlendedInfixLookupFactory,dictionaryImpl=RandomTestDictionaryFactory,randDictMaxItems=100,blenderType=position_linear,suggestAnalyzerFieldType=text,indexPath=short_random_blended_infix_suggester,highlight=true,buildOnStartup=false,buildOnCommit=false}
   [junit4]   2> 2343630 INFO  (TEST-InfixSuggestersTest.testBlendedInfixSuggesterBuildThenReload-seed#[CC507C6B1CD6524F]) [    x:collection1] o.a.s.h.ReplicationHandler Commits will be reserved for  10000
   [junit4]   2> 2343632 INFO  (TEST-InfixSuggestersTest.testBlendedInfixSuggesterBuildThenReload-seed#[CC507C6B1CD6524F]) [    x:collection1] o.a.s.u.RandomMergePolicy RandomMergePolicy wrapping class org.apache.lucene.index.AlcoholicMergePolicy: [AlcoholicMergePolicy: minMergeSize=0, mergeFactor=10, maxMergeSize=2080919263, maxMergeSizeForForcedMerge=9223372036854775807, calibrateSizeByDeletes=true, maxMergeDocs=2147483647, maxCFSSegmentSizeMB=8.796093022207999E12, noCFSRatio=0.1]
   [junit4]   2> 2343632 INFO  (searcherExecutor-10391-thread-1-processing-x:collection1) [    x:collection1] o.a.s.c.SolrCore [collection1] Registered new searcher Searcher@4012de23[collection1] main{ExitableDirectoryReader(UninvertingDirectoryReader())}
   [junit4]   2> 2343633 INFO  (TEST-InfixSuggestersTest.testBlendedInfixSuggesterBuildThenReload-seed#[CC507C6B1CD6524F]) [    x:collection1] o.a.s.u.DefaultSolrCoreState New IndexWriter is ready to be used.
   [junit4]   2> 2343633 INFO  (TEST-InfixSuggestersTest.testBlendedInfixSuggesterBuildThenReload-seed#[CC507C6B1CD6524F]) [    x:collection1] o.a.s.s.SolrIndexSearcher Opening [Searcher@3dc20077[collection1] main]
   [junit4]   2> 2343633 INFO  (TEST-InfixSuggestersTest.testBlendedInfixSuggesterBuildThenReload-seed#[CC507C6B1CD6524F]) [    x:collection1] o.a.s.c.SolrCore [collection1]  CLOSING SolrCore org.apache.solr.core.SolrCore@62d88e90
   [junit4]   2> 2343633 INFO  (TEST-InfixSuggestersTest.testBlendedInfixSuggesterBuildThenReload-seed#[CC507C6B1CD6524F]) [    x:collection1] o.a.s.m.SolrMetricManager Closing metric reporters for registry=solr.core.collection1, tag=1658359440
   [junit4]   2> 2343633 INFO  (TEST-InfixSuggestersTest.testBlendedInfixSuggesterBuildThenReload-seed#[CC507C6B1CD6524F]) [    x:collection1] o.a.s.m.r.SolrJmxReporter Closing reporter [org.apache.solr.metrics.reporters.SolrJmxReporter@49c6a948: rootName = null, domain = solr.core.collection1, service url = null, agent id = null] for registry solr.core.collection1 / com.codahale.metrics.MetricRegistry@486094e3
   [junit4]   2> 2343634 INFO  (searcherExecutor-10391-thread-1-processing-x:collection1) [    x:collection1] o.a.s.c.SolrCore [collection1] Registered new searcher Searcher@3dc20077[collection1] main{ExitableDirectoryReader(UninvertingDirectoryReader())}
   [junit4]   2> 2343642 INFO  (TEST-InfixSuggestersTest.testBlendedInfixSuggesterBuildThenReload-seed#[CC507C6B1CD6524F]) [    x:collection1] o.a.s.SolrTestCaseJ4 ###Ending testBlendedInfixSuggesterBuildThenReload
   [junit4]   2> 2343644 INFO  (TEST-InfixSuggestersTest.test2xBuildReload-seed#[CC507C6B1CD6524F]) [    x:collection1] o.a.s.SolrTestCaseJ4 ###Starting test2xBuildReload
   [junit4]   2> 2343644 INFO  (TEST-InfixSuggestersTest.test2xBuildReload-seed#[CC507C6B1CD6524F]) [    x:collection1] o.a.s.h.c.SuggestComponent SuggestComponent prepare with : qt=/suggest_analyzing_infix_short_dictionary&suggest=true&suggest.buildAll=true&wt=xml&indent=off
   [junit4]   2> 2343644 INFO  (TEST-InfixSuggestersTest.test2xBuildReload-seed#[CC507C6B1CD6524F]) [    x:collection1] o.a.s.s.s.SolrSuggester SolrSuggester.build(shortRandomAnalyzingInfixSuggester)
   [junit4]   2> 2343658 INFO  (TEST-InfixSuggestersTest.test2xBuildReload-seed#[CC507C6B1CD6524F]) [    x:collection1] o.a.s.s.s.RandomTestDictionaryFactory org.apache.solr.spelling.suggest.RandomTestDictionaryFactory$RandomTestDictionary.enabled.shortRandomAnalyzingInfixSuggester disabled after emitting 100 items.
   [junit4]   2> 2343728 INFO  (TEST-InfixSuggestersTest.test2xBuildReload-seed#[CC507C6B1CD6524F]) [    x:collection1] o.a.s.h.c.SuggestComponent SuggestComponent process with : qt=/suggest_analyzing_infix_short_dictionary&suggest=true&suggest.buildAll=true&wt=xml&indent=off
   [junit4]   2> 2343729 INFO  (TEST-InfixSuggestersTest.test2xBuildReload-seed#[CC507C6B1CD6524F]) [    x:collection1] o.a.s.c.S.Request [collection1]  webapp=null path=null params={qt=/suggest_analyzing_infix_short_dictionary&suggest.buildAll=true&wt=xml} status=0 QTime=84
   [junit4]   2> 2343729 ERROR (TEST-InfixSuggestersTest.test2xBuildReload-seed#[CC507C6B1CD6524F]) [    x:collection1] o.a.s.c.CorePropertiesLocator Couldn't load core descriptor from C:\Users\jenkins\workspace\Lucene-Solr-7.0-Windows\solr\core\src\test-files\solr\collection1\core.properties:java.nio.file.NoSuchFileException: C:\Users\jenkins\workspace\Lucene-Solr-7.0-Windows\solr\core\src\test-files\solr\collection1\core.properties
   [junit4]   2> 2343731 INFO  (TEST-InfixSuggestersTest.test2xBuildReload-seed#[CC507C6B1CD6524F]) [    x:collection1] o.a.s.c.SolrResourceLoader [null] Added 2 libs to classloader, from paths: [/C:/Users/jenkins/workspace/Lucene-Solr-7.0-Windows/solr/core/src/test-files/solr/collection1/lib, /C:/Users/jenkins/workspace/Lucene-Solr-7.0-Windows/solr/core/src/test-files/solr/collection1/lib/classes]
   [junit4]   2> 2343835 INFO  (TEST-InfixSuggestersTest.test2xBuildReload-seed#[CC507C6B1CD6524F]) [    x:collection1] o.a.s.c.SolrConfig Using Lucene MatchVersion: 7.0.0
   [junit4]   2> 2343844 INFO  (TEST-InfixSuggestersTest.test2xBuildReload-seed#[CC507C6B1CD6524F]) [    x:collection1] o.a.s.s.IndexSchema [collection1] Schema name=test
   [junit4]   2> 2343936 INFO  (TEST-InfixSuggestersTest.test2xBuildReload-seed#[CC507C6B1CD6524F]) [    x:collection1] o.a.s.s.IndexSchema Loaded schema test/1.0 with uniqueid field id
   [junit4]   2> 2343956 INFO  (TEST-InfixSuggestersTest.test2xBuildReload-seed#[CC507C6B1CD6524F]) [    x:collection1] o.a.s.c.CoreContainer Reloading SolrCore 'collection1' using configuration from instancedir C:\Users\jenkins\workspace\Lucene-Solr-7.0-Windows\solr\core\src\test-files\solr\collection1
   [junit4]   2> 2343992 INFO  (TEST-InfixSuggestersTest.test2xBuildReload-seed#[CC507C6B1CD6524F]) [    x:collection1] o.a.s.m.r.SolrJmxReporter JMX monitoring for 'solr.core.collection1' (registry 'solr.core.collection1') enabled at server: com.sun.jmx.mbeanserver.JmxMBeanServer@2528ba64
   [junit4]   2> 2343992 INFO  (TEST-InfixSuggestersTest.test2xBuildReload-seed#[CC507C6B1CD6524F]) [    x:collection1] o.a.s.c.SolrCore [[collection1] ] Opening new SolrCore at [C:\Users\jenkins\workspace\Lucene-Solr-7.0-Windows\solr\core\src\test-files\solr\collection1], dataDir=[C:\Users\jenkins\workspace\Lucene-Solr-7.0-Windows\solr\build\solr-core\test\J0\temp\solr.handler.component.InfixSuggestersTest_CC507C6B1CD6524F-001\init-core-data-001\]
   [junit4]   2> 2344152 INFO  (TEST-InfixSuggestersTest.test2xBuildReload-seed#[CC507C6B1CD6524F]) [    x:collection1] o.a.s.u.CommitTracker Hard AutoCommit: disabled
   [junit4]   2> 2344153 INFO  (TEST-InfixSuggestersTest.test2xBuildReload-seed#[CC507C6B1CD6524F]) [    x:collection1] o.a.s.u.CommitTracker Soft AutoCommit: disabled
   [junit4]   2> 2344155 INFO  (TEST-InfixSuggestersTest.test2xBuildReload-seed#[CC507C6B1CD6524F]) [    x:collection1] o.a.s.s.SolrIndexSearcher Opening [Searcher@68b71d2e[collection1] main]
   [junit4]   2> 2344156 WARN  (TEST-InfixSuggestersTest.test2xBuildReload-seed#[CC507C6B1CD6524F]) [    x:collection1] o.a.s.r.ManagedResourceStorage Cannot write to config directory C:\Users\jenkins\workspace\Lucene-Solr-7.0-Windows\solr\core\src\test-files\solr\collection1\conf; switching to use InMemory storage instead.
   [junit4]   2> 2344156 INFO  (TEST-InfixSuggestersTest.test2xBuildReload-seed#[CC507C6B1CD6524F]) [    x:collection1] o.a.s.h.c.SuggestComponent Initializing SuggestComponent
   [junit4]   2> 2344156 INFO  (TEST-InfixSuggestersTest.test2xBuildReload-seed#[CC507C6B1CD6524F]) [    x:collection1] o.a.s.s.s.SolrSuggester init: {name=shortRandomAnalyzingInfixSuggester,lookupImpl=AnalyzingInfixLookupFactory,dictionaryImpl=RandomTestDictionaryFactory,randDictMaxItems=100,indexPath=short_random_analyzing_infix_suggester,suggestAnalyzerFieldType=text,buildOnCommit=false,buildOnStartup=false}
   [junit4]   2> 2344164 INFO  (TEST-InfixSuggestersTest.test2xBuildReload-seed#[CC507C6B1CD6524F]) [    x:collection1] o.a.s.s.s.SolrSuggester Dictionary loaded with params: {name=shortRandomAnalyzingInfixSuggester,lookupImpl=AnalyzingInfixLookupFactory,dictionaryImpl=RandomTestDictionaryFactory,randDictMaxItems=100,indexPath=short_random_analyzing_infix_suggester,suggestAnalyzerFieldType=text,buildOnCommit=false,buildOnStartup=false}
   [junit4]   2> 2344164 INFO  (TEST-InfixSuggestersTest.test2xBuildReload-seed#[CC507C6B1CD6524F]) [    x:collection1] o.a.s.h.c.SuggestComponent Initializing SuggestComponent
   [junit4]   2> 2344164 INFO  (TEST-InfixSuggestersTest.test2xBuildReload-seed#[CC507C6B1CD6524F]) [    x:collection1] o.a.s.s.s.SolrSuggester init: {name=longRandomAnalyzingInfixSuggester,lookupImpl=AnalyzingInfixLookupFactory,dictionaryImpl=RandomTestDictionaryFactory,randDictMaxItems=100000,indexPath=long_random_analyzing_infix_suggester,suggestAnalyzerFieldType=text,buildOnCommit=false,buildOnStartup=false}
   [junit4]   2> 2344165 INFO  (TEST-InfixSuggestersTest.test2xBuildReload-seed#[CC507C6B1CD6524F]) [    x:collection1] o.a.s.s.s.SolrSuggester Dictionary loaded with params: {name=longRandomAnalyzingInfixSuggester,lookupImpl=AnalyzingInfixLookupFactory,dictionaryImpl=RandomTestDictionaryFactory,randDictMaxItems=100000,indexPath=long_random_analyzing_infix_suggester,suggestAnalyzerFieldType=text,buildOnCommit=false,buildOnStartup=false}
   [junit4]   2> 2344165 INFO  (TEST-InfixSuggestersTest.test2xBuildReload-seed#[CC507C6B1CD6524F]) [    x:collection1] o.a.s.h.c.SuggestComponent Initializing SuggestComponent
   [junit4]   2> 2344165 INFO  (TEST-InfixSuggestersTest.test2xBuildReload-seed#[CC507C6B1CD6524F]) [    x:collection1] o.a.s.s.s.SolrSuggester init: {name=shortRandomBlendedInfixSuggester,lookupImpl=BlendedInfixLookupFactory,dictionaryImpl=RandomTestDictionaryFactory,randDictMaxItems=100,blenderType=position_linear,suggestAnalyzerFieldType=text,indexPath=short_random_blended_infix_suggester,highlight=true,buildOnStartup=false,buildOnCommit=false}
   [junit4]   2> 2344166 INFO  (TEST-InfixSuggestersTest.test2xBuildReload-seed#[CC507C6B1CD6524F]) [    x:collection1] o.a.s.s.s.SolrSuggester Dictionary loaded with params: {name=shortRandomBlendedInfixSuggester,lookupImpl=BlendedInfixLookupFactory,dictionaryImpl=RandomTestDictionaryFactory,randDictMaxItems=100,blenderType=position_linear,suggestAnalyzerFieldType=text,indexPath=short_random_blended_infix_suggester,highlight=true,buildOnStartup=false,buildOnCommit=false}
   [junit4]   2> 2344168 INFO  (TEST-InfixSuggestersTest.test2xBuildReload-seed#[CC507C6B1CD6524F]) [    x:collection1] o.a.s.h.ReplicationHandler Commits will be reserved for  10000
   [junit4]   2> 2344170 INFO  (TEST-InfixSuggestersTest.test2xBuildReload-seed#[CC507C6B1CD6524F]) [    x:collection1] o.a.s.u.RandomMergePolicy RandomMergePolicy wrapping class org.apache.lucene.index.LogByteSizeMergePolicy: [LogByteSizeMergePolicy: minMergeSize=1677721, mergeFactor=18, maxMergeSize=2147483648, maxMergeSizeForForcedMerge=9223372036854775807, calibrateSizeByDeletes=true, maxMergeDocs=2147483647, maxCFSSegmentSizeMB=8.796093022207999E12, noCFSRatio=0.23389532333814123]
   [junit4]   2> 2344171 INFO  (TEST-InfixSuggestersTest.test2xBuildReload-seed#[CC507C6B1CD6524F]) [    x:collection1] o.a.s.u.DefaultSolrCoreState New IndexWriter is ready to be used.
   [junit4]   2> 2344171 INFO  (searcherExecutor-10395-thread-1-processing-x:collection1) [    x:collection1] o.a.s.c.SolrCore [collection1] Registered new searcher Searcher@68b71d2e[collection1] main{ExitableDirectoryReader(UninvertingDirectoryReader())}
   [junit4]   2> 2344172 INFO  (TEST-InfixSuggestersTest.test2xBuildReload-seed#[CC507C6B1CD6524F]) [    x:collection1] o.a.s.s.SolrIndexSearcher Opening [Searcher@6b8f4fe1[collection1] main]
   [junit4]   2> 2344172 INFO  (TEST-InfixSuggestersTest.test2xBuildReload-seed#[CC507C6B1CD6524F]) [    x:collection1] o.a.s.c.SolrCore [collection1]  CLOSING SolrCore org.apache.solr.core.SolrCore@230023be
   [junit4]   2> 2344172 INFO  (TEST-InfixSuggestersTest.test2xBuildReload-seed#[CC507C6B1CD6524F]) [    x:collection1] o.a.s.m.SolrMetricManager Closing metric reporters for registry=solr.core.collection1, tag=587211710
   [junit4]   2> 2344172 INFO  (TEST-InfixSuggestersTest.test2xBuildReload-seed#[CC507C6B1CD6524F]) [    x:collection1] o.a.s.m.r.SolrJmxReporter Closing reporter [org.apache.solr.metrics.reporters.SolrJmxReporter@12ef8f60: rootName = null, domain = solr.core.collection1, service url = null, agent id = null] for registry solr.core.collection1 / com.codahale.metrics.MetricRegistry@486094e3
   [junit4]   2> 2344174 INFO  (searcherExecutor-10395-thread-1-processing-x:collection1) [    x:collection1] o.a.s.c.SolrCore [collection1] Registered new searcher Searcher@6b8f4fe1[collection1] main{ExitableDirectoryReader(UninvertingDirectoryReader())}
   [junit4]   2> 2344181 INFO  (TEST-InfixSuggestersTest.test2xBuildReload-seed#[CC507C6B1CD6524F]) [    x:collection1] o.a.s.h.c.SuggestComponent SuggestComponent prepare with : qt=/suggest_analyzing_infix_short_dictionary&suggest=true&suggest.buildAll=true&wt=xml&indent=off
   [junit4]   2> 2344181 INFO  (TEST-InfixSuggestersTest.test2xBuildReload-seed#[CC507C6B1CD6524F]) [    x:collection1] o.a.s.s.s.SolrSuggester SolrSuggester.build(shortRandomAnalyzingInfixSuggester)
   [junit4]   2> 2344196 INFO  (TEST-InfixSuggestersTest.test2xBuildReload-seed#[CC507C6B1CD6524F]) [    x:collection1] o.a.s.s.s.RandomTestDictionaryFactory org.apache.solr.spelling.suggest.RandomTestDictionaryFactory$RandomTestDictionary.enabled.shortRandomAnalyzingInfixSuggester disabled after emitting 100 items.
   [junit4]   2> 2344283 INFO  (TEST-InfixSuggestersTest.test2xBuildReload-seed#[CC507C6B1CD6524F]) [    x:collection1] o.a.s.h.c.SuggestComponent SuggestComponent process with : qt=/suggest_analyzing_infix_short_dictionary&suggest=true&suggest.buildAll=true&wt=xml&indent=off
   [junit4]   2> 2344283 INFO  (TEST-InfixSuggestersTest.test2xBuildReload-seed#[CC507C6B1CD6524F]) [    x:collection1] o.a.s.c.S.Request [collection1]  webapp=null path=null params={qt=/suggest_analyzing_infix_short_dictionary&suggest.buildAll=true&wt=xml} status=0 QTime=101
   [junit4]   2> 2344283 ERROR (TEST-InfixSuggestersTest.test2xBuildReload-seed#[CC507C6B1CD6524F]) [    x:collection1] o.a.s.c.CorePropertiesLocator Couldn't load core descriptor from C:\Users\jenkins\workspace\Lucene-Solr-7.0-Windows\solr\core\src\test-files\solr\collection1\core.properties:java.nio.file.NoSuchFileException: C:\Users\jenkins\workspace\Lucene-Solr-7.0-Windows\solr\core\src\test-files\solr\collection1\core.properties
   [junit4]   2> 2344285 INFO  (TEST-InfixSuggestersTest.test2xBuildReload-seed#[CC507C6B1CD6524F]) [    x:collection1] o.a.s.c.SolrResourceLoader [null] Added 2 libs to classloader, from paths: [/C:/Users/jenkins/workspace/Lucene-Solr-7.0-Windows/solr/core/src/test-files/solr/collection1/lib, /C:/Users/jenkins/workspace/Lucene-Solr-7.0-Windows/solr/core/src/test-files/solr/collection1/lib/classes]
   [junit4]   2> 2344407 INFO  (TEST-InfixSuggestersTest.test2xBuildReload-seed#[CC507C6B1CD6524F]) [    x:collection1] o.a.s.c.SolrConfig Using Lucene MatchVersion: 7.0.0
   [junit4]   2> 2344417 INFO  (TEST-InfixSuggestersTest.test2xBuildReload-seed#[CC507C6B1CD6524F]) [    x:collection1] o.a.s.s.IndexSchema [collection1] Schema name=test
   [junit4]   2> 2344541 INFO  (TEST-InfixSuggestersTest.test2xBuildReload-seed#[CC507C6B1CD6524F]) [    x:collection1] o.a.s.s.IndexSchema Loaded schema test/1.0 with uniqueid field id
   [junit4]   2> 2344555 INFO  (TEST-InfixSuggestersTest.test2xBuildReload-seed#[CC507C6B1CD6524F]) [    x:collection1] o.a.s.c.CoreContainer Reloading SolrCore 'collection1' using configuration from instancedir C:\Users\jenkins\workspace\Lucene-Solr-7.0-Windows\solr\core\src\test-files\solr\collection1
   [junit4]   2> 2344584 INFO  (TEST-InfixSuggestersTest.test2xBuildReload-seed#[CC507C6B1CD6524F]) [    x:collection1] o.a.s.m.r.SolrJmxReporter JMX monitoring for 'solr.core.collection1' (registry 'solr.core.collection1') enabled at server: com.sun.jmx.mbeanserver.JmxMBeanServer@2528ba64
   [junit4]   2> 2344584 INFO  (TEST-InfixSuggestersTest.test2xBuildReload-seed#[CC507C6B1CD6524F]) [    x:collection1] o.a.s.c.SolrCore [[collection1] ] Opening new SolrCore at [C:\Users\jenkins\workspace\Lucene-Solr-7.0-Windows\solr\core\src\test-files\solr\collection1], dataDir=[C:\Users\jenkins\workspace\Lucene-Solr-7.0-Windows\solr\build\solr-core\test\J0\temp\solr.handler.component.InfixSuggestersTest_CC507C6B1CD6524F-001\init-core-data-001\]
   [junit4]   2> 2344748 INFO  (TEST-InfixSuggestersTest.test2xBuildReload-seed#[CC507C6B1CD6524F]) [    x:collection1] o.a.s.u.CommitTracker Hard AutoCommit: disabled
   [junit4]   2> 2344749 INFO  (TEST-InfixSuggestersTest.test2xBuildReload-seed#[CC507C6B1CD6524F]) [    x:collection1] o.a.s.u.CommitTracker Soft AutoCommit: disabled
   [junit4]   2> 2344750 INFO  (TEST-InfixSuggestersTest.test2xBuildReload-seed#[CC507C6B1CD6524F]) [    x:collection1] o.a.s.s.SolrIndexSearcher Opening [Searcher@711a32ec[collection1] main]
   [junit4]   2> 2344751 WARN  (TEST-InfixSuggestersTest.test2xBuildReload-seed#[CC507C6B1CD6524F]) [    x:collection1] o.a.s.r.ManagedResourceStorage Cannot write to config directory C:\Users\jenkins\workspace\Lucene-Solr-7.0-Windows\solr\core\src\test-files\solr\collection1\conf; switching to use InMemory storage instead.
   [junit4]   2> 2344752 INFO  (TEST-InfixSuggestersTest.test2xBuildReload-seed#[CC507C6B1CD6524F]) [    x:collection1] o.a.s.h.c.SuggestComponent Initializing SuggestComponent
   [junit4]   2> 2344752 INFO  (TEST-InfixSuggestersTest.test2xBuildReload-seed#[CC507C6B1CD6524F]) [    x:collection1] o.a.s.s.s.SolrSuggester init: {name=shortRandomAnalyzingInfixSuggester,lookupImpl=AnalyzingInfixLookupFactory,dictionaryImpl=RandomTestDictionaryFactory,randDictMaxItems=100,indexPath=short_random_analyzing_infix_suggester,suggestAnalyzerFieldType=text,buildOnCommit=false,buildOnStartup=false}
   [junit4]   2> 2344758 INFO  (TEST-InfixSuggestersTest.test2xBuildReload-seed#[CC507C6B1CD6524F]) [    x:collection1] o.a.s.s.s.SolrSuggester Dictionary loaded with params: {name=shortRandomAnalyzingInfixSuggester,lookupImpl=AnalyzingInfixLookupFactory,dictionaryImpl=RandomTestDictionaryFactory,randDictMaxItems=100,indexPath=short_random_analyzing_infix_suggester,suggestAnalyzerFieldType=text,buildOnCommit=false,buildOnStartup=false}
   [junit4]   2> 2344758 INFO  (TEST-InfixSuggestersTest.test2xBuildReload-seed#[CC507C6B1CD6524F]) [    x:collection1] o.a.s.h.c.SuggestComponent Initializing SuggestComponent
   [junit4]   2> 2344759 INFO  (TEST-InfixSuggestersTest.test2xBuildReload-seed#[CC507C6B1CD6524F]) [    x:collection1] o.a.s.s.s.SolrSuggester init: {name=longRandomAnalyzingInfixSuggester,lookupImpl=AnalyzingInfixLookupFactory,dictionaryImpl=RandomTestDictionaryFactory,randDictMaxItems=100000,indexPath=long_random_analyzing_infix_suggester,suggestAnalyzerFieldType=text,buildOnCommit=false,buildOnStartup=false}
   [junit4]   2> 2344759 INFO  (TEST-InfixSuggestersTest.test2xBuildReload-seed#[CC507C6B1CD6524F]) [    x:collection1] o.a.s.s.s.SolrSuggester Dictionary loaded with params: {name=longRandomAnalyzingInfixSuggester,lookupImpl=AnalyzingInfixLookupFactory,dictionaryImpl=RandomTestDictionaryFactory,randDictMaxItems=100000,indexPath=long_random_analyzing_infix_suggester,suggestAnalyzerFieldType=text,buildOnCommit=false,buildOnStartup=false}
   [junit4]   2> 2344759 INFO  (TEST-InfixSuggestersTest.test2xBuildReload-seed#[CC507C6B1CD6524F]) [    x:collection1] o.a.s.h.c.SuggestComponent Initializing SuggestComponent
   [junit4]   2> 2344759 INFO  (TEST-InfixSuggestersTest.test2xBuildReload-seed#[CC507C6B1CD6524F]) [    x:collection1] o.a.s.s.s.SolrSuggester init: {name=shortRandomBlendedInfixSuggester,lookupImpl=BlendedInfixLookupFactory,dictionaryImpl=RandomTestDictionaryFactory,randDictMaxItems=100,blenderType=position_linear,suggestAnalyzerFieldType=text,indexPath=short_random_blended_infix_suggester,highlight=true,buildOnStartup=false,buildOnCommit=false}
   [junit4]   2> 2344762 INFO  (TEST-InfixSuggestersTest.test2xBuildReload-seed#[CC507C6B1CD6524F]) [    x:collection1] o.a.s.s.s.SolrSuggester Dictionary loaded with params: {name=shortRandomBlendedInfixSuggester,lookupImpl=BlendedInfixLookupFactory,dictionaryImpl=RandomTestDictionaryFactory,randDictMaxItems=100,blenderType=position_linear,suggestAnalyzerFieldType=text,indexPath=short_random_blended_infix_suggester,highlight=true,buildOnStartup=false,buildOnCommit=false}
   [junit4]   2> 2344762 INFO  (TEST-InfixSuggestersTest.test2xBuildReload-seed#[CC507C6B1CD6524F]) [    x:collection1] o.a.s.h.ReplicationHandler Commits will be reserved for  10000
   [junit4]   2> 2344762 INFO  (TEST-InfixSuggestersTest.test2xBuildReload-seed#[CC507C6B1CD6524F]) [    x:collection1] o.a.s.u.RandomMergePolicy RandomMergePolicy wrapping class org.apache.lucene.index.TieredMergePolicy: [TieredMergePolicy: maxMergeAtOnce=45, maxMergeAtOnceExplicit=27, maxMergedSegmentMB=32.6298828125, floorSegmentMB=2.0009765625, forceMergeDeletesPctAllowed=0.7829267951434005, segmentsPerTier=47.0, maxCFSSegmentSizeMB=8.796093022207999E12, noCFSRatio=0.0
   [junit4]   2> 2344762 INFO  (TEST-InfixSuggestersTest.test2xBuildReload-seed#[CC507C6B1CD6524F]) [    x:collection1] o.a.s.u.DefaultSolrCoreState New IndexWriter is ready to be used.
   [junit4]   2> 2344767 INFO  (searcherExecutor-10399-thread-1-processing-x:collection1) [    x:collection1] o.a.s.c.SolrCore [collection1] Registered new searcher Searcher@711a32ec[collection1] main{ExitableDirectoryReader(UninvertingDirectoryReader())}
   [junit4]   2> 2344767 INFO  (TEST-InfixSuggestersTest.test2xBuildReload-seed#[CC507C6B1CD6524F]) [    x:collection1] o.a.s.s.SolrIndexSearcher Opening [Searcher@75330ca3[collection1] main]
   [junit4]   2> 2344767 INFO  (TEST-InfixSuggestersTest.test2xBuildReload-seed#[CC507C6B1CD6524F]) [    x:collection1] o.a.s.c.SolrCore [collection1]  CLOSING SolrCore org.apache.solr.core.SolrCore@3f884638
   [junit4]   2> 2344767 INFO  (TEST-InfixSuggestersTest.test2xBuildReload-seed#[CC507C6B1CD6524F]) [    x:collection1] o.a.s.m.SolrMetricManager Closing metric reporters for registry=solr.core.collection1, tag=1065895480
   [junit4]   2> 2344767 INFO  (TEST-InfixSuggestersTest.test2xBuildReload-seed#[CC507C6B1CD6524F]) [    x:collection1] o.a.s.m.r.SolrJmxReporter Closing reporter [org.apache.solr.metrics.reporters.SolrJmxReporter@5c0a208c: rootName = null, domain = solr.core.collection1, service url = null, agent id = null] for registry solr.core.collection1 / com.codahale.metrics.MetricRegistry@486094e3
   [junit4]   2> 2344767 INFO  (TEST-InfixSuggestersTest.test2xBuildReload-seed#[CC507C6B1CD6524F]) [    x:collection1] o.a.s.SolrTestCaseJ4 ###Ending test2xBuildReload
   [junit4]   2> 2344782 INFO  (searcherExecutor-10399-thread-1-processing-x:collection1) [    x:collection1] o.a.s.c.SolrCore [collection1] Registered new searcher Searcher@75330ca3[collection1] main{ExitableDirectoryReader(UninvertingDirectoryReader())}
   [junit4]   2> 2344786 INFO  (TEST-InfixSuggestersTest.testBuildThen2xReload-seed#[CC507C6B1CD6524F]) [    x:collection1] o.a.s.SolrTestCaseJ4 ###Starting testBuildThen2xReload
   [junit4]   2> 2344786 INFO  (TEST-InfixSuggestersTest.testBuildThen2xReload-seed#[CC507C6B1CD6524F]) [    x:collection1] o.a.s.h.c.SuggestComponent SuggestComponent prepare with : qt=/suggest_analyzing_infix_short_dictionary&suggest=true&suggest.buildAll=true&wt=xml&indent=off
   [junit4]   2> 2344786 INFO  (TEST-InfixSuggestersTest.testBuildThen2xReload-seed#[CC507C6B1CD6524F]) [    x:collection1] o.a.s.s.s.SolrSuggester SolrSuggester.build(shortRandomAnalyzingInfixSuggester)
   [junit4]   2> 2344796 INFO  (TEST-InfixSuggestersTest.testBuildThen2xReload-seed#[CC507C6B1CD6524F]) [    x:collection1] o.a.s.s.s.RandomTestDictionaryFactory org.apache.solr.spelling.suggest.RandomTestDictionaryFactory$RandomTestDictionary.enabled.shortRandomAnalyzingInfixSuggester disabled after emitting 100 items.
   [junit4]   2> 2344950 INFO  (TEST-InfixSuggestersTest.testBuildThen2xReload-seed#[CC507C6B1CD6524F]) [    x:collection1] o.a.s.h.c.SuggestComponent SuggestComponent process with : qt=/suggest_analyzing_infix_short_dictionary&suggest=true&suggest.buildAll=true&wt=xml&indent=off
   [junit4]   2> 2344950 INFO  (TEST-InfixSuggestersTest.testBuildThen2xReload-seed#[CC507C6B1CD6524F]) [    x:collection1] o.a.s.c.S.Request [collection1]  webapp=null path=null params={qt=/suggest_analyzing_infix_short_dictionary&suggest.buildAll=true&wt=xml} status=0 QTime=164
   [junit4]   2> 2344951 ERROR (TEST-InfixSuggestersTest.testBuildThen2xReload-seed#[CC507C6B1CD6524F]) [    x:collection1] o.a.s.c.CorePropertiesLocator Couldn't load core descriptor from C:\Users\jenkins\workspace\Lucene-Solr-7.0-Windows\solr\core\src\test-files\solr\collection1\core.properties:java.nio.file.NoSuchFileException: C:\Users\jenkins\workspace\Lucene-Solr-7.0-Windows\solr\core\src\test-files\solr\collection1\core.properties
   [junit4]   2> 2344958 INFO  (TEST-InfixSuggestersTest.testBuildThen2xReload-seed#[CC507C6B1CD6524F]) [    x:collection1] o.a.s.c.SolrResourceLoader [null] Added 2 libs to classloader, from paths: [/C:/Users/jenkins/workspace/Lucene-Solr-7.0-Windows/solr/core/src/test-files/solr/collection1/lib, /C:/Users/jenkins/workspace/Lucene-Solr-7.0-Windows/solr/core/src/test-files/solr/collection1/lib/classes]
   [junit4]   2> 2345037 INFO  (TEST-InfixSuggestersTest.testBuildThen2xReload-seed#[CC507C6B1CD6524F]) [    x:collection1] o.a.s.c.SolrConfig Using Lucene MatchVersion: 7.0.0
   [junit4]   2> 2345045 INFO  (TEST-InfixSuggestersTest.testBuildThen2xReload-seed#[CC507C6B1CD6524F]) [    x:collection1] o.a.s.s.IndexSchema [collection1] Schema name=test
   [junit4]   2> 2345169 INFO  (TEST-InfixSuggestersTest.testBuildThen2xReload-seed#[CC507C6B1CD6524F]) [    x:collection1] o.a.s.s.IndexSchema Loaded schema test/1.0 with uniqueid field id
   [junit4]   2> 2345181 INFO  (TEST-InfixSuggestersTest.testBuildThen2xReload-seed#[CC507C6B1CD6524F]) [    x:collection1] o.a.s.c.CoreContainer Reloading SolrCore 'collection1' using configuration from instancedir C:\Users\jenkins\workspace\Lucene-Solr-7.0-Windows\solr\core\src\test-files\solr\collection1
   [junit4]   2> 2345220 INFO  (TEST-InfixSuggestersTest.testBuildThen2xReload-seed#[CC507C6B1CD6524F]) [    x:collection1] o.a.s.m.r.SolrJmxReporter JMX monitoring for 'solr.core.collection1' (registry 'solr.core.collection1') enabled at server: com.sun.jmx.mbeanserver.JmxMBeanServer@2528ba64
   [junit4]   2> 2345220 INFO  (TEST-InfixSuggestersTest.testBuildThen2xReload-seed#[CC507C6B1CD6524F]) [    x:collection1] o.a.s.c.SolrCore [[collection1] ] Opening new SolrCore at [C:\Users\jenkins\workspace\Lucene-Solr-7.0-Windows\solr\core\src\test-files\solr\collection1], dataDir=[C:\Users\jenkins\workspace\Lucene-Solr-7.0-Windows\solr\build\solr-core\test\J0\temp\solr.handler.component.InfixSuggestersTest_CC507C6B1CD6524F-001\init-core-data-001\]
   [junit4]   2> 2345425 INFO  (TEST-InfixSuggestersTest.testBuildThen2xReload-seed#[CC507C6B1CD6524F]) [    x:collection1] o.a.s.u.CommitTracker Hard AutoCommit: disabled
   [junit4]   2> 2345425 INFO  (TEST-InfixSuggestersTest.testBuildThen2xReload-seed#[CC507C6B1CD6524F]) [    x:collection1] o.a.s.u.CommitTracker Soft AutoCommit: disabled
   [junit4]   2> 2345429 INFO  (TEST-InfixSuggestersTest.testBuildThen2xReload-seed#[CC507C6B1CD6524F]) [    x:collection1] o.a.s.s.SolrIndexSearcher Opening [Searcher@33bdf156[collection1] main]
   [junit4]   2> 2345430 WARN  (TEST-InfixSuggestersTest.testBuildThen2xReload-seed#[CC507C6B1CD6524F]) [    x:collection1] o.a.s.r.ManagedResourceStorage Cannot write to config directory C:\Users\jenkins\workspace\Lucene-Solr-7.0-Windows\solr\core\src\test-files\solr\collection1\conf; switching to use InMemory storage instead.
   [junit4]   2> 2345431 INFO  (TEST-InfixSuggestersTest.testBuildThen2xReload-seed#[CC507C6B1CD6524F]) [    x:collection1] o.a.s.h.c.SuggestComponent Initializing SuggestComponent
   [junit4]   2> 2345431 INFO  (TEST-InfixSuggestersTest.testBuildThen2xReload-seed#[CC507C6B1CD6524F]) [    x:collection1] o.a.s.s.s.SolrSuggester init: {name=shortRandomAnalyzingInfixSuggester,lookupImpl=AnalyzingInfixLookupFactory,dictionaryImpl=RandomTestDictionaryFactory,randDictMaxItems=100,indexPath=short_random_analyzing_infix_suggester,suggestAnalyzerFieldType=text,buildOnCommit=false,buildOnStartup=false}
   [junit4]   2> 2345437 INFO  (TEST-InfixSuggestersTest.testBuildThen2xReload-seed#[CC507C6B1CD6524F]) [    x:collection1] o.a.s.s.s.SolrSuggester Dictionary loaded with params: {name=shortRandomAnalyzingInfixSuggester,lookupImpl=AnalyzingInfixLookupFactory,dictionaryImpl=RandomTestDictionaryFactory,randDictMaxItems=100,indexPath=short_random_analyzing_infix_suggester,suggestAnalyzerFieldType=text,buildOnCommit=false,buildOnStartup=false}
   [junit4]   2> 2345437 INFO  (TEST-InfixSuggestersTest.testBuildThen2xReload-seed#[CC507C6B1CD6524F]) [    x:collection1] o.a.s.h.c.SuggestComponent Initializing SuggestComponent
   [junit4]   2> 2345437 INFO  (TEST-InfixSuggestersTest.testBuildThen2xReload-seed#[CC507C6B1CD6524F]) [    x:collection1] o.a.s.s.s.SolrSuggester init: {name=longRandomAnalyzingInfixSuggester,lookupImpl=AnalyzingInfixLookupFactory,dictionaryImpl=RandomTestDictionaryFactory,randDictMaxItems=100000,indexPath=long_random_analyzing_infix_suggester,suggestAnalyzerFieldType=text,buildOnCommit=false,buildOnStartup=false}
   [junit4]   2> 2345437 INFO  (TEST-InfixSuggestersTest.testBuildThen2xReload-seed#[CC507C6B1CD6524F]) [    x:collection1] o.a.s.s.s.SolrSuggester Dictionary loaded with params: {name=longRandomAnalyzingInfixSuggester,lookupImpl=AnalyzingInfixLookupFactory,dictionaryImpl=RandomTestDictionaryFactory,randDictMaxItems=100000,indexPath=long_random_analyzing_infix_suggester,suggestAnalyzerFieldType=text,buildOnCommit=false,buildOnStartup=false}
   [junit4]   2> 2345437 INFO  (TEST-InfixSuggestersTest.testBuildThen2xReload-seed#[CC507C6B1CD6524F]) [    x:collection1] o.a.s.h.c.SuggestComponent Initializing SuggestComponent
   [junit4]   2> 2345437 INFO  (TEST-InfixSuggestersTest.testBuildThen2xReload-seed#[CC507C6B1CD6524F]) [    x:collection1] o.a.s.s.s.SolrSuggester init: {name=shortRandomBlendedInfixSuggester,lookupImpl=BlendedInfixLookupFactory,dictionaryImpl=RandomTestDictionaryFactory,randDictMaxItems=100,blenderType=position_linear,suggestAnalyzerFieldType=text,indexPath=short_random_blended_infix_suggester,highlight=true,buildOnStartup=false,buildOnCommit=false}
   [junit4]   2> 2345441 INFO  (TEST-InfixSuggestersTest.testBuildThen2xReload-seed#[CC507C6B1CD6524F]) [    x:collection1] o.a.s.s.s.SolrSuggester Dictionary loaded with params: {name=shortRandomBlendedInfixSuggester,lookupImpl=BlendedInfixLookupFactory,dictionaryImpl=RandomTestDictionaryFactory,randDictMaxItems=100,blenderType=position_linear,suggestAnalyzerFieldType=text,indexPath=short_random_blended_infix_suggester,highlight=true,buildOnStartup=false,buildOnCommit=false}
   [junit4]   2> 2345441 INFO  (TEST-InfixSuggestersTest.testBuildThen2xReload-seed#[CC507C6B1CD6524F]) [    x:collection1] o.a.s.h.ReplicationHandler Commits will be reserved for  10000
   [junit4]   2> 2345441 INFO  (TEST-InfixSuggestersTest.testBuildThen2xReload-seed#[CC507C6B1CD6524F]) [    x:collection1] o.a.s.u.RandomMergePolicy RandomMergePolicy wrapping class org.apache.lucene.index.AlcoholicMergePolicy: [AlcoholicMergePolicy: minMergeSize=0, mergeFactor=10, maxMergeSize=1145498110, maxMergeSizeForForcedMerge=9223372036854775807, calibrateSizeByDeletes=true, maxMergeDocs=2147483647, maxCFSSegmentSizeMB=8.796093022207999E12, noCFSRatio=0.1]
   [junit4]   2> 2345441 INFO  (TEST-InfixSuggestersTest.testBuildThen2xReload-seed#[CC507C6B1CD6524F]) [    x:collection1] o.a.s.u.DefaultSolrCoreState New IndexWriter is ready to be used.
   [junit4]   2> 2345441 INFO  (searcherExecutor-10403-thread-1-processing-x:collection1) [    x:collection1] o.a.s.c.SolrCore [collection1] Registered new searcher Searcher@33bdf156[collection1] main{ExitableDirectoryReader(UninvertingDirectoryReader())}
   [junit4]   2> 2345445 INFO  (TEST-InfixSuggestersTest.testBuildThen2xReload-seed#[CC507C6B1CD6524F]) [    x:collection1] o.a.s.s.SolrIndexSearcher Opening [Searcher@101ad043[collection1] main]
   [junit4]   2> 2345446 INFO  (TEST-InfixSuggestersTest.testBuildThen2xReload-seed#[CC507C6B1CD6524F]) [    x:collection1] o.a.s.c.SolrCore [collection1

[...truncated too long message...]

worker) [    x:collection1] o.a.s.m.SolrMetricManager Closing metric reporters for registry=solr.node, tag=null
   [junit4]   2> 2361752 INFO  (SUITE-InfixSuggestersTest-seed#[CC507C6B1CD6524F]-worker) [    x:collection1] o.a.s.m.r.SolrJmxReporter Closing reporter [org.apache.solr.metrics.reporters.SolrJmxReporter@88127fd: rootName = null, domain = solr.node, service url = null, agent id = null] for registry solr.node / com.codahale.metrics.MetricRegistry@6a751aff
   [junit4]   2> 2361755 INFO  (SUITE-InfixSuggestersTest-seed#[CC507C6B1CD6524F]-worker) [    x:collection1] o.a.s.m.SolrMetricManager Closing metric reporters for registry=solr.jvm, tag=null
   [junit4]   2> 2361755 INFO  (SUITE-InfixSuggestersTest-seed#[CC507C6B1CD6524F]-worker) [    x:collection1] o.a.s.m.r.SolrJmxReporter Closing reporter [org.apache.solr.metrics.reporters.SolrJmxReporter@5502bc9e: rootName = null, domain = solr.jvm, service url = null, agent id = null] for registry solr.jvm / com.codahale.metrics.MetricRegistry@45cff19c
   [junit4]   2> 2361759 INFO  (SUITE-InfixSuggestersTest-seed#[CC507C6B1CD6524F]-worker) [    x:collection1] o.a.s.m.SolrMetricManager Closing metric reporters for registry=solr.jetty, tag=null
   [junit4]   2> 2361759 INFO  (SUITE-InfixSuggestersTest-seed#[CC507C6B1CD6524F]-worker) [    x:collection1] o.a.s.m.r.SolrJmxReporter Closing reporter [org.apache.solr.metrics.reporters.SolrJmxReporter@7c498164: rootName = null, domain = solr.jetty, service url = null, agent id = null] for registry solr.jetty / com.codahale.metrics.MetricRegistry@2c6b9537
   [junit4]   2> 2361759 INFO  (SUITE-InfixSuggestersTest-seed#[CC507C6B1CD6524F]-worker) [    x:collection1] o.a.s.c.TransientSolrCoreCacheDefault Allocating transient cache for 2147483647 transient cores
   [junit4]   2> 2361760 INFO  (coreCloseExecutor-10427-thread-1-processing-x:collection1) [    x:collection1] o.a.s.c.SolrCore [collection1]  CLOSING SolrCore org.apache.solr.core.SolrCore@ec8eee6
   [junit4]   2> 2361760 INFO  (coreCloseExecutor-10427-thread-1-processing-x:collection1) [    x:collection1] o.a.s.m.SolrMetricManager Closing metric reporters for registry=solr.core.collection1, tag=248049382
   [junit4]   2> 2361760 INFO  (coreCloseExecutor-10427-thread-1-processing-x:collection1) [    x:collection1] o.a.s.m.r.SolrJmxReporter Closing reporter [org.apache.solr.metrics.reporters.SolrJmxReporter@2ddfb119: rootName = null, domain = solr.core.collection1, service url = null, agent id = null] for registry solr.core.collection1 / com.codahale.metrics.MetricRegistry@49cf2008
   [junit4]   2> NOTE: leaving temporary files on disk at: C:\Users\jenkins\workspace\Lucene-Solr-7.0-Windows\solr\build\solr-core\test\J0\temp\solr.handler.component.InfixSuggestersTest_CC507C6B1CD6524F-001
   [junit4]   2> NOTE: test params are: codec=Asserting(Lucene70): {textgrams=FSTOrd50, text=TestBloomFilteredLucenePostings(BloomFilteringPostingsFormat(Lucene50(blocksize=128))), exacttext=PostingsFormat(name=MockRandom)}, docValues:{weight=DocValuesFormat(name=Memory), text=DocValuesFormat(name=Lucene70)}, maxPointsInLeafNode=1309, maxMBSortInHeap=5.9786075224668815, sim=RandomSimilarity(queryNorm=true): {}, locale=bg, timezone=Asia/Tashkent
   [junit4]   2> NOTE: Windows 10 10.0 amd64/Oracle Corporation 1.8.0_144 (64-bit)/cpus=3,threads=1,free=197409680,total=515899392
   [junit4]   2> NOTE: All tests run in this JVM: [XmlUpdateRequestHandlerTest, DistributedSuggestComponentTest, TestDistributedSearch, RequestLoggingTest, SolrTestCaseJ4Test, TestLegacyNumericUtils, TestTestInjection, ShardRoutingTest, BigEndianAscendingWordSerializerTest, TestReversedWildcardFilterFactory, DistributedQueryComponentCustomSortTest, TestScoreJoinQPScore, TestCloudPseudoReturnFields, TestIBSimilarityFactory, TestSubQueryTransformerDistrib, DistributedSpellCheckComponentTest, CleanupOldIndexTest, TestFaceting, TestSolrDeletionPolicy2, MinimalSchemaTest, OutOfBoxZkACLAndCredentialsProvidersTest, DateFieldTest, CoreAdminHandlerTest, TestMissingGroups, SuggesterTest, TestSchemalessBufferedUpdates, TestMaxTokenLenTokenizer, TestSystemCollAutoCreate, SpatialFilterTest, AtomicUpdateProcessorFactoryTest, HdfsNNFailoverTest, TestTolerantSearch, TestPayloadCheckQParserPlugin, OverseerTest, LeaderFailureAfterFreshStartTest, TestUniqueKeyFieldResource, TestStressLiveNodes, TestStandardQParsers, RankQueryTest, TestLegacyField, ShardSplitTest, SharedFSAutoReplicaFailoverUtilsTest, FieldAnalysisRequestHandlerTest, TestHashQParserPlugin, URLClassifyProcessorTest, PropertiesRequestHandlerTest, TestSolrCoreProperties, TestPHPSerializedResponseWriter, TestQuerySenderNoQuery, MetricsConfigTest, TestStressVersions, SparseHLLTest, ShufflingReplicaListTransformerTest, IndexSchemaTest, CdcrBootstrapTest, SyncSliceTest, TestClusterProperties, TestCoreContainer, HdfsTlogReplayBufferedWhileIndexingTest, TestNRTOpen, TestJavabinTupleStreamParser, QueryResultKeyTest, TestHdfsUpdateLog, MissingSegmentRecoveryTest, TestCustomSort, TestRandomDVFaceting, TestAddFieldRealTimeGet, SpellCheckCollatorWithCollapseTest, TestSizeLimitedDistributedMap, SimplePostToolTest, TestQuerySenderListener, BJQParserTest, RAMDirectoryFactoryTest, TestFieldResource, TestCSVResponseWriter, TestEmbeddedSolrServerSchemaAPI, TestBlobHandler, ChaosMonkeySafeLeaderWithPullReplicasTest, TestRawResponseWriter, TestTrieFacet, DistribCursorPagingTest, ForceLeaderTest, CreateCollectionCleanupTest, BadCopyFieldTest, TestSurroundQueryParser, TestFieldTypeResource, SolrCLIZkUtilsTest, TestPullReplicaErrorHandling, TestZkAclsWithHadoopAuth, TestSlowCompositeReaderWrapper, MoveReplicaHDFSUlogDirTest, ChaosMonkeyNothingIsSafeTest, V2StandaloneTest, TestFuzzyAnalyzedSuggestions, TestDynamicLoading, AliasIntegrationTest, TestReplicaProperties, TestImpersonationWithHadoopAuth, AsyncCallRequestStatusResponseTest, HardAutoCommitTest, TestBulkSchemaAPI, TestCloudDeleteByQuery, TestSolrCloudWithKerberosAlt, HdfsLockFactoryTest, TestFieldCacheVsDocValues, VMParamsZkACLAndCredentialsProvidersTest, ConnectionReuseTest, LargeFieldTest, RecoveryAfterSoftCommitTest, TestFieldCache, TestNonDefinedSimilarityFactory, HdfsWriteToMultipleCollectionsTest, SubstringBytesRefFilterTest, TestBlendedInfixSuggestions, DeleteInactiveReplicaTest, TestPolicyCloud, TestClusterStateMutator, TestStressRecovery, TestConfigSetProperties, ScriptEngineTest, TestSchemaVersionResource, TlogReplayBufferedWhileIndexingTest, SpatialRPTFieldTypeTest, AddBlockUpdateTest, TestPrepRecovery, DocValuesTest, TestApiFramework, DateMathParserTest, TestCorePropertiesReload, HLLSerializationTest, CdcrUpdateLogTest, HighlighterConfigTest, TestSchemaResource, UUIDFieldTest, TestTrackingShardHandlerFactory, TestHdfsBackupRestoreCore, TestHashPartitioner, EnumFieldTest, ZkStateWriterTest, QueryElevationComponentTest, UUIDUpdateProcessorFallbackTest, TestPhraseSuggestions, FastVectorHighlighterTest, TestNestedDocsSort, TestTolerantUpdateProcessorCloud, InfoHandlerTest, ResponseHeaderTest, TestLFUCache, PreAnalyzedFieldManagedSchemaCloudTest, SolrCloudReportersTest, TestNoOpRegenerator, TestPseudoReturnFields, SolrIndexSplitterTest, PrimitiveFieldTypeTest, SortByFunctionTest, CursorPagingTest, TestIntervalFaceting, RuleEngineTest, SSLMigrationTest, TestSearcherReuse, AnalysisAfterCoreReloadTest, SolrMetricManagerTest, TimeZoneUtilsTest, TestCloudManagedSchema, LeaderElectionTest, TestCloudSchemaless, TestManagedSynonymFilterFactory, ExitableDirectoryReaderTest, TestLocalFSCloudBackupRestore, HdfsBasicDistributedZkTest, OverseerCollectionConfigSetProcessorTest, SolrInfoBeanTest, LeaderInitiatedRecoveryOnShardRestartTest, SimpleFacetsTest, TestHalfAndHalfDocValues, ZkCLITest, TestExactStatsCache, SoftAutoCommitTest, ZkControllerTest, TestJoin, TestRangeQuery, StatsComponentTest, PeerSyncTest, DirectUpdateHandlerTest, TestBadConfig, TestIndexSearcher, TestExtendedDismaxParser, TestFoldingMultitermQuery, TestStressLucene, SuggesterWFSTTest, PolyFieldTest, WordBreakSolrSpellCheckerTest, TestUpdate, TestAtomicUpdateErrorCases, DirectUpdateHandlerOptimizeTest, DocValuesMultiTest, XsltUpdateRequestHandlerTest, LukeRequestHandlerTest, TestQueryTypes, TermsComponentTest, TestIndexingPerformance, RequiredFieldsTest, RegexBoostProcessorTest, ReturnFieldsTest, QueryParsingTest, UniqFieldsUpdateProcessorFactoryTest, TestPartialUpdateDeduplication, CSVRequestHandlerTest, SearchHandlerTest, AlternateDirectoryTest, CopyFieldTest, SolrIndexConfigTest, MultiTermTest, TestBinaryField, NumericFieldsTest, OutputWriterTest, DirectSolrConnectionTest, NotRequiredUniqueKeyTest, TestCodecSupport, TestBM25SimilarityFactory, PreAnalyzedFieldTest, ClusterStateTest, TestLRUCache, TestDocumentBuilder, SliceStateTest, CircularListTest, DistributedMLTComponentTest, TestSimpleTrackingShardHandler, CollectionReloadTest, CollectionTooManyReplicasTest, CollectionsAPISolrJTest, DistributedVersionInfoTest, LeaderElectionContextKeyTest, MoveReplicaHDFSTest, MultiThreadedOCPTest, OverriddenZkACLAndCredentialsProvidersTest, OverseerModifyCollectionTest, OverseerRolesTest, OverseerTaskQueueTest, PeerSyncReplicationTest, RemoteQueryErrorTest, ReplaceNodeTest, SaslZkACLProviderTest, SharedFSAutoReplicaFailoverTest, SolrCloudExampleTest, TestCloudRecovery, TestConfigSetsAPIExclusivity, TestConfigSetsAPIZkFailure, TestDeleteCollectionOnDownNodes, TestDownShardTolerantSearch, TestExclusionRuleCollectionAccess, TestHdfsCloudBackupRestore, TestLeaderElectionZkExpiry, TestMiniSolrCloudCluster, TestPullReplica, TestSSLRandomization, TestStressCloudBlindAtomicUpdates, TestTlogReplica, TestInfoStreamLogging, TestShardHandlerFactory, TestSimpleTextCodec, TestSolrConfigHandler, TestSolrXml, TestSolrCloudSnapshots, TestSQLHandlerNonCloud, TestSolrConfigHandlerCloud, TestSolrConfigHandlerConcurrent, DistributedFacetPivotLongTailTest, InfixSuggestersTest]
   [junit4] Completed [596/729 (1!)] on J0 in 21.98s, 7 tests, 1 error <<< FAILURES!

[...truncated 43826 lines...]


---------------------------------------------------------------------
To unsubscribe, e-mail: [hidden email]
For additional commands, e-mail: [hidden email]