[JENKINS] Lucene-Solr-7.7-Windows (64bit/jdk-11) - Build # 32 - Unstable!

classic Classic list List threaded Threaded
1 message Options
Reply | Threaded
Open this post in threaded view
|

[JENKINS] Lucene-Solr-7.7-Windows (64bit/jdk-11) - Build # 32 - Unstable!

Policeman Jenkins Server-2
Build: https://jenkins.thetaphi.de/job/Lucene-Solr-7.7-Windows/32/
Java: 64bit/jdk-11 -XX:+UseCompressedOops -XX:+UseG1GC

2 tests failed.
FAILED:  org.apache.solr.client.solrj.impl.CloudSolrClientTest.testRetryUpdatesWhenClusterStateIsStale

Error Message:
Error from server at http://127.0.0.1:53636/solr/stale_state_test_col: ClusterState says we are the leader (http://127.0.0.1:53636/solr/stale_state_test_col_shard1_replica_n3), but locally we don't think so. Request came from null

Stack Trace:
org.apache.solr.client.solrj.impl.HttpSolrClient$RemoteSolrException: Error from server at http://127.0.0.1:53636/solr/stale_state_test_col: ClusterState says we are the leader (http://127.0.0.1:53636/solr/stale_state_test_col_shard1_replica_n3), but locally we don't think so. Request came from null
        at __randomizedtesting.SeedInfo.seed([AACA89DE8F3BF936:1EFB11366CD28F1A]:0)
        at org.apache.solr.client.solrj.impl.HttpSolrClient.executeMethod(HttpSolrClient.java:643)
        at org.apache.solr.client.solrj.impl.HttpSolrClient.request(HttpSolrClient.java:255)
        at org.apache.solr.client.solrj.impl.HttpSolrClient.request(HttpSolrClient.java:244)
        at org.apache.solr.client.solrj.impl.LBHttpSolrClient.doRequest(LBHttpSolrClient.java:484)
        at org.apache.solr.client.solrj.impl.LBHttpSolrClient.request(LBHttpSolrClient.java:414)
        at org.apache.solr.client.solrj.impl.CloudSolrClient.sendRequest(CloudSolrClient.java:1110)
        at org.apache.solr.client.solrj.impl.CloudSolrClient.requestWithRetryOnStaleState(CloudSolrClient.java:884)
        at org.apache.solr.client.solrj.impl.CloudSolrClient.requestWithRetryOnStaleState(CloudSolrClient.java:997)
        at org.apache.solr.client.solrj.impl.CloudSolrClient.request(CloudSolrClient.java:817)
        at org.apache.solr.client.solrj.SolrRequest.process(SolrRequest.java:194)
        at org.apache.solr.client.solrj.request.UpdateRequest.commit(UpdateRequest.java:237)
        at org.apache.solr.client.solrj.impl.CloudSolrClientTest.testRetryUpdatesWhenClusterStateIsStale(CloudSolrClientTest.java:835)
        at java.base/jdk.internal.reflect.NativeMethodAccessorImpl.invoke0(Native Method)
        at java.base/jdk.internal.reflect.NativeMethodAccessorImpl.invoke(NativeMethodAccessorImpl.java:62)
        at java.base/jdk.internal.reflect.DelegatingMethodAccessorImpl.invoke(DelegatingMethodAccessorImpl.java:43)
        at java.base/java.lang.reflect.Method.invoke(Method.java:566)
        at com.carrotsearch.randomizedtesting.RandomizedRunner.invoke(RandomizedRunner.java:1750)
        at com.carrotsearch.randomizedtesting.RandomizedRunner$8.evaluate(RandomizedRunner.java:938)
        at com.carrotsearch.randomizedtesting.RandomizedRunner$9.evaluate(RandomizedRunner.java:974)
        at com.carrotsearch.randomizedtesting.RandomizedRunner$10.evaluate(RandomizedRunner.java:988)
        at org.junit.rules.ExpectedException$ExpectedExceptionStatement.evaluate(ExpectedException.java:239)
        at com.carrotsearch.randomizedtesting.rules.SystemPropertiesRestoreRule$1.evaluate(SystemPropertiesRestoreRule.java:57)
        at org.apache.lucene.util.TestRuleSetupTeardownChained$1.evaluate(TestRuleSetupTeardownChained.java:49)
        at org.apache.lucene.util.AbstractBeforeAfterRule$1.evaluate(AbstractBeforeAfterRule.java:45)
        at org.apache.lucene.util.TestRuleThreadAndTestName$1.evaluate(TestRuleThreadAndTestName.java:48)
        at org.apache.lucene.util.TestRuleIgnoreAfterMaxFailures$1.evaluate(TestRuleIgnoreAfterMaxFailures.java:64)
        at org.apache.lucene.util.TestRuleMarkFailure$1.evaluate(TestRuleMarkFailure.java:47)
        at com.carrotsearch.randomizedtesting.rules.StatementAdapter.evaluate(StatementAdapter.java:36)
        at com.carrotsearch.randomizedtesting.ThreadLeakControl$StatementRunner.run(ThreadLeakControl.java:368)
        at com.carrotsearch.randomizedtesting.ThreadLeakControl.forkTimeoutingTask(ThreadLeakControl.java:817)
        at com.carrotsearch.randomizedtesting.ThreadLeakControl$3.evaluate(ThreadLeakControl.java:468)
        at com.carrotsearch.randomizedtesting.RandomizedRunner.runSingleTest(RandomizedRunner.java:947)
        at com.carrotsearch.randomizedtesting.RandomizedRunner$5.evaluate(RandomizedRunner.java:832)
        at com.carrotsearch.randomizedtesting.RandomizedRunner$6.evaluate(RandomizedRunner.java:883)
        at com.carrotsearch.randomizedtesting.RandomizedRunner$7.evaluate(RandomizedRunner.java:894)
        at com.carrotsearch.randomizedtesting.rules.StatementAdapter.evaluate(StatementAdapter.java:36)
        at com.carrotsearch.randomizedtesting.rules.SystemPropertiesRestoreRule$1.evaluate(SystemPropertiesRestoreRule.java:57)
        at org.apache.lucene.util.AbstractBeforeAfterRule$1.evaluate(AbstractBeforeAfterRule.java:45)
        at com.carrotsearch.randomizedtesting.rules.StatementAdapter.evaluate(StatementAdapter.java:36)
        at org.apache.lucene.util.TestRuleStoreClassName$1.evaluate(TestRuleStoreClassName.java:41)
        at com.carrotsearch.randomizedtesting.rules.NoShadowingOrOverridesOnMethodsRule$1.evaluate(NoShadowingOrOverridesOnMethodsRule.java:40)
        at com.carrotsearch.randomizedtesting.rules.NoShadowingOrOverridesOnMethodsRule$1.evaluate(NoShadowingOrOverridesOnMethodsRule.java:40)
        at com.carrotsearch.randomizedtesting.rules.StatementAdapter.evaluate(StatementAdapter.java:36)
        at com.carrotsearch.randomizedtesting.rules.StatementAdapter.evaluate(StatementAdapter.java:36)
        at org.apache.lucene.util.TestRuleAssertionsRequired$1.evaluate(TestRuleAssertionsRequired.java:53)
        at org.apache.lucene.util.TestRuleMarkFailure$1.evaluate(TestRuleMarkFailure.java:47)
        at org.apache.lucene.util.TestRuleIgnoreAfterMaxFailures$1.evaluate(TestRuleIgnoreAfterMaxFailures.java:64)
        at org.apache.lucene.util.TestRuleIgnoreTestSuites$1.evaluate(TestRuleIgnoreTestSuites.java:54)
        at com.carrotsearch.randomizedtesting.rules.StatementAdapter.evaluate(StatementAdapter.java:36)
        at com.carrotsearch.randomizedtesting.ThreadLeakControl$StatementRunner.run(ThreadLeakControl.java:368)
        at java.base/java.lang.Thread.run(Thread.java:834)


FAILED:  junit.framework.TestSuite.org.apache.solr.client.solrj.impl.CloudSolrClientTest

Error Message:
ObjectTracker found 3 object(s) that were not released!!! [SolrCore, MockDirectoryWrapper, MockDirectoryWrapper] org.apache.solr.common.util.ObjectReleaseTracker$ObjectTrackerException: org.apache.solr.core.SolrCore  at org.apache.solr.common.util.ObjectReleaseTracker.track(ObjectReleaseTracker.java:42)  at org.apache.solr.core.SolrCore.<init>(SolrCore.java:1054)  at org.apache.solr.core.SolrCore.<init>(SolrCore.java:874)  at org.apache.solr.core.CoreContainer.createFromDescriptor(CoreContainer.java:1178)  at org.apache.solr.core.CoreContainer.create(CoreContainer.java:1088)  at org.apache.solr.handler.admin.CoreAdminOperation.lambda$static$0(CoreAdminOperation.java:92)  at org.apache.solr.handler.admin.CoreAdminOperation.execute(CoreAdminOperation.java:360)  at org.apache.solr.handler.admin.CoreAdminHandler$CallInfo.call(CoreAdminHandler.java:395)  at org.apache.solr.handler.admin.CoreAdminHandler.lambda$handleRequestBody$0(CoreAdminHandler.java:188)  at com.codahale.metrics.InstrumentedExecutorService$InstrumentedRunnable.run(InstrumentedExecutorService.java:176)  at org.apache.solr.common.util.ExecutorUtil$MDCAwareThreadPoolExecutor.lambda$execute$0(ExecutorUtil.java:209)  at java.base/java.util.concurrent.ThreadPoolExecutor.runWorker(ThreadPoolExecutor.java:1128)  at java.base/java.util.concurrent.ThreadPoolExecutor$Worker.run(ThreadPoolExecutor.java:628)  at java.base/java.lang.Thread.run(Thread.java:834)  org.apache.solr.common.util.ObjectReleaseTracker$ObjectTrackerException: org.apache.lucene.store.MockDirectoryWrapper  at org.apache.solr.common.util.ObjectReleaseTracker.track(ObjectReleaseTracker.java:42)  at org.apache.solr.core.CachingDirectoryFactory.get(CachingDirectoryFactory.java:348)  at org.apache.solr.update.SolrIndexWriter.create(SolrIndexWriter.java:95)  at org.apache.solr.core.SolrCore.initIndex(SolrCore.java:770)  at org.apache.solr.core.SolrCore.<init>(SolrCore.java:967)  at org.apache.solr.core.SolrCore.<init>(SolrCore.java:874)  at org.apache.solr.core.CoreContainer.createFromDescriptor(CoreContainer.java:1178)  at org.apache.solr.core.CoreContainer.create(CoreContainer.java:1088)  at org.apache.solr.handler.admin.CoreAdminOperation.lambda$static$0(CoreAdminOperation.java:92)  at org.apache.solr.handler.admin.CoreAdminOperation.execute(CoreAdminOperation.java:360)  at org.apache.solr.handler.admin.CoreAdminHandler$CallInfo.call(CoreAdminHandler.java:395)  at org.apache.solr.handler.admin.CoreAdminHandler.lambda$handleRequestBody$0(CoreAdminHandler.java:188)  at com.codahale.metrics.InstrumentedExecutorService$InstrumentedRunnable.run(InstrumentedExecutorService.java:176)  at org.apache.solr.common.util.ExecutorUtil$MDCAwareThreadPoolExecutor.lambda$execute$0(ExecutorUtil.java:209)  at java.base/java.util.concurrent.ThreadPoolExecutor.runWorker(ThreadPoolExecutor.java:1128)  at java.base/java.util.concurrent.ThreadPoolExecutor$Worker.run(ThreadPoolExecutor.java:628)  at java.base/java.lang.Thread.run(Thread.java:834)  org.apache.solr.common.util.ObjectReleaseTracker$ObjectTrackerException: org.apache.lucene.store.MockDirectoryWrapper  at org.apache.solr.common.util.ObjectReleaseTracker.track(ObjectReleaseTracker.java:42)  at org.apache.solr.core.CachingDirectoryFactory.get(CachingDirectoryFactory.java:348)  at org.apache.solr.core.SolrCore.initSnapshotMetaDataManager(SolrCore.java:508)  at org.apache.solr.core.SolrCore.<init>(SolrCore.java:959)  at org.apache.solr.core.SolrCore.<init>(SolrCore.java:874)  at org.apache.solr.core.CoreContainer.createFromDescriptor(CoreContainer.java:1178)  at org.apache.solr.core.CoreContainer.create(CoreContainer.java:1088)  at org.apache.solr.handler.admin.CoreAdminOperation.lambda$static$0(CoreAdminOperation.java:92)  at org.apache.solr.handler.admin.CoreAdminOperation.execute(CoreAdminOperation.java:360)  at org.apache.solr.handler.admin.CoreAdminHandler$CallInfo.call(CoreAdminHandler.java:395)  at org.apache.solr.handler.admin.CoreAdminHandler.lambda$handleRequestBody$0(CoreAdminHandler.java:188)  at com.codahale.metrics.InstrumentedExecutorService$InstrumentedRunnable.run(InstrumentedExecutorService.java:176)  at org.apache.solr.common.util.ExecutorUtil$MDCAwareThreadPoolExecutor.lambda$execute$0(ExecutorUtil.java:209)  at java.base/java.util.concurrent.ThreadPoolExecutor.runWorker(ThreadPoolExecutor.java:1128)  at java.base/java.util.concurrent.ThreadPoolExecutor$Worker.run(ThreadPoolExecutor.java:628)  at java.base/java.lang.Thread.run(Thread.java:834)   expected null, but was:<ObjectTracker found 3 object(s) that were not released!!! [SolrCore, MockDirectoryWrapper, MockDirectoryWrapper] org.apache.solr.common.util.ObjectReleaseTracker$ObjectTrackerException: org.apache.solr.core.SolrCore  at org.apache.solr.common.util.ObjectReleaseTracker.track(ObjectReleaseTracker.java:42)  at org.apache.solr.core.SolrCore.<init>(SolrCore.java:1054)  at org.apache.solr.core.SolrCore.<init>(SolrCore.java:874)  at org.apache.solr.core.CoreContainer.createFromDescriptor(CoreContainer.java:1178)  at org.apache.solr.core.CoreContainer.create(CoreContainer.java:1088)  at org.apache.solr.handler.admin.CoreAdminOperation.lambda$static$0(CoreAdminOperation.java:92)  at org.apache.solr.handler.admin.CoreAdminOperation.execute(CoreAdminOperation.java:360)  at org.apache.solr.handler.admin.CoreAdminHandler$CallInfo.call(CoreAdminHandler.java:395)  at org.apache.solr.handler.admin.CoreAdminHandler.lambda$handleRequestBody$0(CoreAdminHandler.java:188)  at com.codahale.metrics.InstrumentedExecutorService$InstrumentedRunnable.run(InstrumentedExecutorService.java:176)  at org.apache.solr.common.util.ExecutorUtil$MDCAwareThreadPoolExecutor.lambda$execute$0(ExecutorUtil.java:209)  at java.base/java.util.concurrent.ThreadPoolExecutor.runWorker(ThreadPoolExecutor.java:1128)  at java.base/java.util.concurrent.ThreadPoolExecutor$Worker.run(ThreadPoolExecutor.java:628)  at java.base/java.lang.Thread.run(Thread.java:834)  org.apache.solr.common.util.ObjectReleaseTracker$ObjectTrackerException: org.apache.lucene.store.MockDirectoryWrapper  at org.apache.solr.common.util.ObjectReleaseTracker.track(ObjectReleaseTracker.java:42)  at org.apache.solr.core.CachingDirectoryFactory.get(CachingDirectoryFactory.java:348)  at org.apache.solr.update.SolrIndexWriter.create(SolrIndexWriter.java:95)  at org.apache.solr.core.SolrCore.initIndex(SolrCore.java:770)  at org.apache.solr.core.SolrCore.<init>(SolrCore.java:967)  at org.apache.solr.core.SolrCore.<init>(SolrCore.java:874)  at org.apache.solr.core.CoreContainer.createFromDescriptor(CoreContainer.java:1178)  at org.apache.solr.core.CoreContainer.create(CoreContainer.java:1088)  at org.apache.solr.handler.admin.CoreAdminOperation.lambda$static$0(CoreAdminOperation.java:92)  at org.apache.solr.handler.admin.CoreAdminOperation.execute(CoreAdminOperation.java:360)  at org.apache.solr.handler.admin.CoreAdminHandler$CallInfo.call(CoreAdminHandler.java:395)  at org.apache.solr.handler.admin.CoreAdminHandler.lambda$handleRequestBody$0(CoreAdminHandler.java:188)  at com.codahale.metrics.InstrumentedExecutorService$InstrumentedRunnable.run(InstrumentedExecutorService.java:176)  at org.apache.solr.common.util.ExecutorUtil$MDCAwareThreadPoolExecutor.lambda$execute$0(ExecutorUtil.java:209)  at java.base/java.util.concurrent.ThreadPoolExecutor.runWorker(ThreadPoolExecutor.java:1128)  at java.base/java.util.concurrent.ThreadPoolExecutor$Worker.run(ThreadPoolExecutor.java:628)  at java.base/java.lang.Thread.run(Thread.java:834)  org.apache.solr.common.util.ObjectReleaseTracker$ObjectTrackerException: org.apache.lucene.store.MockDirectoryWrapper  at org.apache.solr.common.util.ObjectReleaseTracker.track(ObjectReleaseTracker.java:42)  at org.apache.solr.core.CachingDirectoryFactory.get(CachingDirectoryFactory.java:348)  at org.apache.solr.core.SolrCore.initSnapshotMetaDataManager(SolrCore.java:508)  at org.apache.solr.core.SolrCore.<init>(SolrCore.java:959)  at org.apache.solr.core.SolrCore.<init>(SolrCore.java:874)  at org.apache.solr.core.CoreContainer.createFromDescriptor(CoreContainer.java:1178)  at org.apache.solr.core.CoreContainer.create(CoreContainer.java:1088)  at org.apache.solr.handler.admin.CoreAdminOperation.lambda$static$0(CoreAdminOperation.java:92)  at org.apache.solr.handler.admin.CoreAdminOperation.execute(CoreAdminOperation.java:360)  at org.apache.solr.handler.admin.CoreAdminHandler$CallInfo.call(CoreAdminHandler.java:395)  at org.apache.solr.handler.admin.CoreAdminHandler.lambda$handleRequestBody$0(CoreAdminHandler.java:188)  at com.codahale.metrics.InstrumentedExecutorService$InstrumentedRunnable.run(InstrumentedExecutorService.java:176)  at org.apache.solr.common.util.ExecutorUtil$MDCAwareThreadPoolExecutor.lambda$execute$0(ExecutorUtil.java:209)  at java.base/java.util.concurrent.ThreadPoolExecutor.runWorker(ThreadPoolExecutor.java:1128)  at java.base/java.util.concurrent.ThreadPoolExecutor$Worker.run(ThreadPoolExecutor.java:628)  at java.base/java.lang.Thread.run(Thread.java:834)  >

Stack Trace:
java.lang.AssertionError: ObjectTracker found 3 object(s) that were not released!!! [SolrCore, MockDirectoryWrapper, MockDirectoryWrapper]
org.apache.solr.common.util.ObjectReleaseTracker$ObjectTrackerException: org.apache.solr.core.SolrCore
        at org.apache.solr.common.util.ObjectReleaseTracker.track(ObjectReleaseTracker.java:42)
        at org.apache.solr.core.SolrCore.<init>(SolrCore.java:1054)
        at org.apache.solr.core.SolrCore.<init>(SolrCore.java:874)
        at org.apache.solr.core.CoreContainer.createFromDescriptor(CoreContainer.java:1178)
        at org.apache.solr.core.CoreContainer.create(CoreContainer.java:1088)
        at org.apache.solr.handler.admin.CoreAdminOperation.lambda$static$0(CoreAdminOperation.java:92)
        at org.apache.solr.handler.admin.CoreAdminOperation.execute(CoreAdminOperation.java:360)
        at org.apache.solr.handler.admin.CoreAdminHandler$CallInfo.call(CoreAdminHandler.java:395)
        at org.apache.solr.handler.admin.CoreAdminHandler.lambda$handleRequestBody$0(CoreAdminHandler.java:188)
        at com.codahale.metrics.InstrumentedExecutorService$InstrumentedRunnable.run(InstrumentedExecutorService.java:176)
        at org.apache.solr.common.util.ExecutorUtil$MDCAwareThreadPoolExecutor.lambda$execute$0(ExecutorUtil.java:209)
        at java.base/java.util.concurrent.ThreadPoolExecutor.runWorker(ThreadPoolExecutor.java:1128)
        at java.base/java.util.concurrent.ThreadPoolExecutor$Worker.run(ThreadPoolExecutor.java:628)
        at java.base/java.lang.Thread.run(Thread.java:834)

org.apache.solr.common.util.ObjectReleaseTracker$ObjectTrackerException: org.apache.lucene.store.MockDirectoryWrapper
        at org.apache.solr.common.util.ObjectReleaseTracker.track(ObjectReleaseTracker.java:42)
        at org.apache.solr.core.CachingDirectoryFactory.get(CachingDirectoryFactory.java:348)
        at org.apache.solr.update.SolrIndexWriter.create(SolrIndexWriter.java:95)
        at org.apache.solr.core.SolrCore.initIndex(SolrCore.java:770)
        at org.apache.solr.core.SolrCore.<init>(SolrCore.java:967)
        at org.apache.solr.core.SolrCore.<init>(SolrCore.java:874)
        at org.apache.solr.core.CoreContainer.createFromDescriptor(CoreContainer.java:1178)
        at org.apache.solr.core.CoreContainer.create(CoreContainer.java:1088)
        at org.apache.solr.handler.admin.CoreAdminOperation.lambda$static$0(CoreAdminOperation.java:92)
        at org.apache.solr.handler.admin.CoreAdminOperation.execute(CoreAdminOperation.java:360)
        at org.apache.solr.handler.admin.CoreAdminHandler$CallInfo.call(CoreAdminHandler.java:395)
        at org.apache.solr.handler.admin.CoreAdminHandler.lambda$handleRequestBody$0(CoreAdminHandler.java:188)
        at com.codahale.metrics.InstrumentedExecutorService$InstrumentedRunnable.run(InstrumentedExecutorService.java:176)
        at org.apache.solr.common.util.ExecutorUtil$MDCAwareThreadPoolExecutor.lambda$execute$0(ExecutorUtil.java:209)
        at java.base/java.util.concurrent.ThreadPoolExecutor.runWorker(ThreadPoolExecutor.java:1128)
        at java.base/java.util.concurrent.ThreadPoolExecutor$Worker.run(ThreadPoolExecutor.java:628)
        at java.base/java.lang.Thread.run(Thread.java:834)

org.apache.solr.common.util.ObjectReleaseTracker$ObjectTrackerException: org.apache.lucene.store.MockDirectoryWrapper
        at org.apache.solr.common.util.ObjectReleaseTracker.track(ObjectReleaseTracker.java:42)
        at org.apache.solr.core.CachingDirectoryFactory.get(CachingDirectoryFactory.java:348)
        at org.apache.solr.core.SolrCore.initSnapshotMetaDataManager(SolrCore.java:508)
        at org.apache.solr.core.SolrCore.<init>(SolrCore.java:959)
        at org.apache.solr.core.SolrCore.<init>(SolrCore.java:874)
        at org.apache.solr.core.CoreContainer.createFromDescriptor(CoreContainer.java:1178)
        at org.apache.solr.core.CoreContainer.create(CoreContainer.java:1088)
        at org.apache.solr.handler.admin.CoreAdminOperation.lambda$static$0(CoreAdminOperation.java:92)
        at org.apache.solr.handler.admin.CoreAdminOperation.execute(CoreAdminOperation.java:360)
        at org.apache.solr.handler.admin.CoreAdminHandler$CallInfo.call(CoreAdminHandler.java:395)
        at org.apache.solr.handler.admin.CoreAdminHandler.lambda$handleRequestBody$0(CoreAdminHandler.java:188)
        at com.codahale.metrics.InstrumentedExecutorService$InstrumentedRunnable.run(InstrumentedExecutorService.java:176)
        at org.apache.solr.common.util.ExecutorUtil$MDCAwareThreadPoolExecutor.lambda$execute$0(ExecutorUtil.java:209)
        at java.base/java.util.concurrent.ThreadPoolExecutor.runWorker(ThreadPoolExecutor.java:1128)
        at java.base/java.util.concurrent.ThreadPoolExecutor$Worker.run(ThreadPoolExecutor.java:628)
        at java.base/java.lang.Thread.run(Thread.java:834)

 expected null, but was:<ObjectTracker found 3 object(s) that were not released!!! [SolrCore, MockDirectoryWrapper, MockDirectoryWrapper]
org.apache.solr.common.util.ObjectReleaseTracker$ObjectTrackerException: org.apache.solr.core.SolrCore
        at org.apache.solr.common.util.ObjectReleaseTracker.track(ObjectReleaseTracker.java:42)
        at org.apache.solr.core.SolrCore.<init>(SolrCore.java:1054)
        at org.apache.solr.core.SolrCore.<init>(SolrCore.java:874)
        at org.apache.solr.core.CoreContainer.createFromDescriptor(CoreContainer.java:1178)
        at org.apache.solr.core.CoreContainer.create(CoreContainer.java:1088)
        at org.apache.solr.handler.admin.CoreAdminOperation.lambda$static$0(CoreAdminOperation.java:92)
        at org.apache.solr.handler.admin.CoreAdminOperation.execute(CoreAdminOperation.java:360)
        at org.apache.solr.handler.admin.CoreAdminHandler$CallInfo.call(CoreAdminHandler.java:395)
        at org.apache.solr.handler.admin.CoreAdminHandler.lambda$handleRequestBody$0(CoreAdminHandler.java:188)
        at com.codahale.metrics.InstrumentedExecutorService$InstrumentedRunnable.run(InstrumentedExecutorService.java:176)
        at org.apache.solr.common.util.ExecutorUtil$MDCAwareThreadPoolExecutor.lambda$execute$0(ExecutorUtil.java:209)
        at java.base/java.util.concurrent.ThreadPoolExecutor.runWorker(ThreadPoolExecutor.java:1128)
        at java.base/java.util.concurrent.ThreadPoolExecutor$Worker.run(ThreadPoolExecutor.java:628)
        at java.base/java.lang.Thread.run(Thread.java:834)

org.apache.solr.common.util.ObjectReleaseTracker$ObjectTrackerException: org.apache.lucene.store.MockDirectoryWrapper
        at org.apache.solr.common.util.ObjectReleaseTracker.track(ObjectReleaseTracker.java:42)
        at org.apache.solr.core.CachingDirectoryFactory.get(CachingDirectoryFactory.java:348)
        at org.apache.solr.update.SolrIndexWriter.create(SolrIndexWriter.java:95)
        at org.apache.solr.core.SolrCore.initIndex(SolrCore.java:770)
        at org.apache.solr.core.SolrCore.<init>(SolrCore.java:967)
        at org.apache.solr.core.SolrCore.<init>(SolrCore.java:874)
        at org.apache.solr.core.CoreContainer.createFromDescriptor(CoreContainer.java:1178)
        at org.apache.solr.core.CoreContainer.create(CoreContainer.java:1088)
        at org.apache.solr.handler.admin.CoreAdminOperation.lambda$static$0(CoreAdminOperation.java:92)
        at org.apache.solr.handler.admin.CoreAdminOperation.execute(CoreAdminOperation.java:360)
        at org.apache.solr.handler.admin.CoreAdminHandler$CallInfo.call(CoreAdminHandler.java:395)
        at org.apache.solr.handler.admin.CoreAdminHandler.lambda$handleRequestBody$0(CoreAdminHandler.java:188)
        at com.codahale.metrics.InstrumentedExecutorService$InstrumentedRunnable.run(InstrumentedExecutorService.java:176)
        at org.apache.solr.common.util.ExecutorUtil$MDCAwareThreadPoolExecutor.lambda$execute$0(ExecutorUtil.java:209)
        at java.base/java.util.concurrent.ThreadPoolExecutor.runWorker(ThreadPoolExecutor.java:1128)
        at java.base/java.util.concurrent.ThreadPoolExecutor$Worker.run(ThreadPoolExecutor.java:628)
        at java.base/java.lang.Thread.run(Thread.java:834)

org.apache.solr.common.util.ObjectReleaseTracker$ObjectTrackerException: org.apache.lucene.store.MockDirectoryWrapper
        at org.apache.solr.common.util.ObjectReleaseTracker.track(ObjectReleaseTracker.java:42)
        at org.apache.solr.core.CachingDirectoryFactory.get(CachingDirectoryFactory.java:348)
        at org.apache.solr.core.SolrCore.initSnapshotMetaDataManager(SolrCore.java:508)
        at org.apache.solr.core.SolrCore.<init>(SolrCore.java:959)
        at org.apache.solr.core.SolrCore.<init>(SolrCore.java:874)
        at org.apache.solr.core.CoreContainer.createFromDescriptor(CoreContainer.java:1178)
        at org.apache.solr.core.CoreContainer.create(CoreContainer.java:1088)
        at org.apache.solr.handler.admin.CoreAdminOperation.lambda$static$0(CoreAdminOperation.java:92)
        at org.apache.solr.handler.admin.CoreAdminOperation.execute(CoreAdminOperation.java:360)
        at org.apache.solr.handler.admin.CoreAdminHandler$CallInfo.call(CoreAdminHandler.java:395)
        at org.apache.solr.handler.admin.CoreAdminHandler.lambda$handleRequestBody$0(CoreAdminHandler.java:188)
        at com.codahale.metrics.InstrumentedExecutorService$InstrumentedRunnable.run(InstrumentedExecutorService.java:176)
        at org.apache.solr.common.util.ExecutorUtil$MDCAwareThreadPoolExecutor.lambda$execute$0(ExecutorUtil.java:209)
        at java.base/java.util.concurrent.ThreadPoolExecutor.runWorker(ThreadPoolExecutor.java:1128)
        at java.base/java.util.concurrent.ThreadPoolExecutor$Worker.run(ThreadPoolExecutor.java:628)
        at java.base/java.lang.Thread.run(Thread.java:834)

>
        at __randomizedtesting.SeedInfo.seed([AACA89DE8F3BF936]:0)
        at org.junit.Assert.fail(Assert.java:88)
        at org.junit.Assert.failNotNull(Assert.java:755)
        at org.junit.Assert.assertNull(Assert.java:737)
        at org.apache.solr.SolrTestCaseJ4.teardownTestCases(SolrTestCaseJ4.java:320)
        at jdk.internal.reflect.GeneratedMethodAccessor37.invoke(Unknown Source)
        at java.base/jdk.internal.reflect.DelegatingMethodAccessorImpl.invoke(DelegatingMethodAccessorImpl.java:43)
        at java.base/java.lang.reflect.Method.invoke(Method.java:566)
        at com.carrotsearch.randomizedtesting.RandomizedRunner.invoke(RandomizedRunner.java:1750)
        at com.carrotsearch.randomizedtesting.RandomizedRunner$7.evaluate(RandomizedRunner.java:901)
        at com.carrotsearch.randomizedtesting.rules.StatementAdapter.evaluate(StatementAdapter.java:36)
        at com.carrotsearch.randomizedtesting.rules.SystemPropertiesRestoreRule$1.evaluate(SystemPropertiesRestoreRule.java:57)
        at org.apache.lucene.util.AbstractBeforeAfterRule$1.evaluate(AbstractBeforeAfterRule.java:45)
        at com.carrotsearch.randomizedtesting.rules.StatementAdapter.evaluate(StatementAdapter.java:36)
        at org.apache.lucene.util.TestRuleStoreClassName$1.evaluate(TestRuleStoreClassName.java:41)
        at com.carrotsearch.randomizedtesting.rules.NoShadowingOrOverridesOnMethodsRule$1.evaluate(NoShadowingOrOverridesOnMethodsRule.java:40)
        at com.carrotsearch.randomizedtesting.rules.NoShadowingOrOverridesOnMethodsRule$1.evaluate(NoShadowingOrOverridesOnMethodsRule.java:40)
        at com.carrotsearch.randomizedtesting.rules.StatementAdapter.evaluate(StatementAdapter.java:36)
        at com.carrotsearch.randomizedtesting.rules.StatementAdapter.evaluate(StatementAdapter.java:36)
        at org.apache.lucene.util.TestRuleAssertionsRequired$1.evaluate(TestRuleAssertionsRequired.java:53)
        at org.apache.lucene.util.TestRuleMarkFailure$1.evaluate(TestRuleMarkFailure.java:47)
        at org.apache.lucene.util.TestRuleIgnoreAfterMaxFailures$1.evaluate(TestRuleIgnoreAfterMaxFailures.java:64)
        at org.apache.lucene.util.TestRuleIgnoreTestSuites$1.evaluate(TestRuleIgnoreTestSuites.java:54)
        at com.carrotsearch.randomizedtesting.rules.StatementAdapter.evaluate(StatementAdapter.java:36)
        at com.carrotsearch.randomizedtesting.ThreadLeakControl$StatementRunner.run(ThreadLeakControl.java:368)
        at java.base/java.lang.Thread.run(Thread.java:834)




Build Log:
[...truncated 16622 lines...]
   [junit4] Suite: org.apache.solr.client.solrj.impl.CloudSolrClientTest
   [junit4]   2> Creating dataDir: C:\Users\jenkins\workspace\Lucene-Solr-7.7-Windows\solr\build\solr-solrj\test\J0\temp\solr.client.solrj.impl.CloudSolrClientTest_AACA89DE8F3BF936-001\init-core-data-001
   [junit4]   1> 15:46:10.033 [jetty-launcher-1440-thread-1] ERROR org.apache.solr.util.StartupLoggingUtils - Missing Java Option solr.log.dir. Logging may be missing or incomplete.
   [junit4]   1> 15:46:10.045 [jetty-launcher-1440-thread-2] ERROR org.apache.solr.util.StartupLoggingUtils - Missing Java Option solr.log.dir. Logging may be missing or incomplete.
   [junit4]   1> 15:46:10.053 [jetty-launcher-1440-thread-3] ERROR org.apache.solr.util.StartupLoggingUtils - Missing Java Option solr.log.dir. Logging may be missing or incomplete.
   [junit4]   1> 15:46:14.938 [jetty-launcher-1511-thread-2] ERROR org.apache.solr.util.StartupLoggingUtils - Missing Java Option solr.log.dir. Logging may be missing or incomplete.
   [junit4]   1> 15:46:14.942 [jetty-launcher-1511-thread-1] ERROR org.apache.solr.util.StartupLoggingUtils - Missing Java Option solr.log.dir. Logging may be missing or incomplete.
   [junit4]   1> 15:46:14.951 [jetty-launcher-1511-thread-3] ERROR org.apache.solr.util.StartupLoggingUtils - Missing Java Option solr.log.dir. Logging may be missing or incomplete.
   [junit4]   1> 15:46:16.060 [SyncThread:0] ERROR org.apache.zookeeper.server.NIOServerCnxn - Unexpected Exception:
   [junit4]   1> java.nio.channels.CancelledKeyException: null
   [junit4]   1> at sun.nio.ch.SelectionKeyImpl.ensureValid(SelectionKeyImpl.java:71) ~[?:?]
   [junit4]   1> at sun.nio.ch.SelectionKeyImpl.interestOps(SelectionKeyImpl.java:96) ~[?:?]
   [junit4]   1> at org.apache.zookeeper.server.NIOServerCnxn.internalSendBuffer(NIOServerCnxn.java:188) ~[zookeeper-3.4.13.jar:3.4.13-2d71af4dbe22557fda74f9a9b4309b15a7487f03]
   [junit4]   1> at org.apache.zookeeper.server.NIOServerCnxn.sendBuffer(NIOServerCnxn.java:147) [zookeeper-3.4.13.jar:3.4.13-2d71af4dbe22557fda74f9a9b4309b15a7487f03]
   [junit4]   1> at org.apache.zookeeper.server.NIOServerCnxn.sendCloseSession(NIOServerCnxn.java:119) [zookeeper-3.4.13.jar:3.4.13-2d71af4dbe22557fda74f9a9b4309b15a7487f03]
   [junit4]   1> at org.apache.zookeeper.server.FinalRequestProcessor.processRequest(FinalRequestProcessor.java:394) [zookeeper-3.4.13.jar:3.4.13-2d71af4dbe22557fda74f9a9b4309b15a7487f03]
   [junit4]   1> at org.apache.zookeeper.server.SyncRequestProcessor.flush(SyncRequestProcessor.java:199) [zookeeper-3.4.13.jar:3.4.13-2d71af4dbe22557fda74f9a9b4309b15a7487f03]
   [junit4]   1> at org.apache.zookeeper.server.SyncRequestProcessor.run(SyncRequestProcessor.java:131) [zookeeper-3.4.13.jar:3.4.13-2d71af4dbe22557fda74f9a9b4309b15a7487f03]
   [junit4]   1> 15:46:17.334 [jetty-launcher-1587-thread-2] ERROR org.apache.solr.util.StartupLoggingUtils - Missing Java Option solr.log.dir. Logging may be missing or incomplete.
   [junit4]   1> 15:46:17.334 [jetty-launcher-1587-thread-3] ERROR org.apache.solr.util.StartupLoggingUtils - Missing Java Option solr.log.dir. Logging may be missing or incomplete.
   [junit4]   1> 15:46:17.338 [jetty-launcher-1587-thread-1] ERROR org.apache.solr.util.StartupLoggingUtils - Missing Java Option solr.log.dir. Logging may be missing or incomplete.
   [junit4]   1> 15:46:23.415 [jetty-launcher-1658-thread-2] ERROR org.apache.solr.util.StartupLoggingUtils - Missing Java Option solr.log.dir. Logging may be missing or incomplete.
   [junit4]   1> 15:46:23.421 [jetty-launcher-1658-thread-1] ERROR org.apache.solr.util.StartupLoggingUtils - Missing Java Option solr.log.dir. Logging may be missing or incomplete.
   [junit4]   1> 15:46:23.428 [jetty-launcher-1658-thread-3] ERROR org.apache.solr.util.StartupLoggingUtils - Missing Java Option solr.log.dir. Logging may be missing or incomplete.
   [junit4]   1> 15:46:28.280 [jetty-launcher-1734-thread-1] ERROR org.apache.solr.util.StartupLoggingUtils - Missing Java Option solr.log.dir. Logging may be missing or incomplete.
   [junit4]   1> 15:46:28.282 [jetty-launcher-1734-thread-2] ERROR org.apache.solr.util.StartupLoggingUtils - Missing Java Option solr.log.dir. Logging may be missing or incomplete.
   [junit4]   1> 15:46:28.302 [jetty-launcher-1734-thread-3] ERROR org.apache.solr.util.StartupLoggingUtils - Missing Java Option solr.log.dir. Logging may be missing or incomplete.
   [junit4]   1> 15:46:32.364 [jetty-launcher-1810-thread-1] ERROR org.apache.solr.util.StartupLoggingUtils - Missing Java Option solr.log.dir. Logging may be missing or incomplete.
   [junit4]   1> 15:46:32.372 [jetty-launcher-1810-thread-2] ERROR org.apache.solr.util.StartupLoggingUtils - Missing Java Option solr.log.dir. Logging may be missing or incomplete.
   [junit4]   1> 15:46:32.385 [jetty-launcher-1810-thread-3] ERROR org.apache.solr.util.StartupLoggingUtils - Missing Java Option solr.log.dir. Logging may be missing or incomplete.
   [junit4]   1> 15:46:37.156 [jetty-launcher-1881-thread-1] ERROR org.apache.solr.util.StartupLoggingUtils - Missing Java Option solr.log.dir. Logging may be missing or incomplete.
   [junit4]   1> 15:46:37.160 [jetty-launcher-1881-thread-2] ERROR org.apache.solr.util.StartupLoggingUtils - Missing Java Option solr.log.dir. Logging may be missing or incomplete.
   [junit4]   1> 15:46:37.169 [jetty-launcher-1881-thread-3] ERROR org.apache.solr.util.StartupLoggingUtils - Missing Java Option solr.log.dir. Logging may be missing or incomplete.
   [junit4]   1> 15:46:39.821 [jetty-launcher-1953-thread-2] ERROR org.apache.solr.util.StartupLoggingUtils - Missing Java Option solr.log.dir. Logging may be missing or incomplete.
   [junit4]   1> 15:46:39.830 [jetty-launcher-1953-thread-1] ERROR org.apache.solr.util.StartupLoggingUtils - Missing Java Option solr.log.dir. Logging may be missing or incomplete.
   [junit4]   1> 15:46:39.849 [jetty-launcher-1953-thread-3] ERROR org.apache.solr.util.StartupLoggingUtils - Missing Java Option solr.log.dir. Logging may be missing or incomplete.
   [junit4]   1> 15:46:45.527 [jetty-launcher-2024-thread-1] ERROR org.apache.solr.util.StartupLoggingUtils - Missing Java Option solr.log.dir. Logging may be missing or incomplete.
   [junit4]   1> 15:46:45.527 [jetty-launcher-2024-thread-2] ERROR org.apache.solr.util.StartupLoggingUtils - Missing Java Option solr.log.dir. Logging may be missing or incomplete.
   [junit4]   1> 15:46:45.556 [jetty-launcher-2024-thread-3] ERROR org.apache.solr.util.StartupLoggingUtils - Missing Java Option solr.log.dir. Logging may be missing or incomplete.
   [junit4]   1> 15:46:56.197 [jetty-launcher-2095-thread-1] ERROR org.apache.solr.util.StartupLoggingUtils - Missing Java Option solr.log.dir. Logging may be missing or incomplete.
   [junit4]   1> 15:46:56.227 [jetty-launcher-2095-thread-3] ERROR org.apache.solr.util.StartupLoggingUtils - Missing Java Option solr.log.dir. Logging may be missing or incomplete.
   [junit4]   1> 15:46:56.408 [jetty-launcher-2095-thread-2] ERROR org.apache.solr.util.StartupLoggingUtils - Missing Java Option solr.log.dir. Logging may be missing or incomplete.
   [junit4]   1> 15:46:57.611 [qtp1562440883-5945] ERROR org.apache.solr.handler.RequestHandlerBase - org.apache.solr.common.SolrException: Collection: boguscollectionname not found
   [junit4]   1> at org.apache.solr.handler.admin.ClusterStatus.getClusterStatus(ClusterStatus.java:115)
   [junit4]   1> at org.apache.solr.handler.admin.CollectionsHandler$CollectionOperation.lambda$static$22(CollectionsHandler.java:866)
   [junit4]   1> at org.apache.solr.handler.admin.CollectionsHandler$CollectionOperation.execute(CollectionsHandler.java:1178)
   [junit4]   1> at org.apache.solr.handler.admin.CollectionsHandler.invokeAction(CollectionsHandler.java:259)
   [junit4]   1> at org.apache.solr.handler.admin.CollectionsHandler.handleRequestBody(CollectionsHandler.java:247)
   [junit4]   1> at org.apache.solr.handler.RequestHandlerBase.handleRequest(RequestHandlerBase.java:199)
   [junit4]   1> at org.apache.solr.servlet.HttpSolrCall.handleAdmin(HttpSolrCall.java:735)
   [junit4]   1> at org.apache.solr.servlet.HttpSolrCall.handleAdminRequest(HttpSolrCall.java:716)
   [junit4]   1> at org.apache.solr.servlet.HttpSolrCall.call(HttpSolrCall.java:496)
   [junit4]   1> at org.apache.solr.servlet.SolrDispatchFilter.doFilter(SolrDispatchFilter.java:395)
   [junit4]   1> at org.apache.solr.servlet.SolrDispatchFilter.doFilter(SolrDispatchFilter.java:341)
   [junit4]   1> at org.eclipse.jetty.servlet.ServletHandler$CachedChain.doFilter(ServletHandler.java:1610)
   [junit4]   1> at org.apache.solr.client.solrj.embedded.JettySolrRunner$DebugFilter.doFilter(JettySolrRunner.java:158)
   [junit4]   1> at org.eclipse.jetty.servlet.ServletHandler$CachedChain.doFilter(ServletHandler.java:1610)
   [junit4]   1> at org.eclipse.jetty.servlet.ServletHandler.doHandle(ServletHandler.java:540)
   [junit4]   1> at org.eclipse.jetty.server.handler.ScopedHandler.nextHandle(ScopedHandler.java:255)
   [junit4]   1> at org.eclipse.jetty.server.session.SessionHandler.doHandle(SessionHandler.java:1588)
   [junit4]   1> at org.eclipse.jetty.server.handler.ScopedHandler.nextHandle(ScopedHandler.java:255)
   [junit4]   1> at org.eclipse.jetty.server.handler.ContextHandler.doHandle(ContextHandler.java:1345)
   [junit4]   1> at org.eclipse.jetty.server.handler.ScopedHandler.nextScope(ScopedHandler.java:203)
   [junit4]   1> at org.eclipse.jetty.servlet.ServletHandler.doScope(ServletHandler.java:480)
   [junit4]   1> at org.eclipse.jetty.server.session.SessionHandler.doScope(SessionHandler.java:1557)
   [junit4]   1> at org.eclipse.jetty.server.handler.ScopedHandler.nextScope(ScopedHandler.java:201)
   [junit4]   1> at org.eclipse.jetty.server.handler.ContextHandler.doScope(ContextHandler.java:1247)
   [junit4]   1> at org.eclipse.jetty.server.handler.ScopedHandler.handle(ScopedHandler.java:144)
   [junit4]   1> at org.eclipse.jetty.server.handler.gzip.GzipHandler.handle(GzipHandler.java:753)
   [junit4]   1> at org.eclipse.jetty.server.handler.HandlerWrapper.handle(HandlerWrapper.java:132)
   [junit4]   1> at org.eclipse.jetty.server.Server.handle(Server.java:502)
   [junit4]   1> at org.eclipse.jetty.server.HttpChannel.handle(HttpChannel.java:364)
   [junit4]   1> at org.eclipse.jetty.server.HttpConnection.onFillable(HttpConnection.java:260)
   [junit4]   1> at org.eclipse.jetty.io.AbstractConnection$ReadCallback.succeeded(AbstractConnection.java:305)
   [junit4]   1> at org.eclipse.jetty.io.FillInterest.fillable(FillInterest.java:103)
   [junit4]   1> at org.eclipse.jetty.io.ChannelEndPoint$2.run(ChannelEndPoint.java:118)
   [junit4]   1> at org.eclipse.jetty.util.thread.QueuedThreadPool.runJob(QueuedThreadPool.java:765)
   [junit4]   1> at org.eclipse.jetty.util.thread.QueuedThreadPool$2.run(QueuedThreadPool.java:683)
   [junit4]   1> at java.base/java.lang.Thread.run(Thread.java:834)
   [junit4]   1>
   [junit4]   1> 15:46:57.620 [qtp1562440883-5943] ERROR org.apache.solr.handler.RequestHandlerBase - org.apache.solr.common.SolrException: Collection: boguscollectionname not found
   [junit4]   1> at org.apache.solr.handler.admin.ClusterStatus.getClusterStatus(ClusterStatus.java:115)
   [junit4]   1> at org.apache.solr.handler.admin.CollectionsHandler$CollectionOperation.lambda$static$22(CollectionsHandler.java:866)
   [junit4]   1> at org.apache.solr.handler.admin.CollectionsHandler$CollectionOperation.execute(CollectionsHandler.java:1178)
   [junit4]   1> at org.apache.solr.handler.admin.CollectionsHandler.invokeAction(CollectionsHandler.java:259)
   [junit4]   1> at org.apache.solr.handler.admin.CollectionsHandler.handleRequestBody(CollectionsHandler.java:247)
   [junit4]   1> at org.apache.solr.handler.RequestHandlerBase.handleRequest(RequestHandlerBase.java:199)
   [junit4]   1> at org.apache.solr.servlet.HttpSolrCall.handleAdmin(HttpSolrCall.java:735)
   [junit4]   1> at org.apache.solr.servlet.HttpSolrCall.handleAdminRequest(HttpSolrCall.java:716)
   [junit4]   1> at org.apache.solr.servlet.HttpSolrCall.call(HttpSolrCall.java:496)
   [junit4]   1> at org.apache.solr.servlet.SolrDispatchFilter.doFilter(SolrDispatchFilter.java:395)
   [junit4]   1> at org.apache.solr.servlet.SolrDispatchFilter.doFilter(SolrDispatchFilter.java:341)
   [junit4]   1> at org.eclipse.jetty.servlet.ServletHandler$CachedChain.doFilter(ServletHandler.java:1610)
   [junit4]   1> at org.apache.solr.client.solrj.embedded.JettySolrRunner$DebugFilter.doFilter(JettySolrRunner.java:158)
   [junit4]   1> at org.eclipse.jetty.servlet.ServletHandler$CachedChain.doFilter(ServletHandler.java:1610)
   [junit4]   1> at org.eclipse.jetty.servlet.ServletHandler.doHandle(ServletHandler.java:540)
   [junit4]   1> at org.eclipse.jetty.server.handler.ScopedHandler.nextHandle(ScopedHandler.java:255)
   [junit4]   1> at org.eclipse.jetty.server.session.SessionHandler.doHandle(SessionHandler.java:1588)
   [junit4]   1> at org.eclipse.jetty.server.handler.ScopedHandler.nextHandle(ScopedHandler.java:255)
   [junit4]   1> at org.eclipse.jetty.server.handler.ContextHandler.doHandle(ContextHandler.java:1345)
   [junit4]   1> at org.eclipse.jetty.server.handler.ScopedHandler.nextScope(ScopedHandler.java:203)
   [junit4]   1> at org.eclipse.jetty.servlet.ServletHandler.doScope(ServletHandler.java:480)
   [junit4]   1> at org.eclipse.jetty.server.session.SessionHandler.doScope(SessionHandler.java:1557)
   [junit4]   1> at org.eclipse.jetty.server.handler.ScopedHandler.nextScope(ScopedHandler.java:201)
   [junit4]   1> at org.eclipse.jetty.server.handler.ContextHandler.doScope(ContextHandler.java:1247)
   [junit4]   1> at org.eclipse.jetty.server.handler.ScopedHandler.handle(ScopedHandler.java:144)
   [junit4]   1> at org.eclipse.jetty.server.handler.gzip.GzipHandler.handle(GzipHandler.java:753)
   [junit4]   1> at org.eclipse.jetty.server.handler.HandlerWrapper.handle(HandlerWrapper.java:132)
   [junit4]   1> at org.eclipse.jetty.server.Server.handle(Server.java:502)
   [junit4]   1> at org.eclipse.jetty.server.HttpChannel.handle(HttpChannel.java:364)
   [junit4]   1> at org.eclipse.jetty.server.HttpConnection.onFillable(HttpConnection.java:260)
   [junit4]   1> at org.eclipse.jetty.io.AbstractConnection$ReadCallback.succeeded(AbstractConnection.java:305)
   [junit4]   1> at org.eclipse.jetty.io.FillInterest.fillable(FillInterest.java:103)
   [junit4]   1> at org.eclipse.jetty.io.ChannelEndPoint$2.run(ChannelEndPoint.java:118)
   [junit4]   1> at org.eclipse.jetty.util.thread.QueuedThreadPool.runJob(QueuedThreadPool.java:765)
   [junit4]   1> at org.eclipse.jetty.util.thread.QueuedThreadPool$2.run(QueuedThreadPool.java:683)
   [junit4]   1> at java.base/java.lang.Thread.run(Thread.java:834)
   [junit4]   1>
   [junit4]   1> 15:46:59.258 [jetty-launcher-2166-thread-1] ERROR org.apache.solr.util.StartupLoggingUtils - Missing Java Option solr.log.dir. Logging may be missing or incomplete.
   [junit4]   1> 15:46:59.267 [jetty-launcher-2166-thread-3] ERROR org.apache.solr.util.StartupLoggingUtils - Missing Java Option solr.log.dir. Logging may be missing or incomplete.
   [junit4]   1> 15:46:59.268 [jetty-launcher-2166-thread-2] ERROR org.apache.solr.util.StartupLoggingUtils - Missing Java Option solr.log.dir. Logging may be missing or incomplete.
   [junit4]   1> replica:core_node2 rstate:active live:true
   [junit4]   1> replica:core_node4 rstate:down live:true
   [junit4]   1> replica:core_node2 rstate:active live:true
   [junit4]   1> replica:core_node4 rstate:down live:true
   [junit4]   1> replica:core_node2 rstate:active live:true
   [junit4]   1> replica:core_node4 rstate:recovering live:true
   [junit4]   1> replica:core_node2 rstate:active live:true
   [junit4]   1> replica:core_node4 rstate:active live:true
   [junit4]   1> no one is recoverying
   [junit4]   1> replica:core_node4 rstate:active live:true
   [junit4]   1> no one is recoverying
   [junit4]   1> 15:47:05.169 [TEST-CloudSolrClientTest.testRetryUpdatesWhenClusterStateIsStale-seed#[AACA89DE8F3BF936]] ERROR org.apache.solr.client.solrj.impl.CloudSolrClient - Request to collection [stale_state_test_col] failed due to (404) org.apache.solr.client.solrj.impl.HttpSolrClient$RemoteSolrException: Error from server at http://127.0.0.1:59433/solr/stale_state_test_col_shard1_replica_n1: Expected mime type application/octet-stream but got text/html. <html>
   [junit4]   1> <head>
   [junit4]   1> <meta http-equiv="Content-Type" content="text/html;charset=utf-8"/>
   [junit4]   1> <title>Error 404 Can not find: /solr/stale_state_test_col_shard1_replica_n1/update</title>
   [junit4]   1> </head>
   [junit4]   1> <body><h2>HTTP ERROR 404</h2>
   [junit4]   1> <p>Problem accessing /solr/stale_state_test_col_shard1_replica_n1/update. Reason:
   [junit4]   1> <pre>    Can not find: /solr/stale_state_test_col_shard1_replica_n1/update</pre></p><hr><a href="http://eclipse.org/jetty">Powered by Jetty:// 9.4.14.v20181114</a><hr/>
   [junit4]   1>
   [junit4]   1> </body>
   [junit4]   1> </html>
   [junit4]   1> , retry=0 commError=false errorCode=404
   [junit4]   1> 15:47:09.820 [jetty-launcher-2243-thread-2] ERROR org.apache.solr.util.StartupLoggingUtils - Missing Java Option solr.log.dir. Logging may be missing or incomplete.
   [junit4]   1> 15:47:09.865 [jetty-launcher-2243-thread-3] ERROR org.apache.solr.util.StartupLoggingUtils - Missing Java Option solr.log.dir. Logging may be missing or incomplete.
   [junit4]   1> 15:47:09.865 [jetty-launcher-2243-thread-1] ERROR org.apache.solr.util.StartupLoggingUtils - Missing Java Option solr.log.dir. Logging may be missing or incomplete.
   [junit4]   1> 15:47:19.641 [indexFetcher-1558-thread-1] ERROR org.apache.solr.handler.ReplicationHandler - Index fetch failed :org.apache.solr.common.SolrException: SolrCoreState already closed.
   [junit4]   1> at org.apache.solr.update.DefaultSolrCoreState.lock(DefaultSolrCoreState.java:186)
   [junit4]   1> at org.apache.solr.update.DefaultSolrCoreState.newIndexWriter(DefaultSolrCoreState.java:227)
   [junit4]   1> at org.apache.solr.update.DirectUpdateHandler2.newIndexWriter(DirectUpdateHandler2.java:758)
   [junit4]   1> at org.apache.solr.handler.IndexFetcher.fetchLatestIndex(IndexFetcher.java:650)
   [junit4]   1> at org.apache.solr.handler.IndexFetcher.fetchLatestIndex(IndexFetcher.java:346)
   [junit4]   1> at org.apache.solr.handler.ReplicationHandler.doFetch(ReplicationHandler.java:425)
   [junit4]   1> at org.apache.solr.handler.ReplicationHandler.lambda$setupPolling$13(ReplicationHandler.java:1171)
   [junit4]   1> at java.base/java.util.concurrent.Executors$RunnableAdapter.call(Executors.java:515)
   [junit4]   1> at java.base/java.util.concurrent.FutureTask.runAndReset(FutureTask.java:305)
   [junit4]   1> at java.base/java.util.concurrent.ScheduledThreadPoolExecutor$ScheduledFutureTask.run(ScheduledThreadPoolExecutor.java:305)
   [junit4]   1> at java.base/java.util.concurrent.ThreadPoolExecutor.runWorker(ThreadPoolExecutor.java:1128)
   [junit4]   1> at java.base/java.util.concurrent.ThreadPoolExecutor$Worker.run(ThreadPoolExecutor.java:628)
   [junit4]   1> at java.base/java.lang.Thread.run(Thread.java:834)
   [junit4]   1>
   [junit4]   1> 15:47:19.642 [indexFetcher-1564-thread-1] ERROR org.apache.solr.handler.ReplicationHandler - Index fetch failed :org.apache.solr.common.SolrException: Index fetch failed :
   [junit4]   1> at org.apache.solr.handler.IndexFetcher.fetchLatestIndex(IndexFetcher.java:676)
   [junit4]   1> at org.apache.solr.handler.IndexFetcher.fetchLatestIndex(IndexFetcher.java:346)
   [junit4]   1> at org.apache.solr.handler.ReplicationHandler.doFetch(ReplicationHandler.java:425)
   [junit4]   1> at org.apache.solr.handler.ReplicationHandler.lambda$setupPolling$13(ReplicationHandler.java:1171)
   [junit4]   1> at java.base/java.util.concurrent.Executors$RunnableAdapter.call(Executors.java:515)
   [junit4]   1> at java.base/java.util.concurrent.FutureTask.runAndReset(FutureTask.java:305)
   [junit4]   1> at java.base/java.util.concurrent.ScheduledThreadPoolExecutor$ScheduledFutureTask.run(ScheduledThreadPoolExecutor.java:305)
   [junit4]   1> at java.base/java.util.concurrent.ThreadPoolExecutor.runWorker(ThreadPoolExecutor.java:1128)
   [junit4]   1> at java.base/java.util.concurrent.ThreadPoolExecutor$Worker.run(ThreadPoolExecutor.java:628)
   [junit4]   1> at java.base/java.lang.Thread.run(Thread.java:834)
   [junit4]   1> Caused by: java.lang.NullPointerException
   [junit4]   1> at org.apache.solr.handler.IndexFetcher.openNewSearcherAndUpdateCommitPoint(IndexFetcher.java:909)
   [junit4]   1> at org.apache.solr.handler.IndexFetcher.fetchLatestIndex(IndexFetcher.java:653)
   [junit4]   1> ... 9 more
   [junit4]   1>
   [junit4]   1> 15:47:33.092 [coreCloseExecutor-1570-thread-2] ERROR org.apache.solr.core.CachingDirectoryFactory - Timeout waiting for all directory ref counts to be released - gave up waiting on CachedDir<<refCount=1;path=C:\Users\jenkins\workspace\Lucene-Solr-7.7-Windows\solr\build\solr-solrj\test\J0\temp\solr.client.solrj.impl.CloudSolrClientTest_AACA89DE8F3BF936-001\tempDir-012\node3\.\replicaTypesTestColl_shard1_replica_t2\data\index;done=false>>
   [junit4]   1> 15:47:33.092 [coreCloseExecutor-1570-thread-2] ERROR org.apache.solr.core.CachingDirectoryFactory - Error closing directory:org.apache.solr.common.SolrException: Timeout waiting for all directory ref counts to be released - gave up waiting on CachedDir<<refCount=1;path=C:\Users\jenkins\workspace\Lucene-Solr-7.7-Windows\solr\build\solr-solrj\test\J0\temp\solr.client.solrj.impl.CloudSolrClientTest_AACA89DE8F3BF936-001\tempDir-012\node3\.\replicaTypesTestColl_shard1_replica_t2\data\index;done=false>>
   [junit4]   1> at org.apache.solr.core.CachingDirectoryFactory.close(CachingDirectoryFactory.java:178)
   [junit4]   1> at org.apache.solr.core.SolrCore.close(SolrCore.java:1652)
   [junit4]   1> at org.apache.solr.core.SolrCores.lambda$close$0(SolrCores.java:141)
   [junit4]   1> at java.base/java.util.concurrent.FutureTask.run(FutureTask.java:264)
   [junit4]   1> at org.apache.solr.common.util.ExecutorUtil$MDCAwareThreadPoolExecutor.lambda$execute$0(ExecutorUtil.java:209)
   [junit4]   1> at java.base/java.util.concurrent.ThreadPoolExecutor.runWorker(ThreadPoolExecutor.java:1128)
   [junit4]   1> at java.base/java.util.concurrent.ThreadPoolExecutor$Worker.run(ThreadPoolExecutor.java:628)
   [junit4]   1> at java.base/java.lang.Thread.run(Thread.java:834)
   [junit4]   1>
   [junit4]   1> 15:47:33.093 [coreCloseExecutor-1570-thread-2] ERROR org.apache.solr.core.SolrCore - java.lang.AssertionError: 1
   [junit4]   1> at org.apache.solr.core.CachingDirectoryFactory.close(CachingDirectoryFactory.java:192)
   [junit4]   1> at org.apache.solr.core.SolrCore.close(SolrCore.java:1652)
   [junit4]   1> at org.apache.solr.core.SolrCores.lambda$close$0(SolrCores.java:141)
   [junit4]   1> at java.base/java.util.concurrent.FutureTask.run(FutureTask.java:264)
   [junit4]   1> at org.apache.solr.common.util.ExecutorUtil$MDCAwareThreadPoolExecutor.lambda$execute$0(ExecutorUtil.java:209)
   [junit4]   1> at java.base/java.util.concurrent.ThreadPoolExecutor.runWorker(ThreadPoolExecutor.java:1128)
   [junit4]   1> at java.base/java.util.concurrent.ThreadPoolExecutor$Worker.run(ThreadPoolExecutor.java:628)
   [junit4]   1> at java.base/java.lang.Thread.run(Thread.java:834)
   [junit4]   1>
   [junit4]   1> 15:47:33.093 [coreCloseExecutor-1570-thread-2] ERROR org.apache.solr.core.SolrCores - Error shutting down core:java.lang.AssertionError: 1
   [junit4]   1> at org.apache.solr.core.CachingDirectoryFactory.close(CachingDirectoryFactory.java:192)
   [junit4]   1> at org.apache.solr.core.SolrCore.close(SolrCore.java:1652)
   [junit4]   1> at org.apache.solr.core.SolrCores.lambda$close$0(SolrCores.java:141)
   [junit4]   1> at java.base/java.util.concurrent.FutureTask.run(FutureTask.java:264)
   [junit4]   1> at org.apache.solr.common.util.ExecutorUtil$MDCAwareThreadPoolExecutor.lambda$execute$0(ExecutorUtil.java:209)
   [junit4]   1> at java.base/java.util.concurrent.ThreadPoolExecutor.runWorker(ThreadPoolExecutor.java:1128)
   [junit4]   1> at java.base/java.util.concurrent.ThreadPoolExecutor$Worker.run(ThreadPoolExecutor.java:628)
   [junit4]   1> at java.base/java.lang.Thread.run(Thread.java:834)
   [junit4]   1>
   [junit4]   1> 15:47:34.340 [jetty-launcher-2314-thread-2] ERROR org.apache.solr.util.StartupLoggingUtils - Missing Java Option solr.log.dir. Logging may be missing or incomplete.
   [junit4]   1> 15:47:34.343 [jetty-launcher-2314-thread-1] ERROR org.apache.solr.util.StartupLoggingUtils - Missing Java Option solr.log.dir. Logging may be missing or incomplete.
   [junit4]   1> 15:47:34.343 [jetty-launcher-2314-thread-3] ERROR org.apache.solr.util.StartupLoggingUtils - Missing Java Option solr.log.dir. Logging may be missing or incomplete.
   [junit4]   1> 15:47:39.409 [qtp1175375282-6579] ERROR org.apache.solr.handler.RequestHandlerBase - org.apache.solr.common.SolrException: Unknown action: foobar
   [junit4]   1> at org.apache.solr.handler.admin.ConfigSetsHandler.handleRequestBody(ConfigSetsHandler.java:109)
   [junit4]   1> at org.apache.solr.handler.RequestHandlerBase.handleRequest(RequestHandlerBase.java:199)
   [junit4]   1> at org.apache.solr.servlet.HttpSolrCall.handleAdmin(HttpSolrCall.java:735)
   [junit4]   1> at org.apache.solr.servlet.HttpSolrCall.handleAdminRequest(HttpSolrCall.java:716)
   [junit4]   1> at org.apache.solr.servlet.HttpSolrCall.call(HttpSolrCall.java:496)
   [junit4]   1> at org.apache.solr.servlet.SolrDispatchFilter.doFilter(SolrDispatchFilter.java:395)
   [junit4]   1> at org.apache.solr.servlet.SolrDispatchFilter.doFilter(SolrDispatchFilter.java:341)
   [junit4]   1> at org.eclipse.jetty.servlet.ServletHandler$CachedChain.doFilter(ServletHandler.java:1610)
   [junit4]   1> at org.apache.solr.client.solrj.embedded.JettySolrRunner$DebugFilter.doFilter(JettySolrRunner.java:158)
   [junit4]   1> at org.eclipse.jetty.servlet.ServletHandler$CachedChain.doFilter(ServletHandler.java:1610)
   [junit4]   1> at org.eclipse.jetty.servlet.ServletHandler.doHandle(ServletHandler.java:540)
   [junit4]   1> at org.eclipse.jetty.server.handler.ScopedHandler.nextHandle(ScopedHandler.java:255)
   [junit4]   1> at org.eclipse.jetty.server.session.SessionHandler.doHandle(SessionHandler.java:1588)
   [junit4]   1> at org.eclipse.jetty.server.handler.ScopedHandler.nextHandle(ScopedHandler.java:255)
   [junit4]   1> at org.eclipse.jetty.server.handler.ContextHandler.doHandle(ContextHandler.java:1345)
   [junit4]   1> at org.eclipse.jetty.server.handler.ScopedHandler.nextScope(ScopedHandler.java:203)
   [junit4]   1> at org.eclipse.jetty.servlet.ServletHandler.doScope(ServletHandler.java:480)
   [junit4]   1> at org.eclipse.jetty.server.session.SessionHandler.doScope(SessionHandler.java:1557)
   [junit4]   1> at org.eclipse.jetty.server.handler.ScopedHandler.nextScope(ScopedHandler.java:201)
   [junit4]   1> at org.eclipse.jetty.server.handler.ContextHandler.doScope(ContextHandler.java:1247)
   [junit4]   1> at org.eclipse.jetty.server.handler.ScopedHandler.handle(ScopedHandler.java:144)
   [junit4]   1> at org.eclipse.jetty.server.handler.gzip.GzipHandler.handle(GzipHandler.java:753)
   [junit4]   1> at org.eclipse.jetty.server.handler.HandlerWrapper.handle(HandlerWrapper.java:132)
   [junit4]   1> at org.eclipse.jetty.server.Server.handle(Server.java:502)
   [junit4]   1> at org.eclipse.jetty.server.HttpChannel.handle(HttpChannel.java:364)
   [junit4]   1> at org.eclipse.jetty.server.HttpConnection.onFillable(HttpConnection.java:260)
   [junit4]   1> at org.eclipse.jetty.io.AbstractConnection$ReadCallback.succeeded(AbstractConnection.java:305)
   [junit4]   1> at org.eclipse.jetty.io.FillInterest.fillable(FillInterest.java:103)
   [junit4]   1> at org.eclipse.jetty.io.ChannelEndPoint$2.run(ChannelEndPoint.java:118)
   [junit4]   1> at org.eclipse.jetty.util.thread.QueuedThreadPool.runJob(QueuedThreadPool.java:765)
   [junit4]   1> at org.eclipse.jetty.util.thread.QueuedThreadPool$2.run(QueuedThreadPool.java:683)
   [junit4]   1> at java.base/java.lang.Thread.run(Thread.java:834)
   [junit4]   1>
   [junit4]   1> 15:47:39.456 [qtp1175375282-6580] ERROR org.apache.solr.handler.RequestHandlerBase - org.apache.solr.common.SolrException: Unknown action: foobar
   [junit4]   1> at org.apache.solr.handler.admin.CollectionsHandler.handleRequestBody(CollectionsHandler.java:242)
   [junit4]   1> at org.apache.solr.handler.RequestHandlerBase.handleRequest(RequestHandlerBase.java:199)
   [junit4]   1> at org.apache.solr.servlet.HttpSolrCall.handleAdmin(HttpSolrCall.java:735)
   [junit4]   1> at org.apache.solr.servlet.HttpSolrCall.handleAdminRequest(HttpSolrCall.java:716)
   [junit4]   1> at org.apache.solr.servlet.HttpSolrCall.call(HttpSolrCall.java:496)
   [junit4]   1> at org.apache.solr.servlet.SolrDispatchFilter.doFilter(SolrDispatchFilter.java:395)
   [junit4]   1> at org.apache.solr.servlet.SolrDispatchFilter.doFilter(SolrDispatchFilter.java:341)
   [junit4]   1> at org.eclipse.jetty.servlet.ServletHandler$CachedChain.doFilter(ServletHandler.java:1610)
   [junit4]   1> at org.apache.solr.client.solrj.embedded.JettySolrRunner$DebugFilter.doFilter(JettySolrRunner.java:158)
   [junit4]   1> at org.eclipse.jetty.servlet.ServletHandler$CachedChain.doFilter(ServletHandler.java:1610)
   [junit4]   1> at org.eclipse.jetty.servlet.ServletHandler.doHandle(ServletHandler.java:540)
   [junit4]   1> at org.eclipse.jetty.server.handler.ScopedHandler.nextHandle(ScopedHandler.java:255)
   [junit4]   1> at org.eclipse.jetty.server.session.SessionHandler.doHandle(SessionHandler.java:1588)
   [junit4]   1> at org.eclipse.jetty.server.handler.ScopedHandler.nextHandle(ScopedHandler.java:255)
   [junit4]   1> at org.eclipse.jetty.server.handler.ContextHandler.doHandle(ContextHandler.java:1345)
   [junit4]   1> at org.eclipse.jetty.server.handler.ScopedHandler.nextScope(ScopedHandler.java:203)
   [junit4]   1> at org.eclipse.jetty.servlet.ServletHandler.doScope(ServletHandler.java:480)
   [junit4]   1> at org.eclipse.jetty.server.session.SessionHandler.doScope(SessionHandler.java:1557)
   [junit4]   1> at org.eclipse.jetty.server.handler.ScopedHandler.nextScope(ScopedHandler.java:201)
   [junit4]   1> at org.eclipse.jetty.server.handler.ContextHandler.doScope(ContextHandler.java:1247)
   [junit4]   1> at org.eclipse.jetty.server.handler.ScopedHandler.handle(ScopedHandler.java:144)
   [junit4]   1> at org.eclipse.jetty.server.handler.gzip.GzipHandler.handle(GzipHandler.java:753)
   [junit4]   1> at org.eclipse.jetty.server.handler.HandlerWrapper.handle(HandlerWrapper.java:132)
   [junit4]   1> at org.eclipse.jetty.server.Server.handle(Server.java:502)
   [junit4]   1> at org.eclipse.jetty.server.HttpChannel.handle(HttpChannel.java:364)
   [junit4]   1> at org.eclipse.jetty.server.HttpConnection.onFillable(HttpConnection.java:260)
   [junit4]   1> at org.eclipse.jetty.io.AbstractConnection$ReadCallback.succeeded(AbstractConnection.java:305)
   [junit4]   1> at org.eclipse.jetty.io.FillInterest.fillable(FillInterest.java:103)
   [junit4]   1> at org.eclipse.jetty.io.ChannelEndPoint$2.run(ChannelEndPoint.java:118)
   [junit4]   1> at org.eclipse.jetty.util.thread.QueuedThreadPool.runJob(QueuedThreadPool.java:765)
   [junit4]   1> at org.eclipse.jetty.util.thread.QueuedThreadPool$2.run(QueuedThreadPool.java:683)
   [junit4]   1> at java.base/java.lang.Thread.run(Thread.java:834)
   [junit4]   1>
   [junit4]   1> 15:47:39.502 [qtp1175375282-6577] ERROR org.apache.solr.handler.RequestHandlerBase - org.apache.solr.common.SolrException: Unsupported operation: foobar
   [junit4]   1> at org.apache.solr.handler.admin.CoreAdminHandler.handleCustomAction(CoreAdminHandler.java:220)
   [junit4]   1> at org.apache.solr.handler.admin.CoreAdminHandler.handleRequestBody(CoreAdminHandler.java:169)
   [junit4]   1> at org.apache.solr.handler.RequestHandlerBase.handleRequest(RequestHandlerBase.java:199)
   [junit4]   1> at org.apache.solr.servlet.HttpSolrCall.handleAdmin(HttpSolrCall.java:735)
   [junit4]   1> at org.apache.solr.servlet.HttpSolrCall.handleAdminRequest(HttpSolrCall.java:716)
   [junit4]   1> at org.apache.solr.servlet.HttpSolrCall.call(HttpSolrCall.java:496)
   [junit4]   1> at org.apache.solr.servlet.SolrDispatchFilter.doFilter(SolrDispatchFilter.java:395)
   [junit4]   1> at org.apache.solr.servlet.SolrDispatchFilter.doFilter(SolrDispatchFilter.java:341)
   [junit4]   1> at org.eclipse.jetty.servlet.ServletHandler$CachedChain.doFilter(ServletHandler.java:1610)
   [junit4]   1> at org.apache.solr.client.solrj.embedded.JettySolrRunner$DebugFilter.doFilter(JettySolrRunner.java:158)
   [junit4]   1> at org.eclipse.jetty.servlet.ServletHandler$CachedChain.doFilter(ServletHandler.java:1610)
   [junit4]   1> at org.eclipse.jetty.servlet.ServletHandler.doHandle(ServletHandler.java:540)
   [junit4]   1> at org.eclipse.jetty.server.handler.ScopedHandler.nextHandle(ScopedHandler.java:255)
   [junit4]   1> at org.eclipse.jetty.server.session.SessionHandler.doHandle(SessionHandler.java:1588)
   [junit4]   1> at org.eclipse.jetty.server.handler.ScopedHandler.nextHandle(ScopedHandler.java:255)
   [junit4]   1> at org.eclipse.jetty.server.handler.ContextHandler.doHandle(ContextHandler.java:1345)
   [junit4]   1> at org.eclipse.jetty.server.handler.ScopedHandler.nextScope(ScopedHandler.java:203)
   [junit4]   1> at org.eclipse.jetty.servlet.ServletHandler.doScope(ServletHandler.java:480)
   [junit4]   1> at org.eclipse.jetty.server.session.SessionHandler.doScope(SessionHandler.java:1557)
   [junit4]   1> at org.eclipse.jetty.server.handler.ScopedHandler.nextScope(ScopedHandler.java:201)
   [junit4]   1> at org.eclipse.jetty.server.handler.ContextHandler.doScope(ContextHandler.java:1247)
   [junit4]   1> at org.eclipse.jetty.server.handler.ScopedHandler.handle(ScopedHandler.java:144)
   [junit4]   1> at org.eclipse.jetty.server.handler.gzip.GzipHandler.handle(GzipHandler.java:753)
   [junit4]   1> at org.eclipse.jetty.server.handler.HandlerWrapper.handle(HandlerWrapper.java:132)
   [junit4]   1> at org.eclipse.jetty.server.Server.handle(Server.java:502)
   [junit4]   1> at org.eclipse.jetty.server.HttpChannel.handle(HttpChannel.java:364)
   [junit4]   1> at org.eclipse.jetty.server.HttpConnection.onFillable(HttpConnection.java:260)
   [junit4]   1> at org.eclipse.jetty.io.AbstractConnection$ReadCallback.succeeded(AbstractConnection.java:305)
   [junit4]   1> at org.eclipse.jetty.io.FillInterest.fillable(FillInterest.java:103)
   [junit4]   1> at org.eclipse.jetty.io.ChannelEndPoint$2.run(ChannelEndPoint.java:118)
   [junit4]   1> at org.eclipse.jetty.util.thread.QueuedThreadPool.runJob(QueuedThreadPool.java:765)
   [junit4]   1> at org.eclipse.jetty.util.thread.QueuedThreadPool$2.run(QueuedThreadPool.java:683)
   [junit4]   1> at java.base/java.lang.Thread.run(Thread.java:834)
   [junit4]   1>
   [junit4]   1> 15:47:40.849 [jetty-launcher-2390-thread-2] ERROR org.apache.solr.util.StartupLoggingUtils - Missing Java Option solr.log.dir. Logging may be missing or incomplete.
   [junit4]   1> 15:47:40.849 [jetty-launcher-2390-thread-1] ERROR org.apache.solr.util.StartupLoggingUtils - Missing Java Option solr.log.dir. Logging may be missing or incomplete.
   [junit4]   1> 15:47:40.849 [jetty-launcher-2390-thread-3] ERROR org.apache.solr.util.StartupLoggingUtils - Missing Java Option solr.log.dir. Logging may be missing or incomplete.
   [junit4]   1> 15:47:45.501 [jetty-launcher-2461-thread-1] ERROR org.apache.solr.util.StartupLoggingUtils - Missing Java Option solr.log.dir. Logging may be missing or incomplete.
   [junit4]   1> 15:47:45.504 [jetty-launcher-2461-thread-2] ERROR org.apache.solr.util.StartupLoggingUtils - Missing Java Option solr.log.dir. Logging may be missing or incomplete.
   [junit4]   1> 15:47:45.508 [jetty-launcher-2461-thread-3] ERROR org.apache.solr.util.StartupLoggingUtils - Missing Java Option solr.log.dir. Logging may be missing or incomplete.
   [junit4]   1> 15:47:50.713 [jetty-launcher-2537-thread-3] ERROR org.apache.solr.util.StartupLoggingUtils - Missing Java Option solr.log.dir. Logging may be missing or incomplete.
   [junit4]   1> 15:47:50.713 [jetty-launcher-2537-thread-2] ERROR org.apache.solr.util.StartupLoggingUtils - Missing Java Option solr.log.dir. Logging may be missing or incomplete.
   [junit4]   1> 15:47:50.723 [jetty-launcher-2537-thread-1] ERROR org.apache.solr.util.StartupLoggingUtils - Missing Java Option solr.log.dir. Logging may be missing or incomplete.
   [junit4]   2> Common-Cleaner:
   [junit4]   2>     java.base@11/java.lang.Object.wait(Native Method)
   [junit4]   2>     java.base@11/java.lang.ref.ReferenceQueue.remove(ReferenceQueue.java:155)
   [junit4]   2>     java.base@11/jdk.internal.ref.CleanerImpl.run(CleanerImpl.java:148)
   [junit4]   2>     java.base@11/java.lang.Thread.run(Thread.java:834)
   [junit4]   2>     java.base@11/jdk.internal.misc.InnocuousThread.run(InnocuousThread.java:134)
   [junit4]   2>
   [junit4]   2> SUITE-CloudSolrClientTest-seed#[AACA89DE8F3BF936]:
   [junit4]   2>     java.base@11/java.lang.Thread.sleep(Native Method)
   [junit4]   2>     app//com.carrotsearch.randomizedtesting.ThreadLeakControl.join(ThreadLeakControl.java:840)
   [junit4]   2>     app//com.carrotsearch.randomizedtesting.ThreadLeakControl.forkTimeoutingTask(ThreadLeakControl.java:822)
   [junit4]   2>     app//com.carrotsearch.randomizedtesting.ThreadLeakControl$2.evaluate(ThreadLeakControl.java:404)
   [junit4]   2>     app//com.carrotsearch.randomizedtesting.RandomizedRunner.runSuite(RandomizedRunner.java:708)
   [junit4]   2>     app//com.carrotsearch.randomizedtesting.RandomizedRunner.access$200(RandomizedRunner.java:138)
   [junit4]   2>     app//com.carrotsearch.randomizedtesting.RandomizedRunner$2.run(RandomizedRunner.java:629)
   [junit4]   2>
   [junit4]   2> ForkJoinPool.commonPool-worker-3:
   [junit4]   2>     java.base@11/jdk.internal.misc.Unsafe.park(Native Method)
   [junit4]   2>     java.base@11/java.util.concurrent.locks.LockSupport.park(LockSupport.java:194)
   [junit4]   2>     java.base@11/java.util.concurrent.ForkJoinPool.runWorker(ForkJoinPool.java:1628)
   [junit4]   2>     java.base@11/java.util.concurrent.ForkJoinWorkerThread.run(ForkJoinWorkerThread.java:177)
   [junit4]   2>
   [junit4]   2> main:
   [junit4]   2>     java.base@11/java.lang.Object.wait(Native Method)
   [junit4]   2>     java.base@11/java.lang.Thread.join(Thread.java:1305)
   [junit4]   2>     java.base@11/java.lang.Thread.join(Thread.java:1379)
   [junit4]   2>     app//com.carrotsearch.randomizedtesting.RandomizedRunner.runSuite(RandomizedRunner.java:639)
   [junit4]   2>     app//com.carrotsearch.randomizedtesting.RandomizedRunner.run(RandomizedRunner.java:496)
   [junit4]   2>     app//com.carrotsearch.ant.tasks.junit4.slave.SlaveMain.execute(SlaveMain.java:269)
   [junit4]   2>     app//com.carrotsearch.ant.tasks.junit4.slave.SlaveMain.main(SlaveMain.java:394)
   [junit4]   2>     app//com.carrotsearch.ant.tasks.junit4.slave.SlaveMainSafe.main(SlaveMainSafe.java:13)
   [junit4]   2>
   [junit4]   2> SUITE-CloudSolrClientTest-seed#[AACA89DE8F3BF936]-worker:
   [junit4]   2>     java.base@11/java.lang.Thread.dumpThreads(Native Method)
   [junit4]   2>     java.base@11/java.lang.Thread.getAllStackTraces(Thread.java:1657)
   [junit4]   2>     app//org.apache.solr.SolrTestCaseJ4.clearObjectTrackerAndCheckEmpty(SolrTestCaseJ4.java:391)
   [junit4]   2>     app//org.apache.solr.SolrTestCaseJ4.teardownTestCases(SolrTestCaseJ4.java:319)
   [junit4]   2>     jdk.internal.reflect.GeneratedMethodAccessor37.invoke(Unknown Source)
   [junit4]   2>     java.base@11/jdk.internal.reflect.DelegatingMethodAccessorImpl.invoke(DelegatingMethodAccessorImpl.java:43)
   [junit4]   2>     java.base@11/java.lang.reflect.Method.invoke(Method.java:566)
   [junit4]   2>     app//com.carrotsearch.randomizedtesting.RandomizedRunner.invoke(RandomizedRunner.java:1750)
   [junit4]   2>     app//com.carrotsearch.randomizedtesting.RandomizedRunner$7.evaluate(RandomizedRunner.java:901)
   [junit4]   2>     app//com.carrotsearch.randomizedtesting.rules.StatementAdapter.evaluate(StatementAdapter.java:36)
   [junit4]   2>     app//com.carrotsearch.randomizedtesting.rules.SystemPropertiesRestoreRule$1.evaluate(SystemPropertiesRestoreRule.java:57)
   [junit4]   2>     app//org.apache.lucene.util.AbstractBeforeAfterRule$1.evaluate(AbstractBeforeAfterRule.java:45)
   [junit4]   2>     app//com.carrotsearch.randomizedtesting.rules.StatementAdapter.evaluate(StatementAdapter.java:36)
   [junit4]   2>     app//org.apache.lucene.util.TestRuleStoreClassName$1.evaluate(TestRuleStoreClassName.java:41)
   [junit4]   2>     app//com.carrotsearch.randomizedtesting.rules.NoShadowingOrOverridesOnMethodsRule$1.evaluate(NoShadowingOrOverridesOnMethodsRule.java:40)
   [junit4]   2>     app//com.carrotsearch.randomizedtesting.rules.NoShadowingOrOverridesOnMethodsRule$1.evaluate(NoShadowingOrOverridesOnMethodsRule.java:40)
   [junit4]   2>     app//com.carrotsearch.randomizedtesting.rules.StatementAdapter.evaluate(StatementAdapter.java:36)
   [junit4]   2>     app//com.carrotsearch.randomizedtesting.rules.StatementAdapter.evaluate(StatementAdapter.java:36)
   [junit4]   2>     app//org.apache.lucene.util.TestRuleAssertionsRequired$1.evaluate(TestRuleAssertionsRequired.java:53)
   [junit4]   2>     app//org.apache.lucene.util.TestRuleMarkFailure$1.evaluate(TestRuleMarkFailure.java:47)
   [junit4]   2>     app//org.apache.lucene.util.TestRuleIgnoreAfterMaxFailures$1.evaluate(TestRuleIgnoreAfterMaxFailures.java:64)
   [junit4]   2>     app//org.apache.lucene.util.TestRuleIgnoreTestSuites$1.evaluate(TestRuleIgnoreTestSuites.java:54)
   [junit4]   2>     app//com.carrotsearch.randomizedtesting.rules.StatementAdapter.evaluate(StatementAdapter.java:36)
   [junit4]   2>     app//com.carrotsearch.randomizedtesting.ThreadLeakControl$StatementRunner.run(ThreadLeakControl.java:368)
   [junit4]   2>     java.base@11/java.lang.Thread.run(Thread.java:834)
   [junit4]   2>
   [junit4]   2> Reference Handler:
   [junit4]   2>     java.base@11/java.lang.ref.Reference.waitForReferencePendingList(Native Method)
   [junit4]   2>     java.base@11/java.lang.ref.Reference.processPendingReferences(Reference.java:241)
   [junit4]   2>     java.base@11/java.lang.ref.Reference$ReferenceHandler.run(Reference.java:213)
   [junit4]   2>
   [junit4]   2> Signal Dispatcher:
   [junit4]   2>
   [junit4]   2> Attach Listener:
   [junit4]   2>
   [junit4]   2> ForkJoinPool.commonPool-worker-1:
   [junit4]   2>     java.base@11/jdk.internal.misc.Unsafe.park(Native Method)
   [junit4]   2>     java.base@11/java.util.concurrent.locks.LockSupport.parkUntil(LockSupport.java:275)
   [junit4]   2>     java.base@11/java.util.concurrent.ForkJoinPool.runWorker(ForkJoinPool.java:1619)
   [junit4]   2>     java.base@11/java.util.concurrent.ForkJoinWorkerThread.run(ForkJoinWorkerThread.java:177)
   [junit4]   2>
   [junit4]   2> Finalizer:
   [junit4]   2>     java.base@11/java.lang.Object.wait(Native Method)
   [junit4]   2>     java.base@11/java.lang.ref.ReferenceQueue.remove(ReferenceQueue.java:155)
   [junit4]   2>     java.base@11/java.lang.ref.ReferenceQueue.remove(ReferenceQueue.java:176)
   [junit4]   2>     java.base@11/java.lang.ref.Finalizer$FinalizerThread.run(Finalizer.java:170)
   [junit4]   2>
   [junit4]   2> SeedGenerator Thread:
   [junit4]   2>     java.base@11/java.lang.Object.wait(Native Method)
   [junit4]   2>     java.base@11/java.lang.Object.wait(Object.java:328)
   [junit4]   2>     java.base@11/sun.security.provider.SeedGenerator$ThreadedSeedGenerator.run(SeedGenerator.java:332)
   [junit4]   2>     java.base@11/java.lang.Thread.run(Thread.java:834)
   [junit4]   2>
   [junit4]   2> JUnit4-serializer-daemon:
   [junit4]   2>     java.base@11/java.lang.Thread.sleep(Native Method)
   [junit4]   2>     app//com.carrotsearch.ant.tasks.junit4.events.Serializer$1.run(Serializer.java:50)
   [junit4]   2>
   [junit4]   2> Common-Cleaner:
   [junit4]   2>     java.base@11/java.lang.Object.wait(Native Method)
   [junit4]   2>     java.base@11/java.lang.ref.ReferenceQueue.remove(ReferenceQueue.java:155)
   [junit4]   2>     java.base@11/jdk.internal.ref.CleanerImpl.run(CleanerImpl.java:148)
   [junit4]   2>     java.base@11/java.lang.Thread.run(Thread.java:834)
   [junit4]   2>     java.base@11/jdk.internal.misc.InnocuousThread.run(InnocuousThread.java:134)
   [junit4]   2>
   [junit4]   2> SUITE-CloudSolrClientTest-seed#[AACA89DE8F3BF936]:
   [junit4]   2>     java.base@11/java.lang.Thread.sleep(Native Method)
   [junit4]   2>     app//com.carrotsearch.randomizedtesting.ThreadLeakControl.join(ThreadLeakControl.java:840)
   [junit4]   2>     app//com.carrotsearch.randomizedtesting.ThreadLeakControl.forkTimeoutingTask(ThreadLeakControl.java:822)
   [junit4]   2>     app//com.carrotsearch.randomizedtesting.ThreadLeakControl$2.evaluate(ThreadLeakControl.java:404)
   [junit4]   2>     app//com.carrotsearch.randomizedtesting.RandomizedRunner.runSuite(RandomizedRunner.java:708)
   [junit4]   2>     app//com.carrotsearch.randomizedtesting.RandomizedRunner.access$200(RandomizedRunner.java:138)
   [junit4]   2>     app//com.carrotsearch.randomizedtesting.RandomizedRunner$2.run(RandomizedRunner.java:629)
   [junit4]   2>
   [junit4]   2> ForkJoinPool.commonPool-worker-3:
   [junit4]   2>     java.base@11/jdk.internal.misc.Unsafe.park(Native Method)
   [junit4]   2>     java.base@11/java.util.concurrent.locks.LockSupport.park(LockSupport.java:194)
   [junit4]   2>     java.base@11/java.util.concurrent.ForkJoinPool.runWorker(ForkJoinPool.java:1628)
   [junit4]   2>     java.base@11/java.util.concurrent.ForkJoinWorkerThread.run(ForkJoinWorkerThread.java:177)
   [junit4]   2>
   [junit4]   2> main:
   [junit4]   2>     java.base@11/java.lang.Object.wait(Native Method)
   [junit4]   2>     java.base@11/java.lang.Thread.join(Thread.java:1305)
   [junit4]   2>     java.base@11/java.lang.Thread.join(Thread.java:1379)
   [junit4]   2>     app//com.carrotsearch.randomizedtesting.RandomizedRunner.runSuite(RandomizedRunner.java:639)
   [junit4]   2>     app//com.carrotsearch.randomizedtesting.RandomizedRunner.run(RandomizedRunner.java:496)
   [junit4]   2>     app//com.carrotsearch.ant.tasks.junit4.slave.SlaveMain.execute(SlaveMain.java:269)
   [junit4]   2>     app//com.carrotsearch.ant.tasks.junit4.slave.SlaveMain.main(SlaveMain.java:394)
   [junit4]   2>     app//com.carrotsearch.ant.tasks.junit4.slave.SlaveMainSafe.main(SlaveMainSafe.java:13)
   [junit4]   2>
   [junit4]   2> SUITE-CloudSolrClientTest-seed#[AACA89DE8F3BF936]-worker:
   [junit4]   2>     java.base@11/java.lang.Thread.dumpThreads(Native Method)
   [junit4]   2>     java.base@11/java.lang.Thread.getAllStackTraces(Thread.java:1657)
   [junit4]   2>     app//org.apache.solr.SolrTestCaseJ4.clearObjectTrackerAndCheckEmpty(SolrTestCaseJ4.java:391)
   [junit4]   2>     app//org.apache.solr.SolrTestCaseJ4.teardownTestCases(SolrTestCaseJ4.java:319)
   [junit4]   2>     jdk.internal.reflect.GeneratedMethodAccessor37.invoke(Unknown Source)
   [junit4]   2>     java.base@11/jdk.internal.reflect.DelegatingMethodAccessorImpl.invoke(DelegatingMethodAccessorImpl.java:43)
   [junit4]   2>     java.base@11/java.lang.reflect.Method.invoke(Method.java:566)
   [junit4]   2>     app//com.carrotsearch.randomizedtesting.RandomizedRunner.invoke(RandomizedRunner.java:1750)
   [junit4]   2>     app//com.carrotsearch.randomizedtesting.RandomizedRunner$7.evaluate(RandomizedRunner.java:901)
   [junit4]   2>     app//com.carrotsearch.randomizedtesting.rules.StatementAdapter.evaluate(StatementAdapter.java:36)
   [junit4]   2>     app//com.carrotsearch.randomizedtesting.rules.SystemPropertiesRestoreRule$1.evaluate(SystemPropertiesRestoreRule.java:57)
   [junit4]   2>     app//org.apache.lucene.util.AbstractBeforeAfterRule$1.evaluate(AbstractBeforeAfterRule.java:45)
   [junit4]   2>     app//com.carrotsearch.randomizedtesting.rules.StatementAdapter.evaluate(StatementAdapter.java:36)
   [junit4]   2>     app//org.apache.lucene.util.TestRuleStoreClassName$1.evaluate(TestRuleStoreClassName.java:41)
   [junit4]   2>     app//com.carrotsearch.randomizedtesting.rules.NoShadowingOrOverridesOnMethodsRule$1.evaluate(NoShadowingOrOverridesOnMethodsRule.java:40)
   [junit4]   2>     app//com.carrotsearch.randomizedtesting.rules.NoShadowingOrOverridesOnMethodsRule$1.evaluate(NoShadowingOrOverridesOnMethodsRule.java:40)
   [junit4]   2>     app//com.carrotsearch.randomizedtesting.rules.StatementAdapter.evaluate(StatementAdapter.java:36)
   [junit4]   2>     app//com.carrotsearch.randomizedtesting.rules.StatementAdapter.evaluate(StatementAdapter.java:36)
   [junit4]   2>     app//org.apache.lucene.util.TestRuleAssertionsRequired$1.evaluate(TestRuleAssertionsRequired.java:53)
   [junit4]   2>     app//org.apache.lucene.util.TestRuleMarkFailure$1.evaluate(TestRuleMarkFailure.java:47)
   [junit4]   2>     app//org.apache.lucene.util.TestRuleIgnoreAfterMaxFailures$1.evaluate(TestRuleIgnoreAfterMaxFailures.java:64)
   [junit4]   2>     app//org.apache.lucene.util.TestRuleIgnoreTestSuites$1.evaluate(TestRuleIgnoreTestSuites.java:54)
   [junit4]   2>     app//com.carrotsearch.randomizedtesting.rules.StatementAdapter.evaluate(StatementAdapter.java:36)
   [junit4]   2>     app//com.carrotsearch.randomizedtesting.ThreadLeakControl$StatementRunner.run(ThreadLeakControl.java:368)
   [junit4]   2>     java.base@11/java.lang.Thread.run(Thread.java:834)
   [junit4]   2>
   [junit4]   2> Reference Handler:
   [junit4]   2>     java.base@11/java.lang.ref.Reference.waitForReferencePendingList(Native Method)
   [junit4]   2>     java.base@11/java.lang.ref.Reference.processPendingReferences(Reference.java:241)
   [junit4]   2>     java.base@11/java.lang.ref.Reference$ReferenceHandler.run(Reference.java:213)
   [junit4]   2>
   [junit4]   2> Signal Dispatcher:
   [junit4]   2>
   [junit4]   2> Attach Listener:
   [junit4]   2>
   [junit4]   2> ForkJoinPool.commonPool-worker-1:
   [junit4]   2>     java.base@11/jdk.internal.misc.Unsafe.park(Native Method)
   [junit4]   2>     java.base@11/java.util.concurrent.locks.LockSupport.parkUntil(LockSupport.java:275)
   [junit4]   2>     java.base@11/java.util.concurrent.ForkJoinPool.runWorker(ForkJoinPool.java:1619)
   [junit4]   2>     java.base@11/java.util.concurrent.ForkJoinWorkerThread.run(ForkJoinWorkerThread.java:177)
   [junit4]   2>
   [junit4]   2> Finalizer:
   [junit4]   2>     java.base@11/java.lang.Object.wait(Native Method)
   [junit4]   2>     java.base@11/java.lang.ref.ReferenceQueue.remove(ReferenceQueue.java:155)
   [junit4]   2>     java.base@11/java.lang.ref.ReferenceQueue.remove(ReferenceQueue.java:176)
   [junit4]   2>     java.base@11/java.lang.ref.Finalizer$FinalizerThread.run(Finalizer.java:170)
   [junit4]   2>
   [junit4]   2> SeedGenerator Thread:
   [junit4]   2>     java.base@11/java.lang.Object.wait(Native Method)
   [junit4]   2>     java.base@11/java.lang.Object.wait(Object.java:328)
   [junit4]   2>     java.base@11/sun.security.provider.SeedGenerator$ThreadedSeedGenerator.run(SeedGenerator.java:332)
   [junit4]   2>     java.base@11/java.lang.Thread.run(Thread.java:834)
   [junit4]   2>
   [junit4]   2> JUnit4-serializer-daemon:
   [junit4]   2>     java.base@11/java.lang.Thread.sleep(Native Method)
   [junit4]   2>     app//com.carrotsearch.ant.tasks.junit4.events.Serializer$1.run(Serializer.java:50)
   [junit4]   2>
   [junit4]   2> Common-Cleaner:
   [junit4]   2>     java.base@11/java.lang.Object.wait(Native Method)
   [junit4]   2>     java.base@11/java.lang.ref.ReferenceQueue.remove(ReferenceQueue.java:155)
   [junit4]   2>     java.base@11/jdk.internal.ref.CleanerImpl.run(CleanerImpl.java:148)
   [junit4]   2>     java.base@11/java.lang.Thread.run(Thread.java:834)
   [junit4]   2>     java.base@11/jdk.internal.misc.InnocuousThread.run(InnocuousThread.java:134)
   [junit4]   2>
   [junit4]   2> SUITE-CloudSolrClientTest-seed#[AACA89DE8F3BF936]:
   [junit4]   2>     java.base@11/java.lang.Thread.sleep(Native Method)
   [junit4]   2>     app//com.carrotsearch.randomizedtesting.ThreadLeakControl.join(ThreadLeakControl.java:840)
   [junit4]   2>     app//com.carrotsearch.randomizedtesting.ThreadLeakControl.forkTimeoutingTask(ThreadLeakControl.java:822)
   [junit4]   2>     app//com.carrotsearch.randomizedtesting.ThreadLeakControl$2.evaluate(ThreadLeakControl.java:404)
   [junit4]   2>     app//com.carrotsearch.randomizedtesting.RandomizedRunner.runSuite(RandomizedRunner.java:708)
   [junit4]   2>     app//com.carrotsearch.randomizedtesting.RandomizedRunner.access$200(RandomizedRunner.java:138)
   [junit4]   2>     app//com.carrotsearch.randomizedtesting.RandomizedRunner$2.run(RandomizedRunner.java:629)
   [junit4]   2>
   [junit4]   2> ForkJoinPool.commonPool-worker-3:
   [junit4]   2>     java.base@11/jdk.internal.misc.Unsafe.park(Native Method)
   [junit4]   2>     java.base@11/java.util.concurrent.locks.LockSupport.park(LockSupport.java:194)
   [junit4]   2>     java.base@11/java.util.concurrent.ForkJoinPool.runWorker(ForkJoinPool.java:1628)
   [junit4]   2>     java.base@11/java.util.concurrent.ForkJoinWorkerThread.run(ForkJoinWorkerThread.java:177)
   [junit4]   2>
   [junit4]   2> main:
   [junit4]   2>     java.base@11/java.lang.Object.wait(Native Method)
   [junit4]   2>     java.base@11/java.lang.Thread.join(Thread.java:1305)
   [junit4]   2>     java.base@11/java.lang.Thread.join(Thread.java:1379)
   [junit4]   2>     app//com.carrotsearch.randomizedtesting.RandomizedRunner.runSuite(RandomizedRunner.java:639)
   [junit4]   2>     app//com.carrotsearch.randomizedtesting.RandomizedRunner.run(RandomizedRunner.java:496)
   [junit4]   2>     app//com.carrotsearch.ant.tasks.junit4.slave.SlaveMain.execute(SlaveMain.java:269)
   [junit4]   2>     app//com.carrotsearch.ant.tasks.junit4.slave.SlaveMain.main(SlaveMain.java:394)
   [junit4]   2>     app//com.carrotsearch.ant.tasks.junit4.slave.SlaveMainSafe.main(SlaveMainSafe.java:13)
   [junit4]   2>
   [junit4]   2> SUITE-CloudSolrClientTest-seed#[AACA89DE8F3BF936]-worker:
   [junit4]   2>     java.base@11/java.lang.Thread.dumpThreads(Native Method)
   [junit4]   2>     java.base@11/java.lang.Thread.getAllStackTraces(Thread.java:1657)
   [junit4]   2>     app//org.apache.solr.SolrTestCaseJ4.clearObjectTrackerAndCheckEmpty(SolrTestCaseJ4.java:391)
   [junit4]   2>     app//org.apache.solr.SolrTestCaseJ4.teardownTestCases(SolrTestCaseJ4.java:319)
   [junit4]   2>     jdk.internal.reflect.GeneratedMethodAccessor37.invoke(Unknown Source)
   [junit4]   2>     java.base@11/jdk.internal.reflect.DelegatingMethodAccessorImpl.invoke(DelegatingMethodAccessorImpl.java:43)
   [junit4]   2>     java.base@11/java.lang.reflect.Method.invoke(Method.java:566)
   [junit4]   2>     app//com.carrotsearch.randomizedtesting.RandomizedRunner.invoke(RandomizedRunner.java:1750)
   [junit4]   2>     app//com.carrotsearch.randomizedtesting.RandomizedRunner$7.evaluate(RandomizedRunner.java:901)
   [junit4]   2>     app//com.carrotsearch.randomizedtesting.rules.StatementAdapter.evaluate(StatementAdapter.java:36)
   [junit4]   2>     app//com.carrotsearch.randomizedtesting.rules.SystemPropertiesRestoreRule$1.evaluate(SystemPropertiesRestoreRule.java:57)
   [junit4]   2>     app//org.apache.lucene.util.AbstractBeforeAfterRule$1.evaluate(AbstractBeforeAfterRule.java:45)
   [junit4]   2>     app//com.carrotsearch.randomizedtesting.rules.StatementAdapter.evaluate(StatementAdapter.java:36)
   [junit4]   2>     app//org.apache.lucene.util.TestRuleStoreClassName$1.evaluate(TestRuleStoreClassName.java:41)
   [junit4]   2>     app//com.carrotsearch.randomizedtesting.rules.NoShadowingOrOverridesOnMethodsRule$1.evaluate(NoShadowingOrOverridesOnMethodsRule.java:40)
   [junit4]   2>     app//com.carrotsearch.randomizedtesting.rules.NoShadowingOrOverridesOnMethodsRule$1.evaluate(NoShadowingOrOverridesOnMethodsRule.java:40)
   [junit4]   2>     app//com.carrotsearch.randomizedtesting.rules.StatementAdapter.evaluate(StatementAdapter.java:36)
   [junit4]   2>     app//com.carrotsearch.randomizedtesting.rules.StatementAdapter.evaluate(StatementAdapter.java:36)
   [junit4]   2>     app//org.apache.lucene.util.TestRuleAssertionsRequired$1.evaluate(TestRuleAssertionsRequired.java:53)
   [junit4]   2>     app//org.apache.lucene.util.TestRuleMarkFailure$1.evaluate(TestRuleMarkFailure.java:47)
   [junit4]   2>     app//org.apache.lucene.util.TestRuleIgnoreAfterMaxFailures$1.evaluate(TestRuleIgnoreAfterMaxFailures.java:64)
   [junit4]   2>     app//org.apache.lucene.util.TestRuleIgnoreTestSuites$1.evaluate(TestRuleIgnoreTestSuites.java:54)
   [junit4]   2>     app//com.carrotsearch.randomizedtesting.rules.StatementAdapter.evaluate(StatementAdapter.java:36)
   [junit4]   2>     app//com.carrotsearch.randomizedtesting.ThreadLeakControl$StatementRunner.run(ThreadLeakControl.java:368)
   [junit4]   2>     java.base@11/java.lang.Thread.run(Thread.java:834)
   [junit4]   2>
   [junit4]   2> Reference Handler:
   [junit4]   2>     java.base@11/java.lang.ref.Reference.waitForReferencePendingList(Native Method)
   [junit4]   2>     java.base@11/java.lang.ref.Reference.processPendingReferences(Reference.java:241)
   [junit4]   2>     java.base@11/java.lang.ref.Reference$ReferenceHandler.run(Reference.java:213)
   [junit4]   2>
   [junit4]   2> Signal Dispatcher:
   [junit4]   2>
   [junit4]   2> Attach Listener:
   [junit4]   2>
   [junit4]   2> ForkJoinPool.commonPool-worker-1:
   [junit4]   2>     java.base@11/jdk.internal.misc.Unsafe.park(Native Method)
   [junit4]   2>     java.base@11/java.util.concurrent.locks.LockSupport.parkUntil(LockSupport.java:275)
   [junit4]   2>     java.base@11/java.util.concurrent.ForkJoinPool.runWorker(ForkJoinPool.java:1619)
   [junit4]   2>     java.base@11/java.util.concurrent.ForkJoinWorkerThread.run(ForkJoinWorkerThread.java:177)
   [junit4]   2>
   [junit4]   2> Finalizer:
   [junit4]   2>     java.base@11/java.lang.Object.wait(Native Method)
   [junit4]   2>     java.base@11/java.lang.ref.ReferenceQueue.remove(ReferenceQueue.java:155)
   [junit4]   2>     java.base@11/java.lang.ref.ReferenceQueue.remove(ReferenceQueue.java:176)
   [junit4]   2>     java.base@11/java.lang.ref.Finalizer$FinalizerThread.run(Finalizer.java:170)
   [junit4]   2>
   [junit4]   2> SeedGenerator Thread:
   [junit4]   2>     java.base@11/java.lang.Object.wait(Native Method)
   [junit4]   2>     java.base@11/java.lang.Object.wait(Object.java:328)
   [junit4]   2>     java.base@11/sun.security.provider.SeedGenerator$ThreadedSeedGenerator.run(SeedGenerator.java:332)
   [junit4]   2>     java.base@11/java.lang.Thread.run(Thread.java:834)
   [junit4]   2>
   [junit4]   2> JUnit4-serializer-daemon:
   [junit4]   2>     java.base@11/java.lang.Thread.sleep(Native Method)
   [junit4]   2>     app//com.carrotsearch.ant.tasks.junit4.events.Serializer$1.run(Serializer.java:50)
   [junit4]   2>
   [junit4]   2> Common-Cleaner:
   [junit4]   2>     java.base@11/java.lang.Object.wait(Native Method)
   [junit4]   2>     java.base@11/java.lang.ref.ReferenceQueue.remove(ReferenceQueue.java:155)
   [junit4]   2>     java.base@11/jdk.internal.ref.CleanerImpl.run(CleanerImpl.java:148)
   [junit4]   2>     java.base@11/java.lang.Thread.run(Thread.java:834)
   [junit4]   2>     java.base@11/jdk.internal.misc.InnocuousThread.run(InnocuousThread.java:134)
   [junit4]   2>
   [junit4]   2> SUITE-CloudSolrClientTest-seed#[AACA89DE8F3BF936]:
   [junit4]   2>     java.base@11/java.lang.Thread.sleep(Native Method)
   [junit4]   2>     app//com.carrotsearch.randomizedtesting.ThreadLeakControl.join(ThreadLeakControl.java:840)
   [junit4]   2>     app//com.carrotsearch.randomizedtesting.ThreadLeakControl.forkTimeoutingTask(ThreadLeakControl.java:822)
   [junit4]   2>     app//com.carrotsearch.randomizedtesting.ThreadLeakControl$2.evaluate(ThreadLeakControl.java:404)
   [junit4]   2>     app//com.carrotsearch.randomizedtesting.RandomizedRunner.runSuite(RandomizedRunner.java:708)
   [junit4]   2>     app//com.carrotsearch.randomizedtesting.RandomizedRunner.access$200(RandomizedRunner.java:138)
   [junit4]   2>     app//com.carrotsearch.randomizedtesting.RandomizedRunner$2.run(RandomizedRunner.java:629)
   [junit4]   2>
   [junit4]   2> ForkJoinPool.commonPool-worker-3:
   [junit4]   2>     java.base@11/jdk.internal.misc.Unsafe.park(Native Method)
   [junit4]   2>     java.base@11/java.util.concurrent.locks.LockSupport.park(LockSupport.java:194)
   [junit4]   2>     java.base@11/java.util.concurrent.ForkJoinPool.runWorker(ForkJoinPool.java:1628)
   [junit4]   2>     java.base@11/java.util.concurrent.ForkJoinWorkerThread.run(ForkJoinWorkerThread.java:177)
   [junit4]   2>
   [junit4]   2> main:
   [junit4]   2>     java.base@11/java.lang.Object.wait(Native Method)
   [junit4]   2>     java.base@11/java.lang.Thread.join(Thread.java:1305)
   [junit4]   2>     java.base@11/java.lang.Thread.join(Thread.java:1379)
   [junit4]   2>     app//com.carrotsearch.randomizedtesting.RandomizedRunner.runSuite(RandomizedRunner.java:639)
   [junit4]   2>     app//com.carrotsearch.randomizedtesting.RandomizedRunner.run(RandomizedRunner.java:496)
   [junit4]   2>     app//com.carrotsearch.ant.tasks.junit4.slave.SlaveMain.execute(SlaveMain.java:269)
   [junit4]   2>     app//com.carrotsearch.ant.tasks.junit4.slave.SlaveMain.main(SlaveMain.java:394)
   [junit4]   2>     app//com.carrotsearch.ant.tasks.junit4.slave.SlaveMainSafe.main(SlaveMainSafe.java:13)
   [junit4]   2>
   [junit4]   2> SUITE-CloudSolrClientTest-seed#[AACA89DE8F3BF936]-worker:
   [junit4]   2>     java.base@11/java.lang.Thread.dumpThreads(Native Method)
   [junit4]   2>     java.base@11/java.lang.Thread.getAllStackTraces(Thread.java:1657)
   [junit4]   2>     app//org.apache.solr.SolrTestCaseJ4.clearObjectTrackerAndCheckEmpty(SolrTestCaseJ4.java:391)
   [junit4]   2>     app//org.apache.solr.SolrTestCaseJ4.teardownTestCases(SolrTestCaseJ4.java:319)
   [junit4]   2>     jdk.internal.reflect.GeneratedMethodAccessor37.invoke(Unknown Source)
   [junit4]   2>     java.base@11/jdk.internal.reflect.DelegatingMethodAccessorImpl.invoke(DelegatingMethodAccessorImpl.java:43)
   [junit4]   2>     java.base@11/java.lang.reflect.Method.invoke(Method.java:566)
   [junit4]   2>     ap

[...truncated too long message...]

]   1> at org.eclipse.jetty.io.AbstractConnection$ReadCallback.succeeded(AbstractConnection.java:305)
   [junit4]   1> at org.eclipse.jetty.io.FillInterest.fillable(FillInterest.java:103)
   [junit4]   1> at org.eclipse.jetty.io.ChannelEndPoint$2.run(ChannelEndPoint.java:118)
   [junit4]   1> at org.eclipse.jetty.util.thread.QueuedThreadPool.runJob(QueuedThreadPool.java:765)
   [junit4]   1> at org.eclipse.jetty.util.thread.QueuedThreadPool$2.run(QueuedThreadPool.java:683)
   [junit4]   1> at java.base/java.lang.Thread.run(Thread.java:834)
   [junit4]   1>
   [junit4]   1> 16:10:00.429 [qtp1432483334-5680] ERROR org.apache.solr.handler.RequestHandlerBase - org.apache.solr.common.SolrException: Unsupported operation: foobar
   [junit4]   1> at org.apache.solr.handler.admin.CoreAdminHandler.handleCustomAction(CoreAdminHandler.java:220)
   [junit4]   1> at org.apache.solr.handler.admin.CoreAdminHandler.handleRequestBody(CoreAdminHandler.java:169)
   [junit4]   1> at org.apache.solr.handler.RequestHandlerBase.handleRequest(RequestHandlerBase.java:199)
   [junit4]   1> at org.apache.solr.servlet.HttpSolrCall.handleAdmin(HttpSolrCall.java:735)
   [junit4]   1> at org.apache.solr.servlet.HttpSolrCall.handleAdminRequest(HttpSolrCall.java:716)
   [junit4]   1> at org.apache.solr.servlet.HttpSolrCall.call(HttpSolrCall.java:496)
   [junit4]   1> at org.apache.solr.servlet.SolrDispatchFilter.doFilter(SolrDispatchFilter.java:395)
   [junit4]   1> at org.apache.solr.servlet.SolrDispatchFilter.doFilter(SolrDispatchFilter.java:341)
   [junit4]   1> at org.eclipse.jetty.servlet.ServletHandler$CachedChain.doFilter(ServletHandler.java:1610)
   [junit4]   1> at org.apache.solr.client.solrj.embedded.JettySolrRunner$DebugFilter.doFilter(JettySolrRunner.java:158)
   [junit4]   1> at org.eclipse.jetty.servlet.ServletHandler$CachedChain.doFilter(ServletHandler.java:1610)
   [junit4]   1> at org.eclipse.jetty.servlet.ServletHandler.doHandle(ServletHandler.java:540)
   [junit4]   1> at org.eclipse.jetty.server.handler.ScopedHandler.nextHandle(ScopedHandler.java:255)
   [junit4]   1> at org.eclipse.jetty.server.session.SessionHandler.doHandle(SessionHandler.java:1588)
   [junit4]   1> at org.eclipse.jetty.server.handler.ScopedHandler.nextHandle(ScopedHandler.java:255)
   [junit4]   1> at org.eclipse.jetty.server.handler.ContextHandler.doHandle(ContextHandler.java:1345)
   [junit4]   1> at org.eclipse.jetty.server.handler.ScopedHandler.nextScope(ScopedHandler.java:203)
   [junit4]   1> at org.eclipse.jetty.servlet.ServletHandler.doScope(ServletHandler.java:480)
   [junit4]   1> at org.eclipse.jetty.server.session.SessionHandler.doScope(SessionHandler.java:1557)
   [junit4]   1> at org.eclipse.jetty.server.handler.ScopedHandler.nextScope(ScopedHandler.java:201)
   [junit4]   1> at org.eclipse.jetty.server.handler.ContextHandler.doScope(ContextHandler.java:1247)
   [junit4]   1> at org.eclipse.jetty.server.handler.ScopedHandler.handle(ScopedHandler.java:144)
   [junit4]   1> at org.eclipse.jetty.server.handler.gzip.GzipHandler.handle(GzipHandler.java:753)
   [junit4]   1> at org.eclipse.jetty.server.handler.HandlerWrapper.handle(HandlerWrapper.java:132)
   [junit4]   1> at org.eclipse.jetty.server.Server.handle(Server.java:502)
   [junit4]   1> at org.eclipse.jetty.server.HttpChannel.handle(HttpChannel.java:364)
   [junit4]   1> at org.eclipse.jetty.server.HttpConnection.onFillable(HttpConnection.java:260)
   [junit4]   1> at org.eclipse.jetty.io.AbstractConnection$ReadCallback.succeeded(AbstractConnection.java:305)
   [junit4]   1> at org.eclipse.jetty.io.FillInterest.fillable(FillInterest.java:103)
   [junit4]   1> at org.eclipse.jetty.io.ChannelEndPoint$2.run(ChannelEndPoint.java:118)
   [junit4]   1> at org.eclipse.jetty.util.thread.QueuedThreadPool.runJob(QueuedThreadPool.java:765)
   [junit4]   1> at org.eclipse.jetty.util.thread.QueuedThreadPool$2.run(QueuedThreadPool.java:683)
   [junit4]   1> at java.base/java.lang.Thread.run(Thread.java:834)
   [junit4]   1>
   [junit4] OK      5.42s J1 | CloudSolrClientTest.testNonRetryableRequests
   [junit4]   1> 16:10:01.644 [jetty-launcher-2127-thread-2] ERROR org.apache.solr.util.StartupLoggingUtils - Missing Java Option solr.log.dir. Logging may be missing or incomplete.
   [junit4]   1> 16:10:01.644 [jetty-launcher-2127-thread-3] ERROR org.apache.solr.util.StartupLoggingUtils - Missing Java Option solr.log.dir. Logging may be missing or incomplete.
   [junit4]   1> 16:10:01.646 [jetty-launcher-2127-thread-1] ERROR org.apache.solr.util.StartupLoggingUtils - Missing Java Option solr.log.dir. Logging may be missing or incomplete.
   [junit4] OK      4.93s J1 | CloudSolrClientTest.testInitializationWithSolrUrls
   [junit4]   1> 16:10:06.590 [jetty-launcher-2198-thread-1] ERROR org.apache.solr.util.StartupLoggingUtils - Missing Java Option solr.log.dir. Logging may be missing or incomplete.
   [junit4]   1> 16:10:06.591 [jetty-launcher-2198-thread-3] ERROR org.apache.solr.util.StartupLoggingUtils - Missing Java Option solr.log.dir. Logging may be missing or incomplete.
   [junit4]   1> 16:10:06.612 [jetty-launcher-2198-thread-2] ERROR org.apache.solr.util.StartupLoggingUtils - Missing Java Option solr.log.dir. Logging may be missing or incomplete.
   [junit4] OK      5.87s J1 | CloudSolrClientTest.checkCollectionParameters
   [junit4]   1> 16:10:12.442 [jetty-launcher-2274-thread-2] ERROR org.apache.solr.util.StartupLoggingUtils - Missing Java Option solr.log.dir. Logging may be missing or incomplete.
   [junit4]   1> 16:10:12.452 [jetty-launcher-2274-thread-1] ERROR org.apache.solr.util.StartupLoggingUtils - Missing Java Option solr.log.dir. Logging may be missing or incomplete.
   [junit4]   1> 16:10:12.460 [jetty-launcher-2274-thread-3] ERROR org.apache.solr.util.StartupLoggingUtils - Missing Java Option solr.log.dir. Logging may be missing or incomplete.
   [junit4] OK      8.09s J1 | CloudSolrClientTest.testAliasHandling
   [junit4]   2> NOTE: leaving temporary files on disk at: C:\Users\jenkins\workspace\Lucene-Solr-7.7-Windows\solr\build\solr-solrj\test\J1\temp\solr.client.solrj.impl.CloudSolrClientTest_AACA89DE8F3BF936-001
   [junit4]   2> NOTE: test params are: codec=Asserting(Lucene70): {_version_=PostingsFormat(name=Memory), multiDefault=FSTOrd50, a_t=PostingsFormat(name=Memory), title_s=FSTOrd50, intDefault=PostingsFormat(name=Memory), id=PostingsFormat(name=LuceneFixedGap), text=FST50, timestamp=PostingsFormat(name=Memory)}, docValues:{_version_=DocValuesFormat(name=Direct), multiDefault=DocValuesFormat(name=Memory), a_t=DocValuesFormat(name=Direct), title_s=DocValuesFormat(name=Memory), intDefault=DocValuesFormat(name=Direct), id=DocValuesFormat(name=Lucene70), text=DocValuesFormat(name=Asserting), timestamp=DocValuesFormat(name=Direct)}, maxPointsInLeafNode=487, maxMBSortInHeap=7.141824254031699, sim=RandomSimilarity(queryNorm=true): {}, locale=vai, timezone=America/Boise
   [junit4]   2> NOTE: Windows 10 10.0 amd64/Oracle Corporation 11 (64-bit)/cpus=3,threads=1,free=158931328,total=411041792
   [junit4]   2> NOTE: All tests run in this JVM: [CloudSolrClientTest, CloudSolrClientTest]
   [junit4] Completed [4/5 (1!)] on J1 in 74.13s, 16 tests, 1 error <<< FAILURES!

[...truncated 29 lines...]
BUILD FAILED
C:\Users\jenkins\workspace\Lucene-Solr-7.7-Windows\lucene\common-build.xml:1572: The following error occurred while executing this line:
C:\Users\jenkins\workspace\Lucene-Solr-7.7-Windows\lucene\common-build.xml:1099: There were test failures: 5 suites, 80 tests, 1 error [seed: AACA89DE8F3BF936]

Total time: 4 minutes 33 seconds

[repro] Setting last failure code to 1

[repro] Failures:
[repro]   1/5 failed: org.apache.solr.client.solrj.impl.CloudSolrClientTest
[repro] Exiting with code 1

C:\Users\jenkins\workspace\Lucene-Solr-7.7-Windows>IF EXIST lucene\build move /y lucene\build lucene\build.repro
        1 dir(s) moved.

C:\Users\jenkins\workspace\Lucene-Solr-7.7-Windows>IF EXIST solr\build move /y solr\build solr\build.repro
        1 dir(s) moved.

C:\Users\jenkins\workspace\Lucene-Solr-7.7-Windows>IF EXIST lucene\build.orig move /y lucene\build.orig lucene\build
        1 dir(s) moved.

C:\Users\jenkins\workspace\Lucene-Solr-7.7-Windows>IF EXIST solr\build.orig move /y solr\build.orig solr\build
        1 dir(s) moved.

C:\Users\jenkins\workspace\Lucene-Solr-7.7-Windows>exit 0
Archiving artifacts
Setting ANT_1_8_2_HOME=C:\Users\jenkins\tools\hudson.tasks.Ant_AntInstallation\ANT_1.8.2
[WARNINGS] Parsing warnings in console log with parser Java Compiler (javac)
Setting ANT_1_8_2_HOME=C:\Users\jenkins\tools\hudson.tasks.Ant_AntInstallation\ANT_1.8.2
No credentials specified
Setting ANT_1_8_2_HOME=C:\Users\jenkins\tools\hudson.tasks.Ant_AntInstallation\ANT_1.8.2
<Git Blamer> Using GitBlamer to create author and commit information for all warnings.
<Git Blamer> GIT_COMMIT=bd9152e5522be58579cc4043630f343c10285433, workspace=C:\Users\jenkins\workspace\Lucene-Solr-7.7-Windows
[WARNINGS] Computing warning deltas based on reference build #31
Recording test results
Setting ANT_1_8_2_HOME=C:\Users\jenkins\tools\hudson.tasks.Ant_AntInstallation\ANT_1.8.2
Build step 'Publish JUnit test result report' changed build result to UNSTABLE
Email was triggered for: Unstable (Test Failures)
Sending email for trigger: Unstable (Test Failures)
Setting ANT_1_8_2_HOME=C:\Users\jenkins\tools\hudson.tasks.Ant_AntInstallation\ANT_1.8.2
Setting ANT_1_8_2_HOME=C:\Users\jenkins\tools\hudson.tasks.Ant_AntInstallation\ANT_1.8.2
Setting ANT_1_8_2_HOME=C:\Users\jenkins\tools\hudson.tasks.Ant_AntInstallation\ANT_1.8.2
Setting ANT_1_8_2_HOME=C:\Users\jenkins\tools\hudson.tasks.Ant_AntInstallation\ANT_1.8.2
Setting ANT_1_8_2_HOME=C:\Users\jenkins\tools\hudson.tasks.Ant_AntInstallation\ANT_1.8.2
Setting ANT_1_8_2_HOME=C:\Users\jenkins\tools\hudson.tasks.Ant_AntInstallation\ANT_1.8.2


---------------------------------------------------------------------
To unsubscribe, e-mail: [hidden email]
For additional commands, e-mail: [hidden email]