[JENKINS] Lucene-Solr-7.x-Linux (32bit/jdk1.8.0_144) - Build # 241 - Unstable!

Previous Topic Next Topic
 
classic Classic list List threaded Threaded
1 message Options
Reply | Threaded
Open this post in threaded view
|  
Report Content as Inappropriate

[JENKINS] Lucene-Solr-7.x-Linux (32bit/jdk1.8.0_144) - Build # 241 - Unstable!

Policeman Jenkins Server-2
Build: https://jenkins.thetaphi.de/job/Lucene-Solr-7.x-Linux/241/
Java: 32bit/jdk1.8.0_144 -client -XX:+UseParallelGC

2 tests failed.
FAILED:  org.apache.solr.client.solrj.io.stream.StreamExpressionTest.testParallelExecutorStream

Error Message:
Error from server at https://127.0.0.1:36343/solr/workQueue_shard2_replica_n2: Expected mime type application/octet-stream but got text/html. <html> <head> <meta http-equiv="Content-Type" content="text/html;charset=ISO-8859-1"/> <title>Error 404 </title> </head> <body> <h2>HTTP ERROR: 404</h2> <p>Problem accessing /solr/workQueue_shard2_replica_n2/update. Reason: <pre>    Can not find: /solr/workQueue_shard2_replica_n2/update</pre></p> <hr /><a href="http://eclipse.org/jetty">Powered by Jetty:// 9.3.14.v20161028</a><hr/> </body> </html>

Stack Trace:
org.apache.solr.client.solrj.impl.CloudSolrClient$RouteException: Error from server at https://127.0.0.1:36343/solr/workQueue_shard2_replica_n2: Expected mime type application/octet-stream but got text/html. <html>
<head>
<meta http-equiv="Content-Type" content="text/html;charset=ISO-8859-1"/>
<title>Error 404 </title>
</head>
<body>
<h2>HTTP ERROR: 404</h2>
<p>Problem accessing /solr/workQueue_shard2_replica_n2/update. Reason:
<pre>    Can not find: /solr/workQueue_shard2_replica_n2/update</pre></p>
<hr /><a href="http://eclipse.org/jetty">Powered by Jetty:// 9.3.14.v20161028</a><hr/>
</body>
</html>

        at __randomizedtesting.SeedInfo.seed([AF50AF7082ACBD25:1247DA69BB808078]:0)
        at org.apache.solr.client.solrj.impl.CloudSolrClient.directUpdate(CloudSolrClient.java:539)
        at org.apache.solr.client.solrj.impl.CloudSolrClient.sendRequest(CloudSolrClient.java:993)
        at org.apache.solr.client.solrj.impl.CloudSolrClient.requestWithRetryOnStaleState(CloudSolrClient.java:862)
        at org.apache.solr.client.solrj.impl.CloudSolrClient.request(CloudSolrClient.java:793)
        at org.apache.solr.client.solrj.SolrRequest.process(SolrRequest.java:178)
        at org.apache.solr.client.solrj.request.UpdateRequest.commit(UpdateRequest.java:233)
        at org.apache.solr.client.solrj.io.stream.StreamExpressionTest.testParallelExecutorStream(StreamExpressionTest.java:6884)
        at sun.reflect.NativeMethodAccessorImpl.invoke0(Native Method)
        at sun.reflect.NativeMethodAccessorImpl.invoke(NativeMethodAccessorImpl.java:62)
        at sun.reflect.DelegatingMethodAccessorImpl.invoke(DelegatingMethodAccessorImpl.java:43)
        at java.lang.reflect.Method.invoke(Method.java:498)
        at com.carrotsearch.randomizedtesting.RandomizedRunner.invoke(RandomizedRunner.java:1713)
        at com.carrotsearch.randomizedtesting.RandomizedRunner$8.evaluate(RandomizedRunner.java:907)
        at com.carrotsearch.randomizedtesting.RandomizedRunner$9.evaluate(RandomizedRunner.java:943)
        at com.carrotsearch.randomizedtesting.RandomizedRunner$10.evaluate(RandomizedRunner.java:957)
        at com.carrotsearch.randomizedtesting.rules.SystemPropertiesRestoreRule$1.evaluate(SystemPropertiesRestoreRule.java:57)
        at org.apache.lucene.util.TestRuleSetupTeardownChained$1.evaluate(TestRuleSetupTeardownChained.java:49)
        at org.apache.lucene.util.AbstractBeforeAfterRule$1.evaluate(AbstractBeforeAfterRule.java:45)
        at org.apache.lucene.util.TestRuleThreadAndTestName$1.evaluate(TestRuleThreadAndTestName.java:48)
        at org.apache.lucene.util.TestRuleIgnoreAfterMaxFailures$1.evaluate(TestRuleIgnoreAfterMaxFailures.java:64)
        at org.apache.lucene.util.TestRuleMarkFailure$1.evaluate(TestRuleMarkFailure.java:47)
        at com.carrotsearch.randomizedtesting.rules.StatementAdapter.evaluate(StatementAdapter.java:36)
        at com.carrotsearch.randomizedtesting.ThreadLeakControl$StatementRunner.run(ThreadLeakControl.java:368)
        at com.carrotsearch.randomizedtesting.ThreadLeakControl.forkTimeoutingTask(ThreadLeakControl.java:817)
        at com.carrotsearch.randomizedtesting.ThreadLeakControl$3.evaluate(ThreadLeakControl.java:468)
        at com.carrotsearch.randomizedtesting.RandomizedRunner.runSingleTest(RandomizedRunner.java:916)
        at com.carrotsearch.randomizedtesting.RandomizedRunner$5.evaluate(RandomizedRunner.java:802)
        at com.carrotsearch.randomizedtesting.RandomizedRunner$6.evaluate(RandomizedRunner.java:852)
        at com.carrotsearch.randomizedtesting.RandomizedRunner$7.evaluate(RandomizedRunner.java:863)
        at com.carrotsearch.randomizedtesting.rules.StatementAdapter.evaluate(StatementAdapter.java:36)
        at com.carrotsearch.randomizedtesting.rules.SystemPropertiesRestoreRule$1.evaluate(SystemPropertiesRestoreRule.java:57)
        at org.apache.lucene.util.AbstractBeforeAfterRule$1.evaluate(AbstractBeforeAfterRule.java:45)
        at com.carrotsearch.randomizedtesting.rules.StatementAdapter.evaluate(StatementAdapter.java:36)
        at org.apache.lucene.util.TestRuleStoreClassName$1.evaluate(TestRuleStoreClassName.java:41)
        at com.carrotsearch.randomizedtesting.rules.NoShadowingOrOverridesOnMethodsRule$1.evaluate(NoShadowingOrOverridesOnMethodsRule.java:40)
        at com.carrotsearch.randomizedtesting.rules.NoShadowingOrOverridesOnMethodsRule$1.evaluate(NoShadowingOrOverridesOnMethodsRule.java:40)
        at com.carrotsearch.randomizedtesting.rules.StatementAdapter.evaluate(StatementAdapter.java:36)
        at com.carrotsearch.randomizedtesting.rules.StatementAdapter.evaluate(StatementAdapter.java:36)
        at com.carrotsearch.randomizedtesting.rules.StatementAdapter.evaluate(StatementAdapter.java:36)
        at org.apache.lucene.util.TestRuleAssertionsRequired$1.evaluate(TestRuleAssertionsRequired.java:53)
        at org.apache.lucene.util.TestRuleMarkFailure$1.evaluate(TestRuleMarkFailure.java:47)
        at org.apache.lucene.util.TestRuleIgnoreAfterMaxFailures$1.evaluate(TestRuleIgnoreAfterMaxFailures.java:64)
        at org.apache.lucene.util.TestRuleIgnoreTestSuites$1.evaluate(TestRuleIgnoreTestSuites.java:54)
        at com.carrotsearch.randomizedtesting.rules.StatementAdapter.evaluate(StatementAdapter.java:36)
        at com.carrotsearch.randomizedtesting.ThreadLeakControl$StatementRunner.run(ThreadLeakControl.java:368)
        at java.lang.Thread.run(Thread.java:748)
Caused by: org.apache.solr.client.solrj.impl.HttpSolrClient$RemoteSolrException: Error from server at https://127.0.0.1:36343/solr/workQueue_shard2_replica_n2: Expected mime type application/octet-stream but got text/html. <html>
<head>
<meta http-equiv="Content-Type" content="text/html;charset=ISO-8859-1"/>
<title>Error 404 </title>
</head>
<body>
<h2>HTTP ERROR: 404</h2>
<p>Problem accessing /solr/workQueue_shard2_replica_n2/update. Reason:
<pre>    Can not find: /solr/workQueue_shard2_replica_n2/update</pre></p>
<hr /><a href="http://eclipse.org/jetty">Powered by Jetty:// 9.3.14.v20161028</a><hr/>
</body>
</html>

        at org.apache.solr.client.solrj.impl.HttpSolrClient.executeMethod(HttpSolrClient.java:591)
        at org.apache.solr.client.solrj.impl.HttpSolrClient.request(HttpSolrClient.java:253)
        at org.apache.solr.client.solrj.impl.HttpSolrClient.request(HttpSolrClient.java:242)
        at org.apache.solr.client.solrj.impl.LBHttpSolrClient.doRequest(LBHttpSolrClient.java:483)
        at org.apache.solr.client.solrj.impl.LBHttpSolrClient.request(LBHttpSolrClient.java:413)
        at org.apache.solr.client.solrj.impl.CloudSolrClient.lambda$directUpdate$0(CloudSolrClient.java:516)
        at java.util.concurrent.FutureTask.run(FutureTask.java:266)
        at org.apache.solr.common.util.ExecutorUtil$MDCAwareThreadPoolExecutor.lambda$execute$0(ExecutorUtil.java:188)
        at java.util.concurrent.ThreadPoolExecutor.runWorker(ThreadPoolExecutor.java:1149)
        at java.util.concurrent.ThreadPoolExecutor$Worker.run(ThreadPoolExecutor.java:624)
        ... 1 more


FAILED:  org.apache.solr.cloud.ForceLeaderTest.testReplicasInLIRNoLeader

Error Message:
Doc with id=1 not found in http://127.0.0.1:34051/forceleader_test_collection due to: Path not found: /id; rsp={doc=null}

Stack Trace:
java.lang.AssertionError: Doc with id=1 not found in http://127.0.0.1:34051/forceleader_test_collection due to: Path not found: /id; rsp={doc=null}
        at __randomizedtesting.SeedInfo.seed([C210C1CE96CE91AB:2487F50EAF4C68CA]:0)
        at org.junit.Assert.fail(Assert.java:93)
        at org.junit.Assert.assertTrue(Assert.java:43)
        at org.apache.solr.cloud.HttpPartitionTest.assertDocExists(HttpPartitionTest.java:603)
        at org.apache.solr.cloud.HttpPartitionTest.assertDocsExistInAllReplicas(HttpPartitionTest.java:556)
        at org.apache.solr.cloud.ForceLeaderTest.testReplicasInLIRNoLeader(ForceLeaderTest.java:142)
        at sun.reflect.NativeMethodAccessorImpl.invoke0(Native Method)
        at sun.reflect.NativeMethodAccessorImpl.invoke(NativeMethodAccessorImpl.java:62)
        at sun.reflect.DelegatingMethodAccessorImpl.invoke(DelegatingMethodAccessorImpl.java:43)
        at java.lang.reflect.Method.invoke(Method.java:498)
        at com.carrotsearch.randomizedtesting.RandomizedRunner.invoke(RandomizedRunner.java:1713)
        at com.carrotsearch.randomizedtesting.RandomizedRunner$8.evaluate(RandomizedRunner.java:907)
        at com.carrotsearch.randomizedtesting.RandomizedRunner$9.evaluate(RandomizedRunner.java:943)
        at com.carrotsearch.randomizedtesting.RandomizedRunner$10.evaluate(RandomizedRunner.java:957)
        at org.apache.solr.BaseDistributedSearchTestCase$ShardsRepeatRule$ShardsFixedStatement.callStatement(BaseDistributedSearchTestCase.java:993)
        at org.apache.solr.BaseDistributedSearchTestCase$ShardsRepeatRule$ShardsStatement.evaluate(BaseDistributedSearchTestCase.java:968)
        at com.carrotsearch.randomizedtesting.rules.SystemPropertiesRestoreRule$1.evaluate(SystemPropertiesRestoreRule.java:57)
        at org.apache.lucene.util.TestRuleSetupTeardownChained$1.evaluate(TestRuleSetupTeardownChained.java:49)
        at org.apache.lucene.util.AbstractBeforeAfterRule$1.evaluate(AbstractBeforeAfterRule.java:45)
        at org.apache.lucene.util.TestRuleThreadAndTestName$1.evaluate(TestRuleThreadAndTestName.java:48)
        at org.apache.lucene.util.TestRuleIgnoreAfterMaxFailures$1.evaluate(TestRuleIgnoreAfterMaxFailures.java:64)
        at org.apache.lucene.util.TestRuleMarkFailure$1.evaluate(TestRuleMarkFailure.java:47)
        at com.carrotsearch.randomizedtesting.rules.StatementAdapter.evaluate(StatementAdapter.java:36)
        at com.carrotsearch.randomizedtesting.ThreadLeakControl$StatementRunner.run(ThreadLeakControl.java:368)
        at com.carrotsearch.randomizedtesting.ThreadLeakControl.forkTimeoutingTask(ThreadLeakControl.java:817)
        at com.carrotsearch.randomizedtesting.ThreadLeakControl$3.evaluate(ThreadLeakControl.java:468)
        at com.carrotsearch.randomizedtesting.RandomizedRunner.runSingleTest(RandomizedRunner.java:916)
        at com.carrotsearch.randomizedtesting.RandomizedRunner$5.evaluate(RandomizedRunner.java:802)
        at com.carrotsearch.randomizedtesting.RandomizedRunner$6.evaluate(RandomizedRunner.java:852)
        at com.carrotsearch.randomizedtesting.RandomizedRunner$7.evaluate(RandomizedRunner.java:863)
        at com.carrotsearch.randomizedtesting.rules.StatementAdapter.evaluate(StatementAdapter.java:36)
        at com.carrotsearch.randomizedtesting.rules.SystemPropertiesRestoreRule$1.evaluate(SystemPropertiesRestoreRule.java:57)
        at org.apache.lucene.util.AbstractBeforeAfterRule$1.evaluate(AbstractBeforeAfterRule.java:45)
        at com.carrotsearch.randomizedtesting.rules.StatementAdapter.evaluate(StatementAdapter.java:36)
        at org.apache.lucene.util.TestRuleStoreClassName$1.evaluate(TestRuleStoreClassName.java:41)
        at com.carrotsearch.randomizedtesting.rules.NoShadowingOrOverridesOnMethodsRule$1.evaluate(NoShadowingOrOverridesOnMethodsRule.java:40)
        at com.carrotsearch.randomizedtesting.rules.NoShadowingOrOverridesOnMethodsRule$1.evaluate(NoShadowingOrOverridesOnMethodsRule.java:40)
        at com.carrotsearch.randomizedtesting.rules.StatementAdapter.evaluate(StatementAdapter.java:36)
        at com.carrotsearch.randomizedtesting.rules.StatementAdapter.evaluate(StatementAdapter.java:36)
        at com.carrotsearch.randomizedtesting.rules.StatementAdapter.evaluate(StatementAdapter.java:36)
        at org.apache.lucene.util.TestRuleAssertionsRequired$1.evaluate(TestRuleAssertionsRequired.java:53)
        at org.apache.lucene.util.TestRuleMarkFailure$1.evaluate(TestRuleMarkFailure.java:47)
        at org.apache.lucene.util.TestRuleIgnoreAfterMaxFailures$1.evaluate(TestRuleIgnoreAfterMaxFailures.java:64)
        at org.apache.lucene.util.TestRuleIgnoreTestSuites$1.evaluate(TestRuleIgnoreTestSuites.java:54)
        at com.carrotsearch.randomizedtesting.rules.StatementAdapter.evaluate(StatementAdapter.java:36)
        at com.carrotsearch.randomizedtesting.ThreadLeakControl$StatementRunner.run(ThreadLeakControl.java:368)
        at java.lang.Thread.run(Thread.java:748)




Build Log:
[...truncated 12438 lines...]
   [junit4] Suite: org.apache.solr.cloud.ForceLeaderTest
   [junit4]   2> 1610540 INFO  (SUITE-ForceLeaderTest-seed#[C210C1CE96CE91AB]-worker) [    ] o.a.s.SolrTestCaseJ4 SecureRandom sanity checks: test.solr.allowed.securerandom=null & java.security.egd=file:/dev/./urandom
   [junit4]   2> Creating dataDir: /home/jenkins/workspace/Lucene-Solr-7.x-Linux/solr/build/solr-core/test/J0/temp/solr.cloud.ForceLeaderTest_C210C1CE96CE91AB-001/init-core-data-001
   [junit4]   2> 1610540 WARN  (SUITE-ForceLeaderTest-seed#[C210C1CE96CE91AB]-worker) [    ] o.a.s.SolrTestCaseJ4 startTrackingSearchers: numOpens=39 numCloses=39
   [junit4]   2> 1610540 INFO  (SUITE-ForceLeaderTest-seed#[C210C1CE96CE91AB]-worker) [    ] o.a.s.SolrTestCaseJ4 Using PointFields (NUMERIC_POINTS_SYSPROP=true) w/NUMERIC_DOCVALUES_SYSPROP=false
   [junit4]   2> 1610541 INFO  (SUITE-ForceLeaderTest-seed#[C210C1CE96CE91AB]-worker) [    ] o.a.s.SolrTestCaseJ4 Randomized ssl (false) and clientAuth (false) via: @org.apache.solr.SolrTestCaseJ4$SuppressSSL(bugUrl=https://issues.apache.org/jira/browse/SOLR-5776)
   [junit4]   2> 1610541 INFO  (SUITE-ForceLeaderTest-seed#[C210C1CE96CE91AB]-worker) [    ] o.a.s.BaseDistributedSearchTestCase Setting hostContext system property: /
   [junit4]   2> 1610543 INFO  (TEST-ForceLeaderTest.testLastPublishedStateIsActive-seed#[C210C1CE96CE91AB]) [    ] o.a.s.c.ZkTestServer STARTING ZK TEST SERVER
   [junit4]   2> 1610543 INFO  (Thread-3847) [    ] o.a.s.c.ZkTestServer client port:0.0.0.0/0.0.0.0:0
   [junit4]   2> 1610543 INFO  (Thread-3847) [    ] o.a.s.c.ZkTestServer Starting server
   [junit4]   2> 1610544 ERROR (Thread-3847) [    ] o.a.z.s.ZooKeeperServer ZKShutdownHandler is not registered, so ZooKeeper server won't take any action on ERROR or SHUTDOWN server state changes
   [junit4]   2> 1610643 INFO  (TEST-ForceLeaderTest.testLastPublishedStateIsActive-seed#[C210C1CE96CE91AB]) [    ] o.a.s.c.ZkTestServer start zk server on port:46277
   [junit4]   2> 1610651 INFO  (TEST-ForceLeaderTest.testLastPublishedStateIsActive-seed#[C210C1CE96CE91AB]) [    ] o.a.s.c.AbstractZkTestCase put /home/jenkins/workspace/Lucene-Solr-7.x-Linux/solr/core/src/test-files/solr/collection1/conf/solrconfig-tlog.xml to /configs/conf1/solrconfig.xml
   [junit4]   2> 1610652 INFO  (TEST-ForceLeaderTest.testLastPublishedStateIsActive-seed#[C210C1CE96CE91AB]) [    ] o.a.s.c.AbstractZkTestCase put /home/jenkins/workspace/Lucene-Solr-7.x-Linux/solr/core/src/test-files/solr/collection1/conf/schema.xml to /configs/conf1/schema.xml
   [junit4]   2> 1610653 INFO  (TEST-ForceLeaderTest.testLastPublishedStateIsActive-seed#[C210C1CE96CE91AB]) [    ] o.a.s.c.AbstractZkTestCase put /home/jenkins/workspace/Lucene-Solr-7.x-Linux/solr/core/src/test-files/solr/collection1/conf/solrconfig.snippet.randomindexconfig.xml to /configs/conf1/solrconfig.snippet.randomindexconfig.xml
   [junit4]   2> 1610654 INFO  (TEST-ForceLeaderTest.testLastPublishedStateIsActive-seed#[C210C1CE96CE91AB]) [    ] o.a.s.c.AbstractZkTestCase put /home/jenkins/workspace/Lucene-Solr-7.x-Linux/solr/core/src/test-files/solr/collection1/conf/stopwords.txt to /configs/conf1/stopwords.txt
   [junit4]   2> 1610655 INFO  (TEST-ForceLeaderTest.testLastPublishedStateIsActive-seed#[C210C1CE96CE91AB]) [    ] o.a.s.c.AbstractZkTestCase put /home/jenkins/workspace/Lucene-Solr-7.x-Linux/solr/core/src/test-files/solr/collection1/conf/protwords.txt to /configs/conf1/protwords.txt
   [junit4]   2> 1610656 INFO  (TEST-ForceLeaderTest.testLastPublishedStateIsActive-seed#[C210C1CE96CE91AB]) [    ] o.a.s.c.AbstractZkTestCase put /home/jenkins/workspace/Lucene-Solr-7.x-Linux/solr/core/src/test-files/solr/collection1/conf/currency.xml to /configs/conf1/currency.xml
   [junit4]   2> 1610657 INFO  (TEST-ForceLeaderTest.testLastPublishedStateIsActive-seed#[C210C1CE96CE91AB]) [    ] o.a.s.c.AbstractZkTestCase put /home/jenkins/workspace/Lucene-Solr-7.x-Linux/solr/core/src/test-files/solr/collection1/conf/enumsConfig.xml to /configs/conf1/enumsConfig.xml
   [junit4]   2> 1610657 INFO  (TEST-ForceLeaderTest.testLastPublishedStateIsActive-seed#[C210C1CE96CE91AB]) [    ] o.a.s.c.AbstractZkTestCase put /home/jenkins/workspace/Lucene-Solr-7.x-Linux/solr/core/src/test-files/solr/collection1/conf/open-exchange-rates.json to /configs/conf1/open-exchange-rates.json
   [junit4]   2> 1610658 INFO  (TEST-ForceLeaderTest.testLastPublishedStateIsActive-seed#[C210C1CE96CE91AB]) [    ] o.a.s.c.AbstractZkTestCase put /home/jenkins/workspace/Lucene-Solr-7.x-Linux/solr/core/src/test-files/solr/collection1/conf/mapping-ISOLatin1Accent.txt to /configs/conf1/mapping-ISOLatin1Accent.txt
   [junit4]   2> 1610659 INFO  (TEST-ForceLeaderTest.testLastPublishedStateIsActive-seed#[C210C1CE96CE91AB]) [    ] o.a.s.c.AbstractZkTestCase put /home/jenkins/workspace/Lucene-Solr-7.x-Linux/solr/core/src/test-files/solr/collection1/conf/old_synonyms.txt to /configs/conf1/old_synonyms.txt
   [junit4]   2> 1610660 INFO  (TEST-ForceLeaderTest.testLastPublishedStateIsActive-seed#[C210C1CE96CE91AB]) [    ] o.a.s.c.AbstractZkTestCase put /home/jenkins/workspace/Lucene-Solr-7.x-Linux/solr/core/src/test-files/solr/collection1/conf/synonyms.txt to /configs/conf1/synonyms.txt
   [junit4]   2> 1610660 INFO  (TEST-ForceLeaderTest.testLastPublishedStateIsActive-seed#[C210C1CE96CE91AB]) [    ] o.a.s.c.AbstractFullDistribZkTestBase Will use TLOG replicas unless explicitly asked otherwise
   [junit4]   2> 1610758 INFO  (TEST-ForceLeaderTest.testLastPublishedStateIsActive-seed#[C210C1CE96CE91AB]) [    ] o.e.j.s.Server jetty-9.3.14.v20161028
   [junit4]   2> 1610759 INFO  (TEST-ForceLeaderTest.testLastPublishedStateIsActive-seed#[C210C1CE96CE91AB]) [    ] o.e.j.s.h.ContextHandler Started o.e.j.s.ServletContextHandler@a4d6f6{/,null,AVAILABLE}
   [junit4]   2> 1610760 INFO  (TEST-ForceLeaderTest.testLastPublishedStateIsActive-seed#[C210C1CE96CE91AB]) [    ] o.e.j.s.AbstractConnector Started ServerConnector@9fb26f{HTTP/1.1,[http/1.1]}{127.0.0.1:42813}
   [junit4]   2> 1610760 INFO  (TEST-ForceLeaderTest.testLastPublishedStateIsActive-seed#[C210C1CE96CE91AB]) [    ] o.e.j.s.Server Started @1611706ms
   [junit4]   2> 1610760 INFO  (TEST-ForceLeaderTest.testLastPublishedStateIsActive-seed#[C210C1CE96CE91AB]) [    ] o.a.s.c.s.e.JettySolrRunner Jetty properties: {solr.data.dir=/home/jenkins/workspace/Lucene-Solr-7.x-Linux/solr/build/solr-core/test/J0/temp/solr.cloud.ForceLeaderTest_C210C1CE96CE91AB-001/tempDir-001/control/data, hostContext=/, hostPort=43187, coreRootDirectory=/home/jenkins/workspace/Lucene-Solr-7.x-Linux/solr/build/solr-core/test/J0/temp/solr.cloud.ForceLeaderTest_C210C1CE96CE91AB-001/control-001/cores}
   [junit4]   2> 1610760 ERROR (TEST-ForceLeaderTest.testLastPublishedStateIsActive-seed#[C210C1CE96CE91AB]) [    ] o.a.s.s.StartupLoggingUtils Missing Java Option solr.log.dir. Logging may be missing or incomplete.
   [junit4]   2> 1610760 INFO  (TEST-ForceLeaderTest.testLastPublishedStateIsActive-seed#[C210C1CE96CE91AB]) [    ] o.a.s.s.SolrDispatchFilter  ___      _       Welcome to Apache Solr™ version 7.1.0
   [junit4]   2> 1610760 INFO  (TEST-ForceLeaderTest.testLastPublishedStateIsActive-seed#[C210C1CE96CE91AB]) [    ] o.a.s.s.SolrDispatchFilter / __| ___| |_ _   Starting in cloud mode on port null
   [junit4]   2> 1610760 INFO  (TEST-ForceLeaderTest.testLastPublishedStateIsActive-seed#[C210C1CE96CE91AB]) [    ] o.a.s.s.SolrDispatchFilter \__ \/ _ \ | '_|  Install dir: null, Default config dir: null
   [junit4]   2> 1610760 INFO  (TEST-ForceLeaderTest.testLastPublishedStateIsActive-seed#[C210C1CE96CE91AB]) [    ] o.a.s.s.SolrDispatchFilter |___/\___/_|_|    Start time: 2017-08-11T14:35:16.802Z
   [junit4]   2> 1610763 INFO  (TEST-ForceLeaderTest.testLastPublishedStateIsActive-seed#[C210C1CE96CE91AB]) [    ] o.a.s.s.SolrDispatchFilter Loading solr.xml from SolrHome (not found in ZooKeeper)
   [junit4]   2> 1610763 INFO  (TEST-ForceLeaderTest.testLastPublishedStateIsActive-seed#[C210C1CE96CE91AB]) [    ] o.a.s.c.SolrXmlConfig Loading container configuration from /home/jenkins/workspace/Lucene-Solr-7.x-Linux/solr/build/solr-core/test/J0/temp/solr.cloud.ForceLeaderTest_C210C1CE96CE91AB-001/control-001/solr.xml
   [junit4]   2> 1610772 INFO  (TEST-ForceLeaderTest.testLastPublishedStateIsActive-seed#[C210C1CE96CE91AB]) [    ] o.a.s.c.SolrXmlConfig MBean server found: com.sun.jmx.mbeanserver.JmxMBeanServer@815291, but no JMX reporters were configured - adding default JMX reporter.
   [junit4]   2> 1610777 INFO  (TEST-ForceLeaderTest.testLastPublishedStateIsActive-seed#[C210C1CE96CE91AB]) [    ] o.a.s.c.ZkContainer Zookeeper client=127.0.0.1:46277/solr
   [junit4]   2> 1610839 INFO  (TEST-ForceLeaderTest.testLastPublishedStateIsActive-seed#[C210C1CE96CE91AB]) [n:127.0.0.1:43187_    ] o.a.s.c.Overseer Overseer (id=null) closing
   [junit4]   2> 1610839 INFO  (TEST-ForceLeaderTest.testLastPublishedStateIsActive-seed#[C210C1CE96CE91AB]) [n:127.0.0.1:43187_    ] o.a.s.c.OverseerElectionContext I am going to be the leader 127.0.0.1:43187_
   [junit4]   2> 1610840 INFO  (TEST-ForceLeaderTest.testLastPublishedStateIsActive-seed#[C210C1CE96CE91AB]) [n:127.0.0.1:43187_    ] o.a.s.c.Overseer Overseer (id=98465357272580100-127.0.0.1:43187_-n_0000000000) starting
   [junit4]   2> 1610845 INFO  (TEST-ForceLeaderTest.testLastPublishedStateIsActive-seed#[C210C1CE96CE91AB]) [n:127.0.0.1:43187_    ] o.a.s.c.ZkController Register node as live in ZooKeeper:/live_nodes/127.0.0.1:43187_
   [junit4]   2> 1610846 INFO  (zkCallback-2705-thread-1-processing-n:127.0.0.1:43187_) [n:127.0.0.1:43187_    ] o.a.s.c.c.ZkStateReader Updated live nodes from ZooKeeper... (0) -> (1)
   [junit4]   2> 1610934 INFO  (TEST-ForceLeaderTest.testLastPublishedStateIsActive-seed#[C210C1CE96CE91AB]) [n:127.0.0.1:43187_    ] o.a.s.m.r.SolrJmxReporter JMX monitoring for 'solr.node' (registry 'solr.node') enabled at server: com.sun.jmx.mbeanserver.JmxMBeanServer@815291
   [junit4]   2> 1610939 INFO  (TEST-ForceLeaderTest.testLastPublishedStateIsActive-seed#[C210C1CE96CE91AB]) [n:127.0.0.1:43187_    ] o.a.s.m.r.SolrJmxReporter JMX monitoring for 'solr.jvm' (registry 'solr.jvm') enabled at server: com.sun.jmx.mbeanserver.JmxMBeanServer@815291
   [junit4]   2> 1610939 INFO  (TEST-ForceLeaderTest.testLastPublishedStateIsActive-seed#[C210C1CE96CE91AB]) [n:127.0.0.1:43187_    ] o.a.s.m.r.SolrJmxReporter JMX monitoring for 'solr.jetty' (registry 'solr.jetty') enabled at server: com.sun.jmx.mbeanserver.JmxMBeanServer@815291
   [junit4]   2> 1610940 INFO  (TEST-ForceLeaderTest.testLastPublishedStateIsActive-seed#[C210C1CE96CE91AB]) [n:127.0.0.1:43187_    ] o.a.s.c.CorePropertiesLocator Found 0 core definitions underneath /home/jenkins/workspace/Lucene-Solr-7.x-Linux/solr/build/solr-core/test/J0/temp/solr.cloud.ForceLeaderTest_C210C1CE96CE91AB-001/control-001/cores
   [junit4]   2> 1610955 INFO  (TEST-ForceLeaderTest.testLastPublishedStateIsActive-seed#[C210C1CE96CE91AB]) [    ] o.a.s.c.c.ZkStateReader Updated live nodes from ZooKeeper... (0) -> (1)
   [junit4]   2> 1610956 INFO  (TEST-ForceLeaderTest.testLastPublishedStateIsActive-seed#[C210C1CE96CE91AB]) [    ] o.a.s.c.s.i.ZkClientClusterStateProvider Cluster at 127.0.0.1:46277/solr ready
   [junit4]   2> 1610956 INFO  (SocketProxy-Acceptor-43187) [    ] o.a.s.c.SocketProxy accepted Socket[addr=/127.0.0.1,port=49298,localport=43187], receiveBufferSize:531000
   [junit4]   2> 1610957 INFO  (SocketProxy-Acceptor-43187) [    ] o.a.s.c.SocketProxy proxy connection Socket[addr=/127.0.0.1,port=42813,localport=34320], receiveBufferSize=530904
   [junit4]   2> 1610958 INFO  (qtp20653136-15818) [n:127.0.0.1:43187_    ] o.a.s.h.a.CollectionsHandler Invoked Collection Action :create with params replicationFactor=1&collection.configName=conf1&name=control_collection&nrtReplicas=1&action=CREATE&numShards=1&createNodeSet=127.0.0.1:43187_&wt=javabin&version=2 and sendToOCPQueue=true
   [junit4]   2> 1610960 INFO  (OverseerThreadFactory-6996-thread-1-processing-n:127.0.0.1:43187_) [n:127.0.0.1:43187_    ] o.a.s.c.CreateCollectionCmd Create collection control_collection
   [junit4]   2> 1611063 INFO  (SocketProxy-Acceptor-43187) [    ] o.a.s.c.SocketProxy accepted Socket[addr=/127.0.0.1,port=49302,localport=43187], receiveBufferSize:531000
   [junit4]   2> 1611064 INFO  (SocketProxy-Acceptor-43187) [    ] o.a.s.c.SocketProxy proxy connection Socket[addr=/127.0.0.1,port=42813,localport=34324], receiveBufferSize=530904
   [junit4]   2> 1611064 INFO  (qtp20653136-15814) [n:127.0.0.1:43187_    ] o.a.s.h.a.CoreAdminOperation core create command qt=/admin/cores&collection.configName=conf1&newCollection=true&name=control_collection_shard1_replica_n1&action=CREATE&numShards=1&collection=control_collection&shard=shard1&wt=javabin&version=2&replicaType=NRT
   [junit4]   2> 1611065 INFO  (qtp20653136-15814) [n:127.0.0.1:43187_    ] o.a.s.c.TransientSolrCoreCacheDefault Allocating transient cache for 4 transient cores
   [junit4]   2> 1611168 INFO  (zkCallback-2705-thread-1-processing-n:127.0.0.1:43187_) [n:127.0.0.1:43187_    ] o.a.s.c.c.ZkStateReader A cluster state change: [WatchedEvent state:SyncConnected type:NodeDataChanged path:/collections/control_collection/state.json] for collection [control_collection] has occurred - updating... (live nodes size: [1])
   [junit4]   2> 1612087 INFO  (qtp20653136-15814) [n:127.0.0.1:43187_ c:control_collection s:shard1  x:control_collection_shard1_replica_n1] o.a.s.c.SolrConfig Using Lucene MatchVersion: 7.1.0
   [junit4]   2> 1612119 INFO  (qtp20653136-15814) [n:127.0.0.1:43187_ c:control_collection s:shard1  x:control_collection_shard1_replica_n1] o.a.s.s.IndexSchema [control_collection_shard1_replica_n1] Schema name=test
   [junit4]   2> 1612225 INFO  (qtp20653136-15814) [n:127.0.0.1:43187_ c:control_collection s:shard1  x:control_collection_shard1_replica_n1] o.a.s.s.IndexSchema Loaded schema test/1.0 with uniqueid field id
   [junit4]   2> 1612239 INFO  (qtp20653136-15814) [n:127.0.0.1:43187_ c:control_collection s:shard1  x:control_collection_shard1_replica_n1] o.a.s.c.CoreContainer Creating SolrCore 'control_collection_shard1_replica_n1' using configuration from collection control_collection, trusted=true
   [junit4]   2> 1612240 INFO  (qtp20653136-15814) [n:127.0.0.1:43187_ c:control_collection s:shard1  x:control_collection_shard1_replica_n1] o.a.s.m.r.SolrJmxReporter JMX monitoring for 'solr.core.control_collection.shard1.replica_n1' (registry 'solr.core.control_collection.shard1.replica_n1') enabled at server: com.sun.jmx.mbeanserver.JmxMBeanServer@815291
   [junit4]   2> 1612240 INFO  (qtp20653136-15814) [n:127.0.0.1:43187_ c:control_collection s:shard1  x:control_collection_shard1_replica_n1] o.a.s.c.SolrCore solr.RecoveryStrategy.Builder
   [junit4]   2> 1612240 INFO  (qtp20653136-15814) [n:127.0.0.1:43187_ c:control_collection s:shard1  x:control_collection_shard1_replica_n1] o.a.s.c.SolrCore [[control_collection_shard1_replica_n1] ] Opening new SolrCore at [/home/jenkins/workspace/Lucene-Solr-7.x-Linux/solr/build/solr-core/test/J0/temp/solr.cloud.ForceLeaderTest_C210C1CE96CE91AB-001/control-001/cores/control_collection_shard1_replica_n1], dataDir=[/home/jenkins/workspace/Lucene-Solr-7.x-Linux/solr/build/solr-core/test/J0/temp/solr.cloud.ForceLeaderTest_C210C1CE96CE91AB-001/control-001/cores/control_collection_shard1_replica_n1/data/]
   [junit4]   2> 1612243 INFO  (qtp20653136-15814) [n:127.0.0.1:43187_ c:control_collection s:shard1  x:control_collection_shard1_replica_n1] o.a.s.u.RandomMergePolicy RandomMergePolicy wrapping class org.apache.lucene.index.TieredMergePolicy: [TieredMergePolicy: maxMergeAtOnce=50, maxMergeAtOnceExplicit=41, maxMergedSegmentMB=18.0146484375, floorSegmentMB=0.697265625, forceMergeDeletesPctAllowed=12.124660541981502, segmentsPerTier=10.0, maxCFSSegmentSizeMB=8.796093022207999E12, noCFSRatio=0.741702882694791
   [junit4]   2> 1612245 WARN  (qtp20653136-15814) [n:127.0.0.1:43187_ c:control_collection s:shard1  x:control_collection_shard1_replica_n1] o.a.s.c.RequestHandlers INVALID paramSet a in requestHandler {type = requestHandler,name = /dump,class = DumpRequestHandler,attributes = {initParams=a, name=/dump, class=DumpRequestHandler},args = {defaults={a=A,b=B}}}
   [junit4]   2> 1612283 INFO  (qtp20653136-15814) [n:127.0.0.1:43187_ c:control_collection s:shard1  x:control_collection_shard1_replica_n1] o.a.s.u.UpdateHandler Using UpdateLog implementation: org.apache.solr.update.UpdateLog
   [junit4]   2> 1612283 INFO  (qtp20653136-15814) [n:127.0.0.1:43187_ c:control_collection s:shard1  x:control_collection_shard1_replica_n1] o.a.s.u.UpdateLog Initializing UpdateLog: dataDir= defaultSyncLevel=FLUSH numRecordsToKeep=100 maxNumLogsToKeep=10 numVersionBuckets=65536
   [junit4]   2> 1612284 INFO  (qtp20653136-15814) [n:127.0.0.1:43187_ c:control_collection s:shard1  x:control_collection_shard1_replica_n1] o.a.s.u.CommitTracker Hard AutoCommit: disabled
   [junit4]   2> 1612284 INFO  (qtp20653136-15814) [n:127.0.0.1:43187_ c:control_collection s:shard1  x:control_collection_shard1_replica_n1] o.a.s.u.CommitTracker Soft AutoCommit: disabled
   [junit4]   2> 1612285 INFO  (qtp20653136-15814) [n:127.0.0.1:43187_ c:control_collection s:shard1  x:control_collection_shard1_replica_n1] o.a.s.u.RandomMergePolicy RandomMergePolicy wrapping class org.apache.lucene.index.TieredMergePolicy: [TieredMergePolicy: maxMergeAtOnce=34, maxMergeAtOnceExplicit=48, maxMergedSegmentMB=0.3818359375, floorSegmentMB=1.8955078125, forceMergeDeletesPctAllowed=15.286775077785695, segmentsPerTier=41.0, maxCFSSegmentSizeMB=8.796093022207999E12, noCFSRatio=0.0
   [junit4]   2> 1612285 INFO  (qtp20653136-15814) [n:127.0.0.1:43187_ c:control_collection s:shard1  x:control_collection_shard1_replica_n1] o.a.s.s.SolrIndexSearcher Opening [Searcher@13b81b1[control_collection_shard1_replica_n1] main]
   [junit4]   2> 1612286 INFO  (qtp20653136-15814) [n:127.0.0.1:43187_ c:control_collection s:shard1  x:control_collection_shard1_replica_n1] o.a.s.r.ManagedResourceStorage Configured ZooKeeperStorageIO with znodeBase: /configs/conf1
   [junit4]   2> 1612287 INFO  (qtp20653136-15814) [n:127.0.0.1:43187_ c:control_collection s:shard1  x:control_collection_shard1_replica_n1] o.a.s.r.ManagedResourceStorage Loaded null at path _rest_managed.json using ZooKeeperStorageIO:path=/configs/conf1
   [junit4]   2> 1612287 INFO  (qtp20653136-15814) [n:127.0.0.1:43187_ c:control_collection s:shard1  x:control_collection_shard1_replica_n1] o.a.s.h.ReplicationHandler Commits will be reserved for  10000
   [junit4]   2> 1612289 INFO  (searcherExecutor-6999-thread-1-processing-n:127.0.0.1:43187_ x:control_collection_shard1_replica_n1 s:shard1 c:control_collection) [n:127.0.0.1:43187_ c:control_collection s:shard1  x:control_collection_shard1_replica_n1] o.a.s.c.SolrCore [control_collection_shard1_replica_n1] Registered new searcher Searcher@13b81b1[control_collection_shard1_replica_n1] main{ExitableDirectoryReader(UninvertingDirectoryReader())}
   [junit4]   2> 1612289 INFO  (qtp20653136-15814) [n:127.0.0.1:43187_ c:control_collection s:shard1  x:control_collection_shard1_replica_n1] o.a.s.u.UpdateLog Could not find max version in index or recent updates, using new clock 1575445718191046656
   [junit4]   2> 1612292 INFO  (qtp20653136-15814) [n:127.0.0.1:43187_ c:control_collection s:shard1  x:control_collection_shard1_replica_n1] o.a.s.c.ShardLeaderElectionContext Enough replicas found to continue.
   [junit4]   2> 1612293 INFO  (qtp20653136-15814) [n:127.0.0.1:43187_ c:control_collection s:shard1  x:control_collection_shard1_replica_n1] o.a.s.c.ShardLeaderElectionContext I may be the new leader - try and sync
   [junit4]   2> 1612293 INFO  (qtp20653136-15814) [n:127.0.0.1:43187_ c:control_collection s:shard1  x:control_collection_shard1_replica_n1] o.a.s.c.SyncStrategy Sync replicas to http://127.0.0.1:43187/control_collection_shard1_replica_n1/
   [junit4]   2> 1612293 INFO  (qtp20653136-15814) [n:127.0.0.1:43187_ c:control_collection s:shard1  x:control_collection_shard1_replica_n1] o.a.s.c.SyncStrategy Sync Success - now sync replicas to me
   [junit4]   2> 1612293 INFO  (qtp20653136-15814) [n:127.0.0.1:43187_ c:control_collection s:shard1  x:control_collection_shard1_replica_n1] o.a.s.c.SyncStrategy http://127.0.0.1:43187/control_collection_shard1_replica_n1/ has no replicas
   [junit4]   2> 1612293 INFO  (qtp20653136-15814) [n:127.0.0.1:43187_ c:control_collection s:shard1  x:control_collection_shard1_replica_n1] o.a.s.c.ShardLeaderElectionContext Found all replicas participating in election, clear LIR
   [junit4]   2> 1612295 INFO  (qtp20653136-15814) [n:127.0.0.1:43187_ c:control_collection s:shard1  x:control_collection_shard1_replica_n1] o.a.s.c.ShardLeaderElectionContext I am the new leader: http://127.0.0.1:43187/control_collection_shard1_replica_n1/ shard1
   [junit4]   2> 1612396 INFO  (zkCallback-2705-thread-1-processing-n:127.0.0.1:43187_) [n:127.0.0.1:43187_    ] o.a.s.c.c.ZkStateReader A cluster state change: [WatchedEvent state:SyncConnected type:NodeDataChanged path:/collections/control_collection/state.json] for collection [control_collection] has occurred - updating... (live nodes size: [1])
   [junit4]   2> 1612445 INFO  (qtp20653136-15814) [n:127.0.0.1:43187_ c:control_collection s:shard1  x:control_collection_shard1_replica_n1] o.a.s.c.ZkController I am the leader, no recovery necessary
   [junit4]   2> 1612446 INFO  (qtp20653136-15814) [n:127.0.0.1:43187_ c:control_collection s:shard1  x:control_collection_shard1_replica_n1] o.a.s.s.HttpSolrCall [admin] webapp=null path=/admin/cores params={qt=/admin/cores&collection.configName=conf1&newCollection=true&name=control_collection_shard1_replica_n1&action=CREATE&numShards=1&collection=control_collection&shard=shard1&wt=javabin&version=2&replicaType=NRT} status=0 QTime=1382
   [junit4]   2> 1612450 INFO  (qtp20653136-15818) [n:127.0.0.1:43187_    ] o.a.s.h.a.CollectionsHandler Wait for new collection to be active for at most 30 seconds. Check all shard replicas
   [junit4]   2> 1612549 INFO  (zkCallback-2705-thread-1-processing-n:127.0.0.1:43187_) [n:127.0.0.1:43187_    ] o.a.s.c.c.ZkStateReader A cluster state change: [WatchedEvent state:SyncConnected type:NodeDataChanged path:/collections/control_collection/state.json] for collection [control_collection] has occurred - updating... (live nodes size: [1])
   [junit4]   2> 1612961 INFO  (OverseerCollectionConfigSetProcessor-98465357272580100-127.0.0.1:43187_-n_0000000000) [n:127.0.0.1:43187_    ] o.a.s.c.OverseerTaskQueue Response ZK path: /overseer/collection-queue-work/qnr-0000000000 doesn't exist.  Requestor may have disconnected from ZooKeeper
   [junit4]   2> 1613450 INFO  (qtp20653136-15818) [n:127.0.0.1:43187_    ] o.a.s.s.HttpSolrCall [admin] webapp=null path=/admin/collections params={replicationFactor=1&collection.configName=conf1&name=control_collection&nrtReplicas=1&action=CREATE&numShards=1&createNodeSet=127.0.0.1:43187_&wt=javabin&version=2} status=0 QTime=2491
   [junit4]   2> 1613455 INFO  (TEST-ForceLeaderTest.testLastPublishedStateIsActive-seed#[C210C1CE96CE91AB]) [    ] o.a.s.c.c.ZkStateReader Updated live nodes from ZooKeeper... (0) -> (1)
   [junit4]   2> 1613455 INFO  (TEST-ForceLeaderTest.testLastPublishedStateIsActive-seed#[C210C1CE96CE91AB]) [    ] o.a.s.c.s.i.ZkClientClusterStateProvider Cluster at 127.0.0.1:46277/solr ready
   [junit4]   2> 1613456 INFO  (TEST-ForceLeaderTest.testLastPublishedStateIsActive-seed#[C210C1CE96CE91AB]) [    ] o.a.s.c.ChaosMonkey monkey: init - expire sessions:false cause connection loss:false
   [junit4]   2> 1613456 INFO  (SocketProxy-Acceptor-43187) [    ] o.a.s.c.SocketProxy accepted Socket[addr=/127.0.0.1,port=49312,localport=43187], receiveBufferSize:531000
   [junit4]   2> 1613456 INFO  (SocketProxy-Acceptor-43187) [    ] o.a.s.c.SocketProxy proxy connection Socket[addr=/127.0.0.1,port=42813,localport=34334], receiveBufferSize=530904
   [junit4]   2> 1613457 INFO  (qtp20653136-15818) [n:127.0.0.1:43187_    ] o.a.s.h.a.CollectionsHandler Invoked Collection Action :create with params replicationFactor=1&collection.configName=conf1&name=collection1&nrtReplicas=1&action=CREATE&numShards=2&createNodeSet=&stateFormat=1&wt=javabin&version=2 and sendToOCPQueue=true
   [junit4]   2> 1613458 INFO  (OverseerThreadFactory-6996-thread-2-processing-n:127.0.0.1:43187_) [n:127.0.0.1:43187_    ] o.a.s.c.CreateCollectionCmd Create collection collection1
   [junit4]   2> 1613458 WARN  (OverseerThreadFactory-6996-thread-2-processing-n:127.0.0.1:43187_) [n:127.0.0.1:43187_    ] o.a.s.c.CreateCollectionCmd It is unusual to create a collection (collection1) without cores.
   [junit4]   2> 1613661 INFO  (qtp20653136-15818) [n:127.0.0.1:43187_    ] o.a.s.h.a.CollectionsHandler Wait for new collection to be active for at most 30 seconds. Check all shard replicas
   [junit4]   2> 1613661 INFO  (qtp20653136-15818) [n:127.0.0.1:43187_    ] o.a.s.s.HttpSolrCall [admin] webapp=null path=/admin/collections params={replicationFactor=1&collection.configName=conf1&name=collection1&nrtReplicas=1&action=CREATE&numShards=2&createNodeSet=&stateFormat=1&wt=javabin&version=2} status=0 QTime=204
   [junit4]   2> 1613732 INFO  (TEST-ForceLeaderTest.testLastPublishedStateIsActive-seed#[C210C1CE96CE91AB]) [    ] o.a.s.c.AbstractFullDistribZkTestBase create jetty 1 in directory /home/jenkins/workspace/Lucene-Solr-7.x-Linux/solr/build/solr-core/test/J0/temp/solr.cloud.ForceLeaderTest_C210C1CE96CE91AB-001/shard-1-001 of type TLOG
   [junit4]   2> 1613732 INFO  (TEST-ForceLeaderTest.testLastPublishedStateIsActive-seed#[C210C1CE96CE91AB]) [    ] o.e.j.s.Server jetty-9.3.14.v20161028
   [junit4]   2> 1613733 INFO  (TEST-ForceLeaderTest.testLastPublishedStateIsActive-seed#[C210C1CE96CE91AB]) [    ] o.e.j.s.h.ContextHandler Started o.e.j.s.ServletContextHandler@12d1cd2{/,null,AVAILABLE}
   [junit4]   2> 1613733 INFO  (TEST-ForceLeaderTest.testLastPublishedStateIsActive-seed#[C210C1CE96CE91AB]) [    ] o.e.j.s.AbstractConnector Started ServerConnector@11d7953{HTTP/1.1,[http/1.1]}{127.0.0.1:41897}
   [junit4]   2> 1613733 INFO  (TEST-ForceLeaderTest.testLastPublishedStateIsActive-seed#[C210C1CE96CE91AB]) [    ] o.e.j.s.Server Started @1614679ms
   [junit4]   2> 1613733 INFO  (TEST-ForceLeaderTest.testLastPublishedStateIsActive-seed#[C210C1CE96CE91AB]) [    ] o.a.s.c.s.e.JettySolrRunner Jetty properties: {solr.data.dir=/home/jenkins/workspace/Lucene-Solr-7.x-Linux/solr/build/solr-core/test/J0/temp/solr.cloud.ForceLeaderTest_C210C1CE96CE91AB-001/tempDir-001/jetty1, replicaType=TLOG, solrconfig=solrconfig.xml, hostContext=/, hostPort=45571, coreRootDirectory=/home/jenkins/workspace/Lucene-Solr-7.x-Linux/solr/build/solr-core/test/J0/temp/solr.cloud.ForceLeaderTest_C210C1CE96CE91AB-001/shard-1-001/cores}
   [junit4]   2> 1613734 ERROR (TEST-ForceLeaderTest.testLastPublishedStateIsActive-seed#[C210C1CE96CE91AB]) [    ] o.a.s.s.StartupLoggingUtils Missing Java Option solr.log.dir. Logging may be missing or incomplete.
   [junit4]   2> 1613734 INFO  (TEST-ForceLeaderTest.testLastPublishedStateIsActive-seed#[C210C1CE96CE91AB]) [    ] o.a.s.s.SolrDispatchFilter  ___      _       Welcome to Apache Solr™ version 7.1.0
   [junit4]   2> 1613734 INFO  (TEST-ForceLeaderTest.testLastPublishedStateIsActive-seed#[C210C1CE96CE91AB]) [    ] o.a.s.s.SolrDispatchFilter / __| ___| |_ _   Starting in cloud mode on port null
   [junit4]   2> 1613734 INFO  (TEST-ForceLeaderTest.testLastPublishedStateIsActive-seed#[C210C1CE96CE91AB]) [    ] o.a.s.s.SolrDispatchFilter \__ \/ _ \ | '_|  Install dir: null, Default config dir: null
   [junit4]   2> 1613734 INFO  (TEST-ForceLeaderTest.testLastPublishedStateIsActive-seed#[C210C1CE96CE91AB]) [    ] o.a.s.s.SolrDispatchFilter |___/\___/_|_|    Start time: 2017-08-11T14:35:19.776Z
   [junit4]   2> 1613738 INFO  (TEST-ForceLeaderTest.testLastPublishedStateIsActive-seed#[C210C1CE96CE91AB]) [    ] o.a.s.s.SolrDispatchFilter Loading solr.xml from SolrHome (not found in ZooKeeper)
   [junit4]   2> 1613738 INFO  (TEST-ForceLeaderTest.testLastPublishedStateIsActive-seed#[C210C1CE96CE91AB]) [    ] o.a.s.c.SolrXmlConfig Loading container configuration from /home/jenkins/workspace/Lucene-Solr-7.x-Linux/solr/build/solr-core/test/J0/temp/solr.cloud.ForceLeaderTest_C210C1CE96CE91AB-001/shard-1-001/solr.xml
   [junit4]   2> 1613743 INFO  (TEST-ForceLeaderTest.testLastPublishedStateIsActive-seed#[C210C1CE96CE91AB]) [    ] o.a.s.c.SolrXmlConfig MBean server found: com.sun.jmx.mbeanserver.JmxMBeanServer@815291, but no JMX reporters were configured - adding default JMX reporter.
   [junit4]   2> 1613746 INFO  (TEST-ForceLeaderTest.testLastPublishedStateIsActive-seed#[C210C1CE96CE91AB]) [    ] o.a.s.c.ZkContainer Zookeeper client=127.0.0.1:46277/solr
   [junit4]   2> 1613763 INFO  (TEST-ForceLeaderTest.testLastPublishedStateIsActive-seed#[C210C1CE96CE91AB]) [n:127.0.0.1:45571_    ] o.a.s.c.c.ZkStateReader Updated live nodes from ZooKeeper... (0) -> (1)
   [junit4]   2> 1613764 INFO  (TEST-ForceLeaderTest.testLastPublishedStateIsActive-seed#[C210C1CE96CE91AB]) [n:127.0.0.1:45571_    ] o.a.s.c.Overseer Overseer (id=null) closing
   [junit4]   2> 1613765 INFO  (TEST-ForceLeaderTest.testLastPublishedStateIsActive-seed#[C210C1CE96CE91AB]) [n:127.0.0.1:45571_    ] o.a.s.c.ZkController Register node as live in ZooKeeper:/live_nodes/127.0.0.1:45571_
   [junit4]   2> 1613767 INFO  (zkCallback-2712-thread-1) [    ] o.a.s.c.c.ZkStateReader Updated live nodes from ZooKeeper... (1) -> (2)
   [junit4]   2> 1613767 INFO  (zkCallback-2705-thread-2-processing-n:127.0.0.1:43187_) [n:127.0.0.1:43187_    ] o.a.s.c.c.ZkStateReader Updated live nodes from ZooKeeper... (1) -> (2)
   [junit4]   2> 1613768 INFO  (zkCallback-2717-thread-1-processing-n:127.0.0.1:45571_) [n:127.0.0.1:45571_    ] o.a.s.c.c.ZkStateReader Updated live nodes from ZooKeeper... (1) -> (2)
   [junit4]   2> 1613920 INFO  (TEST-ForceLeaderTest.testLastPublishedStateIsActive-seed#[C210C1CE96CE91AB]) [n:127.0.0.1:45571_    ] o.a.s.m.r.SolrJmxReporter JMX monitoring for 'solr.node' (registry 'solr.node') enabled at server: com.sun.jmx.mbeanserver.JmxMBeanServer@815291
   [junit4]   2> 1613926 INFO  (TEST-ForceLeaderTest.testLastPublishedStateIsActive-seed#[C210C1CE96CE91AB]) [n:127.0.0.1:45571_    ] o.a.s.m.r.SolrJmxReporter JMX monitoring for 'solr.jvm' (registry 'solr.jvm') enabled at server: com.sun.jmx.mbeanserver.JmxMBeanServer@815291
   [junit4]   2> 1613926 INFO  (TEST-ForceLeaderTest.testLastPublishedStateIsActive-seed#[C210C1CE96CE91AB]) [n:127.0.0.1:45571_    ] o.a.s.m.r.SolrJmxReporter JMX monitoring for 'solr.jetty' (registry 'solr.jetty') enabled at server: com.sun.jmx.mbeanserver.JmxMBeanServer@815291
   [junit4]   2> 1613927 INFO  (TEST-ForceLeaderTest.testLastPublishedStateIsActive-seed#[C210C1CE96CE91AB]) [n:127.0.0.1:45571_    ] o.a.s.c.CorePropertiesLocator Found 0 core definitions underneath /home/jenkins/workspace/Lucene-Solr-7.x-Linux/solr/build/solr-core/test/J0/temp/solr.cloud.ForceLeaderTest_C210C1CE96CE91AB-001/shard-1-001/cores
   [junit4]   2> 1613945 INFO  (SocketProxy-Acceptor-45571) [    ] o.a.s.c.SocketProxy accepted Socket[addr=/127.0.0.1,port=55148,localport=45571], receiveBufferSize:531000
   [junit4]   2> 1613946 INFO  (SocketProxy-Acceptor-45571) [    ] o.a.s.c.SocketProxy proxy connection Socket[addr=/127.0.0.1,port=41897,localport=37992], receiveBufferSize=530904
   [junit4]   2> 1613946 INFO  (qtp32670442-15866) [n:127.0.0.1:45571_    ] o.a.s.h.a.CollectionsHandler Invoked Collection Action :addreplica with params node=127.0.0.1:45571_&action=ADDREPLICA&collection=collection1&shard=shard2&type=TLOG&wt=javabin&version=2 and sendToOCPQueue=true
   [junit4]   2> 1613948 INFO  (OverseerThreadFactory-6996-thread-3-processing-n:127.0.0.1:43187_) [n:127.0.0.1:43187_    ] o.a.s.c.AddReplicaCmd Node Identified 127.0.0.1:45571_ for creating new replica
   [junit4]   2> 1613948 INFO  (OverseerCollectionConfigSetProcessor-98465357272580100-127.0.0.1:43187_-n_0000000000) [n:127.0.0.1:43187_    ] o.a.s.c.OverseerTaskQueue Response ZK path: /overseer/collection-queue-work/qnr-0000000002 doesn't exist.  Requestor may have disconnected from ZooKeeper
   [junit4]   2> 1613949 INFO  (SocketProxy-Acceptor-45571) [    ] o.a.s.c.SocketProxy accepted Socket[addr=/127.0.0.1,port=55152,localport=45571], receiveBufferSize:531000
   [junit4]   2> 1613949 INFO  (SocketProxy-Acceptor-45571) [    ] o.a.s.c.SocketProxy proxy connection Socket[addr=/127.0.0.1,port=41897,localport=37996], receiveBufferSize=530904
   [junit4]   2> 1613949 INFO  (qtp32670442-15868) [n:127.0.0.1:45571_    ] o.a.s.h.a.CoreAdminOperation core create command qt=/admin/cores&collection.configName=conf1&name=collection1_shard2_replica_t41&action=CREATE&collection=collection1&shard=shard2&wt=javabin&version=2&replicaType=TLOG
   [junit4]   2> 1613950 INFO  (qtp32670442-15868) [n:127.0.0.1:45571_    ] o.a.s.c.TransientSolrCoreCacheDefault Allocating transient cache for 4 transient cores
   [junit4]   2> 1614964 INFO  (qtp32670442-15868) [n:127.0.0.1:45571_ c:collection1 s:shard2  x:collection1_shard2_replica_t41] o.a.s.c.SolrConfig Using Lucene MatchVersion: 7.1.0
   [junit4]   2> 1614984 INFO  (qtp32670442-15868) [n:127.0.0.1:45571_ c:collection1 s:shard2  x:collection1_shard2_replica_t41] o.a.s.s.IndexSchema [collection1_shard2_replica_t41] Schema name=test
   [junit4]   2> 1615114 INFO  (qtp32670442-15868) [n:127.0.0.1:45571_ c:collection1 s:shard2  x:collection1_shard2_replica_t41] o.a.s.s.IndexSchema Loaded schema test/1.0 with uniqueid field id
   [junit4]   2> 1615125 INFO  (qtp32670442-15868) [n:127.0.0.1:45571_ c:collection1 s:shard2  x:collection1_shard2_replica_t41] o.a.s.c.CoreContainer Creating SolrCore 'collection1_shard2_replica_t41' using configuration from collection collection1, trusted=true
   [junit4]   2> 1615125 INFO  (qtp32670442-15868) [n:127.0.0.1:45571_ c:collection1 s:shard2  x:collection1_shard2_replica_t41] o.a.s.m.r.SolrJmxReporter JMX monitoring for 'solr.core.collection1.shard2.replica_t41' (registry 'solr.core.collection1.shard2.replica_t41') enabled at server: com.sun.jmx.mbeanserver.JmxMBeanServer@815291
   [junit4]   2> 1615126 INFO  (qtp32670442-15868) [n:127.0.0.1:45571_ c:collection1 s:shard2  x:collection1_shard2_replica_t41] o.a.s.c.SolrCore solr.RecoveryStrategy.Builder
   [junit4]   2> 1615126 INFO  (qtp32670442-15868) [n:127.0.0.1:45571_ c:collection1 s:shard2  x:collection1_shard2_replica_t41] o.a.s.c.SolrCore [[collection1_shard2_replica_t41] ] Opening new SolrCore at [/home/jenkins/workspace/Lucene-Solr-7.x-Linux/solr/build/solr-core/test/J0/temp/solr.cloud.ForceLeaderTest_C210C1CE96CE91AB-001/shard-1-001/cores/collection1_shard2_replica_t41], dataDir=[/home/jenkins/workspace/Lucene-Solr-7.x-Linux/solr/build/solr-core/test/J0/temp/solr.cloud.ForceLeaderTest_C210C1CE96CE91AB-001/shard-1-001/cores/collection1_shard2_replica_t41/data/]
   [junit4]   2> 1615128 INFO  (qtp32670442-15868) [n:127.0.0.1:45571_ c:collection1 s:shard2  x:collection1_shard2_replica_t41] o.a.s.u.RandomMergePolicy RandomMergePolicy wrapping class org.apache.lucene.index.TieredMergePolicy: [TieredMergePolicy: maxMergeAtOnce=50, maxMergeAtOnceExplicit=41, maxMergedSegmentMB=18.0146484375, floorSegmentMB=0.697265625, forceMergeDeletesPctAllowed=12.124660541981502, segmentsPerTier=10.0, maxCFSSegmentSizeMB=8.796093022207999E12, noCFSRatio=0.741702882694791
   [junit4]   2> 1615131 WARN  (qtp32670442-15868) [n:127.0.0.1:45571_ c:collection1 s:shard2  x:collection1_shard2_replica_t41] o.a.s.c.RequestHandlers INVALID paramSet a in requestHandler {type = requestHandler,name = /dump,class = DumpRequestHandler,attributes = {initParams=a, name=/dump, class=DumpRequestHandler},args = {defaults={a=A,b=B}}}
   [junit4]   2> 1615166 INFO  (qtp32670442-15868) [n:127.0.0.1:45571_ c:collection1 s:shard2  x:collection1_shard2_replica_t41] o.a.s.u.UpdateHandler Using UpdateLog implementation: org.apache.solr.update.UpdateLog
   [junit4]   2> 1615166 INFO  (qtp32670442-15868) [n:127.0.0.1:45571_ c:collection1 s:shard2  x:collection1_shard2_replica_t41] o.a.s.u.UpdateLog Initializing UpdateLog: dataDir= defaultSyncLevel=FLUSH numRecordsToKeep=100 maxNumLogsToKeep=10 numVersionBuckets=65536
   [junit4]   2> 1615167 INFO  (qtp32670442-15868) [n:127.0.0.1:45571_ c:collection1 s:shard2  x:collection1_shard2_replica_t41] o.a.s.u.CommitTracker Hard AutoCommit: disabled
   [junit4]   2> 1615167 INFO  (qtp32670442-15868) [n:127.0.0.1:45571_ c:collection1 s:shard2  x:collection1_shard2_replica_t41] o.a.s.u.CommitTracker Soft AutoCommit: disabled
   [junit4]   2> 1615168 INFO  (qtp32670442-15868) [n:127.0.0.1:45571_ c:collection1 s:shard2  x:collection1_shard2_replica_t41] o.a.s.u.RandomMergePolicy RandomMergePolicy wrapping class org.apache.lucene.index.TieredMergePolicy: [TieredMergePolicy: maxMergeAtOnce=34, maxMergeAtOnceExplicit=48, maxMergedSegmentMB=0.3818359375, floorSegmentMB=1.8955078125, forceMergeDeletesPctAllowed=15.286775077785695, segmentsPerTier=41.0, maxCFSSegmentSizeMB=8.796093022207999E12, noCFSRatio=0.0
   [junit4]   2> 1615168 INFO  (qtp32670442-15868) [n:127.0.0.1:45571_ c:collection1 s:shard2  x:collection1_shard2_replica_t41] o.a.s.s.SolrIndexSearcher Opening [Searcher@eccf2e[collection1_shard2_replica_t41] main]
   [junit4]   2> 1615170 INFO  (qtp32670442-15868) [n:127.0.0.1:45571_ c:collection1 s:shard2  x:collection1_shard2_replica_t41] o.a.s.r.ManagedResourceStorage Configured ZooKeeperStorageIO with znodeBase: /configs/conf1
   [junit4]   2> 1615170 INFO  (qtp32670442-15868) [n:127.0.0.1:45571_ c:collection1 s:shard2  x:collection1_shard2_replica_t41] o.a.s.r.ManagedResourceStorage Loaded null at path _rest_managed.json using ZooKeeperStorageIO:path=/configs/conf1
   [junit4]   2> 1615170 INFO  (qtp32670442-15868) [n:127.0.0.1:45571_ c:collection1 s:shard2  x:collection1_shard2_replica_t41] o.a.s.h.ReplicationHandler Commits will be reserved for  10000
   [junit4]   2> 1615172 INFO  (searcherExecutor-7010-thread-1-processing-n:127.0.0.1:45571_ x:collection1_shard2_replica_t41 s:shard2 c:collection1) [n:127.0.0.1:45571_ c:collection1 s:shard2  x:collection1_shard2_replica_t41] o.a.s.c.SolrCore [collection1_shard2_replica_t41] Registered new searcher Searcher@eccf2e[collection1_shard2_replica_t41] main{ExitableDirectoryReader(UninvertingDirectoryReader())}
   [junit4]   2> 1615172 INFO  (qtp32670442-15868) [n:127.0.0.1:45571_ c:collection1 s:shard2  x:collection1_shard2_replica_t41] o.a.s.u.UpdateLog Could not find max version in index or recent updates, using new clock 1575445721214091264
   [junit4]   2> 1615175 INFO  (qtp32670442-15868) [n:127.0.0.1:45571_ c:collection1 s:shard2  x:collection1_shard2_replica_t41] o.a.s.c.ShardLeaderElectionContext Enough replicas found to continue.
   [junit4]   2> 1615176 INFO  (qtp32670442-15868) [n:127.0.0.1:45571_ c:collection1 s:shard2  x:collection1_shard2_replica_t41] o.a.s.c.ShardLeaderElectionContext I may be the new leader - try and sync
   [junit4]   2> 1615176 INFO  (qtp32670442-15868) [n:127.0.0.1:45571_ c:collection1 s:shard2  x:collection1_shard2_replica_t41] o.a.s.c.SyncStrategy Sync replicas to http://127.0.0.1:45571/collection1_shard2_replica_t41/
   [junit4]   2> 1615176 INFO  (qtp32670442-15868) [n:127.0.0.1:45571_ c:collection1 s:shard2  x:collection1_shard2_replica_t41] o.a.s.c.SyncStrategy Sync Success - now sync replicas to me
   [junit4]   2> 1615176 INFO  (qtp32670442-15868) [n:127.0.0.1:45571_ c:collection1 s:shard2  x:collection1_shard2_replica_t41] o.a.s.c.SyncStrategy http://127.0.0.1:45571/collection1_shard2_replica_t41/ has no replicas
   [junit4]   2> 1615176 INFO  (qtp32670442-15868) [n:127.0.0.1:45571_ c:collection1 s:shard2  x:collection1_shard2_replica_t41] o.a.s.c.ShardLeaderElectionContext Found all replicas participating in election, clear LIR
   [junit4]   2> 1615176 INFO  (qtp32670442-15868) [n:127.0.0.1:45571_ c:collection1 s:shard2  x:collection1_shard2_replica_t41] o.a.s.c.ZkController collection1_shard2_replica_t41 stopping background replication from leader
   [junit4]   2> 1615177 INFO  (qtp32670442-15868) [n:127.0.0.1:45571_ c:collection1 s:shard2  x:collection1_shard2_replica_t41] o.a.s.c.ShardLeaderElectionContext I am the new leader: http://127.0.0.1:45571/collection1_shard2_replica_t41/ shard2
   [junit4]   2> 1615328 INFO  (qtp32670442-15868) [n:127.0.0.1:45571_ c:collection1 s:shard2  x:collection1_shard2_replica_t41] o.a.s.c.ZkController I am the leader, no recovery necessary
   [junit4]   2> 1615329 INFO  (qtp32670442-15868) [n:127.0.0.1:45571_ c:collection1 s:shard2  x:collection1_shard2_replica_t41] o.a.s.s.HttpSolrCall [admin] webapp=null path=/admin/cores params={qt=/admin/cores&collection.configName=conf1&name=collection1_shard2_replica_t41&action=CREATE&collection=collection1&shard=shard2&wt=javabin&version=2&replicaType=TLOG} status=0 QTime=1380
   [junit4]   2> 1615332 INFO  (qtp32670442-15866) [n:127.0.0.1:45571_    ] o.a.s.s.HttpSolrCall [admin] webapp=null path=/admin/collections params={node=127.0.0.1:45571_&action=ADDREPLICA&collection=collection1&shard=shard2&type=TLOG&wt=javabin&version=2} status=0 QTime=1385
   [junit4]   2> 1615449 INFO  (TEST-ForceLeaderTest.testLastPublishedStateIsActive-seed#[C210C1CE96CE91AB]) [    ] o.a.s.c.AbstractFullDistribZkTestBase create jetty 2 in directory /home/jenkins/workspace/Lucene-Solr-7.x-Linux/solr/build/solr-core/test/J0/temp/solr.cloud.ForceLeaderTest_C210C1CE96CE91AB-001/shard-2-001 of type TLOG
   [junit4]   2> 1615450 INFO  (TEST-ForceLeaderTest.testLastPublishedStateIsActive-seed#[C210C1CE96CE91AB]) [    ] o.e.j.s.Server jetty-9.3.14.v20161028
   [junit4]   2> 1615451 INFO  (TEST-ForceLeaderTest.testLastPublishedStateIsActive-seed#[C210C1CE96CE91AB]) [    ] o.e.j.s.h.ContextHandler Started o.e.j.s.ServletContextHandler@1407962{/,null,AVAILABLE}
   [junit4]   2> 1615451 INFO  (TEST-ForceLeaderTest.testLastPublishedStateIsActive-seed#[C210C1CE96CE91AB]) [    ] o.e.j.s.AbstractConnector Started ServerConnector@1bf95c8{HTTP/1.1,[http/1.1]}{127.0.0.1:40103}
   [junit4]   2> 1615451 INFO  (TEST-ForceLeaderTest.testLastPublishedStateIsActive-seed#[C210C1CE96CE91AB]) [    ] o.e.j.s.Server Started @1616397ms
   [junit4]   2> 1615451 INFO  (TEST-ForceLeaderTest.testLastPublishedStateIsActive-seed#[C210C1CE96CE91AB]) [    ] o.a.s.c.s.e.JettySolrRunner Jetty properties: {solr.data.dir=/home/jenkins/workspace/Lucene-Solr-7.x-Linux/solr/build/solr-core/test/J0/temp/solr.cloud.ForceLeaderTest_C210C1CE96CE91AB-001/tempDir-001/jetty2, replicaType=TLOG, solrconfig=solrconfig.xml, hostContext=/, hostPort=41475, coreRootDirectory=/home/jenkins/workspace/Lucene-Solr-7.x-Linux/solr/build/solr-core/test/J0/temp/solr.cloud.ForceLeaderTest_C210C1CE96CE91AB-001/shard-2-001/cores}
   [junit4]   2> 1615451 ERROR (TEST-ForceLeaderTest.testLastPublishedStateIsActive-seed#[C210C1CE96CE91AB]) [    ] o.a.s.s.StartupLoggingUtils Missing Java Option solr.log.dir. Logging may be missing or incomplete.
   [junit4]   2> 1615451 INFO  (TEST-ForceLeaderTest.testLastPublishedStateIsActive-seed#[C210C1CE96CE91AB]) [    ] o.a.s.s.SolrDispatchFilter  ___      _       Welcome to Apache Solr™ version 7.1.0
   [junit4]   2> 1615451 INFO  (TEST-ForceLeaderTest.testLastPublishedStateIsActive-seed#[C210C1CE96CE91AB]) [    ] o.a.s.s.SolrDispatchFilter / __| ___| |_ _   Starting in cloud mode on port null
   [junit4]   2> 1615451 INFO  (TEST-ForceLeaderTest.testLastPublishedStateIsActive-seed#[C210C1CE96CE91AB]) [    ] o.a.s.s.SolrDispatchFilter \__ \/ _ \ | '_|  Install dir: null, Default config dir: null
   [junit4]   2> 1615451 INFO  (TEST-ForceLeaderTest.testLastPublishedStateIsActive-seed#[C210C1CE96CE91AB]) [    ] o.a.s.s.SolrDispatchFilter |___/\___/_|_|    Start time: 2017-08-11T14:35:21.493Z
   [junit4]   2> 1615453 INFO  (TEST-ForceLeaderTest.testLastPublishedStateIsActive-seed#[C210C1CE96CE91AB]) [    ] o.a.s.s.SolrDispatchFilter Loading solr.xml from SolrHome (not found in ZooKeeper)
   [junit4]   2> 1615453 INFO  (TEST-ForceLeaderTest.testLastPublishedStateIsActive-seed#[C210C1CE96CE91AB]) [    ] o.a.s.c.SolrXmlConfig Loading container configuration from /home/jenkins/workspace/Lucene-Solr-7.x-Linux/solr/build/solr-core/test/J0/temp/solr.cloud.ForceLeaderTest_C210C1CE96CE91AB-001/shard-2-001/solr.xml
   [junit4]   2> 1615457 INFO  (TEST-ForceLeaderTest.testLastPublishedStateIsActive-seed#[C210C1CE96CE91AB]) [    ] o.a.s.c.SolrXmlConfig MBean server found: com.sun.jmx.mbeanserver.JmxMBeanServer@815291, but no JMX reporters were configured - adding default JMX reporter.
   [junit4]   2> 1615460 INFO  (TEST-ForceLeaderTest.testLastPublishedStateIsActive-seed#[C210C1CE96CE91AB]) [    ] o.a.s.c.ZkContainer Zookeeper client=127.0.0.1:46277/solr
   [junit4]   2> 1615465 INFO  (TEST-ForceLeaderTest.testLastPublishedStateIsActive-seed#[C210C1CE96CE91AB]) [n:127.0.0.1:41475_    ] o.a.s.c.c.ZkStateReader Updated live nodes from ZooKeeper... (0) -> (2)
   [junit4]   2> 1615466 INFO  (TEST-ForceLeaderTest.testLastPublishedStateIsActive-seed#[C210C1CE96CE91AB]) [n:127.0.0.1:41475_    ] o.a.s.c.Overseer Overseer (id=null) closing
   [junit4]   2> 1615467 INFO  (TEST-ForceLeaderTest.testLastPublishedStateIsActive-seed#[C210C1CE96CE91AB]) [n:127.0.0.1:41475_    ] o.a.s.c.ZkController Register node as live in ZooKeeper:/live_nodes/127.0.0.1:41475_
   [junit4]   2> 1615468 INFO  (zkCallback-2712-thread-1) [    ] o.a.s.c.c.ZkStateReader Updated live nodes from ZooKeeper... (2) -> (3)
   [junit4]   2> 1615470 INFO  (zkCallback-2723-thread-1-processing-n:127.0.0.1:41475_) [n:127.0.0.1:41475_    ] o.a.s.c.c.ZkStateReader Updated live nodes from ZooKeeper... (2) -> (3)
   [junit4]   2> 1615470 INFO  (zkCallback-2717-thread-1-processing-n:127.0.0.1:45571_) [n:127.0.0.1:45571_    ] o.a.s.c.c.ZkStateReader Updated live nodes from ZooKeeper... (2) -> (3)
   [junit4]   2> 1615470 INFO  (zkCallback-2705-thread-2-processing-n:127.0.0.1:43187_) [n:127.0.0.1:43187_    ] o.a.s.c.c.ZkStateReader Updated live nodes from ZooKeeper... (2) -> (3)
   [junit4]   2> 1615553 INFO  (TEST-ForceLeaderTest.testLastPublishedStateIsActive-seed#[C210C1CE96CE91AB]) [n:127.0.0.1:41475_    ] o.a.s.m.r.SolrJmxReporter JMX monitoring for 'solr.node' (registry 'solr.node') enabled at server: com.sun.jmx.mbeanserver.JmxMBeanServer@815291
   [junit4]   2> 1615558 INFO  (TEST-ForceLeaderTest.testLastPublishedStateIsActive-seed#[C210C1CE96CE91AB]) [n:127.0.0.1:41475_    ] o.a.s.m.r.SolrJmxReporter JMX monitoring for 'solr.jvm' (registry 'solr.jvm') enabled at server: com.sun.jmx.mbeanserver.JmxMBeanServer@815291
   [junit4]   2> 1615558 INFO  (TEST-ForceLeaderTest.testLastPublishedStateIsActive-seed#[C210C1CE96CE91AB]) [n:127.0.0.1:41475_    ] o.a.s.m.r.SolrJmxReporter JMX monitoring for 'solr.jetty' (registry 'solr.jetty') enabled at server: com.sun.jmx.mbeanserver.JmxMBeanServer@815291
   [junit4]   2> 1615560 INFO  (TEST-ForceLeaderTest.testLastPublishedStateIsActive-seed#[C210C1CE96CE91AB]) [n:127.0.0.1:41475_    ] o.a.s.c.CorePropertiesLocator Found 0 core definitions underneath /home/jenkins/workspace/Lucene-Solr-7.x-Linux/solr/build/solr-core/test/J0/temp/solr.cloud.ForceLeaderTest_C210C1CE96CE91AB-001/shard-2-001/cores
   [junit4]   2> 1615588 INFO  (qtp32670442-15867) [n:127.0.0.1:45571_    ] o.a.s.h.a.CollectionsHandler Invoked Collection Action :addreplica with params node=127.0.0.1:41475_&action=ADDREPLICA&collection=collection1&shard=shard1&type=TLOG&wt=javabin&version=2 and sendToOCPQueue=true
   [junit4]   2> 1615590 INFO  (OverseerThreadFactory-6996-thread-4-processing-n:127.0.0.1:43187_) [n:127.0.0.1:43187_    ] o.a.s.c.AddReplicaCmd Node Identified 127.0.0.1:41475_ for creating new replica
   [junit4]   2> 1615590 INFO  (OverseerCollectionConfigSetProcessor-98465357272580100-127.0.0.1:43187_-n_0000000000) [n:127.0.0.1:43187_    ] o.a.s.c.OverseerTaskQueue Response ZK path: /overseer/collection-queue-work/qnr-0000000004 doesn't exist.  Requestor may have disconnected from ZooKeeper
   [junit4]   2> 1615591 INFO  (SocketProxy-Acceptor-41475) [    ] o.a.s.c.SocketProxy accepted Socket[addr=/127.0.0.1,port=44482,localport=41475], receiveBufferSize:531000
   [junit4]   2> 1615592 INFO  (SocketProxy-Acceptor-41475) [    ] o.a.s.c.SocketProxy proxy connection Socket[addr=/127.0.0.1,port=40103,localport=42698], receiveBufferSize=530904
   [junit4]   2> 1615592 INFO  (qtp10831125-15901) [n:127.0.0.1:41475_    ] o.a.s.h.a.CoreAdminOperation core create command qt=/admin/cores&collection.configName=conf1&name=collection1_shard1_replica_t43&action=CREATE&collection=collection1&shard=shard1&wt=javabin&version=2&replicaType=TLOG
   [junit4]   2> 1615592 INFO  (qtp10831125-15901) [n:127.0.0.1:41475_    ] o.a.s.c.TransientSolrCoreCacheDefault Allocating transient cache for 4 transient cores
   [junit4]   2> 1616614 INFO  (qtp10831125-15901) [n:127.0.0.1:41475_ c:collection1 s:shard1  x:collection1_shard1_replica_t43] o.a.s.c.SolrConfig Using Lucene MatchVersion: 7.1.0
   [junit4]   2> 1616627 INFO  (qtp10831125-15901) [n:127.0.0.1:41475_ c:collection1 s:shard1  x:collection1_shard1_replica_t43] o.a.s.s.IndexSchema [collection1_shard1_replica_t43] Schema name=test
   [junit4]   2> 1616730 INFO  (qtp10831125-15901) [n:127.0.0.1:41475_ c:collection1 s:shard1  x:collection1_shard1_replica_t43] o.a.s.s.IndexSchema Loaded schema test/1.0 with uniqueid field id
   [junit4]   2> 1616742 INFO  (qtp10831125-15901) [n:127.0.0.1:41475_ c:collection1 s:shard1  x:collection1_shard1_replica_t43] o.a.s.c.CoreContainer Creating SolrCore 'collection1_shard1_replica_t43' using configuration from collection collection1, trusted=true
   [junit4]   2> 1616743 INFO  (qtp10831125-15901) [n:127.0.0.1:41475_ c:collection1 s:shard1  x:collection1_shard1_replica_t43] o.a.s.m.r.SolrJmxReporter JMX monitoring for 'solr.core.collection1.shard1.replica_t43' (registry 'solr.core.collection1.shard1.replica_t43') enabled at server: com.sun.jmx.mbeanserver.JmxMBeanServer@815291
   [junit4]   2> 1616743 INFO  (qtp10831125-15901) [n:127.0.0.1:41475_ c:collection1 s:shard1  x:collection1_shard1_replica_t43] o.a.s.c.SolrCore solr.RecoveryStrategy.Builder
   [junit4]   2> 1616743 INFO  (qtp10831125-15901) [n:127.0.0.1:41475_ c:collection1 s:shard1  x:collection1_shard1_replica_t43] o.a.s.c.SolrCore [[collection1_shard1_replica_t43] ] Opening new SolrCore at [/home/jenkins/workspace/Lucene-Solr-7.x-Linux/solr/build/solr-core/test/J0/temp/solr.cloud.ForceLeaderTest_C210C1CE96CE91AB-001/shard-2-001/cores/collection1_shard1_replica_t43], dataDir=[/home/jenkins/workspace/Lucene-Solr-7.x-Linux/solr/build/solr-core/test/J0/temp/solr.cloud.ForceLeaderTest_C210C1CE96CE91AB-001/shard-2-001/cores/collection1_shard1_replica_t43/data/]
   [junit4]   2> 1616745 INFO  (qtp10831125-15901) [n:127.0.0.1:41475_ c:collection1 s:shard1  x:collection1_shard1_replica_t43] o.a.s.u.RandomMergePolicy RandomMergePolicy wrapping class org.apache.lucene.index.TieredMergePolicy: [TieredMergePolicy: maxMergeAtOnce=50, maxMergeAtOnceExplicit=41, maxMergedSegmentMB=18.0146484375, floorSegmentMB=0.697265625, forceMergeDeletesPctAllowed=12.124660541981502, segmentsPerTier=10.0, maxCFSSegmentSizeMB=8.796093022207999E12, noCFSRatio=0.741702882694791
   [junit4]   2> 1616748 WARN  (qtp10831125-15901) [n:127.0.0.1:41475_ c:collection1 s:shard1  x:collection1_shard1_replica_t43] o.a.s.c.RequestHandlers INVALID paramSet a in requestHandler {type = requestHandler,name = /dump,class = DumpRequestHandler,attributes = {initParams=a, name=/dump, class=DumpRequestHandler},args = {defaults={a=A,b=B}}}
   [junit4]   2> 1616793 INFO  (qtp10831125-15901) [n:127.0.0.1:41475_ c:collection1 s:shard1  x:collection1_shard1_replica_t43] o.a.s.u.UpdateHandler Using UpdateLog implementation: org.apache.solr.update.UpdateLog
   [junit4]   2> 1616793 INFO  (qtp10831125-15901) [n:127.0.0.1:41475_ c:collection1 s:shard1  x:collection1_shard1_replica_t43] o.a.s.u.UpdateLog Initializing UpdateLog: dataDir= defaultSyncLevel=FLUSH numRecordsToKeep=100 maxNumLogsToKeep=10 numVersionBuckets=65536
   [junit4]   2> 1616794 INFO  (qtp10831125-15901) [n:127.0.0.1:41475_ c:collection1 s:shard1  x:collection1_shard1_replica_t43] o.a.s.u.CommitTracker Hard AutoCommit: disabled
   [junit4]   2> 1616794 INFO  (qtp10831125-15901) [n:127.0.0.1:41475_ c:collection1 s:shard1  x:collection1_shard1_replica_t43] o.a.s.u.CommitTracker Soft AutoCommit: disabled
   [junit4]   2> 1616796 INFO  (qtp10831125-15901) [n:127.0.0.1:41475_ c:collection1 s:shard1  x:collection1_shard1_replica_t43] o.a.s.u.RandomMergePolicy RandomMergePolicy wrapping class org.apache.lucene.index.TieredMergePolicy: [TieredMergePolicy: maxMergeAtOnce=34, maxMergeAtOnceExplicit=48, maxMergedSegmentMB=0.3818359375, floorSegmentMB=1.8955078125, forceMergeDeletesPctAllowed=15.286775077785695, segmentsPerTier=41.0, maxCFSSegmentSizeMB=8.796093022207999E12, noCFSRatio=0.0
   [junit4]   2> 1616797 INFO  (qtp10831125-15901) [n:127.0.0.1:41475_ c:collection1 s:shard1  x:collection1_shard1_replica_t43] o.a.s.s.SolrIndexSearcher Opening [Searcher@1eb863a[collection1_shard1_replica_t43] main]
   [junit4]   2> 1616798 INFO  (qtp10831125-15901) [n:127.0.0.1:41475_ c:collection1 s:shard1  x:collection1_shard1_replica_t43] o.a.s.r.ManagedResourceStorage Configured ZooKeeperStorageIO with znodeBase: /configs/conf1
   [junit4]   2> 1616798 INFO  (qtp10831125-15901) [n:127.0.0.1:41475_ c:collection1 s:shard1  x:collection1_shard1_replica_t43] o.a.s.r.ManagedResourceStorage Loaded null at path _rest_managed.json using ZooKeeperStorageIO:path=/configs/conf1
   [junit4]   2> 1616799 INFO  (qtp10831125-15901) [n:127.0.0.1:41475_ c:collection1 s:shard1  x:collection1_shard1_replica_t43] o.a.s.h.ReplicationHandler Commits will be reserved for  10000
   [junit4]   2> 1616800 INFO  (searcherExecutor-7021-thread-1-processing-n:127.0.0.1:41475_ x:collection1_shard1_replica_t43 s:shard1 c:collection1) [n:127.0.0.1:41475_ c:collection1 s:shard1  x:collection1_shard1_replica_t43] o.a.s.c.SolrCore [collection1_shard1_replica_t43] Registered new searcher Searcher@1eb863a[collection1_shard1_replica_t43] main{ExitableDirectoryReader(UninvertingDirectoryReader())}
   [junit4]   2> 1616800 INFO  (qtp10831125-15901) [n:127.0.0.1:41475_ c:collection1 s:shard1  x:collection1_shard1_replica_t43] o.a.s.u.UpdateLog Could not find max version in index or recent updates, using new clock 1575445722921172992
   [junit4]   2> 1616804 INFO  (qtp10831125-15901) [n:127.0.0.1:41475_ c:collection1 s:shard1  x:collection1_shard1_replica_t43] o.a.s.c.ShardLeaderElectionContext Enough replicas found to continue.
   [junit4]   2> 1616804 INFO  (qtp10831125-15901) [n:127.0.0.1:41475_ c:collection1 s:shard1  x:collection1_shard1_replica_t43] o.a.s.c.ShardLeaderElectionContext I may be the new leader - try and sync
   [junit4]   2> 1616804 INFO  (qtp10831125-15901) [n:127.0.0.1:41475_ c:collection1 s:shard1  x:collection1_shard1_replica_t43] o.a.s.c.SyncStrategy Sync replicas to http://127.0.0.1:41475/collection1_shard1_replica_t43/
   [junit4]   2> 1616804 INFO  (qtp10831125-15901) [n:127.0.0.1:41475_ c:collection1 s:shard1  x:collection1_shard1_replica_t43] o.a.s.c.SyncStrategy Sync Success - now sync replicas to me
   [junit4]   2> 1616804 INFO  (qtp10831125-15901) [n:127.0.0.1:41475_ c:collection1 s:shard1  x:collection1_shard1_replica_t43] o.a.s.c.SyncStrategy http://127.0.0.1:41475/collection1_shard1_replica_t43/ has no replicas
   [junit4]   2> 1616804 INFO  (qtp10831125-15901) [n:127.0.0.1:41475_ c:collection1 s:shard1  x:collection1_shard1_replica_t43] o.a.s.c.ShardLeaderElectionContext Found all replicas participating in election, clear LIR
   [junit4]   2> 1616805 INFO  (qtp10831125-15901) [n:127.0.0.1:41475_ c:collection1 s:shard1  x:collection1_shard1_replica_t43] o.a.s.c.ZkController collection1_shard1_replica_t43 stopping background replication from leader
   [junit4]   2> 1616806 INFO  (qtp10831125-15901) [n:127.0.0.1:41475_ c:collection1 s:shard1  x:collection1_shard1_replica_t43] o.a.s.c.ShardLeaderElectionContext I am the new leader: http://127.0.0.1:41475/collection1_shard1_replica_t43/ shard1
   [junit4]   2> 1616957 INFO  (qtp10831125-15901) [n:127.0.0.1:41475_ c:collection1 s:shard1  x:collection1_shard1_replica_t43] o.a.s.c.ZkController I am the leader, no recovery necessary
   [junit4]   2> 1616958 INFO  (qtp10831125-15901) [n:127.0.0.1:41475_ c:collection1 s:shard1  x:collection1_shard1_replica_t43] o.a.s.s.HttpSolrCall [admin] webapp=null path=/admin/cores params={qt=/admin/cores&collection.configName=conf1&name=collection1_shard1_replica_t43&action=CREATE&collection=collection1&shard=shard1&wt=javabin&version=2&replicaType=TLOG} status=0 QTime=1366
   [junit4]   2> 1616959 INFO  (qtp32670442-15867) [n:127.0.0.1:45571_    ] o.a.s.s.HttpSolrCall [admin] webapp=null path=/admin/collections params={node=127.0.0.1:41475_&action=ADDREPLICA&collection=collection1&shard=shard1&type=TLOG&wt=javabin&version=2} status=0 QTime=1371
   [junit4]   2> 1617026 INFO  (TEST-ForceLeaderTest.testLastPublishedStateIsActive-seed#[C210C1CE96CE91AB]) [    ] o.a.s.c.AbstractFullDistribZkTestBase create jetty 3 in directory /home/jenkins/workspace/Lucene-Solr-7.x-Linux/solr/build/solr-core/test/J0/temp/solr.cloud.ForceLeaderTest_C210C1CE96CE91AB-001/shard-3-001 of type TLOG
   [junit4]   2> 1617026 INFO  (TEST-ForceLeaderTest.testLastPublishedStateIsActive-seed#[C210C1CE96CE91AB]) [    ] o.e.j.s.Server jetty-9.3.14.v20161028
   [junit4]   2> 1617028 INFO  (TEST-ForceLeaderTest.testLastPublishedStateIsActive-seed#[C210C1CE96CE91AB]) [    ] o.e.j.s.h.ContextHandler Started o.e.j.s.ServletContextHandler@990cf3{/,null,AVAILABLE}
   [junit4]   2> 1617028 INFO  (TEST-ForceLeaderTest.testLastPublishedStateIsActive-seed#[C210C1CE96CE91AB]) [    ] o.e.j.s.AbstractConnector Started ServerConnector@6f634f{HTTP/1.1,[http/1.1]}{127.0.0.1:34419}
   [junit4]   2> 1617028 INFO  (TEST-ForceLeaderTest.testLastPublishedStateIsActive-seed#[C210C1CE96CE91AB]) [    ] o.e.j.s.Server Started @1617975ms
   [junit4]   2> 1617029 INFO  (TEST-ForceLeaderTest.testLastPublishedStateIsActive-seed#[C210C1CE96CE91AB]) [    ] o.a.s.c.s.e.JettySolrRunner Jetty properties: {solr.data.dir=/home/jenkins/workspace/Lucene-Solr-7.x-Linux/solr/build/solr-core/test/J0/temp/solr.cloud.ForceLeaderTest_C210C1CE96CE91AB-001/tempDir-001/jetty3, replicaType=TLOG, solrconfig=solrconfig.xml, hostContext=/, hostPort=45847, coreRootDirectory=/home/jenkins/workspace/Lucene-Solr-7.x-Linux/solr/build/solr-core/test/J0/temp/solr.cloud.ForceLeaderTest_C210C1CE96CE91AB-001/shard-3-001/cores}
   [junit4]   2> 1617029 ERROR (TEST-ForceLeaderTest.testLastPublishedStateIsActive-seed#[C210C1CE96CE91AB]) [    ] o.a.s.s.StartupLoggingUtils Missing Java Option solr.log.dir. Logging may be missing or incomplete.
   [junit4]   2> 1617029 INFO  (TEST-ForceLeaderTest.testLastPublishedStateIsActive-seed#[C210C1CE96CE91AB]) [    ] o.a.s.s.SolrDispatchFilter  ___      _       Welcome to Apache Solr™ version 7.1.0
   [junit4]   2> 1617029 INFO  (TEST-ForceLeaderTest.testLastPublishedStateIsActive-seed#[C210C1CE96CE91AB]) [    ] o.a.s.s.SolrDispatchFilter / __| ___| |_ _   Starting in cloud mode on port null
   [junit4]   2> 1617029 INFO  (TEST-ForceLeaderTest.testLastPublishedStateIsActive-seed#[C210C1CE96CE91AB]) [    ] o.a.s.s.SolrDispatchFilter \__ \/ _ \ | '_|  Install dir: null, Default config dir: null
   [junit4]   2> 1617029 INFO  (TEST-ForceLeaderTest.testLastPublishedStateIsActive-seed#[C210C1CE96CE91AB]) [    ] o.a.s.s.SolrDispatchFilter |___/\___/_|_|    Start time: 2017-08-11T14:35:23.071Z
   [junit4]   2> 1617032 INFO  (TEST-ForceLeaderTest.testLastPublishedStateIsActive-seed#[C210C1CE96CE91AB]) [    ] o.a.s.s.SolrDispatchFilter Loading solr.xml from SolrHome (not found in ZooKeeper)
   [junit4]   2> 1617032 INFO  (TEST-ForceLeaderTest.testLastPublishedStateIsActive-seed#[C210C1CE96CE91AB]) [    ] o.a.s.c.SolrXmlConfig Loading container configuration from /home/jenkins/workspace/Lucene-Solr-7.x-Linux/solr/build/solr-core/test/J0/temp/solr.cloud.ForceLeaderTest_C210C1CE96CE91AB-001/shard-3-001/solr.xml
   [junit4]   2> 1617037 INFO  (TEST-ForceLeaderTest.testLastPublishedStateIsActive-seed#[C210C1CE96CE91AB]) [    ] o.a.s.c.SolrXmlConfig MBean server found: com.sun.jmx.mbeanserver.JmxMBeanServer@815291, but no JMX reporters were configured - adding default JMX reporter.
   [junit4]   2> 1617041 INFO  (TEST-ForceLeaderTest.testLastPublishedStateIsActive-seed#[C210C1CE96CE91AB]) [    ] o.a.s.c.ZkContainer Zookeeper client=127.0.0.1:46277/solr
   [junit4]   2> 1617052 INFO  (TEST-ForceLeaderTest.testLastPublishedStateIsActive-seed#[C210C1CE96CE91AB]) [n:127.0.0.1:45847_    ] o.a.s.c.c.ZkStateReader Updated live nodes from ZooKeeper... (0) -> (3)
   [junit4]   2> 1617053 INFO  (TEST-ForceLeaderTest.testLastPublishedStateIsActive-seed#[C210C1CE96CE91AB]) [n:127.0.0.1:45847_    ] o.a.s.c.Overseer Overseer (id=null) closing
   [junit4]   2> 1617055 INFO  (TEST-ForceLeaderTest.testLastPublishedStateIsActive-seed#[C210C1CE96CE91AB]) [n:127.0.0.1:45847_    ] o.a.s.c.ZkController Register node as live in ZooKeeper:/live_nodes/127.0.0.1:45847_
   [junit4]   2> 1617056 INFO  (zkCallback-2717-thread-1-processing-n:127.0.0.1:45571_) [n:127.0.0.1:45571_    ] o.a.s.c.c.ZkStateReader Updated live nodes from ZooKeeper... (3) -> (4)
   [junit4]   2> 1617056 INFO  (zkCallback-2723-thread-1-processing-n:127.0.0.1:41475_) [n:127.0.0.1:41475_    ] o.a.s.c.c.ZkStateReader Updated live nodes from ZooKeeper... (3) -> (4)
   [junit4]   2> 1617056 INFO  (zkCallback-2712-thread-1) [    ] o.a.s.c.c.ZkStateReader Updated live nodes from ZooKeeper... (3) -> (4)
   [junit4]   2> 1617056 INFO  (zkCallback-2705-thread-2-processing-n:127.0.0.1:43187_) [n:127.0.0.1:43187_    ] o.a.s.c.c.ZkStateReader Updated live nodes from ZooKeeper... (3) -> (4)
   [junit4]   2> 1617057 INFO  (zkCallback-2729-thread-1-processing-n:127.0.0.1:45847_) [n:127.0.0.1:45847_    ] o.a.s.c.c.ZkStateReader Updated live nodes from ZooKeeper... (3) -> (4)
   [junit4]   2> 1617137 INFO  (TEST-ForceLeaderTest.testLastPublishedStateIsActive-seed#[C210C1CE96CE91AB]) [n:127.0.0.1:45847_    ] o.a.s.m.r.SolrJmxReporter JMX monitoring for 'solr.node' (registry 'solr.node') enabled at server: com.sun.jmx.mbeanserver.JmxMBeanServer@815291
   [junit4]   2> 1617142 INFO  (TEST-ForceLeaderTest.testLastPublishedStateIsActive-seed#[C210C1CE96CE91AB]) [n:127.0.0.1:45847_    ] o.a.s.m.r.SolrJmxReporter JMX monitoring for 'solr.jvm' (registry 'solr.jvm') enabled at server: com.sun.jmx.mbeanserver.JmxMBeanServer@815291
   [junit4]   2> 1617142 INFO  (TEST-ForceLeaderTest.testLastPublishedStateIsActive-seed#[C210C1CE96CE91AB]) [n:127.0.0.1:45847_    ] o.a.s.m.r.SolrJmxReporter JMX monitoring for 'solr.jetty' (registry 'solr.jetty') enabled at server: com.sun.jmx.mbeanserver.JmxMBeanServer@815291
   [junit4]   2> 1617143 INFO  (TEST-ForceLeaderTest.testLastPublishedStateIsActive-seed#[C210C1CE96CE91AB]) [n:127.0.0.1:45847_    ] o.a.s.c.CorePropertiesLocator Found 0 core definitions underneath /home/jenkins/workspace/Lucene-Solr-7.x-Linux/solr/build/solr-core/test/J0/temp/solr.cloud.ForceLeaderTest_C210C1CE96CE91AB-001/shard-3-001/cores
   [junit4]   2> 1617175 INFO  (qtp32670442-15862) [n:127.0.0.1:45571_    ] o.a.s.h.a.CollectionsHandler Invoked Collection Action :addreplica with params node=127.0.0.1:45847_&action=ADDREPLICA&collection=collection1&shard=shard2&type=TLOG&wt=javabin&version=2 and sendToOCPQueue=true
   [junit4]   2> 1617177 INFO  (OverseerThreadFactory-6996-thread-5-processing-n:127.0.0.1:43187_) [n:127.0.0.1:43187_    ] o.a.s.c.AddReplicaCmd Node Identified 127.0.0.1:45847_ for creating new replica
   [junit4]   2> 1617177 INFO  (OverseerCollectionConfigSetProcessor-98465357272580100-127.0.0.1:43187_-n_0000000000) [n:127.0.0.1:43187_    ] o.a.s.c.OverseerTaskQueue Response ZK path: /overseer/collection-queue-work/qnr-0000000006 doesn't exist.  Requestor may have disconnected from ZooKeeper
   [junit4]   2> 1617179 INFO  (SocketProxy-Acceptor-45847) [    ] o.a.s.c.SocketProxy accepted Socket[addr=/127.0.0.1,port=42788,localport=45847], receiveBufferSize:531000
   [junit4]   2> 1617179 INFO  (SocketProxy-Acceptor-45847) [    ] o.a.s.c.SocketProxy proxy connection Socket[addr=/127.0.0.1,port=34419,localport=44840], receiveBufferSize=530904
   [junit4]   2> 1617180 INFO  (qtp6559250-15933) [n:127.0.0.1:45847_    ] o.a.s.h.a.CoreAdminOperation core create command qt=/admin/cores&collection.configName=conf1&name=collection1_shard2_replica_t45&action=CREATE&collection=collection1&shard=shard2&wt=javabin&version=2&replicaType=TLOG
   [junit4]   2> 1617180 INFO  (qtp6559250-15933) [n:127.0.0.1:45847_    ] o.a.s.c.TransientSolrCoreCacheDefault Allocating transient cache for 4 transient cores
   [junit4]   2> 1618196 INFO  (qtp6559250-15933) [n:127.0.0.1:45847_ c:collection1 s:shard2  x:collection1_shard2_replica_t45] o.a.s.c.SolrConfig Using Lucene MatchVersion: 7.1.0
   [junit4]   2> 1618223 INFO  (qtp6559250-15933) [n:127.0.0.1:45847_ c:collection1 s:shard2  x:collection1_shard2_replica_t45] o.a.s.s.IndexSchema [collection1_shard2_replica_t45] Schema name=test
   [junit4]   2> 1618304 INFO  (qtp6559250-15933) [n:127.0.0.1:45847_ c:collection1 s:shard2  x:collection1_shard2_replica_t45] o.a.s.s.IndexSchema Loaded schema test/1.0 with uniqueid field id
   [junit4]   2> 1618323 INFO  (qtp6559250-15933) [n:127.0.0.1:45847_ c:collection1 s:shard2  x:collection1_shard2_replica_t45] o.a.s.c.CoreContainer Creating SolrCore 'collection1_shard2_replica_t45' using configuration from collection collection1, trusted=true
   [junit4]   2> 1618323 INFO  (qtp6559250-15933) [n:127.0.0.1:45847_ c:collection1 s:shard2  x:collection1_shard2_replica_t45] o.a.s.m.r.SolrJmxReporter JMX monitoring for 'solr.core.collection1.shard2.replica_t45' (registry 'solr.core.collection1.shard2.replica_t45') enabled at server: com.sun.jmx.mbeanserver.JmxMBeanServer@815291
   [junit4]   2> 1618324 INFO  (qtp6559250-15933) [n:127.0.0.1:45847_ c:collection1 s:shard2  x:collection1_shard2_replica_t45] o.a.s.c.SolrCore solr.RecoveryStrategy.Builder
   [junit4]   2> 1618324 INFO  (qtp6559250-15933) [n:127.0.0.1:45847_ c:collection1 s:shard2  x:collection1_shard2_replica_t45] o.a.s.c.SolrCore [[collection1_shard2_replica_t45] ] Opening new SolrCore at [/home/jenkins/workspace/Lucene-Solr-7.x-Linux/solr/build/solr-core/test/J0/temp/solr.cloud.ForceLeaderTest_C210C1CE96CE91AB-001/shard-3-001/cores/collection1_shard2_replica_t45], dataDir=[/home/jenkins/workspace/Lucene-Solr-7.x-Linux/solr/build/solr-core/test/J0/temp/solr.cloud.ForceLeaderTest_C210C1CE96CE91AB-001/shard-3-001/cores/collection1_shard2_replica_t45/data/]
   [junit4]   2> 1618326 INFO  (qtp6559250-15933) [n:127.0.0.1:45847_ c:collection1 s:shard2  x:collection1_shard2_replica_t45] o.a.s.u.RandomMergePolicy RandomMergePolicy wrapping class org.apache.lucene.index.TieredMergePolicy: [TieredMergePolicy: maxMergeAtOnce=50, maxMergeAtOnceExplicit=41, maxMergedSegmentMB=18.0146484375, floorSegmentMB=0.697265625, forceMergeDeletesPctAllowed=12.124660541981502, segmentsPerTier=10.0, maxCFSSegmentSizeMB=8.796093022207999E12, noCFSRatio=0.741702882694791
   [junit4]   2> 1618329 WARN  (qtp6559250-15933) [n:127.0.0.1:45847_ c:collection1 s:shard2  x:collection1_shard2_replica_t45] o.a.s.c.RequestHandlers INVALID paramSet a in requestHandler {type = requestHandler,name = /dump,class = DumpRequestHandler,attributes = {initParams=a, name=/dump, class=DumpRequestHandler},args = {defaults={a=A,b=B}}}
   [junit4]   2> 1618365 INFO  (qtp6559250-15933) [n:127.0.0.1:45847_ c:collection1 s:shard2  x:collection1_shard2_replica_t45] o.a.s.u.UpdateHandler Using UpdateLog implementation: org.apache.solr.update.UpdateLog
   [junit4]   2> 1618365 INFO  (qtp6559250-15933) [n:127.0.0.1:45847_ c:collection1 s:shard2  x:collection1_shard2_replica_t45] o.a.s.u.UpdateLog Initializing UpdateLog: dataDir= defaultSyncLevel=FLUSH numRecordsToKeep=100 maxNumLogsToKeep=10 numVersionBuckets=65536
   [junit4]   2> 1618366 INFO  (qtp6559250-15933) [n:127.0.0.1:45847_ c:collection1 s:shard2  x:collection1_shard2_replica_t45] o.a.s.u.CommitTracker Hard AutoCommit: disabled
   [junit4]   2> 1618366 INFO  (qtp6559250-15933) [n:127.0.0.1:45847_ c:collection1 s:shard2  x:collection1_shard2_replica_t45] o.a.s.u.CommitTracker Soft AutoCommit: disabled
   [junit4]   2> 1618367 INFO  (qtp6559250-15933) [n:127.0.0.1:45847_ c:collection1 s:shard2  x:collection1_shard2_replica_t45] o.a.s.u.RandomMergePolicy RandomMergePolicy wrapping class org.apache.lucene.index.TieredMergePolicy: [TieredMergePolicy: maxMergeAtOnce=34, maxMergeAtOnceExplicit=48, maxMergedSegmentMB=0.3818359375, floorSegmentMB=1.8955078125, forceMergeDeletesPctAllowed=15.286775077785695, segmentsPerTier=41.0, maxCFSSegmentSizeMB=8.796093022207999E12, noCFSRatio=0.0
   [junit4]   2> 1618368 INFO  (qtp6559250-15933) [n:127.0.0.1:45847_ c:collection1 s:shard2  x:collection1_shard2_replica_t45] o.a.s.s.SolrIndexSearcher Opening [Searcher@1957896[collection1_shard2_replica_t45] main]
   [junit4]   2> 1618369 INFO  (qtp6559250-15933) [n:127.0.0.1:45847_ c:collection1 s:shard2  x:collection1_shard2_replica_t45] o.a.s.r.ManagedResourceStorage Configured ZooKeeperStorageIO with znodeBase: /configs/conf1
   [junit4]   2> 1618369 INFO  (qtp6559250-15933) [n:127.0.0.1:45847_ c:collection1 s:shard2  x:collection1_shard2_replica_t45] o.a.s.r.ManagedResourceStorage Loaded null at path _rest_managed.json using ZooKeeperStorageIO:path=/configs/conf1
   [junit4]   2> 1618369 INFO  (qtp6559250-15933) [n:127.0.0.1:45847_ c:collection1 s:shard2  x:collection1_shard2_replica_t45] o.a.s.h.ReplicationHandler Commits will be reserved for  10000
   [junit4]   2> 1618371 INFO  (searcherExecutor-7032-thread-1-processing-n:127.0.0.1:45847_ x:collection1_shard2_replica_t45 s:shard2 c:collection1) [n:127.0.0.1:45847_ c:collection1 s:shard2  x:collection1_shard2_replica_t45] o.a.s.c.SolrCore [collection1_shard2_replica_t45] Registered new searcher Searcher@1957896[collection1_shard2_replica_t45] main{ExitableDirectoryReader(UninvertingDirectoryReader())}
   [junit4]   2> 1618371 INFO  (qtp6559250-15933) [n:127.0.0.1:45847_ c:collection1 s:shard2  x:collection1_shard2_replica_t45] o.a.s.u.UpdateLog Could not find max version in index or recent updates, using new clock 1575445724568485888
   [junit4]   2> 1618374 INFO  (qtp6559250-15933) [n:127.0.0.1:45847_ c:collection1 s:shard2  x:collection1_shard2_replica_t45] o.a.s.c.ZkController Core needs to recover:collection1_shard2_replica_t45
   [junit4]   2> 1618374 INFO  (updateExecutor-2726-thread-1-processing-n:127.0.0.1:45847_ x:collection1_shard2_replica_t45 s:shard2 c:collection1) [n:127.0.0.1:45847_ c:collection1 s:shard2 r:core_node46 x:collection1_shard2_replica_t45] o.a.s.u.DefaultSolrCoreState Running recovery
   [junit4]   2> 1618374 INFO  (recoveryExecutor-2727-thread-1-processing-n:127.0.0.1:45847_ x:collection1_shard2_replica_t45 s:shard2 c:collection1 r:core_node46) [n:127.0.0.1:45847_ c:collection1 s:shard2 r:core_node46 x:collection1_shard2_replica_t45] o.a.s.c.RecoveryStrategy Starting recovery process. recoveringAfterStartup=true
   [junit4]   2> 1618374 INFO  (recoveryExecutor-2727-thread-1-processing-n:127.0.0.1:45847_ x:collection1_shard2_replica_t45 s:shard2 c:collection1 r:core_node46) [n:127.0.0.1:45847_ c:collection1 s:shard2 r:core_node46 x:collection1_shard2_replica_t45] o.a.s.c.RecoveryStrategy ###### startupVersions=[[]]
   [junit4]   2> 1618374 INFO  (qtp6559250-15933) [n:127.0.0.1:45847_ c:collection1 s:shard2  x:collection1_shard2_replica_t45] o.a.s.s.HttpSolrCall [admin] webapp=null path=/admin/cores params={qt=/admin/cores&collection.configName=conf1&name=collection1_shard2_replica_t45&action=CREATE&collection=collection1&shard=shard2&wt=javabin&version=2&replicaType=TLOG} status=0 QTime=1194
   [junit4]   2> 1618374 INFO  (recoveryExecutor-2727-thread-1-processing-n:127.0.0.1:45847_ x:collection1_shard2_replica_t45 s:shard2 c:collection1 r:core_node46) [n:127.0.0.1:45847_ c:collection1 s:shard2 r:core_node46 x:collection1_shard2_replica_t45] o.a.s.c.ZkController collection1_shard2_replica_t45 stopping background replication from leader
   [junit4]   2> 1618375 INFO  (recoveryExecutor-2727-thread-1-processing-n:127.0.0.1:45847_ x:collection1_shard2_replica_t45 s:shard2 c:collection1 r:core_node46) [n:127.0.0.1:45847_ c:collection1 s:shard2 r:core_node46 x:collection1_shard2_replica_t45] o.a.s.c.RecoveryStrategy Begin buffering updates. core=[collection1_shard2_replica_t45]
   [junit4]   2> 1618375 INFO  (recoveryExecutor-2727-thread-1-processing-n:127.0.0.1:45847_ x:collection1_shard2_replica_t45 s:shard2 c:collection1 r:core_node46) [n:127.0.0.1:45847_ c:collection1 s:shard2 r:core_node46 x:collection1_shard2_replica_t45] o.a.s.u.UpdateLog Starting to buffer updates. FSUpdateLog{state=ACTIVE, tlog=null}
   [junit4]   2> 1618375 INFO  (recoveryExecutor-2727-thread-1-processing-n:127.0.0.1:45847_ x:collection1_shard2_replica_t45 s:shard2 c:collection1 r:core_node46) [n:127.0.0.1:45847_ c:collection1 s:shard2 r:core_node46 x:collection1_shard2_replica_t45] o.a.s.c.RecoveryStrategy Publishing state of core [collection1_shard2_replica_t45] as recovering, leader is [http://127.0.0.1:45571/collection1_shard2_replica_t41/] and I am [http://127.0.0.1:45847/collection1_shard2_replica_t45/]
   [junit4]   2> 1618376 INFO  (qtp32670442-15862) [n:127.0.0.1:45571_    ] o.a.s.s.HttpSolrCall [admin] webapp=null path=/admin/collections params={node=127.0.0.1:45847_&action=ADDREPLICA&collection=collection1&shard=shard2&type=TLOG&wt=javabin&version=2} status=0 QTime=1201
   [junit4]   2> 1618377 INFO  (recoveryExecutor-2727-thread-1-processing-n:127.0.0.1:45847_ x:collection1_shard2_replica_t45 s:shard2 c:collection1 r:core_node46) [n:127.0.0.1:45847_ c:collection1 s:shard2 r:core_node46 x:collection1_shard2_replica_t45] o.a.s.c.RecoveryStrategy Sending prep recovery command to [http://127.0.0.1:45571]; [WaitForState: action=PREPRECOVERY&core=collection1_shard2_replica_t41&nodeName=127.0.0.1:45847_&coreNodeName=core_node46&state=recovering&checkLive=true&onlyIfLeader=true&onlyIfLeaderActive=true]
   [junit4]   2> 1618377 INFO  (SocketProxy-Acceptor-45571) [    ] o.a.s.c.SocketProxy accepted Socket[addr=/127.0.0.1,port=55196,localport=45571], receiveBufferSize:531000
   [junit4]   2> 1618378 INFO  (SocketProxy-Acceptor-45571) [    ] o.a.s.c.SocketProxy proxy connection Socket[addr=/127.0.0.1,port=41897,localport=38040], receiveBufferSize=530904
   [junit4]   2> 1618378 INFO  (TEST-ForceLeaderTest.testLastPublishedStateIsActive-seed#[C210C1CE96CE91AB]) [    ] o.a.s.SolrTestCaseJ4 ###Starting testLastPublishedStateIsActive
   [junit4]   2> 1618378 INFO  (qtp32670442-15863) [n:127.0.0.1:45571_    ] o.a.s.h.a.PrepRecoveryOp Going to wait for coreNodeName: core_node46, state: recovering, checkLive: true, onlyIfLeader: true, onlyIfLeaderActive: true, maxTime: 183 s
   [junit4]   2> 1618378 INFO  (TEST-ForceLeaderTest.testLastPublishedStateIsActive-seed#[C210C1CE96CE91AB]) [    ] o.a.s.c.AbstractFullDistribZkTestBase Creating collection with stateFormat=1: forceleader_last_published
   [junit4]   2> 1618378 INFO  (qtp32670442-15863) [n:127.0.0.1:45571_    ] o.a.s.h.a.PrepRecoveryOp In WaitForState(recovering): collection=collection1, shard=shard2, thisCore=collection1_shard2_replica_t41, leaderDoesNotNeedRecovery=false, isLeader? true, live=true, checkLive=true, currentState=down, localState=active, nodeName=127.0.0.1:45847_, coreNodeName=core_node46, onlyIfActiveCheckResult=false, nodeProps: core_node46:{"core":"collection1_shard2_replica_t45","base_url":"http://127.0.0.1:45847","node_name":"127.0.0.1:45847_","state":"down","type":"TLOG"}
   [junit4]   2> 1618379 INFO  (SocketProxy-Acceptor-41475) [    ] o.a.s.c.SocketProxy accepted Socket[addr=/127.0.0.1,port=44516,localport=41475], receiveBufferSize:531000
   [junit4]   2> 1618380 INFO  (SocketProxy-Acceptor-41475) [    ] o.a.s.c.SocketProxy proxy connection Socket[addr=/127.0.0.1,port=40103,localport=42732], receiveBufferSize=530904
   [junit4]   2> 1618380 INFO  (qtp10831125-15903) [n:127.0.0.1:41475_    ] o.a.s.h.a.CollectionsHandler Invoked Collection Action :create with params pullReplicas=0&maxShardsPerNode=1&collection.configName=conf1&nrtReplicas=0&name=forceleader_last_published&action=CREATE&numShards=1&tlogReplicas=3&stateFormat=1&wt=javabin&version=2 and sendToOCPQueue=true
   [junit4]   2> 1618381 INFO  (OverseerThreadFactory-6996-thread-5-processing-n:127.0.0.1:43187_) [n:127.0.0.1:43187_    ] o.a.s.c.CreateCollectionCmd Create collection forceleader_last_published
   [junit4]   2> 1618381 INFO  (OverseerCollectionConfigSetProcessor-98465357272580100-127.0.0.1:43187_-n_0000000000) [n:127.0.0.1:43187_    ] o.a.s.c.OverseerTaskQueue Response ZK path: /overseer/collection-queue-work/qnr-0000000008 doesn't exist.  Requestor may have disconnected from ZooKeeper
   [junit4]   2> 1618588 INFO  (qtp20653136-15813) [n:127.0.0.1:43187_    ] o.a.s.h.a.CoreAdminOperation core create command qt=/admin/cores&collection.configName=conf1&newCollection=true&name=forceleader_last_published_shard1_replica_t1&action=CREATE&numShards=1&collection=forceleader_last_published&shard=shard1&wt=javabin&version=2&replicaType

[...truncated too long message...]

tion_shard1_replica_n1] o.a.s.m.SolrMetricManager Closing metric reporters for registry=solr.core.destination.shard1.replica_n1, tag=32406644
   [junit4]   2> 125542 INFO  (coreCloseExecutor-575-thread-1) [n:127.0.0.1:44657_solr c:collection1_collection s:shard2 r:core_node4 x:collection1_collection_shard2_replica_n2] o.a.s.c.SolrCore [collection1_collection_shard2_replica_n2]  CLOSING SolrCore org.apache.solr.core.SolrCore@c3e126
   [junit4]   2> 125543 INFO  (coreCloseExecutor-575-thread-2) [n:127.0.0.1:44657_solr c:destination s:shard2 r:core_node4 x:destination_shard2_replica_n2] o.a.s.c.SolrCore [destination_shard2_replica_n2]  CLOSING SolrCore org.apache.solr.core.SolrCore@167f8dd
   [junit4]   2> 125544 INFO  (coreCloseExecutor-573-thread-2) [n:127.0.0.1:44681_solr c:destination s:shard1 r:core_node3 x:destination_shard1_replica_n1] o.a.s.m.SolrMetricManager Closing metric reporters for registry=solr.collection.destination.shard1.leader, tag=32406644
   [junit4]   2> 125544 INFO  (coreCloseExecutor-573-thread-1) [n:127.0.0.1:44681_solr c:mainCorpus s:shard2 r:core_node4 x:mainCorpus_shard2_replica_n2] o.a.s.m.SolrMetricManager Closing metric reporters for registry=solr.core.mainCorpus.shard2.replica_n2, tag=33250296
   [junit4]   2> 125546 INFO  (coreCloseExecutor-572-thread-2) [n:127.0.0.1:36343_solr c:workQueue s:shard2 r:core_node4 x:workQueue_shard2_replica_n3] o.a.s.m.SolrMetricManager Closing metric reporters for registry=solr.core.workQueue.shard2.replica_n3, tag=334781
   [junit4]   2> 125546 INFO  (coreCloseExecutor-575-thread-1) [n:127.0.0.1:44657_solr c:collection1_collection s:shard2 r:core_node4 x:collection1_collection_shard2_replica_n2] o.a.s.m.SolrMetricManager Closing metric reporters for registry=solr.core.collection1_collection.shard2.replica_n2, tag=12837158
   [junit4]   2> 125551 INFO  (coreCloseExecutor-573-thread-1) [n:127.0.0.1:44681_solr c:mainCorpus s:shard2 r:core_node4 x:mainCorpus_shard2_replica_n2] o.a.s.m.SolrMetricManager Closing metric reporters for registry=solr.collection.mainCorpus.shard2.leader, tag=33250296
   [junit4]   2> 125551 INFO  (coreCloseExecutor-572-thread-2) [n:127.0.0.1:36343_solr c:workQueue s:shard2 r:core_node4 x:workQueue_shard2_replica_n3] o.a.s.m.SolrMetricManager Closing metric reporters for registry=solr.collection.workQueue.shard2.leader, tag=334781
   [junit4]   2> 125551 INFO  (coreCloseExecutor-575-thread-2) [n:127.0.0.1:44657_solr c:destination s:shard2 r:core_node4 x:destination_shard2_replica_n2] o.a.s.m.SolrMetricManager Closing metric reporters for registry=solr.core.destination.shard2.replica_n2, tag=23591133
   [junit4]   2> 125554 INFO  (coreCloseExecutor-574-thread-1) [n:127.0.0.1:43233_solr c:workQueue s:shard1 r:core_node2 x:workQueue_shard1_replica_n1] o.a.s.m.SolrMetricManager Closing metric reporters for registry=solr.core.workQueue.shard1.replica_n1, tag=8323251
   [junit4]   2> 125555 INFO  (coreCloseExecutor-575-thread-1) [n:127.0.0.1:44657_solr c:collection1_collection s:shard2 r:core_node4 x:collection1_collection_shard2_replica_n2] o.a.s.m.SolrMetricManager Closing metric reporters for registry=solr.collection.collection1_collection.shard2.leader, tag=12837158
   [junit4]   2> 125555 INFO  (coreCloseExecutor-575-thread-2) [n:127.0.0.1:44657_solr c:destination s:shard2 r:core_node4 x:destination_shard2_replica_n2] o.a.s.m.SolrMetricManager Closing metric reporters for registry=solr.collection.destination.shard2.leader, tag=23591133
   [junit4]   2> 125557 WARN  (NIOServerCxn.Factory:0.0.0.0/0.0.0.0:0) [    ] o.a.z.s.NIOServerCnxn caught end of stream exception
   [junit4]   2> EndOfStreamException: Unable to read additional data from client sessionid 0x15dd1c82947000c, likely client has closed socket
   [junit4]   2> at org.apache.zookeeper.server.NIOServerCnxn.doIO(NIOServerCnxn.java:239)
   [junit4]   2> at org.apache.zookeeper.server.NIOServerCnxnFactory.run(NIOServerCnxnFactory.java:203)
   [junit4]   2> at java.lang.Thread.run(Thread.java:748)
   [junit4]   2> 125557 WARN  (zkCallback-213-thread-1-processing-n:127.0.0.1:44657_solr) [n:127.0.0.1:44657_solr    ] o.a.s.c.c.ZkStateReader ZooKeeper watch triggered, but Solr cannot talk to ZK: [KeeperErrorCode = Session expired for /live_nodes]
   [junit4]   2> 125558 INFO  (jetty-closer-192-thread-2) [    ] o.e.j.s.h.ContextHandler Stopped o.e.j.s.ServletContextHandler@2dda8b{/solr,null,UNAVAILABLE}
   [junit4]   2> 125558 INFO  (zkCallback-210-thread-1-processing-n:127.0.0.1:43233_solr) [n:127.0.0.1:43233_solr    ] o.a.s.c.c.ZkStateReader Updated live nodes from ZooKeeper... (4) -> (3)
   [junit4]   2> 125558 INFO  (zkCallback-211-thread-2-processing-n:127.0.0.1:36343_solr) [n:127.0.0.1:36343_solr    ] o.a.s.c.c.ZkStateReader Updated live nodes from ZooKeeper... (4) -> (3)
   [junit4]   2> 125558 INFO  (zkCallback-212-thread-2-processing-n:127.0.0.1:44681_solr) [n:127.0.0.1:44681_solr    ] o.a.s.c.c.ZkStateReader Updated live nodes from ZooKeeper... (4) -> (3)
   [junit4]   2> 125559 INFO  (jetty-closer-192-thread-4) [    ] o.a.s.c.Overseer Overseer (id=98465424488202250-127.0.0.1:36343_solr-n_0000000000) closing
   [junit4]   2> 125559 INFO  (OverseerStateUpdate-98465424488202250-127.0.0.1:36343_solr-n_0000000000) [n:127.0.0.1:36343_solr    ] o.a.s.c.Overseer Overseer Loop exiting : 127.0.0.1:36343_solr
   [junit4]   2> 125560 INFO  (zkCallback-210-thread-1-processing-n:127.0.0.1:43233_solr) [n:127.0.0.1:43233_solr    ] o.a.s.c.c.ZkStateReader Updated live nodes from ZooKeeper... (3) -> (2)
   [junit4]   2> 125560 INFO  (coreCloseExecutor-574-thread-1) [n:127.0.0.1:43233_solr c:workQueue s:shard1 r:core_node2 x:workQueue_shard1_replica_n1] o.a.s.m.SolrMetricManager Closing metric reporters for registry=solr.collection.workQueue.shard1.leader, tag=8323251
   [junit4]   2> 125560 INFO  (zkCallback-211-thread-2-processing-n:127.0.0.1:36343_solr) [n:127.0.0.1:36343_solr    ] o.a.s.c.c.ZkStateReader Updated live nodes from ZooKeeper... (3) -> (2)
   [junit4]   2> 125565 WARN  (zkCallback-210-thread-1-processing-n:127.0.0.1:43233_solr) [n:127.0.0.1:43233_solr    ] o.a.s.c.c.ZkStateReader ZooKeeper watch triggered, but Solr cannot talk to ZK: [KeeperErrorCode = Session expired for /live_nodes]
   [junit4]   2> 125565 INFO  (jetty-closer-192-thread-1) [    ] o.e.j.s.h.ContextHandler Stopped o.e.j.s.ServletContextHandler@16354ea{/solr,null,UNAVAILABLE}
   [junit4]   2> 127060 WARN  (zkCallback-212-thread-1-processing-n:127.0.0.1:44681_solr) [n:127.0.0.1:44681_solr    ] o.a.s.c.c.ZkStateReader ZooKeeper watch triggered, but Solr cannot talk to ZK: [KeeperErrorCode = Session expired for /live_nodes]
   [junit4]   2> 127060 INFO  (jetty-closer-192-thread-3) [    ] o.e.j.s.h.ContextHandler Stopped o.e.j.s.ServletContextHandler@c49dfb{/solr,null,UNAVAILABLE}
   [junit4]   2> 127065 WARN  (zkCallback-211-thread-2-processing-n:127.0.0.1:36343_solr) [n:127.0.0.1:36343_solr    ] o.a.s.c.c.ZkStateReader ZooKeeper watch triggered, but Solr cannot talk to ZK: [KeeperErrorCode = Session expired for /live_nodes]
   [junit4]   2> 127065 INFO  (jetty-closer-192-thread-4) [    ] o.e.j.s.h.ContextHandler Stopped o.e.j.s.ServletContextHandler@ca2903{/solr,null,UNAVAILABLE}
   [junit4]   2> 127066 ERROR (SUITE-StreamExpressionTest-seed#[AF50AF7082ACBD25]-worker) [    ] o.a.z.s.ZooKeeperServer ZKShutdownHandler is not registered, so ZooKeeper server won't take any action on ERROR or SHUTDOWN server state changes
   [junit4]   2> 127066 INFO  (SUITE-StreamExpressionTest-seed#[AF50AF7082ACBD25]-worker) [    ] o.a.s.c.ZkTestServer connecting to 127.0.0.1:43171 43171
   [junit4]   2> 127810 INFO  (Thread-104) [    ] o.a.s.c.ZkTestServer connecting to 127.0.0.1:43171 43171
   [junit4]   2> 127810 WARN  (Thread-104) [    ] o.a.s.c.ZkTestServer Watch limit violations:
   [junit4]   2> Maximum concurrent create/delete watches above limit:
   [junit4]   2>
   [junit4]   2> 71 /solr/aliases.json
   [junit4]   2> 11 /solr/configs/conf
   [junit4]   2> 4 /solr/security.json
   [junit4]   2>
   [junit4]   2> Maximum concurrent data watches above limit:
   [junit4]   2>
   [junit4]   2> 71 /solr/clusterprops.json
   [junit4]   2> 71 /solr/clusterstate.json
   [junit4]   2> 22 /solr/collections/destination/state.json
   [junit4]   2> 20 /solr/collections/parallelDestinationCollection/state.json
   [junit4]   2> 20 /solr/collections/destinationCollection/state.json
   [junit4]   2> 20 /solr/collections/mainCorpus/state.json
   [junit4]   2> 18 /solr/collections/workQueue/state.json
   [junit4]   2> 18 /solr/collections/parallelDestinationCollection1/state.json
   [junit4]   2> 10 /solr/collections/collection1_collection/state.json
   [junit4]   2> 2 /solr/overseer_elect/election/98465424488202249-127.0.0.1:43233_solr-n_0000000001
   [junit4]   2>
   [junit4]   2> Maximum concurrent children watches above limit:
   [junit4]   2>
   [junit4]   2> 71 /solr/live_nodes
   [junit4]   2> 71 /solr/collections
   [junit4]   2>
   [junit4]   2> NOTE: leaving temporary files on disk at: /home/jenkins/workspace/Lucene-Solr-7.x-Linux/solr/build/solr-solrj/test/J2/temp/solr.client.solrj.io.stream.StreamExpressionTest_AF50AF7082ACBD25-001
   [junit4]   2> NOTE: test params are: codec=Lucene70, sim=RandomSimilarity(queryNorm=false): {}, locale=sv-SE, timezone=Europe/Tiraspol
   [junit4]   2> NOTE: Linux 4.10.0-27-generic i386/Oracle Corporation 1.8.0_144 (32-bit)/cpus=8,threads=1,free=88888096,total=253755392
   [junit4]   2> NOTE: All tests run in this JVM: [SolrZkClientTest, CosineEvaluatorTest, TestDelegationTokenResponse, TestRetryUtil, ConcatOperationTest, FloorEvaluatorTest, CommonAdminParamsTest, EqualsEvaluatorTest, TestBatchUpdate, HyperbolicCosineEvaluatorTest, TestV2Request, SolrExceptionTest, SolrExampleXMLTest, TestCoreAdmin, GraphExpressionTest, StreamExpressionTest]
   [junit4] Completed [127/135 (1!)] on J2 in 77.22s, 94 tests, 1 error, 9 skipped <<< FAILURES!

[...truncated 38576 lines...]


---------------------------------------------------------------------
To unsubscribe, e-mail: [hidden email]
For additional commands, e-mail: [hidden email]
Loading...