[JENKINS] Lucene-Solr-7.x-Linux (32bit/jdk1.8.0_162) - Build # 1528 - Unstable!

Previous Topic Next Topic
 
classic Classic list List threaded Threaded
1 message Options
Reply | Threaded
Open this post in threaded view
|

[JENKINS] Lucene-Solr-7.x-Linux (32bit/jdk1.8.0_162) - Build # 1528 - Unstable!

Policeman Jenkins Server-2
Build: https://jenkins.thetaphi.de/job/Lucene-Solr-7.x-Linux/1528/
Java: 32bit/jdk1.8.0_162 -server -XX:+UseG1GC

4 tests failed.
FAILED:  org.apache.solr.spelling.SpellCheckCollatorTest.testEstimatedHitCounts

Error Message:
Exception during query

Stack Trace:
java.lang.RuntimeException: Exception during query
        at __randomizedtesting.SeedInfo.seed([8CD7520189270179:BD6CEC342C1811A9]:0)
        at org.apache.solr.SolrTestCaseJ4.assertQ(SolrTestCaseJ4.java:908)
        at org.apache.solr.SolrTestCaseJ4.assertQ(SolrTestCaseJ4.java:868)
        at org.apache.solr.spelling.SpellCheckCollatorTest.testEstimatedHitCounts(SpellCheckCollatorTest.java:569)
        at sun.reflect.NativeMethodAccessorImpl.invoke0(Native Method)
        at sun.reflect.NativeMethodAccessorImpl.invoke(NativeMethodAccessorImpl.java:62)
        at sun.reflect.DelegatingMethodAccessorImpl.invoke(DelegatingMethodAccessorImpl.java:43)
        at java.lang.reflect.Method.invoke(Method.java:498)
        at com.carrotsearch.randomizedtesting.RandomizedRunner.invoke(RandomizedRunner.java:1737)
        at com.carrotsearch.randomizedtesting.RandomizedRunner$8.evaluate(RandomizedRunner.java:934)
        at com.carrotsearch.randomizedtesting.RandomizedRunner$9.evaluate(RandomizedRunner.java:970)
        at com.carrotsearch.randomizedtesting.RandomizedRunner$10.evaluate(RandomizedRunner.java:984)
        at com.carrotsearch.randomizedtesting.rules.SystemPropertiesRestoreRule$1.evaluate(SystemPropertiesRestoreRule.java:57)
        at org.apache.lucene.util.TestRuleSetupTeardownChained$1.evaluate(TestRuleSetupTeardownChained.java:49)
        at org.apache.lucene.util.AbstractBeforeAfterRule$1.evaluate(AbstractBeforeAfterRule.java:45)
        at org.apache.lucene.util.TestRuleThreadAndTestName$1.evaluate(TestRuleThreadAndTestName.java:48)
        at org.apache.lucene.util.TestRuleIgnoreAfterMaxFailures$1.evaluate(TestRuleIgnoreAfterMaxFailures.java:64)
        at org.apache.lucene.util.TestRuleMarkFailure$1.evaluate(TestRuleMarkFailure.java:47)
        at com.carrotsearch.randomizedtesting.rules.StatementAdapter.evaluate(StatementAdapter.java:36)
        at com.carrotsearch.randomizedtesting.ThreadLeakControl$StatementRunner.run(ThreadLeakControl.java:368)
        at com.carrotsearch.randomizedtesting.ThreadLeakControl.forkTimeoutingTask(ThreadLeakControl.java:817)
        at com.carrotsearch.randomizedtesting.ThreadLeakControl$3.evaluate(ThreadLeakControl.java:468)
        at com.carrotsearch.randomizedtesting.RandomizedRunner.runSingleTest(RandomizedRunner.java:943)
        at com.carrotsearch.randomizedtesting.RandomizedRunner$5.evaluate(RandomizedRunner.java:829)
        at com.carrotsearch.randomizedtesting.RandomizedRunner$6.evaluate(RandomizedRunner.java:879)
        at com.carrotsearch.randomizedtesting.RandomizedRunner$7.evaluate(RandomizedRunner.java:890)
        at com.carrotsearch.randomizedtesting.rules.StatementAdapter.evaluate(StatementAdapter.java:36)
        at com.carrotsearch.randomizedtesting.rules.SystemPropertiesRestoreRule$1.evaluate(SystemPropertiesRestoreRule.java:57)
        at org.apache.lucene.util.AbstractBeforeAfterRule$1.evaluate(AbstractBeforeAfterRule.java:45)
        at com.carrotsearch.randomizedtesting.rules.StatementAdapter.evaluate(StatementAdapter.java:36)
        at org.apache.lucene.util.TestRuleStoreClassName$1.evaluate(TestRuleStoreClassName.java:41)
        at com.carrotsearch.randomizedtesting.rules.NoShadowingOrOverridesOnMethodsRule$1.evaluate(NoShadowingOrOverridesOnMethodsRule.java:40)
        at com.carrotsearch.randomizedtesting.rules.NoShadowingOrOverridesOnMethodsRule$1.evaluate(NoShadowingOrOverridesOnMethodsRule.java:40)
        at com.carrotsearch.randomizedtesting.rules.StatementAdapter.evaluate(StatementAdapter.java:36)
        at com.carrotsearch.randomizedtesting.rules.StatementAdapter.evaluate(StatementAdapter.java:36)
        at com.carrotsearch.randomizedtesting.rules.StatementAdapter.evaluate(StatementAdapter.java:36)
        at org.apache.lucene.util.TestRuleAssertionsRequired$1.evaluate(TestRuleAssertionsRequired.java:53)
        at org.apache.lucene.util.TestRuleMarkFailure$1.evaluate(TestRuleMarkFailure.java:47)
        at org.apache.lucene.util.TestRuleIgnoreAfterMaxFailures$1.evaluate(TestRuleIgnoreAfterMaxFailures.java:64)
        at org.apache.lucene.util.TestRuleIgnoreTestSuites$1.evaluate(TestRuleIgnoreTestSuites.java:54)
        at com.carrotsearch.randomizedtesting.rules.StatementAdapter.evaluate(StatementAdapter.java:36)
        at com.carrotsearch.randomizedtesting.ThreadLeakControl$StatementRunner.run(ThreadLeakControl.java:368)
        at java.lang.Thread.run(Thread.java:748)
Caused by: java.lang.RuntimeException: REQUEST FAILED: xpath=//lst[@name='spellcheck']/lst[@name='collations']/lst[@name='collation']/long[@name='hits' and 3 <= . and . <= 13]
        xml response was: <?xml version="1.0" encoding="UTF-8"?>
<response>
<lst name="responseHeader"><int name="status">0</int><int name="QTime">5</int></lst><result name="response" numFound="0" start="0"></result><lst name="spellcheck"><lst name="suggestions"><lst name="everother"><int name="numFound">1</int><int name="startOffset">9</int><int name="endOffset">18</int><arr name="suggestion"><str>everyother</str></arr></lst></lst><lst name="collations"><lst name="collation"><str name="collationQuery">teststop:everyother</str><long name="hits">14</long><lst name="misspellingsAndCorrections"><str name="everother">everyother</str></lst></lst></lst></lst>
</response>

        request was:spellcheck=true&spellcheck.dictionary=direct&spellcheck.count=1&spellcheck.collate=true&spellcheck.maxCollationTries=1&spellcheck.maxCollations=1&spellcheck.collateExtendedResults=true&qt=/spellCheckCompRH&q=teststop:everother&spellcheck.collateMaxCollectDocs=5
        at org.apache.solr.SolrTestCaseJ4.assertQ(SolrTestCaseJ4.java:901)
        ... 41 more


FAILED:  org.apache.solr.spelling.SpellCheckCollatorTest.testEstimatedHitCounts

Error Message:
Exception during query

Stack Trace:
java.lang.RuntimeException: Exception during query
        at __randomizedtesting.SeedInfo.seed([8CD7520189270179:BD6CEC342C1811A9]:0)
        at org.apache.solr.SolrTestCaseJ4.assertQ(SolrTestCaseJ4.java:908)
        at org.apache.solr.SolrTestCaseJ4.assertQ(SolrTestCaseJ4.java:868)
        at org.apache.solr.spelling.SpellCheckCollatorTest.testEstimatedHitCounts(SpellCheckCollatorTest.java:569)
        at sun.reflect.NativeMethodAccessorImpl.invoke0(Native Method)
        at sun.reflect.NativeMethodAccessorImpl.invoke(NativeMethodAccessorImpl.java:62)
        at sun.reflect.DelegatingMethodAccessorImpl.invoke(DelegatingMethodAccessorImpl.java:43)
        at java.lang.reflect.Method.invoke(Method.java:498)
        at com.carrotsearch.randomizedtesting.RandomizedRunner.invoke(RandomizedRunner.java:1737)
        at com.carrotsearch.randomizedtesting.RandomizedRunner$8.evaluate(RandomizedRunner.java:934)
        at com.carrotsearch.randomizedtesting.RandomizedRunner$9.evaluate(RandomizedRunner.java:970)
        at com.carrotsearch.randomizedtesting.RandomizedRunner$10.evaluate(RandomizedRunner.java:984)
        at com.carrotsearch.randomizedtesting.rules.SystemPropertiesRestoreRule$1.evaluate(SystemPropertiesRestoreRule.java:57)
        at org.apache.lucene.util.TestRuleSetupTeardownChained$1.evaluate(TestRuleSetupTeardownChained.java:49)
        at org.apache.lucene.util.AbstractBeforeAfterRule$1.evaluate(AbstractBeforeAfterRule.java:45)
        at org.apache.lucene.util.TestRuleThreadAndTestName$1.evaluate(TestRuleThreadAndTestName.java:48)
        at org.apache.lucene.util.TestRuleIgnoreAfterMaxFailures$1.evaluate(TestRuleIgnoreAfterMaxFailures.java:64)
        at org.apache.lucene.util.TestRuleMarkFailure$1.evaluate(TestRuleMarkFailure.java:47)
        at com.carrotsearch.randomizedtesting.rules.StatementAdapter.evaluate(StatementAdapter.java:36)
        at com.carrotsearch.randomizedtesting.ThreadLeakControl$StatementRunner.run(ThreadLeakControl.java:368)
        at com.carrotsearch.randomizedtesting.ThreadLeakControl.forkTimeoutingTask(ThreadLeakControl.java:817)
        at com.carrotsearch.randomizedtesting.ThreadLeakControl$3.evaluate(ThreadLeakControl.java:468)
        at com.carrotsearch.randomizedtesting.RandomizedRunner.runSingleTest(RandomizedRunner.java:943)
        at com.carrotsearch.randomizedtesting.RandomizedRunner$5.evaluate(RandomizedRunner.java:829)
        at com.carrotsearch.randomizedtesting.RandomizedRunner$6.evaluate(RandomizedRunner.java:879)
        at com.carrotsearch.randomizedtesting.RandomizedRunner$7.evaluate(RandomizedRunner.java:890)
        at com.carrotsearch.randomizedtesting.rules.StatementAdapter.evaluate(StatementAdapter.java:36)
        at com.carrotsearch.randomizedtesting.rules.SystemPropertiesRestoreRule$1.evaluate(SystemPropertiesRestoreRule.java:57)
        at org.apache.lucene.util.AbstractBeforeAfterRule$1.evaluate(AbstractBeforeAfterRule.java:45)
        at com.carrotsearch.randomizedtesting.rules.StatementAdapter.evaluate(StatementAdapter.java:36)
        at org.apache.lucene.util.TestRuleStoreClassName$1.evaluate(TestRuleStoreClassName.java:41)
        at com.carrotsearch.randomizedtesting.rules.NoShadowingOrOverridesOnMethodsRule$1.evaluate(NoShadowingOrOverridesOnMethodsRule.java:40)
        at com.carrotsearch.randomizedtesting.rules.NoShadowingOrOverridesOnMethodsRule$1.evaluate(NoShadowingOrOverridesOnMethodsRule.java:40)
        at com.carrotsearch.randomizedtesting.rules.StatementAdapter.evaluate(StatementAdapter.java:36)
        at com.carrotsearch.randomizedtesting.rules.StatementAdapter.evaluate(StatementAdapter.java:36)
        at com.carrotsearch.randomizedtesting.rules.StatementAdapter.evaluate(StatementAdapter.java:36)
        at org.apache.lucene.util.TestRuleAssertionsRequired$1.evaluate(TestRuleAssertionsRequired.java:53)
        at org.apache.lucene.util.TestRuleMarkFailure$1.evaluate(TestRuleMarkFailure.java:47)
        at org.apache.lucene.util.TestRuleIgnoreAfterMaxFailures$1.evaluate(TestRuleIgnoreAfterMaxFailures.java:64)
        at org.apache.lucene.util.TestRuleIgnoreTestSuites$1.evaluate(TestRuleIgnoreTestSuites.java:54)
        at com.carrotsearch.randomizedtesting.rules.StatementAdapter.evaluate(StatementAdapter.java:36)
        at com.carrotsearch.randomizedtesting.ThreadLeakControl$StatementRunner.run(ThreadLeakControl.java:368)
        at java.lang.Thread.run(Thread.java:748)
Caused by: java.lang.RuntimeException: REQUEST FAILED: xpath=//lst[@name='spellcheck']/lst[@name='collations']/lst[@name='collation']/long[@name='hits' and 3 <= . and . <= 13]
        xml response was: <?xml version="1.0" encoding="UTF-8"?>
<response>
<lst name="responseHeader"><int name="status">0</int><int name="QTime">2</int></lst><result name="response" numFound="0" start="0"></result><lst name="spellcheck"><lst name="suggestions"><lst name="everother"><int name="numFound">1</int><int name="startOffset">9</int><int name="endOffset">18</int><arr name="suggestion"><str>everyother</str></arr></lst></lst><lst name="collations"><lst name="collation"><str name="collationQuery">teststop:everyother</str><long name="hits">14</long><lst name="misspellingsAndCorrections"><str name="everother">everyother</str></lst></lst></lst></lst>
</response>

        request was:spellcheck=true&spellcheck.dictionary=direct&spellcheck.count=1&spellcheck.collate=true&spellcheck.maxCollationTries=1&spellcheck.maxCollations=1&spellcheck.collateExtendedResults=true&qt=/spellCheckCompRH&q=teststop:everother&spellcheck.collateMaxCollectDocs=5
        at org.apache.solr.SolrTestCaseJ4.assertQ(SolrTestCaseJ4.java:901)
        ... 41 more


FAILED:  org.apache.solr.spelling.SpellCheckCollatorTest.testEstimatedHitCounts

Error Message:
Exception during query

Stack Trace:
java.lang.RuntimeException: Exception during query
        at __randomizedtesting.SeedInfo.seed([8CD7520189270179:BD6CEC342C1811A9]:0)
        at org.apache.solr.SolrTestCaseJ4.assertQ(SolrTestCaseJ4.java:908)
        at org.apache.solr.SolrTestCaseJ4.assertQ(SolrTestCaseJ4.java:868)
        at org.apache.solr.spelling.SpellCheckCollatorTest.testEstimatedHitCounts(SpellCheckCollatorTest.java:569)
        at sun.reflect.NativeMethodAccessorImpl.invoke0(Native Method)
        at sun.reflect.NativeMethodAccessorImpl.invoke(NativeMethodAccessorImpl.java:62)
        at sun.reflect.DelegatingMethodAccessorImpl.invoke(DelegatingMethodAccessorImpl.java:43)
        at java.lang.reflect.Method.invoke(Method.java:498)
        at com.carrotsearch.randomizedtesting.RandomizedRunner.invoke(RandomizedRunner.java:1737)
        at com.carrotsearch.randomizedtesting.RandomizedRunner$8.evaluate(RandomizedRunner.java:934)
        at com.carrotsearch.randomizedtesting.RandomizedRunner$9.evaluate(RandomizedRunner.java:970)
        at com.carrotsearch.randomizedtesting.RandomizedRunner$10.evaluate(RandomizedRunner.java:984)
        at com.carrotsearch.randomizedtesting.rules.SystemPropertiesRestoreRule$1.evaluate(SystemPropertiesRestoreRule.java:57)
        at org.apache.lucene.util.TestRuleSetupTeardownChained$1.evaluate(TestRuleSetupTeardownChained.java:49)
        at org.apache.lucene.util.AbstractBeforeAfterRule$1.evaluate(AbstractBeforeAfterRule.java:45)
        at org.apache.lucene.util.TestRuleThreadAndTestName$1.evaluate(TestRuleThreadAndTestName.java:48)
        at org.apache.lucene.util.TestRuleIgnoreAfterMaxFailures$1.evaluate(TestRuleIgnoreAfterMaxFailures.java:64)
        at org.apache.lucene.util.TestRuleMarkFailure$1.evaluate(TestRuleMarkFailure.java:47)
        at com.carrotsearch.randomizedtesting.rules.StatementAdapter.evaluate(StatementAdapter.java:36)
        at com.carrotsearch.randomizedtesting.ThreadLeakControl$StatementRunner.run(ThreadLeakControl.java:368)
        at com.carrotsearch.randomizedtesting.ThreadLeakControl.forkTimeoutingTask(ThreadLeakControl.java:817)
        at com.carrotsearch.randomizedtesting.ThreadLeakControl$3.evaluate(ThreadLeakControl.java:468)
        at com.carrotsearch.randomizedtesting.RandomizedRunner.runSingleTest(RandomizedRunner.java:943)
        at com.carrotsearch.randomizedtesting.RandomizedRunner$5.evaluate(RandomizedRunner.java:829)
        at com.carrotsearch.randomizedtesting.RandomizedRunner$6.evaluate(RandomizedRunner.java:879)
        at com.carrotsearch.randomizedtesting.RandomizedRunner$7.evaluate(RandomizedRunner.java:890)
        at com.carrotsearch.randomizedtesting.rules.StatementAdapter.evaluate(StatementAdapter.java:36)
        at com.carrotsearch.randomizedtesting.rules.SystemPropertiesRestoreRule$1.evaluate(SystemPropertiesRestoreRule.java:57)
        at org.apache.lucene.util.AbstractBeforeAfterRule$1.evaluate(AbstractBeforeAfterRule.java:45)
        at com.carrotsearch.randomizedtesting.rules.StatementAdapter.evaluate(StatementAdapter.java:36)
        at org.apache.lucene.util.TestRuleStoreClassName$1.evaluate(TestRuleStoreClassName.java:41)
        at com.carrotsearch.randomizedtesting.rules.NoShadowingOrOverridesOnMethodsRule$1.evaluate(NoShadowingOrOverridesOnMethodsRule.java:40)
        at com.carrotsearch.randomizedtesting.rules.NoShadowingOrOverridesOnMethodsRule$1.evaluate(NoShadowingOrOverridesOnMethodsRule.java:40)
        at com.carrotsearch.randomizedtesting.rules.StatementAdapter.evaluate(StatementAdapter.java:36)
        at com.carrotsearch.randomizedtesting.rules.StatementAdapter.evaluate(StatementAdapter.java:36)
        at com.carrotsearch.randomizedtesting.rules.StatementAdapter.evaluate(StatementAdapter.java:36)
        at org.apache.lucene.util.TestRuleAssertionsRequired$1.evaluate(TestRuleAssertionsRequired.java:53)
        at org.apache.lucene.util.TestRuleMarkFailure$1.evaluate(TestRuleMarkFailure.java:47)
        at org.apache.lucene.util.TestRuleIgnoreAfterMaxFailures$1.evaluate(TestRuleIgnoreAfterMaxFailures.java:64)
        at org.apache.lucene.util.TestRuleIgnoreTestSuites$1.evaluate(TestRuleIgnoreTestSuites.java:54)
        at com.carrotsearch.randomizedtesting.rules.StatementAdapter.evaluate(StatementAdapter.java:36)
        at com.carrotsearch.randomizedtesting.ThreadLeakControl$StatementRunner.run(ThreadLeakControl.java:368)
        at java.lang.Thread.run(Thread.java:748)
Caused by: java.lang.RuntimeException: REQUEST FAILED: xpath=//lst[@name='spellcheck']/lst[@name='collations']/lst[@name='collation']/long[@name='hits' and 3 <= . and . <= 13]
        xml response was: <?xml version="1.0" encoding="UTF-8"?>
<response>
<lst name="responseHeader"><int name="status">0</int><int name="QTime">2</int></lst><result name="response" numFound="0" start="0"></result><lst name="spellcheck"><lst name="suggestions"><lst name="everother"><int name="numFound">1</int><int name="startOffset">9</int><int name="endOffset">18</int><arr name="suggestion"><str>everyother</str></arr></lst></lst><lst name="collations"><lst name="collation"><str name="collationQuery">teststop:everyother</str><long name="hits">14</long><lst name="misspellingsAndCorrections"><str name="everother">everyother</str></lst></lst></lst></lst>
</response>

        request was:spellcheck=true&spellcheck.dictionary=direct&spellcheck.count=1&spellcheck.collate=true&spellcheck.maxCollationTries=1&spellcheck.maxCollations=1&spellcheck.collateExtendedResults=true&qt=/spellCheckCompRH&q=teststop:everother&spellcheck.collateMaxCollectDocs=5
        at org.apache.solr.SolrTestCaseJ4.assertQ(SolrTestCaseJ4.java:901)
        ... 41 more


FAILED:  org.apache.solr.spelling.SpellCheckCollatorTest.testEstimatedHitCounts

Error Message:
Exception during query

Stack Trace:
java.lang.RuntimeException: Exception during query
        at __randomizedtesting.SeedInfo.seed([8CD7520189270179:BD6CEC342C1811A9]:0)
        at org.apache.solr.SolrTestCaseJ4.assertQ(SolrTestCaseJ4.java:908)
        at org.apache.solr.SolrTestCaseJ4.assertQ(SolrTestCaseJ4.java:868)
        at org.apache.solr.spelling.SpellCheckCollatorTest.testEstimatedHitCounts(SpellCheckCollatorTest.java:569)
        at sun.reflect.NativeMethodAccessorImpl.invoke0(Native Method)
        at sun.reflect.NativeMethodAccessorImpl.invoke(NativeMethodAccessorImpl.java:62)
        at sun.reflect.DelegatingMethodAccessorImpl.invoke(DelegatingMethodAccessorImpl.java:43)
        at java.lang.reflect.Method.invoke(Method.java:498)
        at com.carrotsearch.randomizedtesting.RandomizedRunner.invoke(RandomizedRunner.java:1737)
        at com.carrotsearch.randomizedtesting.RandomizedRunner$8.evaluate(RandomizedRunner.java:934)
        at com.carrotsearch.randomizedtesting.RandomizedRunner$9.evaluate(RandomizedRunner.java:970)
        at com.carrotsearch.randomizedtesting.RandomizedRunner$10.evaluate(RandomizedRunner.java:984)
        at com.carrotsearch.randomizedtesting.rules.SystemPropertiesRestoreRule$1.evaluate(SystemPropertiesRestoreRule.java:57)
        at org.apache.lucene.util.TestRuleSetupTeardownChained$1.evaluate(TestRuleSetupTeardownChained.java:49)
        at org.apache.lucene.util.AbstractBeforeAfterRule$1.evaluate(AbstractBeforeAfterRule.java:45)
        at org.apache.lucene.util.TestRuleThreadAndTestName$1.evaluate(TestRuleThreadAndTestName.java:48)
        at org.apache.lucene.util.TestRuleIgnoreAfterMaxFailures$1.evaluate(TestRuleIgnoreAfterMaxFailures.java:64)
        at org.apache.lucene.util.TestRuleMarkFailure$1.evaluate(TestRuleMarkFailure.java:47)
        at com.carrotsearch.randomizedtesting.rules.StatementAdapter.evaluate(StatementAdapter.java:36)
        at com.carrotsearch.randomizedtesting.ThreadLeakControl$StatementRunner.run(ThreadLeakControl.java:368)
        at com.carrotsearch.randomizedtesting.ThreadLeakControl.forkTimeoutingTask(ThreadLeakControl.java:817)
        at com.carrotsearch.randomizedtesting.ThreadLeakControl$3.evaluate(ThreadLeakControl.java:468)
        at com.carrotsearch.randomizedtesting.RandomizedRunner.runSingleTest(RandomizedRunner.java:943)
        at com.carrotsearch.randomizedtesting.RandomizedRunner$5.evaluate(RandomizedRunner.java:829)
        at com.carrotsearch.randomizedtesting.RandomizedRunner$6.evaluate(RandomizedRunner.java:879)
        at com.carrotsearch.randomizedtesting.RandomizedRunner$7.evaluate(RandomizedRunner.java:890)
        at com.carrotsearch.randomizedtesting.rules.StatementAdapter.evaluate(StatementAdapter.java:36)
        at com.carrotsearch.randomizedtesting.rules.SystemPropertiesRestoreRule$1.evaluate(SystemPropertiesRestoreRule.java:57)
        at org.apache.lucene.util.AbstractBeforeAfterRule$1.evaluate(AbstractBeforeAfterRule.java:45)
        at com.carrotsearch.randomizedtesting.rules.StatementAdapter.evaluate(StatementAdapter.java:36)
        at org.apache.lucene.util.TestRuleStoreClassName$1.evaluate(TestRuleStoreClassName.java:41)
        at com.carrotsearch.randomizedtesting.rules.NoShadowingOrOverridesOnMethodsRule$1.evaluate(NoShadowingOrOverridesOnMethodsRule.java:40)
        at com.carrotsearch.randomizedtesting.rules.NoShadowingOrOverridesOnMethodsRule$1.evaluate(NoShadowingOrOverridesOnMethodsRule.java:40)
        at com.carrotsearch.randomizedtesting.rules.StatementAdapter.evaluate(StatementAdapter.java:36)
        at com.carrotsearch.randomizedtesting.rules.StatementAdapter.evaluate(StatementAdapter.java:36)
        at com.carrotsearch.randomizedtesting.rules.StatementAdapter.evaluate(StatementAdapter.java:36)
        at org.apache.lucene.util.TestRuleAssertionsRequired$1.evaluate(TestRuleAssertionsRequired.java:53)
        at org.apache.lucene.util.TestRuleMarkFailure$1.evaluate(TestRuleMarkFailure.java:47)
        at org.apache.lucene.util.TestRuleIgnoreAfterMaxFailures$1.evaluate(TestRuleIgnoreAfterMaxFailures.java:64)
        at org.apache.lucene.util.TestRuleIgnoreTestSuites$1.evaluate(TestRuleIgnoreTestSuites.java:54)
        at com.carrotsearch.randomizedtesting.rules.StatementAdapter.evaluate(StatementAdapter.java:36)
        at com.carrotsearch.randomizedtesting.ThreadLeakControl$StatementRunner.run(ThreadLeakControl.java:368)
        at java.lang.Thread.run(Thread.java:748)
Caused by: java.lang.RuntimeException: REQUEST FAILED: xpath=//lst[@name='spellcheck']/lst[@name='collations']/lst[@name='collation']/long[@name='hits' and 3 <= . and . <= 13]
        xml response was: <?xml version="1.0" encoding="UTF-8"?>
<response>
<lst name="responseHeader"><int name="status">0</int><int name="QTime">2</int></lst><result name="response" numFound="0" start="0"></result><lst name="spellcheck"><lst name="suggestions"><lst name="everother"><int name="numFound">1</int><int name="startOffset">9</int><int name="endOffset">18</int><arr name="suggestion"><str>everyother</str></arr></lst></lst><lst name="collations"><lst name="collation"><str name="collationQuery">teststop:everyother</str><long name="hits">14</long><lst name="misspellingsAndCorrections"><str name="everother">everyother</str></lst></lst></lst></lst>
</response>

        request was:spellcheck=true&spellcheck.dictionary=direct&spellcheck.count=1&spellcheck.collate=true&spellcheck.maxCollationTries=1&spellcheck.maxCollations=1&spellcheck.collateExtendedResults=true&qt=/spellCheckCompRH&q=teststop:everother&spellcheck.collateMaxCollectDocs=5
        at org.apache.solr.SolrTestCaseJ4.assertQ(SolrTestCaseJ4.java:901)
        ... 41 more




Build Log:
[...truncated 1782 lines...]
   [junit4] JVM J0: stdout was not empty, see: /home/jenkins/workspace/Lucene-Solr-7.x-Linux/lucene/build/core/test/temp/junit4-J0-20180313_222624_5244305279075447595487.sysout
   [junit4] >>> JVM J0 emitted unexpected output (verbatim) ----
   [junit4] codec: Lucene70, pf: Direct, dvf: Asserting
   [junit4] <<< JVM J0: EOF ----

[...truncated 11483 lines...]
   [junit4] Suite: org.apache.solr.spelling.SpellCheckCollatorTest
   [junit4]   2> 822851 INFO  (SUITE-SpellCheckCollatorTest-seed#[8CD7520189270179]-worker) [    ] o.a.s.SolrTestCaseJ4 SecureRandom sanity checks: test.solr.allowed.securerandom=null & java.security.egd=file:/dev/./urandom
   [junit4]   2> Creating dataDir: /home/jenkins/workspace/Lucene-Solr-7.x-Linux/solr/build/solr-core/test/J0/temp/solr.spelling.SpellCheckCollatorTest_8CD7520189270179-001/init-core-data-001
   [junit4]   2> 822852 WARN  (SUITE-SpellCheckCollatorTest-seed#[8CD7520189270179]-worker) [    ] o.a.s.SolrTestCaseJ4 startTrackingSearchers: numOpens=2 numCloses=2
   [junit4]   2> 822852 INFO  (SUITE-SpellCheckCollatorTest-seed#[8CD7520189270179]-worker) [    ] o.a.s.SolrTestCaseJ4 Using TrieFields (NUMERIC_POINTS_SYSPROP=false) w/NUMERIC_DOCVALUES_SYSPROP=false
   [junit4]   2> 822854 INFO  (SUITE-SpellCheckCollatorTest-seed#[8CD7520189270179]-worker) [    ] o.a.s.SolrTestCaseJ4 Randomized ssl (true) and clientAuth (true) via: @org.apache.solr.util.RandomizeSSL(reason=, ssl=NaN, value=NaN, clientAuth=NaN)
   [junit4]   2> 822855 INFO  (SUITE-SpellCheckCollatorTest-seed#[8CD7520189270179]-worker) [    ] o.a.s.SolrTestCaseJ4 ####initCore
   [junit4]   2> 822855 INFO  (SUITE-SpellCheckCollatorTest-seed#[8CD7520189270179]-worker) [    ] o.a.s.c.SolrResourceLoader [null] Added 2 libs to classloader, from paths: [/home/jenkins/workspace/Lucene-Solr-7.x-Linux/solr/core/src/test-files/solr/collection1/lib, /home/jenkins/workspace/Lucene-Solr-7.x-Linux/solr/core/src/test-files/solr/collection1/lib/classes]
   [junit4]   2> 822876 INFO  (SUITE-SpellCheckCollatorTest-seed#[8CD7520189270179]-worker) [    ] o.a.s.c.SolrConfig Using Lucene MatchVersion: 7.4.0
   [junit4]   2> 822908 INFO  (SUITE-SpellCheckCollatorTest-seed#[8CD7520189270179]-worker) [    ] o.a.s.s.IndexSchema [null] Schema name=test
   [junit4]   2> 822989 INFO  (SUITE-SpellCheckCollatorTest-seed#[8CD7520189270179]-worker) [    ] o.a.s.s.IndexSchema Loaded schema test/1.0 with uniqueid field id
   [junit4]   2> 823031 INFO  (SUITE-SpellCheckCollatorTest-seed#[8CD7520189270179]-worker) [    ] o.a.s.m.r.SolrJmxReporter JMX monitoring for 'solr.node' (registry 'solr.node') enabled at server: com.sun.jmx.mbeanserver.JmxMBeanServer@162bdf3
   [junit4]   2> 823041 INFO  (SUITE-SpellCheckCollatorTest-seed#[8CD7520189270179]-worker) [    ] o.a.s.m.r.SolrJmxReporter JMX monitoring for 'solr.jvm' (registry 'solr.jvm') enabled at server: com.sun.jmx.mbeanserver.JmxMBeanServer@162bdf3
   [junit4]   2> 823041 INFO  (SUITE-SpellCheckCollatorTest-seed#[8CD7520189270179]-worker) [    ] o.a.s.m.r.SolrJmxReporter JMX monitoring for 'solr.jetty' (registry 'solr.jetty') enabled at server: com.sun.jmx.mbeanserver.JmxMBeanServer@162bdf3
   [junit4]   2> 823043 INFO  (coreLoadExecutor-4131-thread-1) [    ] o.a.s.c.TransientSolrCoreCacheDefault Allocating transient cache for 2147483647 transient cores
   [junit4]   2> 823043 INFO  (coreLoadExecutor-4131-thread-1) [    x:collection1] o.a.s.c.SolrResourceLoader [null] Added 2 libs to classloader, from paths: [/home/jenkins/workspace/Lucene-Solr-7.x-Linux/solr/core/src/test-files/solr/collection1/lib, /home/jenkins/workspace/Lucene-Solr-7.x-Linux/solr/core/src/test-files/solr/collection1/lib/classes]
   [junit4]   2> 823059 INFO  (coreLoadExecutor-4131-thread-1) [    x:collection1] o.a.s.c.SolrConfig Using Lucene MatchVersion: 7.4.0
   [junit4]   2> 823067 INFO  (coreLoadExecutor-4131-thread-1) [    x:collection1] o.a.s.s.IndexSchema [collection1] Schema name=test
   [junit4]   2> 823135 INFO  (coreLoadExecutor-4131-thread-1) [    x:collection1] o.a.s.s.IndexSchema Loaded schema test/1.0 with uniqueid field id
   [junit4]   2> 823140 INFO  (coreLoadExecutor-4131-thread-1) [    x:collection1] o.a.s.c.CoreContainer Creating SolrCore 'collection1' using configuration from instancedir /home/jenkins/workspace/Lucene-Solr-7.x-Linux/solr/core/src/test-files/solr/collection1, trusted=true
   [junit4]   2> 823140 INFO  (coreLoadExecutor-4131-thread-1) [    x:collection1] o.a.s.m.r.SolrJmxReporter JMX monitoring for 'solr.core.collection1' (registry 'solr.core.collection1') enabled at server: com.sun.jmx.mbeanserver.JmxMBeanServer@162bdf3
   [junit4]   2> 823140 INFO  (coreLoadExecutor-4131-thread-1) [    x:collection1] o.a.s.c.SolrCore solr.RecoveryStrategy.Builder
   [junit4]   2> 823140 INFO  (coreLoadExecutor-4131-thread-1) [    x:collection1] o.a.s.c.SolrCore [[collection1] ] Opening new SolrCore at [/home/jenkins/workspace/Lucene-Solr-7.x-Linux/solr/core/src/test-files/solr/collection1], dataDir=[/home/jenkins/workspace/Lucene-Solr-7.x-Linux/solr/build/solr-core/test/J0/temp/solr.spelling.SpellCheckCollatorTest_8CD7520189270179-001/init-core-data-001/]
   [junit4]   2> 823141 INFO  (coreLoadExecutor-4131-thread-1) [    x:collection1] o.a.s.u.RandomMergePolicy RandomMergePolicy wrapping class org.apache.lucene.index.LogByteSizeMergePolicy: [LogByteSizeMergePolicy: minMergeSize=1677721, mergeFactor=17, maxMergeSize=2147483648, maxMergeSizeForForcedMerge=9223372036854775807, calibrateSizeByDeletes=true, maxMergeDocs=2147483647, maxCFSSegmentSizeMB=8.796093022207999E12, noCFSRatio=0.0]
   [junit4]   2> 823168 INFO  (coreLoadExecutor-4131-thread-1) [    x:collection1] o.a.s.u.CommitTracker Hard AutoCommit: disabled
   [junit4]   2> 823168 INFO  (coreLoadExecutor-4131-thread-1) [    x:collection1] o.a.s.u.CommitTracker Soft AutoCommit: disabled
   [junit4]   2> 823169 INFO  (coreLoadExecutor-4131-thread-1) [    x:collection1] o.a.s.u.RandomMergePolicy RandomMergePolicy wrapping class org.apache.lucene.index.TieredMergePolicy: [TieredMergePolicy: maxMergeAtOnce=17, maxMergeAtOnceExplicit=50, maxMergedSegmentMB=85.3466796875, floorSegmentMB=2.005859375, forceMergeDeletesPctAllowed=19.075617358141802, segmentsPerTier=43.0, maxCFSSegmentSizeMB=8.796093022207999E12, noCFSRatio=1.0
   [junit4]   2> 823169 INFO  (coreLoadExecutor-4131-thread-1) [    x:collection1] o.a.s.s.SolrIndexSearcher Opening [Searcher@19d3075[collection1] main]
   [junit4]   2> 823169 WARN  (coreLoadExecutor-4131-thread-1) [    x:collection1] o.a.s.r.ManagedResourceStorage Cannot write to config directory /home/jenkins/workspace/Lucene-Solr-7.x-Linux/solr/core/src/test-files/solr/collection1/conf; switching to use InMemory storage instead.
   [junit4]   2> 823170 INFO  (coreLoadExecutor-4131-thread-1) [    x:collection1] o.a.s.h.c.SpellCheckComponent Initializing spell checkers
   [junit4]   2> 823250 INFO  (coreLoadExecutor-4131-thread-1) [    x:collection1] o.a.s.h.c.SpellCheckComponent Registering newSearcher listener for spellchecker: default
   [junit4]   2> 823265 INFO  (coreLoadExecutor-4131-thread-1) [    x:collection1] o.a.s.h.c.SpellCheckComponent Registering newSearcher listener for spellchecker: default_teststop
   [junit4]   2> 823265 INFO  (coreLoadExecutor-4131-thread-1) [    x:collection1] o.a.s.s.DirectSolrSpellChecker init: {name=direct,classname=solr.DirectSolrSpellChecker,minQueryLength=3,maxQueryFrequency=100.0,field=teststop}
   [junit4]   2> 823265 INFO  (coreLoadExecutor-4131-thread-1) [    x:collection1] o.a.s.s.DirectSolrSpellChecker init: {name=direct_lowerfilt,classname=solr.DirectSolrSpellChecker,minQueryLength=3,maxQueryFrequency=100.0,field=lowerfilt}
   [junit4]   2> 823281 INFO  (coreLoadExecutor-4131-thread-1) [    x:collection1] o.a.s.h.c.SpellCheckComponent Registering newSearcher listener for spellchecker: threshold
   [junit4]   2> 823282 INFO  (coreLoadExecutor-4131-thread-1) [    x:collection1] o.a.s.s.DirectSolrSpellChecker init: {name=threshold_direct,classname=solr.DirectSolrSpellChecker,field=lowerfilt,spellcheckIndexDir=spellcheckerThreshold,buildOnCommit=true,thresholdTokenFrequency=0.29}
   [junit4]   2> 823282 INFO  (coreLoadExecutor-4131-thread-1) [    x:collection1] o.a.s.h.c.SpellCheckComponent Registering newSearcher listener for spellchecker: threshold_direct
   [junit4]   2> 823298 INFO  (coreLoadExecutor-4131-thread-1) [    x:collection1] o.a.s.h.c.SpellCheckComponent Registering newSearcher listener for spellchecker: multipleFields
   [junit4]   2> 823343 INFO  (coreLoadExecutor-4131-thread-1) [    x:collection1] o.a.s.h.c.SpellCheckComponent Registering newSearcher listener for spellchecker: freq
   [junit4]   2> 823358 INFO  (coreLoadExecutor-4131-thread-1) [    x:collection1] o.a.s.h.c.SpellCheckComponent Registering newSearcher listener for spellchecker: fqcn
   [junit4]   2> 823358 INFO  (coreLoadExecutor-4131-thread-1) [    x:collection1] o.a.s.h.ReplicationHandler Commits will be reserved for 10000ms.
   [junit4]   2> 823359 INFO  (searcherExecutor-4132-thread-1-processing-x:collection1) [    x:collection1] o.a.s.h.c.SpellCheckComponent Loading spell index for spellchecker: default
   [junit4]   2> 823359 INFO  (searcherExecutor-4132-thread-1-processing-x:collection1) [    x:collection1] o.a.s.h.c.SpellCheckComponent Loading spell index for spellchecker: default_teststop
   [junit4]   2> 823359 INFO  (searcherExecutor-4132-thread-1-processing-x:collection1) [    x:collection1] o.a.s.h.c.SpellCheckComponent Loading spell index for spellchecker: direct
   [junit4]   2> 823359 INFO  (searcherExecutor-4132-thread-1-processing-x:collection1) [    x:collection1] o.a.s.h.c.SpellCheckComponent Loading spell index for spellchecker: direct_lowerfilt
   [junit4]   2> 823359 INFO  (searcherExecutor-4132-thread-1-processing-x:collection1) [    x:collection1] o.a.s.h.c.SpellCheckComponent Loading spell index for spellchecker: wordbreak
   [junit4]   2> 823359 INFO  (searcherExecutor-4132-thread-1-processing-x:collection1) [    x:collection1] o.a.s.h.c.SpellCheckComponent Loading spell index for spellchecker: threshold
   [junit4]   2> 823359 INFO  (searcherExecutor-4132-thread-1-processing-x:collection1) [    x:collection1] o.a.s.h.c.SpellCheckComponent Loading spell index for spellchecker: threshold_direct
   [junit4]   2> 823359 INFO  (searcherExecutor-4132-thread-1-processing-x:collection1) [    x:collection1] o.a.s.h.c.SpellCheckComponent Loading spell index for spellchecker: multipleFields
   [junit4]   2> 823359 INFO  (searcherExecutor-4132-thread-1-processing-x:collection1) [    x:collection1] o.a.s.h.c.SpellCheckComponent Loading spell index for spellchecker: jarowinkler
   [junit4]   2> 823359 INFO  (searcherExecutor-4132-thread-1-processing-x:collection1) [    x:collection1] o.a.s.h.c.SpellCheckComponent Loading spell index for spellchecker: external
   [junit4]   2> 823359 INFO  (searcherExecutor-4132-thread-1-processing-x:collection1) [    x:collection1] o.a.s.h.c.SpellCheckComponent Loading spell index for spellchecker: freq
   [junit4]   2> 823360 INFO  (searcherExecutor-4132-thread-1-processing-x:collection1) [    x:collection1] o.a.s.h.c.SpellCheckComponent Loading spell index for spellchecker: fqcn
   [junit4]   2> 823360 INFO  (searcherExecutor-4132-thread-1-processing-x:collection1) [    x:collection1] o.a.s.h.c.SpellCheckComponent Loading spell index for spellchecker: perDict
   [junit4]   2> 823360 INFO  (SUITE-SpellCheckCollatorTest-seed#[8CD7520189270179]-worker) [    ] o.a.s.SolrTestCaseJ4 ####initCore end
   [junit4]   2> 823360 INFO  (searcherExecutor-4132-thread-1-processing-x:collection1) [    x:collection1] o.a.s.c.SolrCore [collection1] Registered new searcher Searcher@19d3075[collection1] main{ExitableDirectoryReader(UninvertingDirectoryReader())}
   [junit4]   2> 823361 INFO  (SUITE-SpellCheckCollatorTest-seed#[8CD7520189270179]-worker) [    ] o.a.s.u.p.LogUpdateProcessorFactory [collection1]  webapp=null path=null params={}{add=[0]} 0 0
   [junit4]   2> 823364 INFO  (SUITE-SpellCheckCollatorTest-seed#[8CD7520189270179]-worker) [    ] o.a.s.u.p.LogUpdateProcessorFactory [collection1]  webapp=null path=null params={}{add=[1]} 0 1
   [junit4]   2> 823365 INFO  (SUITE-SpellCheckCollatorTest-seed#[8CD7520189270179]-worker) [    ] o.a.s.u.p.LogUpdateProcessorFactory [collection1]  webapp=null path=null params={}{add=[2]} 0 0
   [junit4]   2> 823367 INFO  (SUITE-SpellCheckCollatorTest-seed#[8CD7520189270179]-worker) [    ] o.a.s.u.p.LogUpdateProcessorFactory [collection1]  webapp=null path=null params={}{add=[3]} 0 2
   [junit4]   2> 823367 INFO  (SUITE-SpellCheckCollatorTest-seed#[8CD7520189270179]-worker) [    ] o.a.s.u.p.LogUpdateProcessorFactory [collection1]  webapp=null path=null params={}{add=[4]} 0 0
   [junit4]   2> 823370 INFO  (SUITE-SpellCheckCollatorTest-seed#[8CD7520189270179]-worker) [    ] o.a.s.u.p.LogUpdateProcessorFactory [collection1]  webapp=null path=null params={}{add=[5]} 0 2
   [junit4]   2> 823370 INFO  (SUITE-SpellCheckCollatorTest-seed#[8CD7520189270179]-worker) [    ] o.a.s.u.p.LogUpdateProcessorFactory [collection1]  webapp=null path=null params={}{add=[6]} 0 0
   [junit4]   2> 823372 INFO  (SUITE-SpellCheckCollatorTest-seed#[8CD7520189270179]-worker) [    ] o.a.s.u.p.LogUpdateProcessorFactory [collection1]  webapp=null path=null params={}{add=[7]} 0 1
   [junit4]   2> 823373 INFO  (SUITE-SpellCheckCollatorTest-seed#[8CD7520189270179]-worker) [    ] o.a.s.u.p.LogUpdateProcessorFactory [collection1]  webapp=null path=null params={}{add=[8]} 0 0
   [junit4]   2> 823375 INFO  (SUITE-SpellCheckCollatorTest-seed#[8CD7520189270179]-worker) [    ] o.a.s.u.p.LogUpdateProcessorFactory [collection1]  webapp=null path=null params={}{add=[9]} 0 1
   [junit4]   2> 823375 INFO  (SUITE-SpellCheckCollatorTest-seed#[8CD7520189270179]-worker) [    ] o.a.s.u.p.LogUpdateProcessorFactory [collection1]  webapp=null path=null params={}{add=[10]} 0 0
   [junit4]   2> 823378 INFO  (SUITE-SpellCheckCollatorTest-seed#[8CD7520189270179]-worker) [    ] o.a.s.u.p.LogUpdateProcessorFactory [collection1]  webapp=null path=null params={}{add=[11]} 0 2
   [junit4]   2> 823379 INFO  (SUITE-SpellCheckCollatorTest-seed#[8CD7520189270179]-worker) [    ] o.a.s.u.p.LogUpdateProcessorFactory [collection1]  webapp=null path=null params={}{add=[12]} 0 0
   [junit4]   2> 823382 INFO  (SUITE-SpellCheckCollatorTest-seed#[8CD7520189270179]-worker) [    ] o.a.s.u.p.LogUpdateProcessorFactory [collection1]  webapp=null path=null params={}{add=[13]} 0 2
   [junit4]   2> 823382 INFO  (SUITE-SpellCheckCollatorTest-seed#[8CD7520189270179]-worker) [    ] o.a.s.u.p.LogUpdateProcessorFactory [collection1]  webapp=null path=null params={}{add=[14]} 0 0
   [junit4]   2> 823385 INFO  (SUITE-SpellCheckCollatorTest-seed#[8CD7520189270179]-worker) [    ] o.a.s.u.p.LogUpdateProcessorFactory [collection1]  webapp=null path=null params={}{add=[15]} 0 2
   [junit4]   2> 823386 INFO  (SUITE-SpellCheckCollatorTest-seed#[8CD7520189270179]-worker) [    ] o.a.s.u.p.LogUpdateProcessorFactory [collection1]  webapp=null path=null params={}{add=[16]} 0 0
   [junit4]   2> 823386 INFO  (SUITE-SpellCheckCollatorTest-seed#[8CD7520189270179]-worker) [    ] o.a.s.u.DirectUpdateHandler2 start commit{,optimize=false,openSearcher=true,waitSearcher=true,expungeDeletes=false,softCommit=false,prepareCommit=false}
   [junit4]   2> 823386 INFO  (SUITE-SpellCheckCollatorTest-seed#[8CD7520189270179]-worker) [    ] o.a.s.u.SolrIndexWriter Calling setCommitData with IW:org.apache.solr.update.SolrIndexWriter@1cb80ce commitCommandVersion:0
   [junit4]   2> 823390 INFO  (SUITE-SpellCheckCollatorTest-seed#[8CD7520189270179]-worker) [    ] o.a.s.s.SolrIndexSearcher Opening [Searcher@a08a96[collection1] main]
   [junit4]   2> 823390 INFO  (SUITE-SpellCheckCollatorTest-seed#[8CD7520189270179]-worker) [    ] o.a.s.u.DirectUpdateHandler2 end_commit_flush
   [junit4]   2> 823390 INFO  (searcherExecutor-4132-thread-1) [    ] o.a.s.h.c.SpellCheckComponent Building spell index for spell checker: default
   [junit4]   2> 823454 INFO  (searcherExecutor-4132-thread-1) [    ] o.a.s.h.c.SpellCheckComponent Building spell index for spell checker: default_teststop
   [junit4]   2> 823513 INFO  (searcherExecutor-4132-thread-1) [    ] o.a.s.h.c.SpellCheckComponent Building spell index for spell checker: threshold
   [junit4]   2> 823530 INFO  (searcherExecutor-4132-thread-1) [    ] o.a.s.h.c.SpellCheckComponent Building spell index for spell checker: threshold_direct
   [junit4]   2> 823530 INFO  (searcherExecutor-4132-thread-1) [    ] o.a.s.h.c.SpellCheckComponent Building spell index for spell checker: multipleFields
   [junit4]   2> 823580 INFO  (searcherExecutor-4132-thread-1) [    ] o.a.s.h.c.SpellCheckComponent Building spell index for spell checker: freq
   [junit4]   2> 823630 INFO  (searcherExecutor-4132-thread-1) [    ] o.a.s.h.c.SpellCheckComponent Building spell index for spell checker: fqcn
   [junit4]   2> 823681 INFO  (searcherExecutor-4132-thread-1) [    ] o.a.s.c.SolrCore [collection1] Registered new searcher Searcher@a08a96[collection1] main{ExitableDirectoryReader(UninvertingDirectoryReader(Uninverting(_0(7.4.0):C2) Uninverting(_1(7.4.0):C2) Uninverting(_2(7.4.0):C2) Uninverting(_3(7.4.0):C2) Uninverting(_4(7.4.0):C2) Uninverting(_5(7.4.0):C2) Uninverting(_6(7.4.0):C2) Uninverting(_7(7.4.0):C2) Uninverting(_8(7.4.0):C1)))}
   [junit4]   2> 823681 INFO  (SUITE-SpellCheckCollatorTest-seed#[8CD7520189270179]-worker) [    ] o.a.s.u.p.LogUpdateProcessorFactory [collection1]  webapp=null path=null params={}{commit=} 0 295
   [junit4]   2> 823683 INFO  (TEST-SpellCheckCollatorTest.testCollateWithOverride-seed#[8CD7520189270179]) [    ] o.a.s.SolrTestCaseJ4 ###Starting testCollateWithOverride
   [junit4]   2> 823716 INFO  (TEST-SpellCheckCollatorTest.testCollateWithOverride-seed#[8CD7520189270179]) [    ] o.a.s.c.S.Request [collection1]  webapp=null path=null params={mm=1&q=partisian+politcal+mashine&defType=edismax&spellcheck.dictionary=direct&qt=/spellCheckCompRH&spellcheck=true&qf=teststop&spellcheck.maxCollations=10&spellcheck.count=10&spellcheck.maxCollationTries=10&wt=xml&spellcheck.collate=true} hits=0 status=0 QTime=33
   [junit4]   2> 823727 INFO  (TEST-SpellCheckCollatorTest.testCollateWithOverride-seed#[8CD7520189270179]) [    ] o.a.s.c.S.Request [collection1]  webapp=null path=null params={mm=1&spellcheck.dictionary=direct&qt=/spellCheckCompRH&spellcheck.maxCollations=10&spellcheck.maxCollationTries=10&q=partisian+politcal+mashine&defType=edismax&spellcheck.collateParam.mm=100%25&spellcheck=true&qf=teststop&spellcheck.count=10&wt=xml&spellcheck.collate=true} hits=0 status=0 QTime=10
   [junit4]   2> 823727 INFO  (TEST-SpellCheckCollatorTest.testCollateWithOverride-seed#[8CD7520189270179]) [    ] o.a.s.SolrTestCaseJ4 ###Ending testCollateWithOverride
   [junit4]   2> 823729 INFO  (TEST-SpellCheckCollatorTest.testContextSensitiveCollate-seed#[8CD7520189270179]) [    ] o.a.s.SolrTestCaseJ4 ###Starting testContextSensitiveCollate
   [junit4]   2> 823736 INFO  (TEST-SpellCheckCollatorTest.testContextSensitiveCollate-seed#[8CD7520189270179]) [    ] o.a.s.c.S.Request [collection1]  webapp=null path=null params={spellcheck.collateExtendedResults=true&qt=/spellCheckCompRH&spellcheck.dictionary=direct&indent=true&spellcheck.maxCollations=1&spellcheck.maxCollationTries=10&spellcheck.alternativeTermCount=5&spellcheck.build=true&spellcheck.extendedResults=true&q=teststop:(flew+AND+form+AND+heathrow)&spellcheck.maxResultsForSuggest=0&spellcheck=true&spellcheck.count=10&wt=xml&spellcheck.collate=true} hits=0 status=0 QTime=6
   [junit4]   2> 823741 INFO  (TEST-SpellCheckCollatorTest.testContextSensitiveCollate-seed#[8CD7520189270179]) [    ] o.a.s.c.S.Request [collection1]  webapp=null path=null params={spellcheck.collateExtendedResults=true&qt=/spellCheckCompRH&spellcheck.dictionary=direct&indent=true&spellcheck.maxCollations=1&spellcheck.maxCollationTries=10&spellcheck.alternativeTermCount=5&spellcheck.extendedResults=true&q=teststop:(june+AND+customs)&spellcheck.maxResultsForSuggest=1&spellcheck=true&spellcheck.count=10&wt=xml&spellcheck.collate=true} hits=1 status=0 QTime=4
   [junit4]   2> 823743 INFO  (TEST-SpellCheckCollatorTest.testContextSensitiveCollate-seed#[8CD7520189270179]) [    ] o.a.s.c.S.Request [collection1]  webapp=null path=null params={mm=2&q=teststop:(june+customs)&qt=/spellCheckCompRH&spellcheck.dictionary=direct&indent=true&spellcheck=true&spellcheck.count=10&spellcheck.alternativeTermCount=0&wt=xml&spellcheck.collate=true} hits=2 status=0 QTime=0
   [junit4]   2> 823811 INFO  (TEST-SpellCheckCollatorTest.testContextSensitiveCollate-seed#[8CD7520189270179]) [    ] o.a.s.c.S.Request [collection1]  webapp=null path=null params={spellcheck.collateExtendedResults=true&qt=/spellCheckCompRH&spellcheck.dictionary=default_teststop&indent=true&spellcheck.maxCollations=1&spellcheck.maxCollationTries=10&spellcheck.alternativeTermCount=5&spellcheck.build=true&spellcheck.extendedResults=true&q=teststop:(flew+AND+form+AND+heathrow)&spellcheck.maxResultsForSuggest=0&spellcheck=true&spellcheck.count=10&wt=xml&spellcheck.collate=true} hits=0 status=0 QTime=68
   [junit4]   2> 823814 INFO  (TEST-SpellCheckCollatorTest.testContextSensitiveCollate-seed#[8CD7520189270179]) [    ] o.a.s.c.S.Request [collection1]  webapp=null path=null params={spellcheck.collateExtendedResults=true&qt=/spellCheckCompRH&spellcheck.dictionary=default_teststop&indent=true&spellcheck.maxCollations=1&spellcheck.maxCollationTries=10&spellcheck.alternativeTermCount=5&spellcheck.extendedResults=true&q=teststop:(june+AND+customs)&spellcheck.maxResultsForSuggest=1&spellcheck=true&spellcheck.count=10&wt=xml&spellcheck.collate=true} hits=1 status=0 QTime=1
   [junit4]   2> 823815 INFO  (TEST-SpellCheckCollatorTest.testContextSensitiveCollate-seed#[8CD7520189270179]) [    ] o.a.s.c.S.Request [collection1]  webapp=null path=null params={mm=2&q=teststop:(june+customs)&qt=/spellCheckCompRH&spellcheck.dictionary=default_teststop&indent=true&spellcheck=true&spellcheck.count=10&spellcheck.alternativeTermCount=0&wt=xml&spellcheck.collate=true} hits=2 status=0 QTime=0
   [junit4]   2> 823815 INFO  (TEST-SpellCheckCollatorTest.testContextSensitiveCollate-seed#[8CD7520189270179]) [    ] o.a.s.SolrTestCaseJ4 ###Ending testContextSensitiveCollate
   [junit4]   2> 823817 INFO  (TEST-SpellCheckCollatorTest.testEstimatedHitCounts-seed#[8CD7520189270179]) [    ] o.a.s.SolrTestCaseJ4 ###Starting testEstimatedHitCounts
   [junit4]   2> 823820 INFO  (TEST-SpellCheckCollatorTest.testEstimatedHitCounts-seed#[8CD7520189270179]) [    ] o.a.s.c.S.Request [collection1]  webapp=null path=null params={spellcheck=true&spellcheck.dictionary=direct&spellcheck.count=1&spellcheck.collate=true&spellcheck.maxCollationTries=1&spellcheck.maxCollations=1&spellcheck.collateExtendedResults=true&qt=/spellCheckCompRH&q=teststop:metnoia} hits=0 status=0 QTime=2
   [junit4]   2> 823825 INFO  (TEST-SpellCheckCollatorTest.testEstimatedHitCounts-seed#[8CD7520189270179]) [    ] o.a.s.c.S.Request [collection1]  webapp=null path=null params={spellcheck=true&spellcheck.dictionary=direct&spellcheck.count=1&spellcheck.collate=true&spellcheck.maxCollationTries=1&spellcheck.maxCollations=1&spellcheck.collateExtendedResults=true&qt=/spellCheckCompRH&q=teststop:metnoia&spellcheck.collateMaxCollectDocs=0} hits=0 status=0 QTime=5
   [junit4]   2> 823829 INFO  (TEST-SpellCheckCollatorTest.testEstimatedHitCounts-seed#[8CD7520189270179]) [    ] o.a.s.c.S.Request [collection1]  webapp=null path=null params={spellcheck=true&spellcheck.dictionary=direct&spellcheck.count=1&spellcheck.collate=true&spellcheck.maxCollationTries=1&spellcheck.maxCollations=1&spellcheck.collateExtendedResults=true&qt=/spellCheckCompRH&q=teststop:metnoia&spellcheck.collateMaxCollectDocs=30} hits=0 status=0 QTime=2
   [junit4]   2> 823832 INFO  (TEST-SpellCheckCollatorTest.testEstimatedHitCounts-seed#[8CD7520189270179]) [    ] o.a.s.c.S.Request [collection1]  webapp=null path=null params={spellcheck=true&spellcheck.dictionary=direct&spellcheck.count=1&spellcheck.collate=true&spellcheck.maxCollationTries=1&spellcheck.maxCollations=1&spellcheck.collateExtendedResults=true&qt=/spellCheckCompRH&q=teststop:metnoia&spellcheck.collateMaxCollectDocs=100} hits=0 status=0 QTime=2
   [junit4]   2> 823834 INFO  (TEST-SpellCheckCollatorTest.testEstimatedHitCounts-seed#[8CD7520189270179]) [    ] o.a.s.c.S.Request [collection1]  webapp=null path=null params={spellcheck=true&spellcheck.dictionary=direct&spellcheck.count=1&spellcheck.collate=true&spellcheck.maxCollationTries=1&spellcheck.maxCollations=1&spellcheck.collateExtendedResults=true&qt=/spellCheckCompRH&q=teststop:metnoia&spellcheck.collateMaxCollectDocs=10000} hits=0 status=0 QTime=2
   [junit4]   2> 823837 INFO  (TEST-SpellCheckCollatorTest.testEstimatedHitCounts-seed#[8CD7520189270179]) [    ] o.a.s.c.S.Request [collection1]  webapp=null path=null params={spellcheck=true&spellcheck.dictionary=direct&spellcheck.count=1&spellcheck.collate=true&spellcheck.maxCollationTries=1&spellcheck.maxCollations=1&spellcheck.collateExtendedResults=true&qt=/spellCheckCompRH&q=teststop:metnoia&spellcheck.collateMaxCollectDocs=7} hits=0 status=0 QTime=2
   [junit4]   2> 823841 INFO  (TEST-SpellCheckCollatorTest.testEstimatedHitCounts-seed#[8CD7520189270179]) [    ] o.a.s.c.S.Request [collection1]  webapp=null path=null params={spellcheck=true&spellcheck.dictionary=direct&spellcheck.count=1&spellcheck.collate=true&spellcheck.maxCollationTries=1&spellcheck.maxCollations=1&spellcheck.collateExtendedResults=true&qt=/spellCheckCompRH&q=teststop:metnoia&spellcheck.collateMaxCollectDocs=2} hits=0 status=0 QTime=2
   [junit4]   2> 823848 INFO  (TEST-SpellCheckCollatorTest.testEstimatedHitCounts-seed#[8CD7520189270179]) [    ] o.a.s.c.S.Request [collection1]  webapp=null path=null params={spellcheck=true&spellcheck.dictionary=direct&spellcheck.count=1&spellcheck.collate=true&spellcheck.maxCollationTries=1&spellcheck.maxCollations=1&spellcheck.collateExtendedResults=true&qt=/spellCheckCompRH&q=teststop:metnoia&spellcheck.collateMaxCollectDocs=1} hits=0 status=0 QTime=6
   [junit4]   2> 823851 INFO  (TEST-SpellCheckCollatorTest.testEstimatedHitCounts-seed#[8CD7520189270179]) [    ] o.a.s.c.S.Request [collection1]  webapp=null path=null params={spellcheck=true&spellcheck.dictionary=direct&spellcheck.count=1&spellcheck.collate=true&spellcheck.maxCollationTries=1&spellcheck.maxCollations=1&spellcheck.collateExtendedResults=true&qt=/spellCheckCompRH&q=teststop:metnoia&spellcheck.collateMaxCollectDocs=7} hits=0 status=0 QTime=2
   [junit4]   2> 823854 INFO  (TEST-SpellCheckCollatorTest.testEstimatedHitCounts-seed#[8CD7520189270179]) [    ] o.a.s.c.S.Request [collection1]  webapp=null path=null params={spellcheck=true&spellcheck.dictionary=direct&spellcheck.count=1&spellcheck.collate=true&spellcheck.maxCollationTries=1&spellcheck.maxCollations=1&spellcheck.collateExtendedResults=true&qt=/spellCheckCompRH&q=teststop:metnoia&spellcheck.collateMaxCollectDocs=7} hits=0 status=0 QTime=2
   [junit4]   2> 823858 INFO  (TEST-SpellCheckCollatorTest.testEstimatedHitCounts-seed#[8CD7520189270179]) [    ] o.a.s.c.S.Request [collection1]  webapp=null path=null params={spellcheck=true&spellcheck.dictionary=direct&spellcheck.count=1&spellcheck.collate=true&spellcheck.maxCollationTries=1&spellcheck.maxCollations=1&spellcheck.collateExtendedResults=true&qt=/spellCheckCompRH&q=teststop:metnoia&spellcheck.collateMaxCollectDocs=12} hits=0 status=0 QTime=4
   [junit4]   2> 823862 INFO  (TEST-SpellCheckCollatorTest.testEstimatedHitCounts-seed#[8CD7520189270179]) [    ] o.a.s.c.S.Request [collection1]  webapp=null path=null params={spellcheck=true&spellcheck.dictionary=direct&spellcheck.count=1&spellcheck.collate=true&spellcheck.maxCollationTries=1&spellcheck.maxCollations=1&spellcheck.collateExtendedResults=true&qt=/spellCheckCompRH&q=teststop:metnoia&spellcheck.collateMaxCollectDocs=2} hits=0 status=0 QTime=2
   [junit4]   2> 823912 INFO  (TEST-SpellCheckCollatorTest.testEstimatedHitCounts-seed#[8CD7520189270179]) [    ] o.a.s.c.S.Request [collection1]  webapp=null path=null params={spellcheck=true&spellcheck.dictionary=direct&spellcheck.count=1&spellcheck.collate=true&spellcheck.maxCollationTries=1&spellcheck.maxCollations=1&spellcheck.collateExtendedResults=true&qt=/spellCheckCompRH&q=teststop:metnoia&spellcheck.collateMaxCollectDocs=5} hits=0 status=0 QTime=2
   [junit4]   2> 823915 INFO  (TEST-SpellCheckCollatorTest.testEstimatedHitCounts-seed#[8CD7520189270179]) [    ] o.a.s.c.S.Request [collection1]  webapp=null path=null params={spellcheck=true&spellcheck.dictionary=direct&spellcheck.count=1&spellcheck.collate=true&spellcheck.maxCollationTries=1&spellcheck.maxCollations=1&spellcheck.collateExtendedResults=true&qt=/spellCheckCompRH&q=teststop:metnoia&spellcheck.collateMaxCollectDocs=1} hits=0 status=0 QTime=2
   [junit4]   2> 823917 INFO  (TEST-SpellCheckCollatorTest.testEstimatedHitCounts-seed#[8CD7520189270179]) [    ] o.a.s.c.S.Request [collection1]  webapp=null path=null params={spellcheck=true&spellcheck.dictionary=direct&spellcheck.count=1&spellcheck.collate=true&spellcheck.maxCollationTries=1&spellcheck.maxCollations=1&spellcheck.collateExtendedResults=true&qt=/spellCheckCompRH&q=teststop:metnoia&spellcheck.collateMaxCollectDocs=15} hits=0 status=0 QTime=2
   [junit4]   2> 823920 INFO  (TEST-SpellCheckCollatorTest.testEstimatedHitCounts-seed#[8CD7520189270179]) [    ] o.a.s.c.S.Request [collection1]  webapp=null path=null params={spellcheck=true&spellcheck.dictionary=direct&spellcheck.count=1&spellcheck.collate=true&spellcheck.maxCollationTries=1&spellcheck.maxCollations=1&spellcheck.collateExtendedResults=true&qt=/spellCheckCompRH&q=teststop:metnoia&spellcheck.collateMaxCollectDocs=8} hits=0 status=0 QTime=2
   [junit4]   2> 823923 INFO  (TEST-SpellCheckCollatorTest.testEstimatedHitCounts-seed#[8CD7520189270179]) [    ] o.a.s.c.S.Request [collection1]  webapp=null path=null params={spellcheck=true&spellcheck.dictionary=direct&spellcheck.count=1&spellcheck.collate=true&spellcheck.maxCollationTries=1&spellcheck.maxCollations=1&spellcheck.collateExtendedResults=true&qt=/spellCheckCompRH&q=teststop:metnoia&spellcheck.collateMaxCollectDocs=11} hits=0 status=0 QTime=2
   [junit4]   2> 823925 INFO  (TEST-SpellCheckCollatorTest.testEstimatedHitCounts-seed#[8CD7520189270179]) [    ] o.a.s.c.S.Request [collection1]  webapp=null path=null params={spellcheck=true&spellcheck.dictionary=direct&spellcheck.count=1&spellcheck.collate=true&spellcheck.maxCollationTries=1&spellcheck.maxCollations=1&spellcheck.collateExtendedResults=true&qt=/spellCheckCompRH&q=teststop:metnoia&spellcheck.collateMaxCollectDocs=12} hits=0 status=0 QTime=2
   [junit4]   2> 823928 INFO  (TEST-SpellCheckCollatorTest.testEstimatedHitCounts-seed#[8CD7520189270179]) [    ] o.a.s.c.S.Request [collection1]  webapp=null path=null params={spellcheck=true&spellcheck.dictionary=direct&spellcheck.count=1&spellcheck.collate=true&spellcheck.maxCollationTries=1&spellcheck.maxCollations=1&spellcheck.collateExtendedResults=true&qt=/spellCheckCompRH&q=teststop:metnoia&spellcheck.collateMaxCollectDocs=10} hits=0 status=0 QTime=2
   [junit4]   2> 823935 INFO  (TEST-SpellCheckCollatorTest.testEstimatedHitCounts-seed#[8CD7520189270179]) [    ] o.a.s.c.S.Request [collection1]  webapp=null path=null params={spellcheck=true&spellcheck.dictionary=direct&spellcheck.count=1&spellcheck.collate=true&spellcheck.maxCollationTries=1&spellcheck.maxCollations=1&spellcheck.collateExtendedResults=true&qt=/spellCheckCompRH&q=teststop:metnoia&spellcheck.collateMaxCollectDocs=6} hits=0 status=0 QTime=6
   [junit4]   2> 823937 INFO  (TEST-SpellCheckCollatorTest.testEstimatedHitCounts-seed#[8CD7520189270179]) [    ] o.a.s.c.S.Request [collection1]  webapp=null path=null params={spellcheck=true&spellcheck.dictionary=direct&spellcheck.count=1&spellcheck.collate=true&spellcheck.maxCollationTries=1&spellcheck.maxCollations=1&spellcheck.collateExtendedResults=true&qt=/spellCheckCompRH&q=teststop:metnoia&spellcheck.collateMaxCollectDocs=17} hits=0 status=0 QTime=2
   [junit4]   2> 823940 INFO  (TEST-SpellCheckCollatorTest.testEstimatedHitCounts-seed#[8CD7520189270179]) [    ] o.a.s.c.S.Request [collection1]  webapp=null path=null params={spellcheck=true&spellcheck.dictionary=direct&spellcheck.count=1&spellcheck.collate=true&spellcheck.maxCollationTries=1&spellcheck.maxCollations=1&spellcheck.collateExtendedResults=true&qt=/spellCheckCompRH&q=teststop:metnoia&spellcheck.collateMaxCollectDocs=2} hits=0 status=0 QTime=2
   [junit4]   2> 823942 INFO  (TEST-SpellCheckCollatorTest.testEstimatedHitCounts-seed#[8CD7520189270179]) [    ] o.a.s.c.S.Request [collection1]  webapp=null path=null params={spellcheck=true&spellcheck.dictionary=direct&spellcheck.count=1&spellcheck.collate=true&spellcheck.maxCollationTries=1&spellcheck.maxCollations=1&spellcheck.collateExtendedResults=true&qt=/spellCheckCompRH&q=teststop:metnoia&spellcheck.collateMaxCollectDocs=12} hits=0 status=0 QTime=2
   [junit4]   2> 823945 INFO  (TEST-SpellCheckCollatorTest.testEstimatedHitCounts-seed#[8CD7520189270179]) [    ] o.a.s.c.S.Request [collection1]  webapp=null path=null params={spellcheck=true&spellcheck.dictionary=direct&spellcheck.count=1&spellcheck.collate=true&spellcheck.maxCollationTries=1&spellcheck.maxCollations=1&spellcheck.collateExtendedResults=true&qt=/spellCheckCompRH&q=teststop:metnoia&spellcheck.collateMaxCollectDocs=5} hits=0 status=0 QTime=2
   [junit4]   2> 823948 INFO  (TEST-SpellCheckCollatorTest.testEstimatedHitCounts-seed#[8CD7520189270179]) [    ] o.a.s.c.S.Request [collection1]  webapp=null path=null params={spellcheck=true&spellcheck.dictionary=direct&spellcheck.count=1&spellcheck.collate=true&spellcheck.maxCollationTries=1&spellcheck.maxCollations=1&spellcheck.collateExtendedResults=true&qt=/spellCheckCompRH&q=teststop:metnoia&spellcheck.collateMaxCollectDocs=2} hits=0 status=0 QTime=2
   [junit4]   2> 823950 INFO  (TEST-SpellCheckCollatorTest.testEstimatedHitCounts-seed#[8CD7520189270179]) [    ] o.a.s.c.S.Request [collection1]  webapp=null path=null params={spellcheck=true&spellcheck.dictionary=direct&spellcheck.count=1&spellcheck.collate=true&spellcheck.maxCollationTries=1&spellcheck.maxCollations=1&spellcheck.collateExtendedResults=true&qt=/spellCheckCompRH&q=teststop:metnoia&spellcheck.collateMaxCollectDocs=11} hits=0 status=0 QTime=2
   [junit4]   2> 823953 INFO  (TEST-SpellCheckCollatorTest.testEstimatedHitCounts-seed#[8CD7520189270179]) [    ] o.a.s.c.S.Request [collection1]  webapp=null path=null params={spellcheck=true&spellcheck.dictionary=direct&spellcheck.count=1&spellcheck.collate=true&spellcheck.maxCollationTries=1&spellcheck.maxCollations=1&spellcheck.collateExtendedResults=true&qt=/spellCheckCompRH&q=teststop:metnoia&spellcheck.collateMaxCollectDocs=3} hits=0 status=0 QTime=2
   [junit4]   2> 823956 INFO  (TEST-SpellCheckCollatorTest.testEstimatedHitCounts-seed#[8CD7520189270179]) [    ] o.a.s.c.S.Request [collection1]  webapp=null path=null params={spellcheck=true&spellcheck.dictionary=direct&spellcheck.count=1&spellcheck.collate=true&spellcheck.maxCollationTries=1&spellcheck.maxCollations=1&spellcheck.collateExtendedResults=true&qt=/spellCheckCompRH&q=teststop:metnoia&spellcheck.collateMaxCollectDocs=6} hits=0 status=0 QTime=2
   [junit4]   2> 823958 INFO  (TEST-SpellCheckCollatorTest.testEstimatedHitCounts-seed#[8CD7520189270179]) [    ] o.a.s.c.S.Request [collection1]  webapp=null path=null params={spellcheck=true&spellcheck.dictionary=direct&spellcheck.count=1&spellcheck.collate=true&spellcheck.maxCollationTries=1&spellcheck.maxCollations=1&spellcheck.collateExtendedResults=true&qt=/spellCheckCompRH&q=teststop:metnoia&spellcheck.collateMaxCollectDocs=17} hits=0 status=0 QTime=2
   [junit4]   2> 823961 INFO  (TEST-SpellCheckCollatorTest.testEstimatedHitCounts-seed#[8CD7520189270179]) [    ] o.a.s.c.S.Request [collection1]  webapp=null path=null params={spellcheck=true&spellcheck.dictionary=direct&spellcheck.count=1&spellcheck.collate=true&spellcheck.maxCollationTries=1&spellcheck.maxCollations=1&spellcheck.collateExtendedResults=true&qt=/spellCheckCompRH&q=teststop:metnoia&spellcheck.collateMaxCollectDocs=10} hits=0 status=0 QTime=2
   [junit4]   2> 823963 INFO  (TEST-SpellCheckCollatorTest.testEstimatedHitCounts-seed#[8CD7520189270179]) [    ] o.a.s.c.S.Request [collection1]  webapp=null path=null params={spellcheck=true&spellcheck.dictionary=direct&spellcheck.count=1&spellcheck.collate=true&spellcheck.maxCollationTries=1&spellcheck.maxCollations=1&spellcheck.collateExtendedResults=true&qt=/spellCheckCompRH&q=teststop:metnoia&spellcheck.collateMaxCollectDocs=5} hits=0 status=0 QTime=2
   [junit4]   2> 823966 INFO  (TEST-SpellCheckCollatorTest.testEstimatedHitCounts-seed#[8CD7520189270179]) [    ] o.a.s.c.S.Request [collection1]  webapp=null path=null params={spellcheck=true&spellcheck.dictionary=direct&spellcheck.count=1&spellcheck.collate=true&spellcheck.maxCollationTries=1&spellcheck.maxCollations=1&spellcheck.collateExtendedResults=true&qt=/spellCheckCompRH&q=teststop:metnoia&spellcheck.collateMaxCollectDocs=13} hits=0 status=0 QTime=2
   [junit4]   2> 823968 INFO  (TEST-SpellCheckCollatorTest.testEstimatedHitCounts-seed#[8CD7520189270179]) [    ] o.a.s.c.S.Request [collection1]  webapp=null path=null params={spellcheck=true&spellcheck.dictionary=direct&spellcheck.count=1&spellcheck.collate=true&spellcheck.maxCollationTries=1&spellcheck.maxCollations=1&spellcheck.collateExtendedResults=true&qt=/spellCheckCompRH&q=teststop:metnoia&spellcheck.collateMaxCollectDocs=4} hits=0 status=0 QTime=2
   [junit4]   2> 823971 INFO  (TEST-SpellCheckCollatorTest.testEstimatedHitCounts-seed#[8CD7520189270179]) [    ] o.a.s.c.S.Request [collection1]  webapp=null path=null params={spellcheck=true&spellcheck.dictionary=direct&spellcheck.count=1&spellcheck.collate=true&spellcheck.maxCollationTries=1&spellcheck.maxCollations=1&spellcheck.collateExtendedResults=true&qt=/spellCheckCompRH&q=teststop:metnoia&spellcheck.collateMaxCollectDocs=13} hits=0 status=0 QTime=2
   [junit4]   2> 823974 INFO  (TEST-SpellCheckCollatorTest.testEstimatedHitCounts-seed#[8CD7520189270179]) [    ] o.a.s.c.S.Request [collection1]  webapp=null path=null params={spellcheck=true&spellcheck.dictionary=direct&spellcheck.count=1&spellcheck.collate=true&spellcheck.maxCollationTries=1&spellcheck.maxCollations=1&spellcheck.collateExtendedResults=true&qt=/spellCheckCompRH&q=teststop:metnoia&spellcheck.collateMaxCollectDocs=3} hits=0 status=0 QTime=2
   [junit4]   2> 823977 INFO  (TEST-SpellCheckCollatorTest.testEstimatedHitCounts-seed#[8CD7520189270179]) [    ] o.a.s.c.S.Request [collection1]  webapp=null path=null params={spellcheck=true&spellcheck.dictionary=direct&spellcheck.count=1&spellcheck.collate=true&spellcheck.maxCollationTries=1&spellcheck.maxCollations=1&spellcheck.collateExtendedResults=true&qt=/spellCheckCompRH&q=teststop:everother&spellcheck.collateMaxCollectDocs=5} hits=0 status=0 QTime=2
   [junit4]   2> 823978 ERROR (TEST-SpellCheckCollatorTest.testEstimatedHitCounts-seed#[8CD7520189270179]) [    ] o.a.s.SolrTestCaseJ4 REQUEST FAILED: xpath=//lst[@name='spellcheck']/lst[@name='collations']/lst[@name='collation']/long[@name='hits' and 3 <= . and . <= 13]
   [junit4]   2> xml response was: <?xml version="1.0" encoding="UTF-8"?>
   [junit4]   2> <response>
   [junit4]   2> <lst name="responseHeader"><int name="status">0</int><int name="QTime">2</int></lst><result name="response" numFound="0" start="0"></result><lst name="spellcheck"><lst name="suggestions"><lst name="everother"><int name="numFound">1</int><int name="startOffset">9</int><int name="endOffset">18</int><arr name="suggestion"><str>everyother</str></arr></lst></lst><lst name="collations"><lst name="collation"><str name="collationQuery">teststop:everyother</str><long name="hits">14</long><lst name="misspellingsAndCorrections"><str name="everother">everyother</str></lst></lst></lst></lst>
   [junit4]   2> </response>
   [junit4]   2>
   [junit4]   2> request was:spellcheck=true&spellcheck.dictionary=direct&spellcheck.count=1&spellcheck.collate=true&spellcheck.maxCollationTries=1&spellcheck.maxCollations=1&spellcheck.collateExtendedResults=true&qt=/spellCheckCompRH&q=teststop:everother&spellcheck.collateMaxCollectDocs=5
   [junit4]   2> 823978 ERROR (TEST-SpellCheckCollatorTest.testEstimatedHitCounts-seed#[8CD7520189270179]) [    ] o.a.s.SolrTestCaseJ4 REQUEST FAILED: spellcheck=true&spellcheck.dictionary=direct&spellcheck.count=1&spellcheck.collate=true&spellcheck.maxCollationTries=1&spellcheck.maxCollations=1&spellcheck.collateExtendedResults=true&qt=/spellCheckCompRH&q=teststop:everother&spellcheck.collateMaxCollectDocs=5:java.lang.RuntimeException: REQUEST FAILED: xpath=//lst[@name='spellcheck']/lst[@name='collations']/lst[@name='collation']/long[@name='hits' and 3 <= . and . <= 13]
   [junit4]   2> xml response was: <?xml version="1.0" encoding="UTF-8"?>
   [junit4]   2> <response>
   [junit4]   2> <lst name="responseHeader"><int name="status">0</int><int name="QTime">2</int></lst><result name="response" numFound="0" start="0"></result><lst name="spellcheck"><lst name="suggestions"><lst name="everother"><int name="numFound">1</int><int name="startOffset">9</int><int name="endOffset">18</int><arr name="suggestion"><str>everyother</str></arr></lst></lst><lst name="collations"><lst name="collation"><str name="collationQuery">teststop:everyother</str><long name="hits">14</long><lst name="misspellingsAndCorrections"><str name="everother">everyother</str></lst></lst></lst></lst>
   [junit4]   2> </response>
   [junit4]   2>
   [junit4]   2> request was:spellcheck=true&spellcheck.dictionary=direct&spellcheck.count=1&spellcheck.collate=true&spellcheck.maxCollationTries=1&spellcheck.maxCollations=1&spellcheck.collateExtendedResults=true&qt=/spellCheckCompRH&q=teststop:everother&spellcheck.collateMaxCollectDocs=5
   [junit4]   2> at org.apache.solr.SolrTestCaseJ4.assertQ(SolrTestCaseJ4.java:901)
   [junit4]   2> at org.apache.solr.SolrTestCaseJ4.assertQ(SolrTestCaseJ4.java:868)
   [junit4]   2> at org.apache.solr.spelling.SpellCheckCollatorTest.testEstimatedHitCounts(SpellCheckCollatorTest.java:569)
   [junit4]   2> at sun.reflect.NativeMethodAccessorImpl.invoke0(Native Method)
   [junit4]   2> at sun.reflect.NativeMethodAccessorImpl.invoke(NativeMethodAccessorImpl.java:62)
   [junit4]   2> at sun.reflect.DelegatingMethodAccessorImpl.invoke(DelegatingMethodAccessorImpl.java:43)
   [junit4]   2> at java.lang.reflect.Method.invoke(Method.java:498)
   [junit4]   2> at com.carrotsearch.randomizedtesting.RandomizedRunner.invoke(RandomizedRunner.java:1737)
   [junit4]   2> at com.carrotsearch.randomizedtesting.RandomizedRunner$8.evaluate(RandomizedRunner.java:934)
   [junit4]   2> at com.carrotsearch.randomizedtesting.RandomizedRunner$9.evaluate(RandomizedRunner.java:970)
   [junit4]   2> at com.carrotsearch.randomizedtesting.RandomizedRunner$10.evaluate(RandomizedRunner.java:984)
   [junit4]   2> at com.carrotsearch.randomizedtesting.rules.SystemPropertiesRestoreRule$1.evaluate(SystemPropertiesRestoreRule.java:57)
   [junit4]   2> at org.apache.lucene.util.TestRuleSetupTeardownChained$1.evaluate(TestRuleSetupTeardownChained.java:49)
   [junit4]   2> at org.apache.lucene.util.AbstractBeforeAfterRule$1.evaluate(AbstractBeforeAfterRule.java:45)
   [junit4]   2> at org.apache.lucene.util.TestRuleThreadAndTestName$1.evaluate(TestRuleThreadAndTestName.java:48)
   [junit4]   2> at org.apache.lucene.util.TestRuleIgnoreAfterMaxFailures$1.evaluate(TestRuleIgnoreAfterMaxFailures.java:64)
   [junit4]   2> at org.apache.lucene.util.TestRuleMarkFailure$1.evaluate(TestRuleMarkFailure.java:47)
   [junit4]   2> at com.carrotsearch.randomizedtesting.rules.StatementAdapter.evaluate(StatementAdapter.java:36)
   [junit4]   2> at com.carrotsearch.randomizedtesting.ThreadLeakControl$StatementRunner.run(ThreadLeakControl.java:368)
   [junit4]   2> at com.carrotsearch.randomizedtesting.ThreadLeakControl.forkTimeoutingTask(ThreadLeakControl.java:817)
   [junit4]   2> at com.carrotsearch.randomizedtesting.ThreadLeakControl$3.evaluate(ThreadLeakControl.java:468)
   [junit4]   2> at com.carrotsearch.randomizedtesting.RandomizedRunner.runSingleTest(RandomizedRunner.java:943)
   [junit4]   2> at com.carrotsearch.randomizedtesting.RandomizedRunner$5.evaluate(RandomizedRunner.java:829)
   [junit4]   2> at com.carrotsearch.randomizedtesting.RandomizedRunner$6.evaluate(RandomizedRunner.java:879)
   [junit4]   2> at com.carrotsearch.randomizedtesting.RandomizedRunner$7.evaluate(RandomizedRunner.java:890)
   [junit4]   2> at com.carrotsearch.randomizedtesting.rules.StatementAdapter.evaluate(StatementAdapter.java:36)
   [junit4]   2> at com.carrotsearch.randomizedtesting.rules.SystemPropertiesRestoreRule$1.evaluate(SystemPropertiesRestoreRule.java:57)
   [junit4]   2> at org.apache.lucene.util.AbstractBeforeAfterRule$1.evaluate(AbstractBeforeAfterRule.java:45)
   [junit4]   2> at com.carrotsearch.randomizedtesting.rules.StatementAdapter.evaluate(StatementAdapter.java:36)
   [junit4]   2> at org.apache.lucene.util.TestRuleStoreClassName$1.evaluate(TestRuleStoreClassName.java:41)
   [junit4]   2> at com.carrotsearch.randomizedtesting.rules.NoShadowingOrOverridesOnMethodsRule$1.evaluate(NoShadowingOrOverridesOnMethodsRule.java:40)
   [junit4]   2> at com.carrotsearch.randomizedtesting.rules.NoShadowingOrOverridesOnMethodsRule$1.evaluate(NoShadowingOrOverridesOnMethodsRule.java:40)
   [junit4]   2> at com.carrotsearch.randomizedtesting.rules.StatementAdapter.evaluate(StatementAdapter.java:36)
   [junit4]   2> at com.carrotsearch.randomizedtesting.rules.StatementAdapter.evaluate(StatementAdapter.java:36)
   [junit4]   2> at com.carrotsearch.randomizedtesting.rules.StatementAdapter.evaluate(StatementAdapter.java:36)
   [junit4]   2> at org.apache.lucene.util.TestRuleAssertionsRequired$1.evaluate(TestRuleAssertionsRequired.java:53)
   [junit4]   2> at org.apache.lucene.util.TestRuleMarkFailure$1.evaluate(TestRuleMarkFailure.java:47)
   [junit4]   2> at org.apache.lucene.util.TestRuleIgnoreAfterMaxFailures$1.evaluate(TestRuleIgnoreAfterMaxFailures.java:64)
   [junit4]   2> at org.apache.lucene.util.TestRuleIgnoreTestSuites$1.evaluate(TestRuleIgnoreTestSuites.java:54)
   [junit4]   2> at com.carrotsearch.randomizedtesting.rules.StatementAdapter.evaluate(StatementAdapter.java:36)
   [junit4]   2> at com.carrotsearch.randomizedtesting.ThreadLeakControl$StatementRunner.run(ThreadLeakControl.java:368)
   [junit4]   2> at java.lang.Thread.run(Thread.java:748)
   [junit4]   2>
   [junit4]   2> 823979 INFO  (TEST-SpellCheckCollatorTest.testEstimatedHitCounts-seed#[8CD7520189270179]) [    ] o.a.s.SolrTestCaseJ4 ###Ending testEstimatedHitCounts
   [junit4]   2> NOTE: reproduce with: ant test  -Dtestcase=SpellCheckCollatorTest -Dtests.method=testEstimatedHitCounts -Dtests.seed=8CD7520189270179 -Dtests.multiplier=3 -Dtests.slow=true -Dtests.locale=mt -Dtests.timezone=Africa/Maputo -Dtests.asserts=true -Dtests.file.encoding=UTF-8
   [junit4] ERROR   0.16s J0 | SpellCheckCollatorTest.testEstimatedHitCounts <<<
   [junit4]    > Throwable #1: java.lang.RuntimeException: Exception during query
   [junit4]    > at __randomizedtesting.SeedInfo.seed([8CD7520189270179:BD6CEC342C1811A9]:0)
   [junit4]    > at org.apache.solr.SolrTestCaseJ4.assertQ(SolrTestCaseJ4.java:908)
   [junit4]    > at org.apache.solr.SolrTestCaseJ4.assertQ(SolrTestCaseJ4.java:868)
   [junit4]    > at org.apache.solr.spelling.SpellCheckCollatorTest.testEstimatedHitCounts(SpellCheckCollatorTest.java:569)
   [junit4]    > at java.lang.Thread.run(Thread.java:748)
   [junit4]    > Caused by: java.lang.RuntimeException: REQUEST FAILED: xpath=//lst[@name='spellcheck']/lst[@name='collations']/lst[@name='collation']/long[@name='hits' and 3 <= . and . <= 13]
   [junit4]    > xml response was: <?xml version="1.0" encoding="UTF-8"?>
   [junit4]    > <response>
   [junit4]    > <lst name="responseHeader"><int name="status">0</int><int name="QTime">2</int></lst><result name="response" numFound="0" start="0"></result><lst name="spellcheck"><lst name="suggestions"><lst name="everother"><int name="numFound">1</int><int name="startOffset">9</int><int name="endOffset">18</int><arr name="suggestion"><str>everyother</str></arr></lst></lst><lst name="collations"><lst name="collation"><str name="collationQuery">teststop:everyother</str><long name="hits">14</long><lst name="misspellingsAndCorrections"><str name="everother">everyother</str></lst></lst></lst></lst>
   [junit4]    > </response>
   [junit4]    > request was:spellcheck=true&spellcheck.dictionary=direct&spellcheck.count=1&spellcheck.collate=true&spellcheck.maxCollationTries=1&spellcheck.maxCollations=1&spellcheck.collateExtendedResults=true&qt=/spellCheckCompRH&q=teststop:everother&spellcheck.collateMaxCollectDocs=5
   [junit4]    > at org.apache.solr.SolrTestCaseJ4.assertQ(SolrTestCaseJ4.java:901)
   [junit4]    > ... 41 more
   [junit4]   2> 823982 INFO  (TEST-SpellCheckCollatorTest.testCollationWithRangeQuery-seed#[8CD7520189270179]) [    ] o.a.s.SolrTestCaseJ4 ###Starting testCollationWithRangeQuery
   [junit4]   1> id:[1 TO 10] AND lowerfilt:love
   [junit4]   2> 824037 INFO  (TEST-SpellCheckCollatorTest.testCollationWithRangeQuery-seed#[8CD7520189270179]) [    ] o.a.s.SolrTestCaseJ4 ###Ending testCollationWithRangeQuery
   [junit4]   2> 824039 INFO  (TEST-SpellCheckCollatorTest.testZeroTries-seed#[8CD7520189270179]) [    ] o.a.s.SolrTestCaseJ4 ###Starting testZeroTries
   [junit4]   2> 824092 INFO  (TEST-SpellCheckCollatorTest.testZeroTries-seed#[8CD7520189270179]) [    ] o.a.s.SolrTestCaseJ4 ###Ending testZeroTries
   [junit4]   2> 824094 INFO  (TEST-SpellCheckCollatorTest.testCollateWithFilter-seed#[8CD7520189270179]) [    ] o.a.s.SolrTestCaseJ4 ###Starting testCollateWithFilter
   [junit4]   2> 824163 INFO  (TEST-SpellCheckCollatorTest.testCollateWithFilter-seed#[8CD7520189270179]) [    ] o.a.s.SolrTestCaseJ4 ###Ending testCollateWithFilter
   [junit4]   2> 824166 INFO  (TEST-SpellCheckCollatorTest.testCollationWithHypens-seed#[8CD7520189270179]) [    ] o.a.s.SolrTestCaseJ4 ###Starting testCollationWithHypens
   [junit4]   2> 824285 INFO  (TEST-SpellCheckCollatorTest.testCollationWithHypens-seed#[8CD7520189270179]) [    ] o.a.s.SolrTestCaseJ4 ###Ending testCollationWithHypens
   [junit4]   2> 824286 INFO  (TEST-SpellCheckCollatorTest.testCollateWithGrouping-seed#[8CD7520189270179]) [    ] o.a.s.SolrTestCaseJ4 ###Starting testCollateWithGrouping
   [junit4]   2> 824367 INFO  (TEST-SpellCheckCollatorTest.testCollateWithGrouping-seed#[8CD7520189270179]) [    ] o.a.s.SolrTestCaseJ4 ###Ending testCollateWithGrouping
   [junit4]   2> 824369 INFO  (TEST-SpellCheckCollatorTest.testCollateWithMultipleRequestHandlers-seed#[8CD7520189270179]) [    ] o.a.s.SolrTestCaseJ4 ###Starting testCollateWithMultipleRequestHandlers
   [junit4]   2> 824445 INFO  (TEST-SpellCheckCollatorTest.testCollateWithMultipleRequestHandlers-seed#[8CD7520189270179]) [    ] o.a.s.SolrTestCaseJ4 ###Ending testCollateWithMultipleRequestHandlers
   [junit4]   2> 824447 INFO  (TEST-SpellCheckCollatorTest.testWithCursorMark-seed#[8CD7520189270179]) [    ] o.a.s.SolrTestCaseJ4 ###Starting testWithCursorMark
   [junit4]   2> 824509 INFO  (TEST-SpellCheckCollatorTest.testWithCursorMark-seed#[8CD7520189270179]) [    ] o.a.s.SolrTestCaseJ4 ###Ending testWithCursorMark
   [junit4]   2> 824513 INFO  (TEST-SpellCheckCollatorTest.testExtendedCollate-seed#[8CD7520189270179]) [    ] o.a.s.SolrTestCaseJ4 ###Starting testExtendedCollate
   [junit4]   2> 824574 INFO  (TEST-SpellCheckCollatorTest.testExtendedCollate-seed#[8CD7520189270179]) [    ] o.a.s.SolrTestCaseJ4 ###Ending testExtendedCollate
   [junit4]   2> 824574 INFO  (SUITE-SpellCheckCollatorTest-seed#[8CD7520189270179]-worker) [    ] o.a.s.SolrTestCaseJ4 ###deleteCore
   [junit4]   2> 824574 INFO  (SUITE-SpellCheckCollatorTest-seed#[8CD7520189270179]-worker) [    ] o.a.s.c.CoreContainer Shutting down CoreContainer instance=19509123
   [junit4]   2> 824574 INFO  (SUITE-SpellCheckCollatorTest-seed#[8CD7520189270179]-worker) [    ] o.a.s.m.SolrMetricManager Closing metric reporters for registry=solr.node, tag=null
   [junit4]   2> 824574 INFO  (SUITE-SpellCheckCollatorTest-seed#[8CD7520189270179]-worker) [    ] o.a.s.m.r.SolrJmxReporter Closing reporter [org.apache.solr.metrics.reporters.SolrJmxReporter@124cb9a: rootName = null, domain = solr.node, service url = null, agent id = null] for registry solr.node / com.codahale.metrics.MetricRegistry@1bf4394
   [junit4]   2> 824579 INFO  (SUITE-SpellCheckCollatorTest-seed#[8CD7520189270179]-worker) [    ] o.a.s.m.SolrMetricManager Closing metric reporters for registry=solr.jvm, tag=null
   [junit4]   2> 824579 INFO  (SUITE-SpellCheckCollatorTest-seed#[8CD7520189270179]-worker) [    ] o.a.s.m.r.SolrJmxReporter Closing reporter [org.apache.solr.metrics.reporters.SolrJmxReporter@a35055: rootName = null, domain = solr.jvm, service url = null, agent id = null] for registry solr.jvm / com.codahale.metrics.MetricRegistry@191af83
   [junit4]   2> 824583 INFO  (SUITE-SpellCheckCollatorTest-seed#[8CD7520189270179]-worker) [    ] o.a.s.m.SolrMetricManager Closing metric reporters for registry=solr.jetty, tag=null
   [junit4]   2> 824583 INFO  (SUITE-SpellCheckCollatorTest-seed#[8CD7520189270179]-worker) [    ] o.a.s.m.r.SolrJmxReporter Closing reporter [org.apache.solr.metrics.reporters.SolrJmxReporter@71e86c: rootName = null, domain = solr.jetty, service url = null, agent id = null] for registry solr.jetty / com.codahale.metrics.MetricRegistry@1837f49
   [junit4]   2> 824583 INFO  (coreCloseExecutor-4136-thread-1) [    x:collection1] o.a.s.c.SolrCore [collection1]  CLOSING SolrCore org.apache.solr.core.SolrCore@2d157
   [junit4]   2> 824583 INFO  (coreCloseExecutor-4136-thread-1) [    x:collection1] o.a.s.m.SolrMetricManager Closing metric reporters for registry=solr.core.collection1, tag=184663
   [junit4]   2> 824583 INFO  (coreCloseExecutor-4136-thread-1) [    x:collection1] o.a.s.m.r.SolrJmxReporter Closing reporter [org.apache.solr.metrics.reporters.SolrJmxReporter@e42192: rootName = null, domain = solr.core.collection1, service url = null, agent id = null] for registry solr.core.collection1 / com.codahale.metrics.MetricRegistry@40941d
   [junit4]   2> NOTE: leaving temporary files on disk at: /home/jenkins/workspace/Lucene-Solr-7.x-Linux/solr/build/solr-core/test/J0/temp/solr.spelling.SpellCheckCollatorTest_8CD7520189270179-001
   [junit4]   2> NOTE: test params are: codec=Asserting(Lucene70): {start1=PostingsFormat(name=Direct), range_facet_l_dv=PostingsFormat(name=Direct), multiDefault=PostingsFormat(name=LuceneVarGapDocFreqInterval), intDefault=PostingsFormat(name=Memory), range_facet_l=PostingsFormat(name=LuceneVarGapDocFreqInterval), lowerfilt1and2=PostingsFormat(name=LuceneVarGapDocFreqInterval), end4=TestBloomFilteredLucenePostings(BloomFilteringPostingsFormat(Lucene50(blocksize=128))), end3=PostingsFormat(name=Memory), end2=PostingsFormat(name=Direct), end1=PostingsFormat(name=LuceneVarGapDocFreqInterval), lowerfilt=PostingsFormat(name=LuceneVarGapDocFreqInterval), gram1=PostingsFormat(name=LuceneVarGapDocFreqInterval), id=PostingsFormat(name=Direct), gram2=PostingsFormat(name=Direct), gram3=PostingsFormat(name=Memory), start3=TestBloomFilteredLucenePostings(BloomFilteringPostingsFormat(Lucene50(blocksize=128))), gram4=TestBloomFilteredLucenePostings(BloomFilteringPostingsFormat(Lucene50(blocksize=128))), start2=PostingsFormat(name=LuceneVarGapDocFreqInterval), timestamp=PostingsFormat(name=LuceneVarGapDocFreqInterval), start4=PostingsFormat(name=Memory), lowerfilt1=TestBloomFilteredLucenePostings(BloomFilteringPostingsFormat(Lucene50(blocksize=128))), teststop=PostingsFormat(name=LuceneVarGapDocFreqInterval), id_i1=PostingsFormat(name=Memory), range_facet_i_dv=PostingsFormat(name=LuceneVarGapDocFreqInterval), word=PostingsFormat(name=LuceneVarGapDocFreqInterval)}, docValues:{range_facet_l_dv=DocValuesFormat(name=Lucene70), range_facet_i_dv=DocValuesFormat(name=Asserting), intDvoDefault=DocValuesFormat(name=Lucene70), timestamp=DocValuesFormat(name=Asserting)}, maxPointsInLeafNode=1024, maxMBSortInHeap=5.93991551053661, sim=RandomSimilarity(queryNorm=true): {}, locale=mt, timezone=Africa/Maputo
   [junit4]   2> NOTE: Linux 4.13.0-36-generic i386/Oracle Corporation 1.8.0_162 (32-bit)/cpus=8,threads=1,free=248375472,total=396361728
   [junit4]   2> NOTE: All tests run in this JVM: [SynonymTokenizerTest, TokenizerChainTest, EnumFieldTest, MetricTriggerTest, TestRawTransformer, TestUseDocValuesAsStored, HighlighterConfigTest, TestNoOpRegenerator, SpellingQueryConverterTest, TestIndexSearcher, BadCopyFieldTest, UUIDFieldTest, HttpPartitionTest, SparseHLLTest, JvmMetricsTest, ZkShardTermsTest, TestPolicyCloud, MissingSegmentRecoveryTest, ClassificationUpdateProcessorFactoryTest, AddSchemaFieldsUpdateProcessorFactoryTest, TestMergePolicyConfig, TestDirectoryFactory, TestFieldCacheWithThreads, OverseerModifyCollectionTest, TestWordDelimiterFilterFactory, TestManagedStopFilterFactory, TestConfig, MoveReplicaTest, TestJsonFacetsWithNestedObjects, TestSkipOverseerOperations, BlockJoinFacetRandomTest, ZkCLITest, OutputWriterTest, TestReloadDeadlock, TestJavabinTupleStreamParser, TestSystemCollAutoCreate, TestHashPartitioner, TestSQLHandlerNonCloud, ParsingFieldUpdateProcessorsTest, TestCSVLoader, TestNumericRangeQuery64, TestIndexingPerformance, OpenCloseCoreStressTest, ConnectionReuseTest, TestSchemaNameResource, OverseerTaskQueueTest, TestClusterProperties, SolrRequestParserTest, TestOnReconnectListenerSupport, CurrencyFieldTypeTest, TestBulkSchemaConcurrent, OutOfBoxZkACLAndCredentialsProvidersTest, EchoParamsTest, SpatialHeatmapFacetsTest, SolrCLIZkUtilsTest, TestReplicaProperties, AliasIntegrationTest, CloneFieldUpdateProcessorFactoryTest, TolerantUpdateProcessorTest, TestSolrConfigHandler, AnalysisErrorHandlingTest, FullSolrCloudDistribCmdsTest, TestCloudPseudoReturnFields, StatsReloadRaceTest, InfixSuggestersTest, TestDistributedSearch, TestOmitPositions, SimpleMLTQParserTest, TestPivotHelperCode, BigEndianAscendingWordSerializerTest, SolrGangliaReporterTest, UpdateParamsTest, TestLegacyField, DeleteNodeTest, TestReqParamsAPI, DistributedDebugComponentTest, TestBlendedInfixSuggestions, HdfsThreadLeakTest, TestNodeLostTrigger, TestCollectionsAPIViaSolrCloudCluster, TestComponentsName, DistributedFacetPivotLargeTest, TestCollationField, TestStressLucene, SolrIndexSplitterTest, TestWriterPerf, TestScoreJoinQPScore, IndexBasedSpellCheckerTest, TestDistributedStatsComponentCardinality, CoreSorterTest, SearchHandlerTest, PluginInfoTest, TestCollationFieldDocValues, TestFieldResource, AutoAddReplicasPlanActionTest, ShardSplitTest, TemplateUpdateProcessorTest, TestPKIAuthenticationPlugin, TestPHPSerializedResponseWriter, TestTrieFacet, ConjunctionSolrSpellCheckerTest, TestInfoStreamLogging, TestSchemaManager, SimpleFacetsTest, TestFieldCacheSort, TestPayloadScoreQParserPlugin, PropertiesRequestHandlerTest, TestMaxScoreQueryParser, TestPseudoReturnFields, ReplicationFactorTest, DirectUpdateHandlerTest, TestPullReplicaErrorHandling, TestExclusionRuleCollectionAccess, TestCoreBackup, TestConfigSets, TestComplexPhraseLeadingWildcard, TestConfigOverlay, SpellCheckCollatorTest]
   [junit4] Completed [329/783 (1!)] on J0 in 1.77s, 11 tests, 1 error <<< FAILURES!

[...truncated 46736 lines...]
[repro] Jenkins log URL: https://jenkins.thetaphi.de/job/Lucene-Solr-7.x-Linux/1528/consoleText

[repro] Revision: e7dd3fc26c4e4dac17f18ae0e81bfc1356fb7df4

[repro] Ant options: "-Dargs=-server -XX:+UseG1GC"
[repro] Repro line:  ant test  -Dtestcase=SpellCheckCollatorTest -Dtests.method=testEstimatedHitCounts -Dtests.seed=8CD7520189270179 -Dtests.multiplier=3 -Dtests.slow=true -Dtests.locale=mt -Dtests.timezone=Africa/Maputo -Dtests.asserts=true -Dtests.file.encoding=UTF-8

[repro] ant clean

[...truncated 6 lines...]
[repro] Test suites by module:
[repro]    solr/core
[repro]       SpellCheckCollatorTest
[repro] ant compile-test

[...truncated 3310 lines...]
[repro] ant test-nocompile -Dtests.dups=5 -Dtests.maxfailures=5 -Dtests.class="*.SpellCheckCollatorTest" -Dtests.showOutput=onerror "-Dargs=-server -XX:+UseG1GC" -Dtests.seed=8CD7520189270179 -Dtests.multiplier=3 -Dtests.slow=true -Dtests.locale=mt -Dtests.timezone=Africa/Maputo -Dtests.asserts=true -Dtests.file.encoding=UTF-8

[...truncated 32 lines...]
   [junit4] Suite: org.apache.solr.spelling.SpellCheckCollatorTest
   [junit4]   2> 0    INFO  (SUITE-SpellCheckCollatorTest-seed#[8CD7520189270179]-worker) [    ] o.a.s.SolrTestCaseJ4 SecureRandom sanity checks: test.solr.allowed.securerandom=null & java.security.egd=file:/dev/./urandom
   [junit4]   2> Creating dataDir: /home/jenkins/workspace/Lucene-Solr-7.x-Linux/solr/build/solr-core/test/J0/temp/solr.spelling.SpellCheckCollatorTest_8CD7520189270179-001/init-core-data-001
   [junit4]   2> 147  INFO  (SUITE-SpellCheckCollatorTest-seed#[8CD7520189270179]-worker) [    ] o.a.s.SolrTestCaseJ4 Using TrieFields (NUMERIC_POINTS_SYSPROP=false) w/NUMERIC_DOCVALUES_SYSPROP=false
   [junit4]   2> 209  INFO  (SUITE-SpellCheckCollatorTest-seed#[8CD7520189270179]-worker) [    ] o.e.j.u.log Logging initialized @1987ms to org.eclipse.jetty.util.log.Slf4jLog
   [junit4]   2> 218  INFO  (SUITE-SpellCheckCollatorTest-seed#[8CD7520189270179]-worker) [    ] o.a.s.SolrTestCaseJ4 Randomized ssl (true) and clientAuth (true) via: @org.apache.solr.util.RandomizeSSL(reason=, ssl=NaN, value=NaN, clientAuth=NaN)
   [junit4]   2> 641  INFO  (SUITE-SpellCheckCollatorTest-seed#[8CD7520189270179]-worker) [    ] o.a.s.SolrTestCaseJ4 ####initCore
   [junit4]   2> 804  INFO  (SUITE-SpellCheckCollatorTest-seed#[8CD7520189270179]-worker) [    ] o.a.s.c.SolrResourceLoader Using system property solr.solr.home: /home/jenkins/workspace/Lucene-Solr-7.x-Linux/solr/core/src/test-files/solr
   [junit4]   2> 817  INFO  (SUITE-SpellCheckCollatorTest-seed#[8CD7520189270179]-worker) [    ] o.a.s.c.SolrResourceLoader [null] Added 2 libs to classloader, from paths: [/home/jenkins/workspace/Lucene-Solr-7.x-Linux/solr/core/src/test-files/solr/collection1/lib, /home/jenkins/workspace/Lucene-Solr-7.x-Linux/solr/core/src/test-files/solr/collection1/lib/classes]
   [junit4]   2> 1176 INFO  (SUITE-SpellCheckCollatorTest-seed#[8CD7520189270179]-worker) [    ] o.a.s.c.SolrConfig Using Lucene MatchVersion: 7.4.0
   [junit4]   2> 1379 INFO  (SUITE-SpellCheckCollatorTest-seed#[8CD7520189270179]-worker) [    ] o.a.s.s.IndexSchema [null] Schema name=test
   [junit4]   2> 1421 WARN  (SUITE-SpellCheckCollatorTest-seed#[8CD7520189270179]-worker) [    ] o.a.s.c.SolrResourceLoader Solr loaded a deprecated plugin/analysis class [solr.TrieIntField]. Please consult documentation how to replace it accordingly.
   [junit4]   2> 1432 WARN  (SUITE-SpellCheckCollatorTest-seed#[8CD7520189270179]-worker) [    ] o.a.s.c.SolrResourceLoader Solr loaded a deprecated plugin/analysis class [solr.TrieFloatField]. Please consult documentation how to replace it accordingly.
   [junit4]   2> 1440 WARN  (SUITE-SpellCheckCollatorTest-seed#[8CD7520189270179]-worker) [    ] o.a.s.c.SolrResourceLoader Solr loaded a deprecated plugin/analysis class [solr.TrieLongField]. Please consult documentation how to replace it accordingly.
   [junit4]   2> 1448 WARN  (SUITE-SpellCheckCollatorTest-seed#[8CD7520189270179]-worker) [    ] o.a.s.c.SolrResourceLoader Solr loaded a deprecated plugin/analysis class [solr.TrieDoubleField]. Please consult documentation how to replace it accordingly.
   [junit4]   2> 1616 WARN  (SUITE-SpellCheckCollatorTest-seed#[8CD7520189270179]-worker) [    ] o.a.s.c.SolrResourceLoader Solr loaded a deprecated plugin/analysis class [solr.TrieDateField]. Please consult documentation how to replace it accordingly.
   [junit4]   2> 1917 WARN  (SUITE-SpellCheckCollatorTest-seed#[8CD7520189270179]-worker) [    ] o.a.s.c.SolrResourceLoader Solr loaded a deprecated plugin/analysis class [solr.WordDelimiterFilterFactory]. Please consult documentation how to replace it accordingly.
   [junit4]   2> 2034 WARN  (SUITE-SpellCheckCollatorTest-seed#[8CD7520189270179]-worker) [    ] o.a.s.c.SolrResourceLoader Solr loaded a deprecated plugin/analysis class [solr.GeoHashField]. Please consult documentation how to replace it accordingly.
   [junit4]   2> 2042 WARN  (SUITE-SpellCheckCollatorTest-seed#[8CD7520189270179]-worker) [    ] o.a.s.c.SolrResourceLoader Solr loaded a deprecated plugin/analysis class [solr.LatLonType]. Please consult documentation how to replace it accordingly.
   [junit4]   2> 2053 WARN  (SUITE-SpellCheckCollatorTest-seed#[8CD7520189270179]-worker) [    ] o.a.s.c.SolrResourceLoader Solr loaded a deprecated plugin/analysis class [solr.CurrencyField]. Please consult documentation how to replace it accordingly.
   [junit4]   2> 2096 WARN  (SUITE-SpellCheckCollatorTest-seed#[8CD7520189270179]-worker) [    ] o.a.s.c.SolrResourceLoader Solr loaded a deprecated plugin/analysis class [solr.EnumField]. Please consult documentation how to replace it accordingly.
   [junit4]   2> 2188 INFO  (SUITE-SpellCheckCollatorTest-seed#[8CD7520189270179]-worker) [    ] o.a.s.s.IndexSchema Loaded schema test/1.0 with uniqueid field id
   [junit4]   2> 2995 WARN  (SUITE-SpellCheckCollatorTest-seed#[8CD7520189270179]-worker) [    ] o.a.s.m.r.SolrJmxReporter No JMX server found. Not exposing Solr metrics via JMX.
   [junit4]   2> 2996 WARN  (SUITE-SpellCheckCollatorTest-seed#[8CD7520189270179]-worker) [    ] o.a.s.m.r.SolrJmxReporter No JMX server found. Not exposing Solr metrics via JMX.
   [junit4]   2> 2996 WARN  (SUITE-SpellCheckCollatorTest-seed#[8CD7520189270179]-worker) [    ] o.a.s.m.r.SolrJmxReporter No JMX server found. Not exposing Solr metrics via JMX.
   [junit4]   2> 3057 INFO  (coreLoadExecutor-6-thread-1) [    ] o.a.s.c.TransientSolrCoreCacheDefault Allocating transient cache for 2147483647 transient cores
   [junit4]   2> 3060 INFO  (coreLoadExecutor-6-thread-1) [    x:collection1] o.a.s.c.SolrResourceLoader [null] Added 2 libs to classloader, from paths: [/home/jenkins/workspace/Lucene-Solr-7.x-Linux/solr/core/src/test-files/solr/collection1/lib, /home/jenkins/workspace/Lucene-Solr-7.x-Linux/solr/core/src/test-files/solr/collection1/lib/classes]
   [junit4]   2> 3122 INFO  (coreLoadExecutor-6-thread-1) [    x:collection1] o.a.s.c.SolrConfig Using Lucene MatchVersion: 7.4.0
   [junit4]   2> 3159 INFO  (coreLoadExecutor-6-thread-1) [    x:collection1] o.a.s.s.IndexSchema [collection1] Schema name=test
   [junit4]   2> 3528 INFO  (coreLoadExecutor-6-thread-1) [    x:collection1] o.a.s.s.IndexSchema Loaded schema test/1.0 with uniqueid field id
   [junit4]   2> 3561 INFO  (coreLoadExecutor-6-thread-1) [    x:collection1] o.a.s.c.CoreContainer Creating SolrCore 'collection1' using configuration from instancedir /home/jenkins/workspace/Lucene-Solr-7.x-Linux/solr/core/src/test-files/solr/collection1, trusted=true
   [junit4]   2> 3618 WARN  (coreLoadExecutor-6-thread-1) [    x:collection1] o.a.s.m.r.SolrJmxReporter No JMX server found. Not exposing Solr metrics via JMX.
   [junit4]   2> 3625 INFO  (coreLoadExecutor-6-thread-1) [    x:collection1] o.a.s.c.SolrCore solr.RecoveryStrategy.Builder
   [junit4]   2> 3633 INFO  (coreLoadExecutor-6-thread-1) [    x:collection1] o.a.s.c.SolrCore [[collection1] ] Opening new SolrCore at [/home/jenkins/workspace/Lucene-Solr-7.x-Linux/solr/core/src/test-files/solr/collection1], dataDir=[/home/jenkins/workspace/Lucene-Solr-7.x-Linux/so

[...truncated too long message...]

onWithRangeQuery-seed#[8CD7520189270179]) [    ] o.a.s.SolrTestCaseJ4 ###Starting testCollationWithRangeQuery
   [junit4]   1> id:[1 TO 10] AND lowerfilt:love
   [junit4]   2> 14439 INFO  (TEST-SpellCheckCollatorTest.testCollationWithRangeQuery-seed#[8CD7520189270179]) [    ] o.a.s.SolrTestCaseJ4 ###Ending testCollationWithRangeQuery
   [junit4] OK      0.09s J2 | SpellCheckCollatorTest.testCollationWithRangeQuery
   [junit4]   2> 14453 INFO  (TEST-SpellCheckCollatorTest.testZeroTries-seed#[8CD7520189270179]) [    ] o.a.s.SolrTestCaseJ4 ###Starting testZeroTries
   [junit4]   2> 14532 INFO  (TEST-SpellCheckCollatorTest.testZeroTries-seed#[8CD7520189270179]) [    ] o.a.s.SolrTestCaseJ4 ###Ending testZeroTries
   [junit4] OK      0.09s J2 | SpellCheckCollatorTest.testZeroTries
   [junit4]   2> 14533 INFO  (TEST-SpellCheckCollatorTest.testCollateWithFilter-seed#[8CD7520189270179]) [    ] o.a.s.SolrTestCaseJ4 ###Starting testCollateWithFilter
   [junit4]   2> 14669 INFO  (TEST-SpellCheckCollatorTest.testCollateWithFilter-seed#[8CD7520189270179]) [    ] o.a.s.SolrTestCaseJ4 ###Ending testCollateWithFilter
   [junit4] OK      0.14s J2 | SpellCheckCollatorTest.testCollateWithFilter
   [junit4]   2> 14671 INFO  (TEST-SpellCheckCollatorTest.testCollationWithHypens-seed#[8CD7520189270179]) [    ] o.a.s.SolrTestCaseJ4 ###Starting testCollationWithHypens
   [junit4]   2> 14835 INFO  (TEST-SpellCheckCollatorTest.testCollationWithHypens-seed#[8CD7520189270179]) [    ] o.a.s.SolrTestCaseJ4 ###Ending testCollationWithHypens
   [junit4] OK      0.17s J2 | SpellCheckCollatorTest.testCollationWithHypens
   [junit4]   2> 14837 INFO  (TEST-SpellCheckCollatorTest.testCollateWithGrouping-seed#[8CD7520189270179]) [    ] o.a.s.SolrTestCaseJ4 ###Starting testCollateWithGrouping
   [junit4]   2> 14912 INFO  (TEST-SpellCheckCollatorTest.testCollateWithGrouping-seed#[8CD7520189270179]) [    ] o.a.s.SolrTestCaseJ4 ###Ending testCollateWithGrouping
   [junit4] OK      0.08s J2 | SpellCheckCollatorTest.testCollateWithGrouping
   [junit4]   2> 14917 INFO  (TEST-SpellCheckCollatorTest.testCollateWithMultipleRequestHandlers-seed#[8CD7520189270179]) [    ] o.a.s.SolrTestCaseJ4 ###Starting testCollateWithMultipleRequestHandlers
   [junit4]   2> 14993 INFO  (TEST-SpellCheckCollatorTest.testCollateWithMultipleRequestHandlers-seed#[8CD7520189270179]) [    ] o.a.s.SolrTestCaseJ4 ###Ending testCollateWithMultipleRequestHandlers
   [junit4] OK      0.08s J2 | SpellCheckCollatorTest.testCollateWithMultipleRequestHandlers
   [junit4]   2> 14995 INFO  (TEST-SpellCheckCollatorTest.testWithCursorMark-seed#[8CD7520189270179]) [    ] o.a.s.SolrTestCaseJ4 ###Starting testWithCursorMark
   [junit4]   2> 15070 INFO  (TEST-SpellCheckCollatorTest.testWithCursorMark-seed#[8CD7520189270179]) [    ] o.a.s.SolrTestCaseJ4 ###Ending testWithCursorMark
   [junit4] OK      0.08s J2 | SpellCheckCollatorTest.testWithCursorMark
   [junit4]   2> 15071 INFO  (TEST-SpellCheckCollatorTest.testExtendedCollate-seed#[8CD7520189270179]) [    ] o.a.s.SolrTestCaseJ4 ###Starting testExtendedCollate
   [junit4]   2> 15192 INFO  (TEST-SpellCheckCollatorTest.testExtendedCollate-seed#[8CD7520189270179]) [    ] o.a.s.SolrTestCaseJ4 ###Ending testExtendedCollate
   [junit4] OK      0.12s J2 | SpellCheckCollatorTest.testExtendedCollate
   [junit4]   2> 15192 INFO  (SUITE-SpellCheckCollatorTest-seed#[8CD7520189270179]-worker) [    ] o.a.s.SolrTestCaseJ4 ###deleteCore
   [junit4]   2> 15193 INFO  (SUITE-SpellCheckCollatorTest-seed#[8CD7520189270179]-worker) [    ] o.a.s.c.CoreContainer Shutting down CoreContainer instance=12897960
   [junit4]   2> 15193 INFO  (SUITE-SpellCheckCollatorTest-seed#[8CD7520189270179]-worker) [    ] o.a.s.m.SolrMetricManager Closing metric reporters for registry=solr.node, tag=null
   [junit4]   2> 15193 INFO  (SUITE-SpellCheckCollatorTest-seed#[8CD7520189270179]-worker) [    ] o.a.s.m.r.SolrJmxReporter Closing reporter [org.apache.solr.metrics.reporters.SolrJmxReporter@ed43f5: rootName = null, domain = solr.node, service url = null, agent id = null] for registry solr.node / null
   [junit4]   2> 15193 INFO  (SUITE-SpellCheckCollatorTest-seed#[8CD7520189270179]-worker) [    ] o.a.s.m.SolrMetricManager Closing metric reporters for registry=solr.jvm, tag=null
   [junit4]   2> 15193 INFO  (SUITE-SpellCheckCollatorTest-seed#[8CD7520189270179]-worker) [    ] o.a.s.m.r.SolrJmxReporter Closing reporter [org.apache.solr.metrics.reporters.SolrJmxReporter@7ce6fa: rootName = null, domain = solr.jvm, service url = null, agent id = null] for registry solr.jvm / null
   [junit4]   2> 15193 INFO  (SUITE-SpellCheckCollatorTest-seed#[8CD7520189270179]-worker) [    ] o.a.s.m.SolrMetricManager Closing metric reporters for registry=solr.jetty, tag=null
   [junit4]   2> 15193 INFO  (SUITE-SpellCheckCollatorTest-seed#[8CD7520189270179]-worker) [    ] o.a.s.m.r.SolrJmxReporter Closing reporter [org.apache.solr.metrics.reporters.SolrJmxReporter@1aef5f0: rootName = null, domain = solr.jetty, service url = null, agent id = null] for registry solr.jetty / null
   [junit4]   2> 15199 INFO  (coreCloseExecutor-23-thread-1) [    x:collection1] o.a.s.c.SolrCore [collection1]  CLOSING SolrCore org.apache.solr.core.SolrCore@1194587
   [junit4]   2> 15200 INFO  (coreCloseExecutor-23-thread-1) [    x:collection1] o.a.s.m.SolrMetricManager Closing metric reporters for registry=solr.core.collection1, tag=18433415
   [junit4]   2> 15201 INFO  (coreCloseExecutor-23-thread-1) [    x:collection1] o.a.s.m.r.SolrJmxReporter Closing reporter [org.apache.solr.metrics.reporters.SolrJmxReporter@6db3a0: rootName = null, domain = solr.core.collection1, service url = null, agent id = null] for registry solr.core.collection1 / null
   [junit4]   2> NOTE: leaving temporary files on disk at: /home/jenkins/workspace/Lucene-Solr-7.x-Linux/solr/build/solr-core/test/J2/temp/solr.spelling.SpellCheckCollatorTest_8CD7520189270179-002
   [junit4]   2> NOTE: test params are: codec=Asserting(Lucene70): {start1=PostingsFormat(name=Direct), range_facet_l_dv=PostingsFormat(name=Direct), multiDefault=PostingsFormat(name=LuceneVarGapDocFreqInterval), intDefault=PostingsFormat(name=Memory), range_facet_l=PostingsFormat(name=LuceneVarGapDocFreqInterval), lowerfilt1and2=PostingsFormat(name=LuceneVarGapDocFreqInterval), end4=TestBloomFilteredLucenePostings(BloomFilteringPostingsFormat(Lucene50(blocksize=128))), end3=PostingsFormat(name=Memory), end2=PostingsFormat(name=Direct), end1=PostingsFormat(name=LuceneVarGapDocFreqInterval), lowerfilt=PostingsFormat(name=LuceneVarGapDocFreqInterval), gram1=PostingsFormat(name=LuceneVarGapDocFreqInterval), id=PostingsFormat(name=Direct), gram2=PostingsFormat(name=Direct), gram3=PostingsFormat(name=Memory), start3=TestBloomFilteredLucenePostings(BloomFilteringPostingsFormat(Lucene50(blocksize=128))), gram4=TestBloomFilteredLucenePostings(BloomFilteringPostingsFormat(Lucene50(blocksize=128))), start2=PostingsFormat(name=LuceneVarGapDocFreqInterval), timestamp=PostingsFormat(name=LuceneVarGapDocFreqInterval), start4=PostingsFormat(name=Memory), lowerfilt1=TestBloomFilteredLucenePostings(BloomFilteringPostingsFormat(Lucene50(blocksize=128))), teststop=PostingsFormat(name=LuceneVarGapDocFreqInterval), id_i1=PostingsFormat(name=Memory), range_facet_i_dv=PostingsFormat(name=LuceneVarGapDocFreqInterval), word=PostingsFormat(name=LuceneVarGapDocFreqInterval)}, docValues:{range_facet_l_dv=DocValuesFormat(name=Lucene70), range_facet_i_dv=DocValuesFormat(name=Asserting), intDvoDefault=DocValuesFormat(name=Lucene70), timestamp=DocValuesFormat(name=Asserting)}, maxPointsInLeafNode=1024, maxMBSortInHeap=5.93991551053661, sim=RandomSimilarity(queryNorm=true): {}, locale=mt, timezone=Africa/Maputo
   [junit4]   2> NOTE: Linux 4.13.0-36-generic i386/Oracle Corporation 1.8.0_162 (32-bit)/cpus=8,threads=1,free=110328416,total=160432128
   [junit4]   2> NOTE: All tests run in this JVM: [SpellCheckCollatorTest, SpellCheckCollatorTest]
   [junit4] Completed [5/5 (5!)] on J2 in 3.23s, 11 tests, 1 error <<< FAILURES!

[...truncated 15 lines...]
BUILD FAILED
/home/jenkins/workspace/Lucene-Solr-7.x-Linux/lucene/common-build.xml:1561: The following error occurred while executing this line:
/home/jenkins/workspace/Lucene-Solr-7.x-Linux/lucene/common-build.xml:1085: There were test failures: 5 suites, 55 tests, 5 errors [seed: 8CD7520189270179]

Total time: 20 seconds

[repro] Setting last failure code to 256

[repro] Failures:
[repro]   5/5 failed: org.apache.solr.spelling.SpellCheckCollatorTest
[repro] Exiting with code 256
+ mv lucene/build lucene/build.repro
+ mv solr/build solr/build.repro
+ mv lucene/build.orig lucene/build
+ mv solr/build.orig solr/build
Archiving artifacts
Setting ANT_1_8_2_HOME=/var/lib/jenkins/tools/hudson.tasks.Ant_AntInstallation/ANT_1.8.2
[WARNINGS] Parsing warnings in console log with parser Java Compiler (javac)
Setting ANT_1_8_2_HOME=/var/lib/jenkins/tools/hudson.tasks.Ant_AntInstallation/ANT_1.8.2
Setting ANT_1_8_2_HOME=/var/lib/jenkins/tools/hudson.tasks.Ant_AntInstallation/ANT_1.8.2
<Git Blamer> Using GitBlamer to create author and commit information for all warnings.
<Git Blamer> GIT_COMMIT=e7dd3fc26c4e4dac17f18ae0e81bfc1356fb7df4, workspace=/var/lib/jenkins/workspace/Lucene-Solr-7.x-Linux
[WARNINGS] Computing warning deltas based on reference build #1527
Recording test results
Setting ANT_1_8_2_HOME=/var/lib/jenkins/tools/hudson.tasks.Ant_AntInstallation/ANT_1.8.2
Build step 'Publish JUnit test result report' changed build result to UNSTABLE
Email was triggered for: Unstable (Test Failures)
Sending email for trigger: Unstable (Test Failures)
Setting ANT_1_8_2_HOME=/var/lib/jenkins/tools/hudson.tasks.Ant_AntInstallation/ANT_1.8.2
Setting ANT_1_8_2_HOME=/var/lib/jenkins/tools/hudson.tasks.Ant_AntInstallation/ANT_1.8.2
Setting ANT_1_8_2_HOME=/var/lib/jenkins/tools/hudson.tasks.Ant_AntInstallation/ANT_1.8.2
Setting ANT_1_8_2_HOME=/var/lib/jenkins/tools/hudson.tasks.Ant_AntInstallation/ANT_1.8.2


---------------------------------------------------------------------
To unsubscribe, e-mail: [hidden email]
For additional commands, e-mail: [hidden email]