[JENKINS] Lucene-Solr-7.x-Linux (64bit/jdk-10) - Build # 2299 - Unstable!

Previous Topic Next Topic
 
classic Classic list List threaded Threaded
1 message Options
Reply | Threaded
Open this post in threaded view
|

[JENKINS] Lucene-Solr-7.x-Linux (64bit/jdk-10) - Build # 2299 - Unstable!

Policeman Jenkins Server-2
Build: https://jenkins.thetaphi.de/job/Lucene-Solr-7.x-Linux/2299/
Java: 64bit/jdk-10 -XX:-UseCompressedOops -XX:+UseParallelGC

8 tests failed.
FAILED:  org.apache.solr.cloud.LeaderTragicEventTest.testOtherReplicasAreNotActive

Error Message:
org.apache.lucene.store.RawDirectoryWrapper cannot be cast to org.apache.lucene.store.MockDirectoryWrapper

Stack Trace:
java.lang.ClassCastException: org.apache.lucene.store.RawDirectoryWrapper cannot be cast to org.apache.lucene.store.MockDirectoryWrapper
        at __randomizedtesting.SeedInfo.seed([6C3FCA574BA3CD72:E98BE620775C74EA]:0)
        at org.apache.solr.cloud.LeaderTragicEventTest.corruptLeader(LeaderTragicEventTest.java:102)
        at org.apache.solr.cloud.LeaderTragicEventTest.testOtherReplicasAreNotActive(LeaderTragicEventTest.java:150)
        at java.base/jdk.internal.reflect.NativeMethodAccessorImpl.invoke0(Native Method)
        at java.base/jdk.internal.reflect.NativeMethodAccessorImpl.invoke(NativeMethodAccessorImpl.java:62)
        at java.base/jdk.internal.reflect.DelegatingMethodAccessorImpl.invoke(DelegatingMethodAccessorImpl.java:43)
        at java.base/java.lang.reflect.Method.invoke(Method.java:564)
        at com.carrotsearch.randomizedtesting.RandomizedRunner.invoke(RandomizedRunner.java:1737)
        at com.carrotsearch.randomizedtesting.RandomizedRunner$8.evaluate(RandomizedRunner.java:934)
        at com.carrotsearch.randomizedtesting.RandomizedRunner$9.evaluate(RandomizedRunner.java:970)
        at com.carrotsearch.randomizedtesting.RandomizedRunner$10.evaluate(RandomizedRunner.java:984)
        at com.carrotsearch.randomizedtesting.rules.SystemPropertiesRestoreRule$1.evaluate(SystemPropertiesRestoreRule.java:57)
        at org.apache.lucene.util.TestRuleSetupTeardownChained$1.evaluate(TestRuleSetupTeardownChained.java:49)
        at org.apache.lucene.util.AbstractBeforeAfterRule$1.evaluate(AbstractBeforeAfterRule.java:45)
        at org.apache.lucene.util.TestRuleThreadAndTestName$1.evaluate(TestRuleThreadAndTestName.java:48)
        at org.apache.lucene.util.TestRuleIgnoreAfterMaxFailures$1.evaluate(TestRuleIgnoreAfterMaxFailures.java:64)
        at org.apache.lucene.util.TestRuleMarkFailure$1.evaluate(TestRuleMarkFailure.java:47)
        at com.carrotsearch.randomizedtesting.rules.StatementAdapter.evaluate(StatementAdapter.java:36)
        at com.carrotsearch.randomizedtesting.ThreadLeakControl$StatementRunner.run(ThreadLeakControl.java:368)
        at com.carrotsearch.randomizedtesting.ThreadLeakControl.forkTimeoutingTask(ThreadLeakControl.java:817)
        at com.carrotsearch.randomizedtesting.ThreadLeakControl$3.evaluate(ThreadLeakControl.java:468)
        at com.carrotsearch.randomizedtesting.RandomizedRunner.runSingleTest(RandomizedRunner.java:943)
        at com.carrotsearch.randomizedtesting.RandomizedRunner$5.evaluate(RandomizedRunner.java:829)
        at com.carrotsearch.randomizedtesting.RandomizedRunner$6.evaluate(RandomizedRunner.java:879)
        at com.carrotsearch.randomizedtesting.RandomizedRunner$7.evaluate(RandomizedRunner.java:890)
        at com.carrotsearch.randomizedtesting.rules.StatementAdapter.evaluate(StatementAdapter.java:36)
        at com.carrotsearch.randomizedtesting.rules.SystemPropertiesRestoreRule$1.evaluate(SystemPropertiesRestoreRule.java:57)
        at org.apache.lucene.util.AbstractBeforeAfterRule$1.evaluate(AbstractBeforeAfterRule.java:45)
        at com.carrotsearch.randomizedtesting.rules.StatementAdapter.evaluate(StatementAdapter.java:36)
        at org.apache.lucene.util.TestRuleStoreClassName$1.evaluate(TestRuleStoreClassName.java:41)
        at com.carrotsearch.randomizedtesting.rules.NoShadowingOrOverridesOnMethodsRule$1.evaluate(NoShadowingOrOverridesOnMethodsRule.java:40)
        at com.carrotsearch.randomizedtesting.rules.NoShadowingOrOverridesOnMethodsRule$1.evaluate(NoShadowingOrOverridesOnMethodsRule.java:40)
        at com.carrotsearch.randomizedtesting.rules.StatementAdapter.evaluate(StatementAdapter.java:36)
        at com.carrotsearch.randomizedtesting.rules.StatementAdapter.evaluate(StatementAdapter.java:36)
        at org.apache.lucene.util.TestRuleAssertionsRequired$1.evaluate(TestRuleAssertionsRequired.java:53)
        at org.apache.lucene.util.TestRuleMarkFailure$1.evaluate(TestRuleMarkFailure.java:47)
        at org.apache.lucene.util.TestRuleIgnoreAfterMaxFailures$1.evaluate(TestRuleIgnoreAfterMaxFailures.java:64)
        at org.apache.lucene.util.TestRuleIgnoreTestSuites$1.evaluate(TestRuleIgnoreTestSuites.java:54)
        at com.carrotsearch.randomizedtesting.rules.StatementAdapter.evaluate(StatementAdapter.java:36)
        at com.carrotsearch.randomizedtesting.ThreadLeakControl$StatementRunner.run(ThreadLeakControl.java:368)
        at java.base/java.lang.Thread.run(Thread.java:844)


FAILED:  org.apache.solr.cloud.LeaderTragicEventTest.test

Error Message:
Error from server at http://127.0.0.1:37057/solr: collection already exists: collection1

Stack Trace:
org.apache.solr.client.solrj.impl.HttpSolrClient$RemoteSolrException: Error from server at http://127.0.0.1:37057/solr: collection already exists: collection1
        at __randomizedtesting.SeedInfo.seed([6C3FCA574BA3CD72:E46BF58DE55FA08A]:0)
        at org.apache.solr.client.solrj.impl.HttpSolrClient.executeMethod(HttpSolrClient.java:643)
        at org.apache.solr.client.solrj.impl.HttpSolrClient.request(HttpSolrClient.java:255)
        at org.apache.solr.client.solrj.impl.HttpSolrClient.request(HttpSolrClient.java:244)
        at org.apache.solr.client.solrj.impl.LBHttpSolrClient.doRequest(LBHttpSolrClient.java:483)
        at org.apache.solr.client.solrj.impl.LBHttpSolrClient.request(LBHttpSolrClient.java:413)
        at org.apache.solr.client.solrj.impl.CloudSolrClient.sendRequest(CloudSolrClient.java:1106)
        at org.apache.solr.client.solrj.impl.CloudSolrClient.requestWithRetryOnStaleState(CloudSolrClient.java:886)
        at org.apache.solr.client.solrj.impl.CloudSolrClient.request(CloudSolrClient.java:819)
        at org.apache.solr.client.solrj.SolrRequest.process(SolrRequest.java:194)
        at org.apache.solr.client.solrj.SolrRequest.process(SolrRequest.java:211)
        at org.apache.solr.cloud.LeaderTragicEventTest.test(LeaderTragicEventTest.java:70)
        at java.base/jdk.internal.reflect.NativeMethodAccessorImpl.invoke0(Native Method)
        at java.base/jdk.internal.reflect.NativeMethodAccessorImpl.invoke(NativeMethodAccessorImpl.java:62)
        at java.base/jdk.internal.reflect.DelegatingMethodAccessorImpl.invoke(DelegatingMethodAccessorImpl.java:43)
        at java.base/java.lang.reflect.Method.invoke(Method.java:564)
        at com.carrotsearch.randomizedtesting.RandomizedRunner.invoke(RandomizedRunner.java:1737)
        at com.carrotsearch.randomizedtesting.RandomizedRunner$8.evaluate(RandomizedRunner.java:934)
        at com.carrotsearch.randomizedtesting.RandomizedRunner$9.evaluate(RandomizedRunner.java:970)
        at com.carrotsearch.randomizedtesting.RandomizedRunner$10.evaluate(RandomizedRunner.java:984)
        at com.carrotsearch.randomizedtesting.rules.SystemPropertiesRestoreRule$1.evaluate(SystemPropertiesRestoreRule.java:57)
        at org.apache.lucene.util.TestRuleSetupTeardownChained$1.evaluate(TestRuleSetupTeardownChained.java:49)
        at org.apache.lucene.util.AbstractBeforeAfterRule$1.evaluate(AbstractBeforeAfterRule.java:45)
        at org.apache.lucene.util.TestRuleThreadAndTestName$1.evaluate(TestRuleThreadAndTestName.java:48)
        at org.apache.lucene.util.TestRuleIgnoreAfterMaxFailures$1.evaluate(TestRuleIgnoreAfterMaxFailures.java:64)
        at org.apache.lucene.util.TestRuleMarkFailure$1.evaluate(TestRuleMarkFailure.java:47)
        at com.carrotsearch.randomizedtesting.rules.StatementAdapter.evaluate(StatementAdapter.java:36)
        at com.carrotsearch.randomizedtesting.ThreadLeakControl$StatementRunner.run(ThreadLeakControl.java:368)
        at com.carrotsearch.randomizedtesting.ThreadLeakControl.forkTimeoutingTask(ThreadLeakControl.java:817)
        at com.carrotsearch.randomizedtesting.ThreadLeakControl$3.evaluate(ThreadLeakControl.java:468)
        at com.carrotsearch.randomizedtesting.RandomizedRunner.runSingleTest(RandomizedRunner.java:943)
        at com.carrotsearch.randomizedtesting.RandomizedRunner$5.evaluate(RandomizedRunner.java:829)
        at com.carrotsearch.randomizedtesting.RandomizedRunner$6.evaluate(RandomizedRunner.java:879)
        at com.carrotsearch.randomizedtesting.RandomizedRunner$7.evaluate(RandomizedRunner.java:890)
        at com.carrotsearch.randomizedtesting.rules.StatementAdapter.evaluate(StatementAdapter.java:36)
        at com.carrotsearch.randomizedtesting.rules.SystemPropertiesRestoreRule$1.evaluate(SystemPropertiesRestoreRule.java:57)
        at org.apache.lucene.util.AbstractBeforeAfterRule$1.evaluate(AbstractBeforeAfterRule.java:45)
        at com.carrotsearch.randomizedtesting.rules.StatementAdapter.evaluate(StatementAdapter.java:36)
        at org.apache.lucene.util.TestRuleStoreClassName$1.evaluate(TestRuleStoreClassName.java:41)
        at com.carrotsearch.randomizedtesting.rules.NoShadowingOrOverridesOnMethodsRule$1.evaluate(NoShadowingOrOverridesOnMethodsRule.java:40)
        at com.carrotsearch.randomizedtesting.rules.NoShadowingOrOverridesOnMethodsRule$1.evaluate(NoShadowingOrOverridesOnMethodsRule.java:40)
        at com.carrotsearch.randomizedtesting.rules.StatementAdapter.evaluate(StatementAdapter.java:36)
        at com.carrotsearch.randomizedtesting.rules.StatementAdapter.evaluate(StatementAdapter.java:36)
        at org.apache.lucene.util.TestRuleAssertionsRequired$1.evaluate(TestRuleAssertionsRequired.java:53)
        at org.apache.lucene.util.TestRuleMarkFailure$1.evaluate(TestRuleMarkFailure.java:47)
        at org.apache.lucene.util.TestRuleIgnoreAfterMaxFailures$1.evaluate(TestRuleIgnoreAfterMaxFailures.java:64)
        at org.apache.lucene.util.TestRuleIgnoreTestSuites$1.evaluate(TestRuleIgnoreTestSuites.java:54)
        at com.carrotsearch.randomizedtesting.rules.StatementAdapter.evaluate(StatementAdapter.java:36)
        at com.carrotsearch.randomizedtesting.ThreadLeakControl$StatementRunner.run(ThreadLeakControl.java:368)
        at java.base/java.lang.Thread.run(Thread.java:844)


FAILED:  org.apache.solr.cloud.LeaderTragicEventTest.testOtherReplicasAreNotActive

Error Message:
org.apache.lucene.store.RawDirectoryWrapper cannot be cast to org.apache.lucene.store.MockDirectoryWrapper

Stack Trace:
java.lang.ClassCastException: org.apache.lucene.store.RawDirectoryWrapper cannot be cast to org.apache.lucene.store.MockDirectoryWrapper
        at __randomizedtesting.SeedInfo.seed([6C3FCA574BA3CD72:E98BE620775C74EA]:0)
        at org.apache.solr.cloud.LeaderTragicEventTest.corruptLeader(LeaderTragicEventTest.java:102)
        at org.apache.solr.cloud.LeaderTragicEventTest.testOtherReplicasAreNotActive(LeaderTragicEventTest.java:150)
        at java.base/jdk.internal.reflect.NativeMethodAccessorImpl.invoke0(Native Method)
        at java.base/jdk.internal.reflect.NativeMethodAccessorImpl.invoke(NativeMethodAccessorImpl.java:62)
        at java.base/jdk.internal.reflect.DelegatingMethodAccessorImpl.invoke(DelegatingMethodAccessorImpl.java:43)
        at java.base/java.lang.reflect.Method.invoke(Method.java:564)
        at com.carrotsearch.randomizedtesting.RandomizedRunner.invoke(RandomizedRunner.java:1737)
        at com.carrotsearch.randomizedtesting.RandomizedRunner$8.evaluate(RandomizedRunner.java:934)
        at com.carrotsearch.randomizedtesting.RandomizedRunner$9.evaluate(RandomizedRunner.java:970)
        at com.carrotsearch.randomizedtesting.RandomizedRunner$10.evaluate(RandomizedRunner.java:984)
        at com.carrotsearch.randomizedtesting.rules.SystemPropertiesRestoreRule$1.evaluate(SystemPropertiesRestoreRule.java:57)
        at org.apache.lucene.util.TestRuleSetupTeardownChained$1.evaluate(TestRuleSetupTeardownChained.java:49)
        at org.apache.lucene.util.AbstractBeforeAfterRule$1.evaluate(AbstractBeforeAfterRule.java:45)
        at org.apache.lucene.util.TestRuleThreadAndTestName$1.evaluate(TestRuleThreadAndTestName.java:48)
        at org.apache.lucene.util.TestRuleIgnoreAfterMaxFailures$1.evaluate(TestRuleIgnoreAfterMaxFailures.java:64)
        at org.apache.lucene.util.TestRuleMarkFailure$1.evaluate(TestRuleMarkFailure.java:47)
        at com.carrotsearch.randomizedtesting.rules.StatementAdapter.evaluate(StatementAdapter.java:36)
        at com.carrotsearch.randomizedtesting.ThreadLeakControl$StatementRunner.run(ThreadLeakControl.java:368)
        at com.carrotsearch.randomizedtesting.ThreadLeakControl.forkTimeoutingTask(ThreadLeakControl.java:817)
        at com.carrotsearch.randomizedtesting.ThreadLeakControl$3.evaluate(ThreadLeakControl.java:468)
        at com.carrotsearch.randomizedtesting.RandomizedRunner.runSingleTest(RandomizedRunner.java:943)
        at com.carrotsearch.randomizedtesting.RandomizedRunner$5.evaluate(RandomizedRunner.java:829)
        at com.carrotsearch.randomizedtesting.RandomizedRunner$6.evaluate(RandomizedRunner.java:879)
        at com.carrotsearch.randomizedtesting.RandomizedRunner$7.evaluate(RandomizedRunner.java:890)
        at com.carrotsearch.randomizedtesting.rules.StatementAdapter.evaluate(StatementAdapter.java:36)
        at com.carrotsearch.randomizedtesting.rules.SystemPropertiesRestoreRule$1.evaluate(SystemPropertiesRestoreRule.java:57)
        at org.apache.lucene.util.AbstractBeforeAfterRule$1.evaluate(AbstractBeforeAfterRule.java:45)
        at com.carrotsearch.randomizedtesting.rules.StatementAdapter.evaluate(StatementAdapter.java:36)
        at org.apache.lucene.util.TestRuleStoreClassName$1.evaluate(TestRuleStoreClassName.java:41)
        at com.carrotsearch.randomizedtesting.rules.NoShadowingOrOverridesOnMethodsRule$1.evaluate(NoShadowingOrOverridesOnMethodsRule.java:40)
        at com.carrotsearch.randomizedtesting.rules.NoShadowingOrOverridesOnMethodsRule$1.evaluate(NoShadowingOrOverridesOnMethodsRule.java:40)
        at com.carrotsearch.randomizedtesting.rules.StatementAdapter.evaluate(StatementAdapter.java:36)
        at com.carrotsearch.randomizedtesting.rules.StatementAdapter.evaluate(StatementAdapter.java:36)
        at org.apache.lucene.util.TestRuleAssertionsRequired$1.evaluate(TestRuleAssertionsRequired.java:53)
        at org.apache.lucene.util.TestRuleMarkFailure$1.evaluate(TestRuleMarkFailure.java:47)
        at org.apache.lucene.util.TestRuleIgnoreAfterMaxFailures$1.evaluate(TestRuleIgnoreAfterMaxFailures.java:64)
        at org.apache.lucene.util.TestRuleIgnoreTestSuites$1.evaluate(TestRuleIgnoreTestSuites.java:54)
        at com.carrotsearch.randomizedtesting.rules.StatementAdapter.evaluate(StatementAdapter.java:36)
        at com.carrotsearch.randomizedtesting.ThreadLeakControl$StatementRunner.run(ThreadLeakControl.java:368)
        at java.base/java.lang.Thread.run(Thread.java:844)


FAILED:  org.apache.solr.cloud.LeaderTragicEventTest.test

Error Message:
Error from server at http://127.0.0.1:34517/solr: collection already exists: collection1

Stack Trace:
org.apache.solr.client.solrj.impl.HttpSolrClient$RemoteSolrException: Error from server at http://127.0.0.1:34517/solr: collection already exists: collection1
        at __randomizedtesting.SeedInfo.seed([6C3FCA574BA3CD72:E46BF58DE55FA08A]:0)
        at org.apache.solr.client.solrj.impl.HttpSolrClient.executeMethod(HttpSolrClient.java:643)
        at org.apache.solr.client.solrj.impl.HttpSolrClient.request(HttpSolrClient.java:255)
        at org.apache.solr.client.solrj.impl.HttpSolrClient.request(HttpSolrClient.java:244)
        at org.apache.solr.client.solrj.impl.LBHttpSolrClient.doRequest(LBHttpSolrClient.java:483)
        at org.apache.solr.client.solrj.impl.LBHttpSolrClient.request(LBHttpSolrClient.java:413)
        at org.apache.solr.client.solrj.impl.CloudSolrClient.sendRequest(CloudSolrClient.java:1106)
        at org.apache.solr.client.solrj.impl.CloudSolrClient.requestWithRetryOnStaleState(CloudSolrClient.java:886)
        at org.apache.solr.client.solrj.impl.CloudSolrClient.request(CloudSolrClient.java:819)
        at org.apache.solr.client.solrj.SolrRequest.process(SolrRequest.java:194)
        at org.apache.solr.client.solrj.SolrRequest.process(SolrRequest.java:211)
        at org.apache.solr.cloud.LeaderTragicEventTest.test(LeaderTragicEventTest.java:70)
        at java.base/jdk.internal.reflect.NativeMethodAccessorImpl.invoke0(Native Method)
        at java.base/jdk.internal.reflect.NativeMethodAccessorImpl.invoke(NativeMethodAccessorImpl.java:62)
        at java.base/jdk.internal.reflect.DelegatingMethodAccessorImpl.invoke(DelegatingMethodAccessorImpl.java:43)
        at java.base/java.lang.reflect.Method.invoke(Method.java:564)
        at com.carrotsearch.randomizedtesting.RandomizedRunner.invoke(RandomizedRunner.java:1737)
        at com.carrotsearch.randomizedtesting.RandomizedRunner$8.evaluate(RandomizedRunner.java:934)
        at com.carrotsearch.randomizedtesting.RandomizedRunner$9.evaluate(RandomizedRunner.java:970)
        at com.carrotsearch.randomizedtesting.RandomizedRunner$10.evaluate(RandomizedRunner.java:984)
        at com.carrotsearch.randomizedtesting.rules.SystemPropertiesRestoreRule$1.evaluate(SystemPropertiesRestoreRule.java:57)
        at org.apache.lucene.util.TestRuleSetupTeardownChained$1.evaluate(TestRuleSetupTeardownChained.java:49)
        at org.apache.lucene.util.AbstractBeforeAfterRule$1.evaluate(AbstractBeforeAfterRule.java:45)
        at org.apache.lucene.util.TestRuleThreadAndTestName$1.evaluate(TestRuleThreadAndTestName.java:48)
        at org.apache.lucene.util.TestRuleIgnoreAfterMaxFailures$1.evaluate(TestRuleIgnoreAfterMaxFailures.java:64)
        at org.apache.lucene.util.TestRuleMarkFailure$1.evaluate(TestRuleMarkFailure.java:47)
        at com.carrotsearch.randomizedtesting.rules.StatementAdapter.evaluate(StatementAdapter.java:36)
        at com.carrotsearch.randomizedtesting.ThreadLeakControl$StatementRunner.run(ThreadLeakControl.java:368)
        at com.carrotsearch.randomizedtesting.ThreadLeakControl.forkTimeoutingTask(ThreadLeakControl.java:817)
        at com.carrotsearch.randomizedtesting.ThreadLeakControl$3.evaluate(ThreadLeakControl.java:468)
        at com.carrotsearch.randomizedtesting.RandomizedRunner.runSingleTest(RandomizedRunner.java:943)
        at com.carrotsearch.randomizedtesting.RandomizedRunner$5.evaluate(RandomizedRunner.java:829)
        at com.carrotsearch.randomizedtesting.RandomizedRunner$6.evaluate(RandomizedRunner.java:879)
        at com.carrotsearch.randomizedtesting.RandomizedRunner$7.evaluate(RandomizedRunner.java:890)
        at com.carrotsearch.randomizedtesting.rules.StatementAdapter.evaluate(StatementAdapter.java:36)
        at com.carrotsearch.randomizedtesting.rules.SystemPropertiesRestoreRule$1.evaluate(SystemPropertiesRestoreRule.java:57)
        at org.apache.lucene.util.AbstractBeforeAfterRule$1.evaluate(AbstractBeforeAfterRule.java:45)
        at com.carrotsearch.randomizedtesting.rules.StatementAdapter.evaluate(StatementAdapter.java:36)
        at org.apache.lucene.util.TestRuleStoreClassName$1.evaluate(TestRuleStoreClassName.java:41)
        at com.carrotsearch.randomizedtesting.rules.NoShadowingOrOverridesOnMethodsRule$1.evaluate(NoShadowingOrOverridesOnMethodsRule.java:40)
        at com.carrotsearch.randomizedtesting.rules.NoShadowingOrOverridesOnMethodsRule$1.evaluate(NoShadowingOrOverridesOnMethodsRule.java:40)
        at com.carrotsearch.randomizedtesting.rules.StatementAdapter.evaluate(StatementAdapter.java:36)
        at com.carrotsearch.randomizedtesting.rules.StatementAdapter.evaluate(StatementAdapter.java:36)
        at org.apache.lucene.util.TestRuleAssertionsRequired$1.evaluate(TestRuleAssertionsRequired.java:53)
        at org.apache.lucene.util.TestRuleMarkFailure$1.evaluate(TestRuleMarkFailure.java:47)
        at org.apache.lucene.util.TestRuleIgnoreAfterMaxFailures$1.evaluate(TestRuleIgnoreAfterMaxFailures.java:64)
        at org.apache.lucene.util.TestRuleIgnoreTestSuites$1.evaluate(TestRuleIgnoreTestSuites.java:54)
        at com.carrotsearch.randomizedtesting.rules.StatementAdapter.evaluate(StatementAdapter.java:36)
        at com.carrotsearch.randomizedtesting.ThreadLeakControl$StatementRunner.run(ThreadLeakControl.java:368)
        at java.base/java.lang.Thread.run(Thread.java:844)


FAILED:  org.apache.solr.cloud.LeaderTragicEventTest.testOtherReplicasAreNotActive

Error Message:
org.apache.lucene.store.RawDirectoryWrapper cannot be cast to org.apache.lucene.store.MockDirectoryWrapper

Stack Trace:
java.lang.ClassCastException: org.apache.lucene.store.RawDirectoryWrapper cannot be cast to org.apache.lucene.store.MockDirectoryWrapper
        at __randomizedtesting.SeedInfo.seed([6C3FCA574BA3CD72:E98BE620775C74EA]:0)
        at org.apache.solr.cloud.LeaderTragicEventTest.corruptLeader(LeaderTragicEventTest.java:102)
        at org.apache.solr.cloud.LeaderTragicEventTest.testOtherReplicasAreNotActive(LeaderTragicEventTest.java:150)
        at java.base/jdk.internal.reflect.NativeMethodAccessorImpl.invoke0(Native Method)
        at java.base/jdk.internal.reflect.NativeMethodAccessorImpl.invoke(NativeMethodAccessorImpl.java:62)
        at java.base/jdk.internal.reflect.DelegatingMethodAccessorImpl.invoke(DelegatingMethodAccessorImpl.java:43)
        at java.base/java.lang.reflect.Method.invoke(Method.java:564)
        at com.carrotsearch.randomizedtesting.RandomizedRunner.invoke(RandomizedRunner.java:1737)
        at com.carrotsearch.randomizedtesting.RandomizedRunner$8.evaluate(RandomizedRunner.java:934)
        at com.carrotsearch.randomizedtesting.RandomizedRunner$9.evaluate(RandomizedRunner.java:970)
        at com.carrotsearch.randomizedtesting.RandomizedRunner$10.evaluate(RandomizedRunner.java:984)
        at com.carrotsearch.randomizedtesting.rules.SystemPropertiesRestoreRule$1.evaluate(SystemPropertiesRestoreRule.java:57)
        at org.apache.lucene.util.TestRuleSetupTeardownChained$1.evaluate(TestRuleSetupTeardownChained.java:49)
        at org.apache.lucene.util.AbstractBeforeAfterRule$1.evaluate(AbstractBeforeAfterRule.java:45)
        at org.apache.lucene.util.TestRuleThreadAndTestName$1.evaluate(TestRuleThreadAndTestName.java:48)
        at org.apache.lucene.util.TestRuleIgnoreAfterMaxFailures$1.evaluate(TestRuleIgnoreAfterMaxFailures.java:64)
        at org.apache.lucene.util.TestRuleMarkFailure$1.evaluate(TestRuleMarkFailure.java:47)
        at com.carrotsearch.randomizedtesting.rules.StatementAdapter.evaluate(StatementAdapter.java:36)
        at com.carrotsearch.randomizedtesting.ThreadLeakControl$StatementRunner.run(ThreadLeakControl.java:368)
        at com.carrotsearch.randomizedtesting.ThreadLeakControl.forkTimeoutingTask(ThreadLeakControl.java:817)
        at com.carrotsearch.randomizedtesting.ThreadLeakControl$3.evaluate(ThreadLeakControl.java:468)
        at com.carrotsearch.randomizedtesting.RandomizedRunner.runSingleTest(RandomizedRunner.java:943)
        at com.carrotsearch.randomizedtesting.RandomizedRunner$5.evaluate(RandomizedRunner.java:829)
        at com.carrotsearch.randomizedtesting.RandomizedRunner$6.evaluate(RandomizedRunner.java:879)
        at com.carrotsearch.randomizedtesting.RandomizedRunner$7.evaluate(RandomizedRunner.java:890)
        at com.carrotsearch.randomizedtesting.rules.StatementAdapter.evaluate(StatementAdapter.java:36)
        at com.carrotsearch.randomizedtesting.rules.SystemPropertiesRestoreRule$1.evaluate(SystemPropertiesRestoreRule.java:57)
        at org.apache.lucene.util.AbstractBeforeAfterRule$1.evaluate(AbstractBeforeAfterRule.java:45)
        at com.carrotsearch.randomizedtesting.rules.StatementAdapter.evaluate(StatementAdapter.java:36)
        at org.apache.lucene.util.TestRuleStoreClassName$1.evaluate(TestRuleStoreClassName.java:41)
        at com.carrotsearch.randomizedtesting.rules.NoShadowingOrOverridesOnMethodsRule$1.evaluate(NoShadowingOrOverridesOnMethodsRule.java:40)
        at com.carrotsearch.randomizedtesting.rules.NoShadowingOrOverridesOnMethodsRule$1.evaluate(NoShadowingOrOverridesOnMethodsRule.java:40)
        at com.carrotsearch.randomizedtesting.rules.StatementAdapter.evaluate(StatementAdapter.java:36)
        at com.carrotsearch.randomizedtesting.rules.StatementAdapter.evaluate(StatementAdapter.java:36)
        at org.apache.lucene.util.TestRuleAssertionsRequired$1.evaluate(TestRuleAssertionsRequired.java:53)
        at org.apache.lucene.util.TestRuleMarkFailure$1.evaluate(TestRuleMarkFailure.java:47)
        at org.apache.lucene.util.TestRuleIgnoreAfterMaxFailures$1.evaluate(TestRuleIgnoreAfterMaxFailures.java:64)
        at org.apache.lucene.util.TestRuleIgnoreTestSuites$1.evaluate(TestRuleIgnoreTestSuites.java:54)
        at com.carrotsearch.randomizedtesting.rules.StatementAdapter.evaluate(StatementAdapter.java:36)
        at com.carrotsearch.randomizedtesting.ThreadLeakControl$StatementRunner.run(ThreadLeakControl.java:368)
        at java.base/java.lang.Thread.run(Thread.java:844)


FAILED:  org.apache.solr.cloud.LeaderTragicEventTest.test

Error Message:
Error from server at http://127.0.0.1:39073/solr: collection already exists: collection1

Stack Trace:
org.apache.solr.client.solrj.impl.HttpSolrClient$RemoteSolrException: Error from server at http://127.0.0.1:39073/solr: collection already exists: collection1
        at __randomizedtesting.SeedInfo.seed([6C3FCA574BA3CD72:E46BF58DE55FA08A]:0)
        at org.apache.solr.client.solrj.impl.HttpSolrClient.executeMethod(HttpSolrClient.java:643)
        at org.apache.solr.client.solrj.impl.HttpSolrClient.request(HttpSolrClient.java:255)
        at org.apache.solr.client.solrj.impl.HttpSolrClient.request(HttpSolrClient.java:244)
        at org.apache.solr.client.solrj.impl.LBHttpSolrClient.doRequest(LBHttpSolrClient.java:483)
        at org.apache.solr.client.solrj.impl.LBHttpSolrClient.request(LBHttpSolrClient.java:413)
        at org.apache.solr.client.solrj.impl.CloudSolrClient.sendRequest(CloudSolrClient.java:1106)
        at org.apache.solr.client.solrj.impl.CloudSolrClient.requestWithRetryOnStaleState(CloudSolrClient.java:886)
        at org.apache.solr.client.solrj.impl.CloudSolrClient.request(CloudSolrClient.java:819)
        at org.apache.solr.client.solrj.SolrRequest.process(SolrRequest.java:194)
        at org.apache.solr.client.solrj.SolrRequest.process(SolrRequest.java:211)
        at org.apache.solr.cloud.LeaderTragicEventTest.test(LeaderTragicEventTest.java:70)
        at java.base/jdk.internal.reflect.NativeMethodAccessorImpl.invoke0(Native Method)
        at java.base/jdk.internal.reflect.NativeMethodAccessorImpl.invoke(NativeMethodAccessorImpl.java:62)
        at java.base/jdk.internal.reflect.DelegatingMethodAccessorImpl.invoke(DelegatingMethodAccessorImpl.java:43)
        at java.base/java.lang.reflect.Method.invoke(Method.java:564)
        at com.carrotsearch.randomizedtesting.RandomizedRunner.invoke(RandomizedRunner.java:1737)
        at com.carrotsearch.randomizedtesting.RandomizedRunner$8.evaluate(RandomizedRunner.java:934)
        at com.carrotsearch.randomizedtesting.RandomizedRunner$9.evaluate(RandomizedRunner.java:970)
        at com.carrotsearch.randomizedtesting.RandomizedRunner$10.evaluate(RandomizedRunner.java:984)
        at com.carrotsearch.randomizedtesting.rules.SystemPropertiesRestoreRule$1.evaluate(SystemPropertiesRestoreRule.java:57)
        at org.apache.lucene.util.TestRuleSetupTeardownChained$1.evaluate(TestRuleSetupTeardownChained.java:49)
        at org.apache.lucene.util.AbstractBeforeAfterRule$1.evaluate(AbstractBeforeAfterRule.java:45)
        at org.apache.lucene.util.TestRuleThreadAndTestName$1.evaluate(TestRuleThreadAndTestName.java:48)
        at org.apache.lucene.util.TestRuleIgnoreAfterMaxFailures$1.evaluate(TestRuleIgnoreAfterMaxFailures.java:64)
        at org.apache.lucene.util.TestRuleMarkFailure$1.evaluate(TestRuleMarkFailure.java:47)
        at com.carrotsearch.randomizedtesting.rules.StatementAdapter.evaluate(StatementAdapter.java:36)
        at com.carrotsearch.randomizedtesting.ThreadLeakControl$StatementRunner.run(ThreadLeakControl.java:368)
        at com.carrotsearch.randomizedtesting.ThreadLeakControl.forkTimeoutingTask(ThreadLeakControl.java:817)
        at com.carrotsearch.randomizedtesting.ThreadLeakControl$3.evaluate(ThreadLeakControl.java:468)
        at com.carrotsearch.randomizedtesting.RandomizedRunner.runSingleTest(RandomizedRunner.java:943)
        at com.carrotsearch.randomizedtesting.RandomizedRunner$5.evaluate(RandomizedRunner.java:829)
        at com.carrotsearch.randomizedtesting.RandomizedRunner$6.evaluate(RandomizedRunner.java:879)
        at com.carrotsearch.randomizedtesting.RandomizedRunner$7.evaluate(RandomizedRunner.java:890)
        at com.carrotsearch.randomizedtesting.rules.StatementAdapter.evaluate(StatementAdapter.java:36)
        at com.carrotsearch.randomizedtesting.rules.SystemPropertiesRestoreRule$1.evaluate(SystemPropertiesRestoreRule.java:57)
        at org.apache.lucene.util.AbstractBeforeAfterRule$1.evaluate(AbstractBeforeAfterRule.java:45)
        at com.carrotsearch.randomizedtesting.rules.StatementAdapter.evaluate(StatementAdapter.java:36)
        at org.apache.lucene.util.TestRuleStoreClassName$1.evaluate(TestRuleStoreClassName.java:41)
        at com.carrotsearch.randomizedtesting.rules.NoShadowingOrOverridesOnMethodsRule$1.evaluate(NoShadowingOrOverridesOnMethodsRule.java:40)
        at com.carrotsearch.randomizedtesting.rules.NoShadowingOrOverridesOnMethodsRule$1.evaluate(NoShadowingOrOverridesOnMethodsRule.java:40)
        at com.carrotsearch.randomizedtesting.rules.StatementAdapter.evaluate(StatementAdapter.java:36)
        at com.carrotsearch.randomizedtesting.rules.StatementAdapter.evaluate(StatementAdapter.java:36)
        at org.apache.lucene.util.TestRuleAssertionsRequired$1.evaluate(TestRuleAssertionsRequired.java:53)
        at org.apache.lucene.util.TestRuleMarkFailure$1.evaluate(TestRuleMarkFailure.java:47)
        at org.apache.lucene.util.TestRuleIgnoreAfterMaxFailures$1.evaluate(TestRuleIgnoreAfterMaxFailures.java:64)
        at org.apache.lucene.util.TestRuleIgnoreTestSuites$1.evaluate(TestRuleIgnoreTestSuites.java:54)
        at com.carrotsearch.randomizedtesting.rules.StatementAdapter.evaluate(StatementAdapter.java:36)
        at com.carrotsearch.randomizedtesting.ThreadLeakControl$StatementRunner.run(ThreadLeakControl.java:368)
        at java.base/java.lang.Thread.run(Thread.java:844)


FAILED:  org.apache.solr.cloud.LeaderTragicEventTest.testOtherReplicasAreNotActive

Error Message:
org.apache.lucene.store.RawDirectoryWrapper cannot be cast to org.apache.lucene.store.MockDirectoryWrapper

Stack Trace:
java.lang.ClassCastException: org.apache.lucene.store.RawDirectoryWrapper cannot be cast to org.apache.lucene.store.MockDirectoryWrapper
        at __randomizedtesting.SeedInfo.seed([6C3FCA574BA3CD72:E98BE620775C74EA]:0)
        at org.apache.solr.cloud.LeaderTragicEventTest.corruptLeader(LeaderTragicEventTest.java:102)
        at org.apache.solr.cloud.LeaderTragicEventTest.testOtherReplicasAreNotActive(LeaderTragicEventTest.java:150)
        at java.base/jdk.internal.reflect.NativeMethodAccessorImpl.invoke0(Native Method)
        at java.base/jdk.internal.reflect.NativeMethodAccessorImpl.invoke(NativeMethodAccessorImpl.java:62)
        at java.base/jdk.internal.reflect.DelegatingMethodAccessorImpl.invoke(DelegatingMethodAccessorImpl.java:43)
        at java.base/java.lang.reflect.Method.invoke(Method.java:564)
        at com.carrotsearch.randomizedtesting.RandomizedRunner.invoke(RandomizedRunner.java:1737)
        at com.carrotsearch.randomizedtesting.RandomizedRunner$8.evaluate(RandomizedRunner.java:934)
        at com.carrotsearch.randomizedtesting.RandomizedRunner$9.evaluate(RandomizedRunner.java:970)
        at com.carrotsearch.randomizedtesting.RandomizedRunner$10.evaluate(RandomizedRunner.java:984)
        at com.carrotsearch.randomizedtesting.rules.SystemPropertiesRestoreRule$1.evaluate(SystemPropertiesRestoreRule.java:57)
        at org.apache.lucene.util.TestRuleSetupTeardownChained$1.evaluate(TestRuleSetupTeardownChained.java:49)
        at org.apache.lucene.util.AbstractBeforeAfterRule$1.evaluate(AbstractBeforeAfterRule.java:45)
        at org.apache.lucene.util.TestRuleThreadAndTestName$1.evaluate(TestRuleThreadAndTestName.java:48)
        at org.apache.lucene.util.TestRuleIgnoreAfterMaxFailures$1.evaluate(TestRuleIgnoreAfterMaxFailures.java:64)
        at org.apache.lucene.util.TestRuleMarkFailure$1.evaluate(TestRuleMarkFailure.java:47)
        at com.carrotsearch.randomizedtesting.rules.StatementAdapter.evaluate(StatementAdapter.java:36)
        at com.carrotsearch.randomizedtesting.ThreadLeakControl$StatementRunner.run(ThreadLeakControl.java:368)
        at com.carrotsearch.randomizedtesting.ThreadLeakControl.forkTimeoutingTask(ThreadLeakControl.java:817)
        at com.carrotsearch.randomizedtesting.ThreadLeakControl$3.evaluate(ThreadLeakControl.java:468)
        at com.carrotsearch.randomizedtesting.RandomizedRunner.runSingleTest(RandomizedRunner.java:943)
        at com.carrotsearch.randomizedtesting.RandomizedRunner$5.evaluate(RandomizedRunner.java:829)
        at com.carrotsearch.randomizedtesting.RandomizedRunner$6.evaluate(RandomizedRunner.java:879)
        at com.carrotsearch.randomizedtesting.RandomizedRunner$7.evaluate(RandomizedRunner.java:890)
        at com.carrotsearch.randomizedtesting.rules.StatementAdapter.evaluate(StatementAdapter.java:36)
        at com.carrotsearch.randomizedtesting.rules.SystemPropertiesRestoreRule$1.evaluate(SystemPropertiesRestoreRule.java:57)
        at org.apache.lucene.util.AbstractBeforeAfterRule$1.evaluate(AbstractBeforeAfterRule.java:45)
        at com.carrotsearch.randomizedtesting.rules.StatementAdapter.evaluate(StatementAdapter.java:36)
        at org.apache.lucene.util.TestRuleStoreClassName$1.evaluate(TestRuleStoreClassName.java:41)
        at com.carrotsearch.randomizedtesting.rules.NoShadowingOrOverridesOnMethodsRule$1.evaluate(NoShadowingOrOverridesOnMethodsRule.java:40)
        at com.carrotsearch.randomizedtesting.rules.NoShadowingOrOverridesOnMethodsRule$1.evaluate(NoShadowingOrOverridesOnMethodsRule.java:40)
        at com.carrotsearch.randomizedtesting.rules.StatementAdapter.evaluate(StatementAdapter.java:36)
        at com.carrotsearch.randomizedtesting.rules.StatementAdapter.evaluate(StatementAdapter.java:36)
        at org.apache.lucene.util.TestRuleAssertionsRequired$1.evaluate(TestRuleAssertionsRequired.java:53)
        at org.apache.lucene.util.TestRuleMarkFailure$1.evaluate(TestRuleMarkFailure.java:47)
        at org.apache.lucene.util.TestRuleIgnoreAfterMaxFailures$1.evaluate(TestRuleIgnoreAfterMaxFailures.java:64)
        at org.apache.lucene.util.TestRuleIgnoreTestSuites$1.evaluate(TestRuleIgnoreTestSuites.java:54)
        at com.carrotsearch.randomizedtesting.rules.StatementAdapter.evaluate(StatementAdapter.java:36)
        at com.carrotsearch.randomizedtesting.ThreadLeakControl$StatementRunner.run(ThreadLeakControl.java:368)
        at java.base/java.lang.Thread.run(Thread.java:844)


FAILED:  org.apache.solr.cloud.LeaderTragicEventTest.test

Error Message:
Error from server at http://127.0.0.1:43371/solr: collection already exists: collection1

Stack Trace:
org.apache.solr.client.solrj.impl.HttpSolrClient$RemoteSolrException: Error from server at http://127.0.0.1:43371/solr: collection already exists: collection1
        at __randomizedtesting.SeedInfo.seed([6C3FCA574BA3CD72:E46BF58DE55FA08A]:0)
        at org.apache.solr.client.solrj.impl.HttpSolrClient.executeMethod(HttpSolrClient.java:643)
        at org.apache.solr.client.solrj.impl.HttpSolrClient.request(HttpSolrClient.java:255)
        at org.apache.solr.client.solrj.impl.HttpSolrClient.request(HttpSolrClient.java:244)
        at org.apache.solr.client.solrj.impl.LBHttpSolrClient.doRequest(LBHttpSolrClient.java:483)
        at org.apache.solr.client.solrj.impl.LBHttpSolrClient.request(LBHttpSolrClient.java:413)
        at org.apache.solr.client.solrj.impl.CloudSolrClient.sendRequest(CloudSolrClient.java:1106)
        at org.apache.solr.client.solrj.impl.CloudSolrClient.requestWithRetryOnStaleState(CloudSolrClient.java:886)
        at org.apache.solr.client.solrj.impl.CloudSolrClient.request(CloudSolrClient.java:819)
        at org.apache.solr.client.solrj.SolrRequest.process(SolrRequest.java:194)
        at org.apache.solr.client.solrj.SolrRequest.process(SolrRequest.java:211)
        at org.apache.solr.cloud.LeaderTragicEventTest.test(LeaderTragicEventTest.java:70)
        at java.base/jdk.internal.reflect.NativeMethodAccessorImpl.invoke0(Native Method)
        at java.base/jdk.internal.reflect.NativeMethodAccessorImpl.invoke(NativeMethodAccessorImpl.java:62)
        at java.base/jdk.internal.reflect.DelegatingMethodAccessorImpl.invoke(DelegatingMethodAccessorImpl.java:43)
        at java.base/java.lang.reflect.Method.invoke(Method.java:564)
        at com.carrotsearch.randomizedtesting.RandomizedRunner.invoke(RandomizedRunner.java:1737)
        at com.carrotsearch.randomizedtesting.RandomizedRunner$8.evaluate(RandomizedRunner.java:934)
        at com.carrotsearch.randomizedtesting.RandomizedRunner$9.evaluate(RandomizedRunner.java:970)
        at com.carrotsearch.randomizedtesting.RandomizedRunner$10.evaluate(RandomizedRunner.java:984)
        at com.carrotsearch.randomizedtesting.rules.SystemPropertiesRestoreRule$1.evaluate(SystemPropertiesRestoreRule.java:57)
        at org.apache.lucene.util.TestRuleSetupTeardownChained$1.evaluate(TestRuleSetupTeardownChained.java:49)
        at org.apache.lucene.util.AbstractBeforeAfterRule$1.evaluate(AbstractBeforeAfterRule.java:45)
        at org.apache.lucene.util.TestRuleThreadAndTestName$1.evaluate(TestRuleThreadAndTestName.java:48)
        at org.apache.lucene.util.TestRuleIgnoreAfterMaxFailures$1.evaluate(TestRuleIgnoreAfterMaxFailures.java:64)
        at org.apache.lucene.util.TestRuleMarkFailure$1.evaluate(TestRuleMarkFailure.java:47)
        at com.carrotsearch.randomizedtesting.rules.StatementAdapter.evaluate(StatementAdapter.java:36)
        at com.carrotsearch.randomizedtesting.ThreadLeakControl$StatementRunner.run(ThreadLeakControl.java:368)
        at com.carrotsearch.randomizedtesting.ThreadLeakControl.forkTimeoutingTask(ThreadLeakControl.java:817)
        at com.carrotsearch.randomizedtesting.ThreadLeakControl$3.evaluate(ThreadLeakControl.java:468)
        at com.carrotsearch.randomizedtesting.RandomizedRunner.runSingleTest(RandomizedRunner.java:943)
        at com.carrotsearch.randomizedtesting.RandomizedRunner$5.evaluate(RandomizedRunner.java:829)
        at com.carrotsearch.randomizedtesting.RandomizedRunner$6.evaluate(RandomizedRunner.java:879)
        at com.carrotsearch.randomizedtesting.RandomizedRunner$7.evaluate(RandomizedRunner.java:890)
        at com.carrotsearch.randomizedtesting.rules.StatementAdapter.evaluate(StatementAdapter.java:36)
        at com.carrotsearch.randomizedtesting.rules.SystemPropertiesRestoreRule$1.evaluate(SystemPropertiesRestoreRule.java:57)
        at org.apache.lucene.util.AbstractBeforeAfterRule$1.evaluate(AbstractBeforeAfterRule.java:45)
        at com.carrotsearch.randomizedtesting.rules.StatementAdapter.evaluate(StatementAdapter.java:36)
        at org.apache.lucene.util.TestRuleStoreClassName$1.evaluate(TestRuleStoreClassName.java:41)
        at com.carrotsearch.randomizedtesting.rules.NoShadowingOrOverridesOnMethodsRule$1.evaluate(NoShadowingOrOverridesOnMethodsRule.java:40)
        at com.carrotsearch.randomizedtesting.rules.NoShadowingOrOverridesOnMethodsRule$1.evaluate(NoShadowingOrOverridesOnMethodsRule.java:40)
        at com.carrotsearch.randomizedtesting.rules.StatementAdapter.evaluate(StatementAdapter.java:36)
        at com.carrotsearch.randomizedtesting.rules.StatementAdapter.evaluate(StatementAdapter.java:36)
        at org.apache.lucene.util.TestRuleAssertionsRequired$1.evaluate(TestRuleAssertionsRequired.java:53)
        at org.apache.lucene.util.TestRuleMarkFailure$1.evaluate(TestRuleMarkFailure.java:47)
        at org.apache.lucene.util.TestRuleIgnoreAfterMaxFailures$1.evaluate(TestRuleIgnoreAfterMaxFailures.java:64)
        at org.apache.lucene.util.TestRuleIgnoreTestSuites$1.evaluate(TestRuleIgnoreTestSuites.java:54)
        at com.carrotsearch.randomizedtesting.rules.StatementAdapter.evaluate(StatementAdapter.java:36)
        at com.carrotsearch.randomizedtesting.ThreadLeakControl$StatementRunner.run(ThreadLeakControl.java:368)
        at java.base/java.lang.Thread.run(Thread.java:844)




Build Log:
[...truncated 12605 lines...]
   [junit4] Suite: org.apache.solr.cloud.LeaderTragicEventTest
   [junit4]   2> 384153 INFO  (SUITE-LeaderTragicEventTest-seed#[6C3FCA574BA3CD72]-worker) [    ] o.a.s.SolrTestCaseJ4 SecureRandom sanity checks: test.solr.allowed.securerandom=null & java.security.egd=file:/dev/./urandom
   [junit4]   2> Creating dataDir: /home/jenkins/workspace/Lucene-Solr-7.x-Linux/solr/build/solr-core/test/J1/temp/solr.cloud.LeaderTragicEventTest_6C3FCA574BA3CD72-001/init-core-data-001
   [junit4]   2> 384154 WARN  (SUITE-LeaderTragicEventTest-seed#[6C3FCA574BA3CD72]-worker) [    ] o.a.s.SolrTestCaseJ4 startTrackingSearchers: numOpens=6 numCloses=6
   [junit4]   2> 384154 INFO  (SUITE-LeaderTragicEventTest-seed#[6C3FCA574BA3CD72]-worker) [    ] o.a.s.SolrTestCaseJ4 Using PointFields (NUMERIC_POINTS_SYSPROP=true) w/NUMERIC_DOCVALUES_SYSPROP=true
   [junit4]   2> 384154 INFO  (SUITE-LeaderTragicEventTest-seed#[6C3FCA574BA3CD72]-worker) [    ] o.a.s.SolrTestCaseJ4 Randomized ssl (false) and clientAuth (false) via: @org.apache.solr.util.RandomizeSSL(reason="", value=0.0/0.0, ssl=0.0/0.0, clientAuth=0.0/0.0)
   [junit4]   2> 384154 INFO  (SUITE-LeaderTragicEventTest-seed#[6C3FCA574BA3CD72]-worker) [    ] o.a.s.c.MiniSolrCloudCluster Starting cluster of 2 servers in /home/jenkins/workspace/Lucene-Solr-7.x-Linux/solr/build/solr-core/test/J1/temp/solr.cloud.LeaderTragicEventTest_6C3FCA574BA3CD72-001/tempDir-001
   [junit4]   2> 384154 INFO  (SUITE-LeaderTragicEventTest-seed#[6C3FCA574BA3CD72]-worker) [    ] o.a.s.c.ZkTestServer STARTING ZK TEST SERVER
   [junit4]   2> 384155 INFO  (Thread-1045) [    ] o.a.s.c.ZkTestServer client port:0.0.0.0/0.0.0.0:0
   [junit4]   2> 384155 INFO  (Thread-1045) [    ] o.a.s.c.ZkTestServer Starting server
   [junit4]   2> 384156 ERROR (Thread-1045) [    ] o.a.z.s.ZooKeeperServer ZKShutdownHandler is not registered, so ZooKeeper server won't take any action on ERROR or SHUTDOWN server state changes
   [junit4]   2> 384255 INFO  (SUITE-LeaderTragicEventTest-seed#[6C3FCA574BA3CD72]-worker) [    ] o.a.s.c.ZkTestServer start zk server on port:42305
   [junit4]   2> 384258 INFO  (zkConnectionManagerCallback-1095-thread-1) [    ] o.a.s.c.c.ConnectionManager zkClient has connected
   [junit4]   2> 384268 INFO  (jetty-launcher-1092-thread-1) [    ] o.e.j.s.Server jetty-9.4.11.v20180605; built: 2018-06-05T18:24:03.829Z; git: d5fc0523cfa96bfebfbda19606cad384d772f04c; jvm 10+46
   [junit4]   2> 384268 INFO  (jetty-launcher-1092-thread-2) [    ] o.e.j.s.Server jetty-9.4.11.v20180605; built: 2018-06-05T18:24:03.829Z; git: d5fc0523cfa96bfebfbda19606cad384d772f04c; jvm 10+46
   [junit4]   2> 384296 INFO  (jetty-launcher-1092-thread-1) [    ] o.e.j.s.session DefaultSessionIdManager workerName=node0
   [junit4]   2> 384296 INFO  (jetty-launcher-1092-thread-2) [    ] o.e.j.s.session DefaultSessionIdManager workerName=node0
   [junit4]   2> 384296 INFO  (jetty-launcher-1092-thread-1) [    ] o.e.j.s.session No SessionScavenger set, using defaults
   [junit4]   2> 384296 INFO  (jetty-launcher-1092-thread-2) [    ] o.e.j.s.session No SessionScavenger set, using defaults
   [junit4]   2> 384296 INFO  (jetty-launcher-1092-thread-2) [    ] o.e.j.s.session node0 Scavenging every 600000ms
   [junit4]   2> 384296 INFO  (jetty-launcher-1092-thread-1) [    ] o.e.j.s.session node0 Scavenging every 600000ms
   [junit4]   2> 384296 INFO  (jetty-launcher-1092-thread-2) [    ] o.e.j.s.h.ContextHandler Started o.e.j.s.ServletContextHandler@4b50f299{/solr,null,AVAILABLE}
   [junit4]   2> 384297 INFO  (jetty-launcher-1092-thread-1) [    ] o.e.j.s.h.ContextHandler Started o.e.j.s.ServletContextHandler@2e41d183{/solr,null,AVAILABLE}
   [junit4]   2> 384298 INFO  (jetty-launcher-1092-thread-2) [    ] o.e.j.s.AbstractConnector Started ServerConnector@20b77831{HTTP/1.1,[http/1.1]}{127.0.0.1:43371}
   [junit4]   2> 384298 INFO  (jetty-launcher-1092-thread-1) [    ] o.e.j.s.AbstractConnector Started ServerConnector@5329bfd2{HTTP/1.1,[http/1.1]}{127.0.0.1:44909}
   [junit4]   2> 384298 INFO  (jetty-launcher-1092-thread-2) [    ] o.e.j.s.Server Started @384340ms
   [junit4]   2> 384298 INFO  (jetty-launcher-1092-thread-1) [    ] o.e.j.s.Server Started @384340ms
   [junit4]   2> 384298 INFO  (jetty-launcher-1092-thread-2) [    ] o.a.s.c.s.e.JettySolrRunner Jetty properties: {hostContext=/solr, hostPort=43371}
   [junit4]   2> 384298 INFO  (jetty-launcher-1092-thread-1) [    ] o.a.s.c.s.e.JettySolrRunner Jetty properties: {hostContext=/solr, hostPort=44909}
   [junit4]   2> 384298 ERROR (jetty-launcher-1092-thread-2) [    ] o.a.s.u.StartupLoggingUtils Missing Java Option solr.log.dir. Logging may be missing or incomplete.
   [junit4]   2> 384298 ERROR (jetty-launcher-1092-thread-1) [    ] o.a.s.u.StartupLoggingUtils Missing Java Option solr.log.dir. Logging may be missing or incomplete.
   [junit4]   2> 384298 INFO  (jetty-launcher-1092-thread-2) [    ] o.a.s.s.SolrDispatchFilter Using logger factory org.apache.logging.slf4j.Log4jLoggerFactory
   [junit4]   2> 384298 INFO  (jetty-launcher-1092-thread-1) [    ] o.a.s.s.SolrDispatchFilter Using logger factory org.apache.logging.slf4j.Log4jLoggerFactory
   [junit4]   2> 384298 INFO  (jetty-launcher-1092-thread-2) [    ] o.a.s.s.SolrDispatchFilter  ___      _       Welcome to Apache Solr™ version 7.5.0
   [junit4]   2> 384298 INFO  (jetty-launcher-1092-thread-1) [    ] o.a.s.s.SolrDispatchFilter  ___      _       Welcome to Apache Solr™ version 7.5.0
   [junit4]   2> 384298 INFO  (jetty-launcher-1092-thread-2) [    ] o.a.s.s.SolrDispatchFilter / __| ___| |_ _   Starting in cloud mode on port null
   [junit4]   2> 384298 INFO  (jetty-launcher-1092-thread-1) [    ] o.a.s.s.SolrDispatchFilter / __| ___| |_ _   Starting in cloud mode on port null
   [junit4]   2> 384298 INFO  (jetty-launcher-1092-thread-2) [    ] o.a.s.s.SolrDispatchFilter \__ \/ _ \ | '_|  Install dir: null
   [junit4]   2> 384298 INFO  (jetty-launcher-1092-thread-1) [    ] o.a.s.s.SolrDispatchFilter \__ \/ _ \ | '_|  Install dir: null
   [junit4]   2> 384298 INFO  (jetty-launcher-1092-thread-2) [    ] o.a.s.s.SolrDispatchFilter |___/\___/_|_|    Start time: 2018-07-11T15:25:27.353468Z
   [junit4]   2> 384298 INFO  (jetty-launcher-1092-thread-1) [    ] o.a.s.s.SolrDispatchFilter |___/\___/_|_|    Start time: 2018-07-11T15:25:27.353501Z
   [junit4]   2> 384311 INFO  (zkConnectionManagerCallback-1098-thread-1) [    ] o.a.s.c.c.ConnectionManager zkClient has connected
   [junit4]   2> 384312 INFO  (zkConnectionManagerCallback-1099-thread-1) [    ] o.a.s.c.c.ConnectionManager zkClient has connected
   [junit4]   2> 384312 INFO  (jetty-launcher-1092-thread-2) [    ] o.a.s.s.SolrDispatchFilter solr.xml found in ZooKeeper. Loading...
   [junit4]   2> 384312 INFO  (jetty-launcher-1092-thread-1) [    ] o.a.s.s.SolrDispatchFilter solr.xml found in ZooKeeper. Loading...
   [junit4]   2> 384372 INFO  (jetty-launcher-1092-thread-2) [    ] o.a.s.c.ZkContainer Zookeeper client=127.0.0.1:42305/solr
   [junit4]   2> 384374 INFO  (zkConnectionManagerCallback-1103-thread-1) [    ] o.a.s.c.c.ConnectionManager zkClient has connected
   [junit4]   2> 384375 INFO  (zkConnectionManagerCallback-1105-thread-1) [    ] o.a.s.c.c.ConnectionManager zkClient has connected
   [junit4]   2> 384411 INFO  (jetty-launcher-1092-thread-2) [n:127.0.0.1:43371_solr    ] o.a.s.c.Overseer Overseer (id=null) closing
   [junit4]   2> 384412 INFO  (jetty-launcher-1092-thread-2) [n:127.0.0.1:43371_solr    ] o.a.s.c.OverseerElectionContext I am going to be the leader 127.0.0.1:43371_solr
   [junit4]   2> 384412 INFO  (jetty-launcher-1092-thread-2) [n:127.0.0.1:43371_solr    ] o.a.s.c.Overseer Overseer (id=72109492261879812-127.0.0.1:43371_solr-n_0000000000) starting
   [junit4]   2> 384416 INFO  (zkConnectionManagerCallback-1112-thread-1) [    ] o.a.s.c.c.ConnectionManager zkClient has connected
   [junit4]   2> 384417 INFO  (jetty-launcher-1092-thread-2) [n:127.0.0.1:43371_solr    ] o.a.s.c.s.i.ZkClientClusterStateProvider Cluster at 127.0.0.1:42305/solr ready
   [junit4]   2> 384417 INFO  (jetty-launcher-1092-thread-2) [n:127.0.0.1:43371_solr    ] o.a.s.c.ZkController Register node as live in ZooKeeper:/live_nodes/127.0.0.1:43371_solr
   [junit4]   2> 384418 INFO  (zkCallback-1111-thread-1) [    ] o.a.s.c.c.ZkStateReader Updated live nodes from ZooKeeper... (0) -> (1)
   [junit4]   2> 384418 INFO  (zkCallback-1104-thread-1) [    ] o.a.s.c.c.ZkStateReader Updated live nodes from ZooKeeper... (0) -> (1)
   [junit4]   2> 384426 INFO  (jetty-launcher-1092-thread-2) [n:127.0.0.1:43371_solr    ] o.a.s.h.a.MetricsHistoryHandler No .system collection, keeping metrics history in memory.
   [junit4]   2> 384435 INFO  (jetty-launcher-1092-thread-2) [n:127.0.0.1:43371_solr    ] o.a.s.m.r.SolrJmxReporter JMX monitoring for 'solr_43371.solr.node' (registry 'solr.node') enabled at server: com.sun.jmx.mbeanserver.JmxMBeanServer@40c2e5d9
   [junit4]   2> 384437 INFO  (jetty-launcher-1092-thread-1) [    ] o.a.s.c.ZkContainer Zookeeper client=127.0.0.1:42305/solr
   [junit4]   2> 384438 INFO  (zkConnectionManagerCallback-1117-thread-1) [    ] o.a.s.c.c.ConnectionManager zkClient has connected
   [junit4]   2> 384440 INFO  (zkConnectionManagerCallback-1119-thread-1) [    ] o.a.s.c.c.ConnectionManager zkClient has connected
   [junit4]   2> 384441 INFO  (jetty-launcher-1092-thread-2) [n:127.0.0.1:43371_solr    ] o.a.s.m.r.SolrJmxReporter JMX monitoring for 'solr_43371.solr.jvm' (registry 'solr.jvm') enabled at server: com.sun.jmx.mbeanserver.JmxMBeanServer@40c2e5d9
   [junit4]   2> 384441 INFO  (jetty-launcher-1092-thread-2) [n:127.0.0.1:43371_solr    ] o.a.s.m.r.SolrJmxReporter JMX monitoring for 'solr_43371.solr.jetty' (registry 'solr.jetty') enabled at server: com.sun.jmx.mbeanserver.JmxMBeanServer@40c2e5d9
   [junit4]   2> 384442 INFO  (jetty-launcher-1092-thread-2) [n:127.0.0.1:43371_solr    ] o.a.s.c.CorePropertiesLocator Found 0 core definitions underneath /home/jenkins/workspace/Lucene-Solr-7.x-Linux/solr/build/solr-core/test/J1/temp/solr.cloud.LeaderTragicEventTest_6C3FCA574BA3CD72-001/tempDir-001/node2/.
   [junit4]   2> 384443 INFO  (jetty-launcher-1092-thread-1) [n:127.0.0.1:44909_solr    ] o.a.s.c.c.ZkStateReader Updated live nodes from ZooKeeper... (0) -> (1)
   [junit4]   2> 384443 INFO  (jetty-launcher-1092-thread-1) [n:127.0.0.1:44909_solr    ] o.a.s.c.Overseer Overseer (id=null) closing
   [junit4]   2> 384444 INFO  (jetty-launcher-1092-thread-1) [n:127.0.0.1:44909_solr    ] o.a.s.c.TransientSolrCoreCacheDefault Allocating transient cache for 2147483647 transient cores
   [junit4]   2> 384444 INFO  (jetty-launcher-1092-thread-1) [n:127.0.0.1:44909_solr    ] o.a.s.c.ZkController Register node as live in ZooKeeper:/live_nodes/127.0.0.1:44909_solr
   [junit4]   2> 384445 INFO  (zkCallback-1111-thread-1) [    ] o.a.s.c.c.ZkStateReader Updated live nodes from ZooKeeper... (1) -> (2)
   [junit4]   2> 384445 INFO  (zkCallback-1104-thread-1) [    ] o.a.s.c.c.ZkStateReader Updated live nodes from ZooKeeper... (1) -> (2)
   [junit4]   2> 384448 INFO  (zkCallback-1118-thread-1) [    ] o.a.s.c.c.ZkStateReader Updated live nodes from ZooKeeper... (1) -> (2)
   [junit4]   2> 384458 INFO  (zkConnectionManagerCallback-1126-thread-1) [    ] o.a.s.c.c.ConnectionManager zkClient has connected
   [junit4]   2> 384459 INFO  (jetty-launcher-1092-thread-1) [n:127.0.0.1:44909_solr    ] o.a.s.c.c.ZkStateReader Updated live nodes from ZooKeeper... (0) -> (2)
   [junit4]   2> 384460 INFO  (jetty-launcher-1092-thread-1) [n:127.0.0.1:44909_solr    ] o.a.s.c.s.i.ZkClientClusterStateProvider Cluster at 127.0.0.1:42305/solr ready
   [junit4]   2> 384461 INFO  (jetty-launcher-1092-thread-1) [n:127.0.0.1:44909_solr    ] o.a.s.h.a.MetricsHistoryHandler No .system collection, keeping metrics history in memory.
   [junit4]   2> 384469 INFO  (jetty-launcher-1092-thread-1) [n:127.0.0.1:44909_solr    ] o.a.s.m.r.SolrJmxReporter JMX monitoring for 'solr_44909.solr.node' (registry 'solr.node') enabled at server: com.sun.jmx.mbeanserver.JmxMBeanServer@40c2e5d9
   [junit4]   2> 384474 INFO  (jetty-launcher-1092-thread-1) [n:127.0.0.1:44909_solr    ] o.a.s.m.r.SolrJmxReporter JMX monitoring for 'solr_44909.solr.jvm' (registry 'solr.jvm') enabled at server: com.sun.jmx.mbeanserver.JmxMBeanServer@40c2e5d9
   [junit4]   2> 384474 INFO  (jetty-launcher-1092-thread-1) [n:127.0.0.1:44909_solr    ] o.a.s.m.r.SolrJmxReporter JMX monitoring for 'solr_44909.solr.jetty' (registry 'solr.jetty') enabled at server: com.sun.jmx.mbeanserver.JmxMBeanServer@40c2e5d9
   [junit4]   2> 384474 INFO  (jetty-launcher-1092-thread-1) [n:127.0.0.1:44909_solr    ] o.a.s.c.CorePropertiesLocator Found 0 core definitions underneath /home/jenkins/workspace/Lucene-Solr-7.x-Linux/solr/build/solr-core/test/J1/temp/solr.cloud.LeaderTragicEventTest_6C3FCA574BA3CD72-001/tempDir-001/node1/.
   [junit4]   2> 384487 INFO  (zkConnectionManagerCallback-1129-thread-1) [    ] o.a.s.c.c.ConnectionManager zkClient has connected
   [junit4]   2> 384489 INFO  (zkConnectionManagerCallback-1134-thread-1) [    ] o.a.s.c.c.ConnectionManager zkClient has connected
   [junit4]   2> 384490 INFO  (SUITE-LeaderTragicEventTest-seed#[6C3FCA574BA3CD72]-worker) [    ] o.a.s.c.c.ZkStateReader Updated live nodes from ZooKeeper... (0) -> (2)
   [junit4]   2> 384490 INFO  (SUITE-LeaderTragicEventTest-seed#[6C3FCA574BA3CD72]-worker) [    ] o.a.s.c.s.i.ZkClientClusterStateProvider Cluster at 127.0.0.1:42305/solr ready
   [junit4]   2> 384497 INFO  (TEST-LeaderTragicEventTest.testOtherReplicasAreNotActive-seed#[6C3FCA574BA3CD72]) [    ] o.a.s.SolrTestCaseJ4 ###Starting testOtherReplicasAreNotActive
   [junit4]   2> 384499 INFO  (qtp1739762856-4468) [n:127.0.0.1:43371_solr    ] o.a.s.h.a.CollectionsHandler Invoked Collection Action :create with params collection.configName=config&name=collection1&nrtReplicas=1&action=CREATE&numShards=1&wt=javabin&version=2 and sendToOCPQueue=true
   [junit4]   2> 384500 INFO  (OverseerThreadFactory-1985-thread-1) [    ] o.a.s.c.a.c.CreateCollectionCmd Create collection collection1
   [junit4]   2> 384604 INFO  (OverseerStateUpdate-72109492261879812-127.0.0.1:43371_solr-n_0000000000) [    ] o.a.s.c.o.SliceMutator createReplica() {
   [junit4]   2>   "operation":"ADDREPLICA",
   [junit4]   2>   "collection":"collection1",
   [junit4]   2>   "shard":"shard1",
   [junit4]   2>   "core":"collection1_shard1_replica_n1",
   [junit4]   2>   "state":"down",
   [junit4]   2>   "base_url":"http://127.0.0.1:44909/solr",
   [junit4]   2>   "type":"NRT",
   [junit4]   2>   "waitForFinalState":"false"}
   [junit4]   2> 384806 INFO  (qtp852093266-4466) [n:127.0.0.1:44909_solr    x:collection1_shard1_replica_n1] o.a.s.h.a.CoreAdminOperation core create command qt=/admin/cores&coreNodeName=core_node2&collection.configName=config&newCollection=true&name=collection1_shard1_replica_n1&action=CREATE&numShards=1&collection=collection1&shard=shard1&wt=javabin&version=2&replicaType=NRT
   [junit4]   2> 385814 INFO  (qtp852093266-4466) [n:127.0.0.1:44909_solr c:collection1 s:shard1 r:core_node2 x:collection1_shard1_replica_n1] o.a.s.c.SolrConfig Using Lucene MatchVersion: 7.5.0
   [junit4]   2> 385827 INFO  (qtp852093266-4466) [n:127.0.0.1:44909_solr c:collection1 s:shard1 r:core_node2 x:collection1_shard1_replica_n1] o.a.s.s.IndexSchema [collection1_shard1_replica_n1] Schema name=minimal
   [junit4]   2> 385829 INFO  (qtp852093266-4466) [n:127.0.0.1:44909_solr c:collection1 s:shard1 r:core_node2 x:collection1_shard1_replica_n1] o.a.s.s.IndexSchema Loaded schema minimal/1.1 with uniqueid field id
   [junit4]   2> 385829 INFO  (qtp852093266-4466) [n:127.0.0.1:44909_solr c:collection1 s:shard1 r:core_node2 x:collection1_shard1_replica_n1] o.a.s.c.CoreContainer Creating SolrCore 'collection1_shard1_replica_n1' using configuration from collection collection1, trusted=true
   [junit4]   2> 385829 INFO  (qtp852093266-4466) [n:127.0.0.1:44909_solr c:collection1 s:shard1 r:core_node2 x:collection1_shard1_replica_n1] o.a.s.m.r.SolrJmxReporter JMX monitoring for 'solr_44909.solr.core.collection1.shard1.replica_n1' (registry 'solr.core.collection1.shard1.replica_n1') enabled at server: com.sun.jmx.mbeanserver.JmxMBeanServer@40c2e5d9
   [junit4]   2> 385829 INFO  (qtp852093266-4466) [n:127.0.0.1:44909_solr c:collection1 s:shard1 r:core_node2 x:collection1_shard1_replica_n1] o.a.s.c.SolrCore solr.RecoveryStrategy.Builder
   [junit4]   2> 385829 INFO  (qtp852093266-4466) [n:127.0.0.1:44909_solr c:collection1 s:shard1 r:core_node2 x:collection1_shard1_replica_n1] o.a.s.c.SolrCore [[collection1_shard1_replica_n1] ] Opening new SolrCore at [/home/jenkins/workspace/Lucene-Solr-7.x-Linux/solr/build/solr-core/test/J1/temp/solr.cloud.LeaderTragicEventTest_6C3FCA574BA3CD72-001/tempDir-001/node1/collection1_shard1_replica_n1], dataDir=[/home/jenkins/workspace/Lucene-Solr-7.x-Linux/solr/build/solr-core/test/J1/temp/solr.cloud.LeaderTragicEventTest_6C3FCA574BA3CD72-001/tempDir-001/node1/./collection1_shard1_replica_n1/data/]
   [junit4]   2> 385868 INFO  (qtp852093266-4466) [n:127.0.0.1:44909_solr c:collection1 s:shard1 r:core_node2 x:collection1_shard1_replica_n1] o.a.s.u.UpdateHandler Using UpdateLog implementation: org.apache.solr.update.UpdateLog
   [junit4]   2> 385868 INFO  (qtp852093266-4466) [n:127.0.0.1:44909_solr c:collection1 s:shard1 r:core_node2 x:collection1_shard1_replica_n1] o.a.s.u.UpdateLog Initializing UpdateLog: dataDir=null defaultSyncLevel=FLUSH numRecordsToKeep=100 maxNumLogsToKeep=10 numVersionBuckets=65536
   [junit4]   2> 385869 INFO  (qtp852093266-4466) [n:127.0.0.1:44909_solr c:collection1 s:shard1 r:core_node2 x:collection1_shard1_replica_n1] o.a.s.u.CommitTracker Hard AutoCommit: disabled
   [junit4]   2> 385869 INFO  (qtp852093266-4466) [n:127.0.0.1:44909_solr c:collection1 s:shard1 r:core_node2 x:collection1_shard1_replica_n1] o.a.s.u.CommitTracker Soft AutoCommit: disabled
   [junit4]   2> 385870 INFO  (qtp852093266-4466) [n:127.0.0.1:44909_solr c:collection1 s:shard1 r:core_node2 x:collection1_shard1_replica_n1] o.a.s.s.SolrIndexSearcher Opening [Searcher@11905287[collection1_shard1_replica_n1] main]
   [junit4]   2> 385870 INFO  (qtp852093266-4466) [n:127.0.0.1:44909_solr c:collection1 s:shard1 r:core_node2 x:collection1_shard1_replica_n1] o.a.s.r.ManagedResourceStorage Configured ZooKeeperStorageIO with znodeBase: /configs/config
   [junit4]   2> 385871 INFO  (qtp852093266-4466) [n:127.0.0.1:44909_solr c:collection1 s:shard1 r:core_node2 x:collection1_shard1_replica_n1] o.a.s.r.ManagedResourceStorage Loaded null at path _rest_managed.json using ZooKeeperStorageIO:path=/configs/config
   [junit4]   2> 385871 INFO  (qtp852093266-4466) [n:127.0.0.1:44909_solr c:collection1 s:shard1 r:core_node2 x:collection1_shard1_replica_n1] o.a.s.h.ReplicationHandler Commits will be reserved for 10000ms.
   [junit4]   2> 385871 INFO  (qtp852093266-4466) [n:127.0.0.1:44909_solr c:collection1 s:shard1 r:core_node2 x:collection1_shard1_replica_n1] o.a.s.u.UpdateLog Could not find max version in index or recent updates, using new clock 1605708261806309376
   [junit4]   2> 385871 INFO  (searcherExecutor-1997-thread-1-processing-n:127.0.0.1:44909_solr x:collection1_shard1_replica_n1 c:collection1 s:shard1 r:core_node2) [n:127.0.0.1:44909_solr c:collection1 s:shard1 r:core_node2 x:collection1_shard1_replica_n1] o.a.s.c.SolrCore [collection1_shard1_replica_n1] Registered new searcher Searcher@11905287[collection1_shard1_replica_n1] main{ExitableDirectoryReader(UninvertingDirectoryReader())}
   [junit4]   2> 385874 INFO  (qtp852093266-4466) [n:127.0.0.1:44909_solr c:collection1 s:shard1 r:core_node2 x:collection1_shard1_replica_n1] o.a.s.c.ZkShardTerms Successful update of terms at /collections/collection1/terms/shard1 to Terms{values={core_node2=0}, version=0}
   [junit4]   2> 385876 INFO  (qtp852093266-4466) [n:127.0.0.1:44909_solr c:collection1 s:shard1 r:core_node2 x:collection1_shard1_replica_n1] o.a.s.c.ShardLeaderElectionContext Enough replicas found to continue.
   [junit4]   2> 385876 INFO  (qtp852093266-4466) [n:127.0.0.1:44909_solr c:collection1 s:shard1 r:core_node2 x:collection1_shard1_replica_n1] o.a.s.c.ShardLeaderElectionContext I may be the new leader - try and sync
   [junit4]   2> 385876 INFO  (qtp852093266-4466) [n:127.0.0.1:44909_solr c:collection1 s:shard1 r:core_node2 x:collection1_shard1_replica_n1] o.a.s.c.SyncStrategy Sync replicas to http://127.0.0.1:44909/solr/collection1_shard1_replica_n1/
   [junit4]   2> 385876 INFO  (qtp852093266-4466) [n:127.0.0.1:44909_solr c:collection1 s:shard1 r:core_node2 x:collection1_shard1_replica_n1] o.a.s.c.SyncStrategy Sync Success - now sync replicas to me
   [junit4]   2> 385876 INFO  (qtp852093266-4466) [n:127.0.0.1:44909_solr c:collection1 s:shard1 r:core_node2 x:collection1_shard1_replica_n1] o.a.s.c.SyncStrategy http://127.0.0.1:44909/solr/collection1_shard1_replica_n1/ has no replicas
   [junit4]   2> 385876 INFO  (qtp852093266-4466) [n:127.0.0.1:44909_solr c:collection1 s:shard1 r:core_node2 x:collection1_shard1_replica_n1] o.a.s.c.ShardLeaderElectionContext Found all replicas participating in election, clear LIR
   [junit4]   2> 385877 INFO  (qtp852093266-4466) [n:127.0.0.1:44909_solr c:collection1 s:shard1 r:core_node2 x:collection1_shard1_replica_n1] o.a.s.c.ShardLeaderElectionContext I am the new leader: http://127.0.0.1:44909/solr/collection1_shard1_replica_n1/ shard1
   [junit4]   2> 385979 INFO  (qtp852093266-4466) [n:127.0.0.1:44909_solr c:collection1 s:shard1 r:core_node2 x:collection1_shard1_replica_n1] o.a.s.c.ZkController I am the leader, no recovery necessary
   [junit4]   2> 385980 INFO  (qtp852093266-4466) [n:127.0.0.1:44909_solr c:collection1 s:shard1 r:core_node2 x:collection1_shard1_replica_n1] o.a.s.s.HttpSolrCall [admin] webapp=null path=/admin/cores params={qt=/admin/cores&coreNodeName=core_node2&collection.configName=config&newCollection=true&name=collection1_shard1_replica_n1&action=CREATE&numShards=1&collection=collection1&shard=shard1&wt=javabin&version=2&replicaType=NRT} status=0 QTime=1173
   [junit4]   2> 385982 INFO  (qtp1739762856-4468) [n:127.0.0.1:43371_solr    ] o.a.s.h.a.CollectionsHandler Wait for new collection to be active for at most 30 seconds. Check all shard replicas
   [junit4]   2> 386081 INFO  (zkCallback-1118-thread-1) [    ] o.a.s.c.c.ZkStateReader A cluster state change: [WatchedEvent state:SyncConnected type:NodeDataChanged path:/collections/collection1/state.json] for collection [collection1] has occurred - updating... (live nodes size: [2])
   [junit4]   2> 386501 INFO  (OverseerCollectionConfigSetProcessor-72109492261879812-127.0.0.1:43371_solr-n_0000000000) [    ] o.a.s.c.OverseerTaskQueue Response ZK path: /overseer/collection-queue-work/qnr-0000000000 doesn't exist.  Requestor may have disconnected from ZooKeeper
   [junit4]   2> 386983 INFO  (qtp1739762856-4468) [n:127.0.0.1:43371_solr    ] o.a.s.s.HttpSolrCall [admin] webapp=null path=/admin/collections params={collection.configName=config&name=collection1&nrtReplicas=1&action=CREATE&numShards=1&wt=javabin&version=2} status=0 QTime=2484
   [junit4]   2> 386985 INFO  (TEST-LeaderTragicEventTest.testOtherReplicasAreNotActive-seed#[6C3FCA574BA3CD72]) [    ] o.a.s.SolrTestCaseJ4 ###Ending testOtherReplicasAreNotActive
   [junit4]   2> NOTE: reproduce with: ant test  -Dtestcase=LeaderTragicEventTest -Dtests.method=testOtherReplicasAreNotActive -Dtests.seed=6C3FCA574BA3CD72 -Dtests.multiplier=3 -Dtests.slow=true -Dtests.locale=sah -Dtests.timezone=Asia/Muscat -Dtests.asserts=true -Dtests.file.encoding=UTF-8
   [junit4] ERROR   2.49s J1 | LeaderTragicEventTest.testOtherReplicasAreNotActive <<<
   [junit4]    > Throwable #1: java.lang.ClassCastException: org.apache.lucene.store.RawDirectoryWrapper cannot be cast to org.apache.lucene.store.MockDirectoryWrapper
   [junit4]    > at __randomizedtesting.SeedInfo.seed([6C3FCA574BA3CD72:E98BE620775C74EA]:0)
   [junit4]    > at org.apache.solr.cloud.LeaderTragicEventTest.corruptLeader(LeaderTragicEventTest.java:102)
   [junit4]    > at org.apache.solr.cloud.LeaderTragicEventTest.testOtherReplicasAreNotActive(LeaderTragicEventTest.java:150)
   [junit4]    > at java.base/jdk.internal.reflect.NativeMethodAccessorImpl.invoke0(Native Method)
   [junit4]    > at java.base/jdk.internal.reflect.NativeMethodAccessorImpl.invoke(NativeMethodAccessorImpl.java:62)
   [junit4]    > at java.base/jdk.internal.reflect.DelegatingMethodAccessorImpl.invoke(DelegatingMethodAccessorImpl.java:43)
   [junit4]    > at java.base/java.lang.reflect.Method.invoke(Method.java:564)
   [junit4]    > at java.base/java.lang.Thread.run(Thread.java:844)
   [junit4]   2> 386992 INFO  (TEST-LeaderTragicEventTest.test-seed#[6C3FCA574BA3CD72]) [    ] o.a.s.SolrTestCaseJ4 ###Starting test
   [junit4]   2> 386993 INFO  (qtp1739762856-4456) [n:127.0.0.1:43371_solr    ] o.a.s.h.a.CollectionsHandler Invoked Collection Action :create with params collection.configName=config&name=collection1&nrtReplicas=2&action=CREATE&numShards=1&wt=javabin&version=2 and sendToOCPQueue=true
   [junit4]   2> 386994 INFO  (OverseerThreadFactory-1985-thread-2) [    ] o.a.s.c.a.c.CreateCollectionCmd Create collection collection1
   [junit4]   2> 386999 ERROR (OverseerThreadFactory-1985-thread-2) [    ] o.a.s.c.a.c.OverseerCollectionMessageHandler Collection: collection1 operation: create failed:org.apache.solr.common.SolrException: collection already exists: collection1
   [junit4]   2> at org.apache.solr.cloud.api.collections.CreateCollectionCmd.call(CreateCollectionCmd.java:106)
   [junit4]   2> at org.apache.solr.cloud.api.collections.OverseerCollectionMessageHandler.processMessage(OverseerCollectionMessageHandler.java:255)
   [junit4]   2> at org.apache.solr.cloud.OverseerTaskProcessor$Runner.run(OverseerTaskProcessor.java:469)
   [junit4]   2> at org.apache.solr.common.util.ExecutorUtil$MDCAwareThreadPoolExecutor.lambda$execute$0(ExecutorUtil.java:209)
   [junit4]   2> at java.base/java.util.concurrent.ThreadPoolExecutor.runWorker(ThreadPoolExecutor.java:1135)
   [junit4]   2> at java.base/java.util.concurrent.ThreadPoolExecutor$Worker.run(ThreadPoolExecutor.java:635)
   [junit4]   2> at java.base/java.lang.Thread.run(Thread.java:844)
   [junit4]   2>
   [junit4]   2> 387002 INFO  (qtp1739762856-4456) [n:127.0.0.1:43371_solr    ] o.a.s.s.HttpSolrCall [admin] webapp=null path=/admin/collections params={collection.configName=config&name=collection1&nrtReplicas=2&action=CREATE&numShards=1&wt=javabin&version=2} status=400 QTime=9
   [junit4]   2> 387002 INFO  (TEST-LeaderTragicEventTest.test-seed#[6C3FCA574BA3CD72]) [    ] o.a.s.SolrTestCaseJ4 ###Ending test
   [junit4]   2> NOTE: reproduce with: ant test  -Dtestcase=LeaderTragicEventTest -Dtests.method=test -Dtests.seed=6C3FCA574BA3CD72 -Dtests.multiplier=3 -Dtests.slow=true -Dtests.locale=sah -Dtests.timezone=Asia/Muscat -Dtests.asserts=true -Dtests.file.encoding=UTF-8
   [junit4] ERROR   0.02s J1 | LeaderTragicEventTest.test <<<
   [junit4]    > Throwable #1: org.apache.solr.client.solrj.impl.HttpSolrClient$RemoteSolrException: Error from server at http://127.0.0.1:43371/solr: collection already exists: collection1
   [junit4]    > at __randomizedtesting.SeedInfo.seed([6C3FCA574BA3CD72:E46BF58DE55FA08A]:0)
   [junit4]    > at org.apache.solr.client.solrj.impl.HttpSolrClient.executeMethod(HttpSolrClient.java:643)
   [junit4]    > at org.apache.solr.client.solrj.impl.HttpSolrClient.request(HttpSolrClient.java:255)
   [junit4]    > at org.apache.solr.client.solrj.impl.HttpSolrClient.request(HttpSolrClient.java:244)
   [junit4]    > at org.apache.solr.client.solrj.impl.LBHttpSolrClient.doRequest(LBHttpSolrClient.java:483)
   [junit4]    > at org.apache.solr.client.solrj.impl.LBHttpSolrClient.request(LBHttpSolrClient.java:413)
   [junit4]    > at org.apache.solr.client.solrj.impl.CloudSolrClient.sendRequest(CloudSolrClient.java:1106)
   [junit4]    > at org.apache.solr.client.solrj.impl.CloudSolrClient.requestWithRetryOnStaleState(CloudSolrClient.java:886)
   [junit4]    > at org.apache.solr.client.solrj.impl.CloudSolrClient.request(CloudSolrClient.java:819)
   [junit4]    > at org.apache.solr.client.solrj.SolrRequest.process(SolrRequest.java:194)
   [junit4]    > at org.apache.solr.client.solrj.SolrRequest.process(SolrRequest.java:211)
   [junit4]    > at org.apache.solr.cloud.LeaderTragicEventTest.test(LeaderTragicEventTest.java:70)
   [junit4]    > at java.base/jdk.internal.reflect.NativeMethodAccessorImpl.invoke0(Native Method)
   [junit4]    > at java.base/jdk.internal.reflect.NativeMethodAccessorImpl.invoke(NativeMethodAccessorImpl.java:62)
   [junit4]    > at java.base/jdk.internal.reflect.DelegatingMethodAccessorImpl.invoke(DelegatingMethodAccessorImpl.java:43)
   [junit4]    > at java.base/java.lang.reflect.Method.invoke(Method.java:564)
   [junit4]    > at java.base/java.lang.Thread.run(Thread.java:844)
   [junit4]   2> 387004 INFO  (jetty-closer-1093-thread-1) [    ] o.e.j.s.AbstractConnector Stopped ServerConnector@20b77831{HTTP/1.1,[http/1.1]}{127.0.0.1:0}
   [junit4]   2> 387004 INFO  (jetty-closer-1093-thread-2) [    ] o.e.j.s.AbstractConnector Stopped ServerConnector@5329bfd2{HTTP/1.1,[http/1.1]}{127.0.0.1:0}
   [junit4]   2> 387004 INFO  (jetty-closer-1093-thread-1) [    ] o.a.s.c.CoreContainer Shutting down CoreContainer instance=418324753
   [junit4]   2> 387004 INFO  (jetty-closer-1093-thread-2) [    ] o.a.s.c.CoreContainer Shutting down CoreContainer instance=1912883092
   [junit4]   2> 387004 INFO  (jetty-closer-1093-thread-1) [    ] o.a.s.m.SolrMetricManager Closing metric reporters for registry=solr.node, tag=null
   [junit4]   2> 387004 INFO  (jetty-closer-1093-thread-1) [    ] o.a.s.m.r.SolrJmxReporter Closing reporter [org.apache.solr.metrics.reporters.SolrJmxReporter@532839ce: rootName = solr_43371, domain = solr.node, service url = null, agent id = null] for registry solr.node / com.codahale.metrics.MetricRegistry@5b840e06
   [junit4]   2> 387004 INFO  (jetty-closer-1093-thread-2) [    ] o.a.s.m.SolrMetricManager Closing metric reporters for registry=solr.node, tag=null
   [junit4]   2> 387004 INFO  (jetty-closer-1093-thread-2) [    ] o.a.s.m.r.SolrJmxReporter Closing reporter [org.apache.solr.metrics.reporters.SolrJmxReporter@29bb076b: rootName = solr_44909, domain = solr.node, service url = null, agent id = null] for registry solr.node / com.codahale.metrics.MetricRegistry@5ed475f0
   [junit4]   2> 387010 INFO  (jetty-closer-1093-thread-1) [    ] o.a.s.m.SolrMetricManager Closing metric reporters for registry=solr.jvm, tag=null
   [junit4]   2> 387010 INFO  (jetty-closer-1093-thread-2) [    ] o.a.s.m.SolrMetricManager Closing metric reporters for registry=solr.jvm, tag=null
   [junit4]   2> 387010 INFO  (jetty-closer-1093-thread-1) [    ] o.a.s.m.r.SolrJmxReporter Closing reporter [org.apache.solr.metrics.reporters.SolrJmxReporter@3e00be9e: rootName = solr_43371, domain = solr.jvm, service url = null, agent id = null] for registry solr.jvm / com.codahale.metrics.MetricRegistry@d3f05bf
   [junit4]   2> 387010 INFO  (jetty-closer-1093-thread-2) [    ] o.a.s.m.r.SolrJmxReporter Closing reporter [org.apache.solr.metrics.reporters.SolrJmxReporter@5769140f: rootName = solr_44909, domain = solr.jvm, service url = null, agent id = null] for registry solr.jvm / com.codahale.metrics.MetricRegistry@d3f05bf
   [junit4]   2> 387013 INFO  (jetty-closer-1093-thread-1) [    ] o.a.s.m.SolrMetricManager Closing metric reporters for registry=solr.jetty, tag=null
   [junit4]   2> 387013 INFO  (jetty-closer-1093-thread-2) [    ] o.a.s.m.SolrMetricManager Closing metric reporters for registry=solr.jetty, tag=null
   [junit4]   2> 387013 INFO  (jetty-closer-1093-thread-2) [    ] o.a.s.m.r.SolrJmxReporter Closing reporter [org.apache.solr.metrics.reporters.SolrJmxReporter@59875892: rootName = solr_44909, domain = solr.jetty, service url = null, agent id = null] for registry solr.jetty / com.codahale.metrics.MetricRegistry@196f3382
   [junit4]   2> 387013 INFO  (jetty-closer-1093-thread-1) [    ] o.a.s.m.r.SolrJmxReporter Closing reporter [org.apache.solr.metrics.reporters.SolrJmxReporter@29c8b5ad: rootName = solr_43371, domain = solr.jetty, service url = null, agent id = null] for registry solr.jetty / com.codahale.metrics.MetricRegistry@196f3382
   [junit4]   2> 387014 INFO  (jetty-closer-1093-thread-1) [    ] o.a.s.c.ZkController Remove node as live in ZooKeeper:/live_nodes/127.0.0.1:43371_solr
   [junit4]   2> 387014 INFO  (jetty-closer-1093-thread-2) [    ] o.a.s.c.ZkController Remove node as live in ZooKeeper:/live_nodes/127.0.0.1:44909_solr
   [junit4]   2> 387014 INFO  (jetty-closer-1093-thread-1) [    ] o.a.s.m.SolrMetricManager Closing metric reporters for registry=solr.cluster, tag=null
   [junit4]   2> 387014 INFO  (jetty-closer-1093-thread-2) [    ] o.a.s.m.SolrMetricManager Closing metric reporters for registry=solr.cluster, tag=null
   [junit4]   2> 387014 INFO  (zkCallback-1111-thread-1) [    ] o.a.s.c.c.ZkStateReader Updated live nodes from ZooKeeper... (2) -> (0)
   [junit4]   2> 387014 INFO  (zkCallback-1125-thread-1) [    ] o.a.s.c.c.ZkStateReader Updated live nodes from ZooKeeper... (2) -> (0)
   [junit4]   2> 387014 INFO  (zkCallback-1104-thread-1) [    ] o.a.s.c.c.ZkStateReader Updated live nodes from ZooKeeper... (2) -> (0)
   [junit4]   2> 387014 INFO  (jetty-closer-1093-thread-1) [    ] o.a.s.c.TransientSolrCoreCacheDefault Allocating transient cache for 2147483647 transient cores
   [junit4]   2> 387014 INFO  (zkCallback-1118-thread-1) [    ] o.a.s.c.c.ZkStateReader Updated live nodes from ZooKeeper... (2) -> (0)
   [junit4]   2> 387015 INFO  (coreCloseExecutor-2002-thread-1) [n:127.0.0.1:44909_solr c:collection1 s:shard1 r:core_node2 x:collection1_shard1_replica_n1] o.a.s.c.SolrCore [collection1_shard1_replica_n1]  CLOSING SolrCore org.apache.solr.core.SolrCore@2d5d8a06
   [junit4]   2> 387015 INFO  (coreCloseExecutor-2002-thread-1) [n:127.0.0.1:44909_solr c:collection1 s:shard1 r:core_node2 x:collection1_shard1_replica_n1] o.a.s.m.SolrMetricManager Closing metric reporters for registry=solr.core.collection1.shard1.replica_n1, tag=2d5d8a06
   [junit4]   2> 387015 INFO  (coreCloseExecutor-2002-thread-1) [n:127.0.0.1:44909_solr c:collection1 s:shard1 r:core_node2 x:collection1_shard1_replica_n1] o.a.s.m.r.SolrJmxReporter Closing reporter [org.apache.solr.metrics.reporters.SolrJmxReporter@59fdd983: rootName = solr_44909, domain = solr.core.collection1.shard1.replica_n1, service url = null, agent id = null] for registry solr.core.collection1.shard1.replica_n1 / com.codahale.metrics.MetricRegistry@5985cbeb
   [junit4]   2> 387015 INFO  (jetty-closer-1093-thread-1) [    ] o.a.s.c.Overseer Overseer (id=72109492261879812-127.0.0.1:43371_solr-n_0000000000) closing
   [junit4]   2> 387015 INFO  (OverseerStateUpdate-72109492261879812-127.0.0.1:43371_solr-n_0000000000) [    ] o.a.s.c.Overseer Overseer Loop exiting : 127.0.0.1:43371_solr
   [junit4]   2> 387015 WARN  (OverseerAutoScalingTriggerThread-72109492261879812-127.0.0.1:43371_solr-n_0000000000) [    ] o.a.s.c.a.OverseerTriggerThread OverseerTriggerThread woken up but we are closed, exiting.
   [junit4]   2> 387023 INFO  (zkCallback-1118-thread-1) [    ] o.a.s.c.OverseerElectionContext I am going to be the leader 127.0.0.1:44909_solr
   [junit4]   2> 387024 INFO  (jetty-closer-1093-thread-1) [    ] o.e.j.s.h.ContextHandler Stopped o.e.j.s.ServletContextHandler@4b50f299{/solr,null,UNAVAILABLE}
   [junit4]   2> 387024 INFO  (jetty-closer-1093-thread-1) [    ] o.e.j.s.session node0 Stopped scavenging
   [junit4]   2> 387026 INFO  (coreCloseExecutor-2002-thread-1) [n:127.0.0.1:44909_solr c:collection1 s:shard1 r:core_node2 x:collection1_shard1_replica_n1] o.a.s.m.SolrMetricManager Closing metric reporters for registry=solr.collection.collection1.shard1.leader, tag=2d5d8a06
   [junit4]   2> 399139 ERROR (coreCloseExecutor-2002-thread-1) [n:127.0.0.1:44909_solr c:collection1 s:shard1 r:core_node2 x:collection1_shard1_replica_n1] o.a.s.c.CachingDirectoryFactory Timeout waiting for all directory ref counts to be released - gave up waiting on CachedDir<<refCount=1;path=/home/jenkins/workspace/Lucene-Solr-7.x-Linux/solr/build/solr-core/test/J1/temp/solr.cloud.LeaderTragicEventTest_6C3FCA574BA3CD72-001/tempDir-001/node1/./collection1_shard1_replica_n1/data/index;done=false>>
   [junit4]   2> 399139 ERROR (coreCloseExecutor-2002-thread-1) [n:127.0.0.1:44909_solr c:collection1 s:shard1 r:core_node2 x:collection1_shard1_replica_n1] o.a.s.c.CachingDirectoryFactory Error closing directory:org.apache.solr.common.SolrException: Timeout waiting for all directory ref counts to be released - gave up waiting on CachedDir<<refCount=1;path=/home/jenkins/workspace/Lucene-Solr-7.x-Linux/solr/build/solr-core/test/J1/temp/solr.cloud.LeaderTragicEventTest_6C3FCA574BA3CD72-001/tempDir-001/node1/./collection1_shard1_replica_n1/data/index;done=false>>
   [junit4]   2> at org.apache.solr.core.CachingDirectoryFactory.close(CachingDirectoryFactory.java:178)
   [junit4]   2> at org.apache.solr.core.SolrCore.close(SolrCore.java:1643)
   [junit4]   2> at org.apache.solr.core.SolrCores.lambda$close$0(SolrCores.java:141)
   [junit4]   2> at java.base/java.util.concurrent.FutureTask.run(FutureTask.java:264)
   [junit4]   2> at org.apache.solr.common.util.ExecutorUtil$MDCAwareThreadPoolExecutor.lambda$execute$0(ExecutorUtil.java:209)
   [junit4]   2> at java.base/java.util.concurrent.ThreadPoolExecutor.runWorker(ThreadPoolExecutor.java:1135)
   [junit4]   2> at java.base/java.util.concurrent.ThreadPoolExecutor$Worker.run(ThreadPoolExecutor.java:635)
   [junit4]   2> at java.base/java.lang.Thread.run(Thread.java:844)
   [junit4]   2>
   [junit4]   2> 399140 ERROR (coreCloseExecutor-2002-thread-1) [n:127.0.0.1:44909_solr c:collection1 s:shard1 r:core_node2 x:collection1_shard1_replica_n1] o.a.s.c.SolrCore java.lang.AssertionError: 1
   [junit4]   2> at org.apache.solr.core.CachingDirectoryFactory.close(CachingDirectoryFactory.java:192)
   [junit4]   2> at org.apache.solr.core.SolrCore.close(SolrCore.java:1643)
   [junit4]   2> at org.apache.solr.core.SolrCores.lambda$close$0(SolrCores.java:141)
   [junit4]   2> at java.base/java.util.concurrent.FutureTask.run(FutureTask.java:264)
   [junit4]   2> at org.apache.solr.common.util.ExecutorUtil$MDCAwareThreadPoolExecutor.lambda$execute$0(ExecutorUtil.java:209)
   [junit4]   2> at java.base/java.util.concurrent.ThreadPoolExecutor.runWorker(ThreadPoolExecutor.java:1135)
   [junit4]   2> at java.base/java.util.concurrent.ThreadPoolExecutor$Worker.run(ThreadPoolExecutor.java:635)
   [junit4]   2> at java.base/java.lang.Thread.run(Thread.java:844)
   [junit4]   2>
   [junit4]   2> 399140 ERROR (coreCloseExecutor-2002-thread-1) [n:127.0.0.1:44909_solr c:collection1 s:shard1 r:core_node2 x:collection1_shard1_replica_n1] o.a.s.c.SolrCores Error shutting down core:java.lang.AssertionError: 1
   [junit4]   2> at org.apache.solr.core.CachingDirectoryFactory.close(CachingDirectoryFactory.java:192)
   [junit4]   2> at org.apache.solr.core.SolrCore.close(SolrCore.java:1643)
   [junit4]   2> at org.apache.solr.core.SolrCores.lambda$close$0(SolrCores.java:141)
   [junit4]   2> at java.base/java.util.concurrent.FutureTask.run(FutureTask.java:264)
   [junit4]   2> at org.apache.solr.common.util.ExecutorUtil$MDCAwareThreadPoolExecutor.lambda$execute$0(ExecutorUtil.java:209)
   [junit4]   2> at java.base/java.util.concurrent.ThreadPoolExecutor.runWorker(ThreadPoolExecutor.java:1135)
   [junit4]   2> at java.base/java.util.concurrent.ThreadPoolExecutor$Worker.run(ThreadPoolExecutor.java:635)
   [junit4]   2> at java.base/java.lang.Thread.run(Thread.java:844)
   [junit4]   2>
   [junit4]   2> 399142 INFO  (jetty-closer-1093-thread-2) [    ] o.e.j.s.h.ContextHandler Stopped o.e.j.s.ServletContextHandler@2e41d183{/solr,null,UNAVAILABLE}
   [junit4]   2> 399142 INFO  (jetty-closer-1093-thread-2) [    ] o.e.j.s.session node0 Stopped scavenging
   [junit4]   2> 399143 ERROR (SUITE-LeaderTragicEventTest-seed#[6C3FCA574BA3CD72]-worker) [    ] o.a.z.s.ZooKeeperServer ZKShutdownHandler is not registered, so ZooKeeper server won't take any action on ERROR or SHUTDOWN server state changes
   [junit4]   2> 399143 INFO  (SUITE-LeaderTragicEventTest-seed#[6C3FCA574BA3CD72]-worker) [    ] o.a.s.c.ZkTestServer connecting to 127.0.0.1:42305 42305
   [junit4]   2> 399191 INFO  (Thread-1045) [    ] o.a.s.c.ZkTestServer connecting to 127.0.0.1:42305 42305
   [junit4]   2> 399191 WARN  (Thread-1045) [    ] o.a.s.c.ZkTestServer Watch limit violations:
   [junit4]   2> Maximum concurrent create/delete watches above limit:
   [junit4]   2>
   [junit4]   2> 5 /solr/aliases.json
   [junit4]   2> 5 /solr/clusterprops.json
   [junit4]   2> 2 /solr/security.json
   [junit4]   2> 2 /solr/collections/collection1/terms/shard1
   [junit4]   2>
   [junit4]   2> Maximum concurrent data watches above limit:
   [junit4]   2>
   [junit4]   2> 5 /solr/clusterstate.json
   [junit4]   2>
   [junit4]   2> Maximum concurrent children watches above limit:
   [junit4]   2>
   [junit4]   2> 5 /solr/live_nodes
   [junit4]   2> 5 /solr/collections
   [junit4]   2>
   [junit4]   2> NOTE: leaving temporary files on disk at: /home/jenkins/workspace/Lucene-Solr-7.x-Linux/solr/build/solr-core/test/J1/temp/solr.cloud.LeaderTragicEventTest_6C3FCA574BA3CD72-001
   [junit4]   2> Jul 11, 2018 3:25:42 PM com.carrotsearch.randomizedtesting.ThreadLeakControl checkThreadLeaks
   [junit4]   2> WARNING: Will linger awaiting termination of 3 leaked thread(s).
   [junit4]   2> NOTE: test params are: codec=Asserting(Lucene70), sim=RandomSimilarity(queryNorm=true): {}, locale=sah, timezone=Asia/Muscat
   [junit4]   2> NOTE: Linux 4.15.0-24-generic amd64/Oracle Corporation 10 (64-bit)/cpus=8,threads=1,free=130823248,total=495976448
   [junit4]   2> NOTE: All tests run in this JVM: [TestClusterStateProvider, HDFSCollectionsAPITest, TestSolr4Spatial2, CollectionsAPIAsyncDistributedZkTest, ChaosMonkeyNothingIsSafeWithPullReplicasTest, CachingDirectoryFactoryTest, SynonymTokenizerTest, OverseerTaskQueueTest, ScriptEngineTest, TestReloadDeadlock, DistributedFacetExistsSmallTest, TestExecutePlanAction, TestSortableTextField, TestNumericTerms32, UpdateRequestProcessorFactoryTest, BufferStoreTest, DocValuesMissingTest, SharedFSAutoReplicaFailoverTest, TestDistributedStatsComponentCardinality, ScheduledTriggerIntegrationTest, SortSpecParsingTest, TestLRUCache, TestCoreDiscovery, DeleteNodeTest, TestBlobHandler, OutOfBoxZkACLAndCredentialsProvidersTest, StatelessScriptUpdateProcessorFactoryTest, TestSafeXMLParsing, RestartWhileUpdatingTest, PropertiesRequestHandlerTest, ClassificationUpdateProcessorFactoryTest, SolrRrdBackendFactoryTest, AddSchemaFieldsUpdateProcessorFactoryTest, TestFreeTextSuggestions, SimpleCollectionCreateDeleteTest, TestReversedWildcardFilterFactory, MultiSolrCloudTestCaseTest, TestShortCircuitedRequests, TestTlogReplica, TestSubQueryTransformerCrossCore, CurrencyRangeFacetCloudTest, LeaderTragicEventTest]
   [junit4] Completed [113/823 (1!)] on J1 in 16.06s, 2 tests, 2 errors <<< FAILURES!

[...truncated 44428 lines...]
[repro] Jenkins log URL: https://jenkins.thetaphi.de/job/Lucene-Solr-7.x-Linux/2299/consoleText

[repro] Revision: f3e8180bd71cdc3e51a72e9e529a8e69251bdda5

[repro] Ant options: "-Dargs=-XX:-UseCompressedOops -XX:+UseParallelGC"
[repro] Repro line:  ant test  -Dtestcase=LeaderTragicEventTest -Dtests.method=testOtherReplicasAreNotActive -Dtests.seed=6C3FCA574BA3CD72 -Dtests.multiplier=3 -Dtests.slow=true -Dtests.locale=sah -Dtests.timezone=Asia/Muscat -Dtests.asserts=true -Dtests.file.encoding=UTF-8

[repro] Repro line:  ant test  -Dtestcase=LeaderTragicEventTest -Dtests.method=test -Dtests.seed=6C3FCA574BA3CD72 -Dtests.multiplier=3 -Dtests.slow=true -Dtests.locale=sah -Dtests.timezone=Asia/Muscat -Dtests.asserts=true -Dtests.file.encoding=UTF-8

[repro] ant clean

[...truncated 6 lines...]
[repro] Test suites by module:
[repro]    solr/core
[repro]       LeaderTragicEventTest
[repro] ant compile-test

[...truncated 3323 lines...]
[repro] ant test-nocompile -Dtests.dups=5 -Dtests.maxfailures=5 -Dtests.class="*.LeaderTragicEventTest" -Dtests.showOutput=onerror "-Dargs=-XX:-UseCompressedOops -XX:+UseParallelGC" -Dtests.seed=6C3FCA574BA3CD72 -Dtests.multiplier=3 -Dtests.slow=true -Dtests.locale=sah -Dtests.timezone=Asia/Muscat -Dtests.asserts=true -Dtests.file.encoding=UTF-8

[...truncated 32 lines...]
   [junit4] Suite: org.apache.solr.cloud.LeaderTragicEventTest
   [junit4]   2> 2027 INFO  (SUITE-LeaderTragicEventTest-seed#[6C3FCA574BA3CD72]-worker) [    ] o.a.s.SolrTestCaseJ4 SecureRandom sanity checks: test.solr.allowed.securerandom=null & java.security.egd=file:/dev/./urandom
   [junit4]   2> Creating dataDir: /home/jenkins/workspace/Lucene-Solr-7.x-Linux/solr/build/solr-core/test/J1/temp/solr.cloud.LeaderTragicEventTest_6C3FCA574BA3CD72-001/init-core-data-001
   [junit4]   2> 2184 INFO  (SUITE-LeaderTragicEventTest-seed#[6C3FCA574BA3CD72]-worker) [    ] o.a.s.SolrTestCaseJ4 Using PointFields (NUMERIC_POINTS_SYSPROP=true) w/NUMERIC_DOCVALUES_SYSPROP=true
   [junit4]   2> 2216 INFO  (SUITE-LeaderTragicEventTest-seed#[6C3FCA574BA3CD72]-worker) [    ] o.e.j.u.log Logging initialized @2251ms to org.eclipse.jetty.util.log.Slf4jLog
   [junit4]   2> 2235 INFO  (SUITE-LeaderTragicEventTest-seed#[6C3FCA574BA3CD72]-worker) [    ] o.a.s.SolrTestCaseJ4 Randomized ssl (false) and clientAuth (false) via: @org.apache.solr.util.RandomizeSSL(reason="", value=0.0/0.0, ssl=0.0/0.0, clientAuth=0.0/0.0)
   [junit4]   2> 2252 INFO  (SUITE-LeaderTragicEventTest-seed#[6C3FCA574BA3CD72]-worker) [    ] o.a.s.c.MiniSolrCloudCluster Starting cluster of 2 servers in /home/jenkins/workspace/Lucene-Solr-7.x-Linux/solr/build/solr-core/test/J1/temp/solr.cloud.LeaderTragicEventTest_6C3FCA574BA3CD72-001/tempDir-001
   [junit4]   2> 2258 INFO  (SUITE-LeaderTragicEventTest-seed#[6C3FCA574BA3CD72]-worker) [    ] o.a.s.c.ZkTestServer STARTING ZK TEST SERVER
   [junit4]   2> 2261 INFO  (Thread-0) [    ] o.a.s.c.ZkTestServer client port:0.0.0.0/0.0.0.0:0
   [junit4]   2> 2261 INFO  (Thread-0) [    ] o.a.s.c.ZkTestServer Starting server
   [junit4]   2> 2328 ERROR (Thread-0) [    ] o.a.z.s.ZooKeeperServer ZKShutdownHandler is not registered, so ZooKeeper server won't take any action on ERROR or SHUTDOWN server state changes
   [junit4]   2> 2361 INFO  (SUITE-LeaderTragicEventTest-seed#[6C3FCA574BA3CD72]-worker) [    ] o.a.s.c.ZkTestServer start zk server on port:37927
   [junit4]   2> 2422 INFO  (zkConnectionManagerCallback-4-thread-1) [    ] o.a.s.c.c.ConnectionManager zkClient has connected
   [junit4]   2> 2561 INFO  (jetty-launcher-1-thread-2) [    ] o.e.j.s.Server jetty-9.4.11.v20180605; built: 2018-06-05T18:24:03.829Z; git: d5fc0523cfa96bfebfbda19606cad384d772f04c; jvm 10+46
   [junit4]   2> 2561 INFO  (jetty-launcher-1-thread-1) [    ] o.e.j.s.Server jetty-9.4.11.v20180605; built: 2018-06-05T18:24:03.829Z; git: d5fc0523cfa96bfebfbda19606cad384d772f04c; jvm 10+46
   [junit4]   2> 2600 INFO  (jetty-launcher-1-thread-2) [    ] o.e.j.s.session DefaultSessionIdManager workerName=node0
   [junit4]   2> 2600 INFO  (jetty-launcher-1-thread-2) [    ] o.e.j.s.session No SessionScavenger set, using defaults
   [junit4]   2> 2602 INFO  (jetty-launcher-1-thread-2) [    ] o.e.j.s.session node0 Scavenging every 600000ms
   [junit4]   2> 2609 INFO  (jetty-launcher-1-thread-1) [    ] o.e.j.s.session DefaultSessionIdManager workerName=node0
   [junit4]   2> 2609 INFO  (jetty-launcher-1-thread-1) [    ] o.e.j.s.session No SessionScavenger set, using defaults
   [junit4]   2> 2609 INFO  (jetty-launcher-1-thread-1) [    ] o.e.j.s.session node0 Scavenging every 600000ms
   [junit4]   2> 2635 INFO  (jetty-launcher-1-thread-1) [    ] o.e.j.s.h.ContextHandler Started o.e.j.s.ServletContextHandler@43897ec1{/solr,null,AVAILABLE}
   [junit4]   2> 2637 INFO  (jetty-launcher-1-thread-2) [    ] o.e.j.s.h.ContextHandler Started o.e.j.s.ServletContextHandler@7bb4f5e8{/solr,null,AVAILABLE}
   [junit4]   2> 2643 INFO  (jetty-launcher-1-thread-2) [    ] o.e.j.s.AbstractConnector Started ServerConnector@372ce3ac{HTTP/1.1,[http/1.1]}{127.0.0.1:44243}
   [junit4]   2> 2643 INFO  (jetty-launcher-1-thread-2) [    ] o.e.j.s.Server Started @2682ms
   [junit4]   2> 2649 INFO  (jetty-launcher-1-thread-2) [    ] o.a.s.c.s.e.JettySolrRunner Jetty properties: {hostContext=/solr, hostPort=44243}
   [junit4]   2> 2649 INFO  (jetty-launcher-1-thread-1) [    ] o.e.j.s.AbstractConnector Started ServerConnector@7b5a1a4c{HTTP/1.1,[http/1.1]}{127.0.0.1:34923}
   [junit4]   2> 2649 INFO  (jetty-launcher-1-thread-1) [    ] o.e.j.s.Server Started @2688ms
   [junit4]   2> 2650 INFO  (jetty-launcher-1-thread-1) [    ] o.a.s.c.s.e.JettySolrRunner Jetty properties: {hostContext=/solr, hostPort=34923}
   [junit4]   2> 2681 INFO  (jetty-launcher-1-thread-1) [    ] o.a.s.u.c.SSLCredentialProviderFactory Processing SSL Credential Provider chain: env;sysprop
   [junit4]   2> 2699 ERROR (jetty-launcher-1-thread-2) [    ] o.a.s.u.StartupLoggingUtils Missing Java Option solr.log.dir. Logging may be missing or incomplete.
   [junit4]   2> 2700 INFO  (jetty-launcher-1-thread-2) [    ] o.a.s.s.SolrDispatchFilter Using logger factory org.apache.logging.slf4j.Log4jLoggerFactory
   [junit4]   2> 2700 INFO  (jetty-launcher-1-thread-2) [    ] o.a.s.s.SolrDispatchFilter  ___      _       Welcome to Apache Solr™ version 7.5.0
   [junit4]   2> 2704 ERROR (jetty-launcher-1-thread-1) [    ] o.a.s.u.StartupLoggingUtils Missing Java Option solr.log.dir. Logging may be missing or incomplete.
   [junit4]   2> 2704 INFO  (jetty-launcher-1-thread-1) [    ] o.a.s.s.SolrDispatchFilter Using logger factory org.apache.logging.slf4j.Log4jLoggerFactory
   [junit4]   2> 2705 INFO  (jetty-launcher-1-thread-1) [    ] o.a.s.s.SolrDispatchFilter  ___      _       Welcome to Apache Solr™ version 7.5.0
   [junit4]   2> 2705 INFO  (jetty-launcher-1-thread-1) [    ] o.a.s.s.SolrDispatchFilter / __| ___| |_ _   Starting in cloud mode on port null
   [junit4]   2> 2705 INFO  (jetty-launcher-1-thread-1) [    ] o.a.s.s.SolrDispatchFilter \__ \/ _ \ | '_|  Install dir: null
   [junit4]   2> 2706 INFO  (jetty-launcher-1-thread-1) [    ] o.a.s.s.SolrDispatchFilter |___/\___/_|_|    Start time: 2018-07-11T16:03:14.599974Z
   [junit4]   2> 2704 INFO  (jetty-launcher-1-thread-2) [    ] o.a.s.s.SolrDispatchFilter / __| ___| |_ _   Starting in cloud mode on port null
   [junit4]   2> 2706 INFO  (jetty-launcher-1-thread-2) [    ] o.a.s.s.SolrDispatchFilter \__ \/ _ \ | '_|  Install dir: null
   [junit4]   2> 2707 INFO  (jetty-launcher-1-thread-2) [    ] o.a.s.s.SolrDispatchFilter |___/\___/_|_|    Start time: 2018-07-11T16:03:14.600909Z
   [junit4]   2> 2771 INFO  (jetty-launcher-1-thread-2) [    ] o.a.s.c.SolrResourceLoader solr home defaulted to 'solr/' (could not find system property or JNDI)
   [junit4]   2> 2797 INFO  (zkConnectionManagerCallback-8-thread-1) [    ] o.a.s.c.c.ConnectionManager zkClient has connected
   [junit4]   2> 2813 INFO  (jetty-launcher-1-thread-1) [    ] o.a.s.s.SolrDispatchFilter solr.xml found in ZooKeeper. Loading...
   [junit4]   2> 2819 INFO  (zkConnectionManagerCallback-6-thread-1) [    ] o.a.s.c.c.ConnectionManager zkClient has connected
   [junit4]   2> 2825 INFO  (jetty-launcher-1-thread-2) [    ] o.a.s.s.SolrDispatchFilter solr.xml found in ZooKeeper. Loading...
   [junit4]   2> 3634 INFO  (jetty-launcher-1-thread-2) [    ] o.a.s.c.ZkContainer Zookeeper cli

[...truncated too long message...]

  CLOSING SolrCore org.apache.solr.core.SolrCore@347e98b4
   [junit4]   2> 24720 INFO  (OverseerStateUpdate-72109642087137284-127.0.0.1:40945_solr-n_0000000000) [    ] o.a.s.c.Overseer Overseer Loop exiting : 127.0.0.1:40945_solr
   [junit4]   2> 24720 INFO  (coreCloseExecutor-59-thread-1) [n:127.0.0.1:39073_solr c:collection1 s:shard1 r:core_node2 x:collection1_shard1_replica_n1] o.a.s.m.SolrMetricManager Closing metric reporters for registry=solr.core.collection1.shard1.replica_n1, tag=347e98b4
   [junit4]   2> 24720 INFO  (coreCloseExecutor-59-thread-1) [n:127.0.0.1:39073_solr c:collection1 s:shard1 r:core_node2 x:collection1_shard1_replica_n1] o.a.s.m.r.SolrJmxReporter Closing reporter [org.apache.solr.metrics.reporters.SolrJmxReporter@14aae6e2: rootName = solr_39073, domain = solr.core.collection1.shard1.replica_n1, service url = null, agent id = null] for registry solr.core.collection1.shard1.replica_n1 / com.codahale.metrics.MetricRegistry@1382dce0
   [junit4]   2> 24721 WARN  (OverseerAutoScalingTriggerThread-72109642087137284-127.0.0.1:40945_solr-n_0000000000) [    ] o.a.s.c.a.OverseerTriggerThread OverseerTriggerThread woken up but we are closed, exiting.
   [junit4]   2> 24723 INFO  (jetty-closer-45-thread-2) [    ] o.e.j.s.h.ContextHandler Stopped o.e.j.s.ServletContextHandler@7bfbc261{/solr,null,UNAVAILABLE}
   [junit4]   2> 24723 WARN  (NIOServerCxn.Factory:0.0.0.0/0.0.0.0:0) [    ] o.a.z.s.NIOServerCnxn Unable to read additional data from client sessionid 0x1002f56617c0004, likely client has closed socket
   [junit4]   2> 24723 INFO  (jetty-closer-45-thread-2) [    ] o.e.j.s.session node0 Stopped scavenging
   [junit4]   2> 24723 INFO  (zkCallback-64-thread-1) [    ] o.a.s.c.OverseerElectionContext I am going to be the leader 127.0.0.1:39073_solr
   [junit4]   2> 24729 INFO  (coreCloseExecutor-59-thread-1) [n:127.0.0.1:39073_solr c:collection1 s:shard1 r:core_node2 x:collection1_shard1_replica_n1] o.a.s.m.SolrMetricManager Closing metric reporters for registry=solr.collection.collection1.shard1.leader, tag=347e98b4
   [junit4]   2> 36843 ERROR (coreCloseExecutor-59-thread-1) [n:127.0.0.1:39073_solr c:collection1 s:shard1 r:core_node2 x:collection1_shard1_replica_n1] o.a.s.c.CachingDirectoryFactory Timeout waiting for all directory ref counts to be released - gave up waiting on CachedDir<<refCount=1;path=/home/jenkins/workspace/Lucene-Solr-7.x-Linux/solr/build/solr-core/test/J1/temp/solr.cloud.LeaderTragicEventTest_6C3FCA574BA3CD72-002/tempDir-001/node2/./collection1_shard1_replica_n1/data/index;done=false>>
   [junit4]   2> 36844 ERROR (coreCloseExecutor-59-thread-1) [n:127.0.0.1:39073_solr c:collection1 s:shard1 r:core_node2 x:collection1_shard1_replica_n1] o.a.s.c.CachingDirectoryFactory Error closing directory:org.apache.solr.common.SolrException: Timeout waiting for all directory ref counts to be released - gave up waiting on CachedDir<<refCount=1;path=/home/jenkins/workspace/Lucene-Solr-7.x-Linux/solr/build/solr-core/test/J1/temp/solr.cloud.LeaderTragicEventTest_6C3FCA574BA3CD72-002/tempDir-001/node2/./collection1_shard1_replica_n1/data/index;done=false>>
   [junit4]   2> at org.apache.solr.core.CachingDirectoryFactory.close(CachingDirectoryFactory.java:178)
   [junit4]   2> at org.apache.solr.core.SolrCore.close(SolrCore.java:1643)
   [junit4]   2> at org.apache.solr.core.SolrCores.lambda$close$0(SolrCores.java:141)
   [junit4]   2> at java.base/java.util.concurrent.FutureTask.run(FutureTask.java:264)
   [junit4]   2> at org.apache.solr.common.util.ExecutorUtil$MDCAwareThreadPoolExecutor.lambda$execute$0(ExecutorUtil.java:209)
   [junit4]   2> at java.base/java.util.concurrent.ThreadPoolExecutor.runWorker(ThreadPoolExecutor.java:1135)
   [junit4]   2> at java.base/java.util.concurrent.ThreadPoolExecutor$Worker.run(ThreadPoolExecutor.java:635)
   [junit4]   2> at java.base/java.lang.Thread.run(Thread.java:844)
   [junit4]   2>
   [junit4]   2> 36844 ERROR (coreCloseExecutor-59-thread-1) [n:127.0.0.1:39073_solr c:collection1 s:shard1 r:core_node2 x:collection1_shard1_replica_n1] o.a.s.c.SolrCore java.lang.AssertionError: 1
   [junit4]   2> at org.apache.solr.core.CachingDirectoryFactory.close(CachingDirectoryFactory.java:192)
   [junit4]   2> at org.apache.solr.core.SolrCore.close(SolrCore.java:1643)
   [junit4]   2> at org.apache.solr.core.SolrCores.lambda$close$0(SolrCores.java:141)
   [junit4]   2> at java.base/java.util.concurrent.FutureTask.run(FutureTask.java:264)
   [junit4]   2> at org.apache.solr.common.util.ExecutorUtil$MDCAwareThreadPoolExecutor.lambda$execute$0(ExecutorUtil.java:209)
   [junit4]   2> at java.base/java.util.concurrent.ThreadPoolExecutor.runWorker(ThreadPoolExecutor.java:1135)
   [junit4]   2> at java.base/java.util.concurrent.ThreadPoolExecutor$Worker.run(ThreadPoolExecutor.java:635)
   [junit4]   2> at java.base/java.lang.Thread.run(Thread.java:844)
   [junit4]   2>
   [junit4]   2> 36844 ERROR (coreCloseExecutor-59-thread-1) [n:127.0.0.1:39073_solr c:collection1 s:shard1 r:core_node2 x:collection1_shard1_replica_n1] o.a.s.c.SolrCores Error shutting down core:java.lang.AssertionError: 1
   [junit4]   2> at org.apache.solr.core.CachingDirectoryFactory.close(CachingDirectoryFactory.java:192)
   [junit4]   2> at org.apache.solr.core.SolrCore.close(SolrCore.java:1643)
   [junit4]   2> at org.apache.solr.core.SolrCores.lambda$close$0(SolrCores.java:141)
   [junit4]   2> at java.base/java.util.concurrent.FutureTask.run(FutureTask.java:264)
   [junit4]   2> at org.apache.solr.common.util.ExecutorUtil$MDCAwareThreadPoolExecutor.lambda$execute$0(ExecutorUtil.java:209)
   [junit4]   2> at java.base/java.util.concurrent.ThreadPoolExecutor.runWorker(ThreadPoolExecutor.java:1135)
   [junit4]   2> at java.base/java.util.concurrent.ThreadPoolExecutor$Worker.run(ThreadPoolExecutor.java:635)
   [junit4]   2> at java.base/java.lang.Thread.run(Thread.java:844)
   [junit4]   2>
   [junit4]   2> 36846 INFO  (jetty-closer-45-thread-1) [    ] o.e.j.s.h.ContextHandler Stopped o.e.j.s.ServletContextHandler@7e68260e{/solr,null,UNAVAILABLE}
   [junit4]   2> 36846 INFO  (jetty-closer-45-thread-1) [    ] o.e.j.s.session node0 Stopped scavenging
   [junit4]   2> 36849 ERROR (SUITE-LeaderTragicEventTest-seed#[6C3FCA574BA3CD72]-worker) [    ] o.a.z.s.ZooKeeperServer ZKShutdownHandler is not registered, so ZooKeeper server won't take any action on ERROR or SHUTDOWN server state changes
   [junit4]   2> 36849 INFO  (SUITE-LeaderTragicEventTest-seed#[6C3FCA574BA3CD72]-worker) [    ] o.a.s.c.ZkTestServer connecting to 127.0.0.1:45065 45065
   [junit4]   2> 37616 INFO  (Thread-21) [    ] o.a.s.c.ZkTestServer connecting to 127.0.0.1:45065 45065
   [junit4]   2> 37616 WARN  (Thread-21) [    ] o.a.s.c.ZkTestServer Watch limit violations:
   [junit4]   2> Maximum concurrent create/delete watches above limit:
   [junit4]   2>
   [junit4]   2> 5 /solr/aliases.json
   [junit4]   2> 5 /solr/clusterprops.json
   [junit4]   2> 2 /solr/security.json
   [junit4]   2> 2 /solr/collections/collection1/terms/shard1
   [junit4]   2>
   [junit4]   2> Maximum concurrent data watches above limit:
   [junit4]   2>
   [junit4]   2> 5 /solr/clusterstate.json
   [junit4]   2>
   [junit4]   2> Maximum concurrent children watches above limit:
   [junit4]   2>
   [junit4]   2> 5 /solr/live_nodes
   [junit4]   2> 5 /solr/collections
   [junit4]   2>
   [junit4]   2> NOTE: leaving temporary files on disk at: /home/jenkins/workspace/Lucene-Solr-7.x-Linux/solr/build/solr-core/test/J1/temp/solr.cloud.LeaderTragicEventTest_6C3FCA574BA3CD72-002
   [junit4]   2> NOTE: test params are: codec=Asserting(Lucene70), sim=RandomSimilarity(queryNorm=true): {}, locale=sah, timezone=Asia/Muscat
   [junit4]   2> NOTE: Linux 4.15.0-24-generic amd64/Oracle Corporation 10 (64-bit)/cpus=8,threads=1,free=348992856,total=511705088
   [junit4]   2> NOTE: All tests run in this JVM: [LeaderTragicEventTest, LeaderTragicEventTest]
   [junit4] Completed [5/5 (5!)] on J1 in 16.17s, 2 tests, 2 errors <<< FAILURES!

[...truncated 20 lines...]
BUILD FAILED
/home/jenkins/workspace/Lucene-Solr-7.x-Linux/lucene/common-build.xml:1568: The following error occurred while executing this line:
/home/jenkins/workspace/Lucene-Solr-7.x-Linux/lucene/common-build.xml:1092: There were test failures: 5 suites, 10 tests, 10 errors [seed: 6C3FCA574BA3CD72]

Total time: 39 seconds

[repro] Setting last failure code to 256

[repro] Failures:
[repro]   5/5 failed: org.apache.solr.cloud.LeaderTragicEventTest
[repro] Exiting with code 256
+ mv lucene/build lucene/build.repro
+ mv solr/build solr/build.repro
+ mv lucene/build.orig lucene/build
+ mv solr/build.orig solr/build
Archiving artifacts
Setting ANT_1_8_2_HOME=/var/lib/jenkins/tools/hudson.tasks.Ant_AntInstallation/ANT_1.8.2
[WARNINGS] Parsing warnings in console log with parser Java Compiler (javac)
Setting ANT_1_8_2_HOME=/var/lib/jenkins/tools/hudson.tasks.Ant_AntInstallation/ANT_1.8.2
Setting ANT_1_8_2_HOME=/var/lib/jenkins/tools/hudson.tasks.Ant_AntInstallation/ANT_1.8.2
<Git Blamer> Using GitBlamer to create author and commit information for all warnings.
<Git Blamer> GIT_COMMIT=f3e8180bd71cdc3e51a72e9e529a8e69251bdda5, workspace=/var/lib/jenkins/workspace/Lucene-Solr-7.x-Linux
[WARNINGS] Computing warning deltas based on reference build #2298
Recording test results
Setting ANT_1_8_2_HOME=/var/lib/jenkins/tools/hudson.tasks.Ant_AntInstallation/ANT_1.8.2
Build step 'Publish JUnit test result report' changed build result to UNSTABLE
Email was triggered for: Unstable (Test Failures)
Sending email for trigger: Unstable (Test Failures)
Setting ANT_1_8_2_HOME=/var/lib/jenkins/tools/hudson.tasks.Ant_AntInstallation/ANT_1.8.2
Setting ANT_1_8_2_HOME=/var/lib/jenkins/tools/hudson.tasks.Ant_AntInstallation/ANT_1.8.2
Setting ANT_1_8_2_HOME=/var/lib/jenkins/tools/hudson.tasks.Ant_AntInstallation/ANT_1.8.2
Setting ANT_1_8_2_HOME=/var/lib/jenkins/tools/hudson.tasks.Ant_AntInstallation/ANT_1.8.2


---------------------------------------------------------------------
To unsubscribe, e-mail: [hidden email]
For additional commands, e-mail: [hidden email]