[JENKINS] Lucene-Solr-7.x-Linux (64bit/jdk-9.0.4) - Build # 1912 - Unstable!

classic Classic list List threaded Threaded
1 message Options
Reply | Threaded
Open this post in threaded view
|

[JENKINS] Lucene-Solr-7.x-Linux (64bit/jdk-9.0.4) - Build # 1912 - Unstable!

Policeman Jenkins Server-2
Build: https://jenkins.thetaphi.de/job/Lucene-Solr-7.x-Linux/1912/
Java: 64bit/jdk-9.0.4 -XX:+UseCompressedOops -XX:+UseParallelGC

1 tests failed.
FAILED:  org.apache.solr.cloud.autoscaling.SearchRateTriggerTest.testTrigger

Error Message:
expected:<1> but was:<2>

Stack Trace:
java.lang.AssertionError: expected:<1> but was:<2>
        at __randomizedtesting.SeedInfo.seed([40DC3E4A6DE16D98:231708C8F42E1EB5]:0)
        at org.junit.Assert.fail(Assert.java:93)
        at org.junit.Assert.failNotEquals(Assert.java:647)
        at org.junit.Assert.assertEquals(Assert.java:128)
        at org.junit.Assert.assertEquals(Assert.java:472)
        at org.junit.Assert.assertEquals(Assert.java:456)
        at org.apache.solr.cloud.autoscaling.SearchRateTriggerTest.testTrigger(SearchRateTriggerTest.java:133)
        at java.base/jdk.internal.reflect.NativeMethodAccessorImpl.invoke0(Native Method)
        at java.base/jdk.internal.reflect.NativeMethodAccessorImpl.invoke(NativeMethodAccessorImpl.java:62)
        at java.base/jdk.internal.reflect.DelegatingMethodAccessorImpl.invoke(DelegatingMethodAccessorImpl.java:43)
        at java.base/java.lang.reflect.Method.invoke(Method.java:564)
        at com.carrotsearch.randomizedtesting.RandomizedRunner.invoke(RandomizedRunner.java:1737)
        at com.carrotsearch.randomizedtesting.RandomizedRunner$8.evaluate(RandomizedRunner.java:934)
        at com.carrotsearch.randomizedtesting.RandomizedRunner$9.evaluate(RandomizedRunner.java:970)
        at com.carrotsearch.randomizedtesting.RandomizedRunner$10.evaluate(RandomizedRunner.java:984)
        at com.carrotsearch.randomizedtesting.rules.SystemPropertiesRestoreRule$1.evaluate(SystemPropertiesRestoreRule.java:57)
        at org.apache.lucene.util.TestRuleSetupTeardownChained$1.evaluate(TestRuleSetupTeardownChained.java:49)
        at org.apache.lucene.util.AbstractBeforeAfterRule$1.evaluate(AbstractBeforeAfterRule.java:45)
        at org.apache.lucene.util.TestRuleThreadAndTestName$1.evaluate(TestRuleThreadAndTestName.java:48)
        at org.apache.lucene.util.TestRuleIgnoreAfterMaxFailures$1.evaluate(TestRuleIgnoreAfterMaxFailures.java:64)
        at org.apache.lucene.util.TestRuleMarkFailure$1.evaluate(TestRuleMarkFailure.java:47)
        at com.carrotsearch.randomizedtesting.rules.StatementAdapter.evaluate(StatementAdapter.java:36)
        at com.carrotsearch.randomizedtesting.ThreadLeakControl$StatementRunner.run(ThreadLeakControl.java:368)
        at com.carrotsearch.randomizedtesting.ThreadLeakControl.forkTimeoutingTask(ThreadLeakControl.java:817)
        at com.carrotsearch.randomizedtesting.ThreadLeakControl$3.evaluate(ThreadLeakControl.java:468)
        at com.carrotsearch.randomizedtesting.RandomizedRunner.runSingleTest(RandomizedRunner.java:943)
        at com.carrotsearch.randomizedtesting.RandomizedRunner$5.evaluate(RandomizedRunner.java:829)
        at com.carrotsearch.randomizedtesting.RandomizedRunner$6.evaluate(RandomizedRunner.java:879)
        at com.carrotsearch.randomizedtesting.RandomizedRunner$7.evaluate(RandomizedRunner.java:890)
        at com.carrotsearch.randomizedtesting.rules.StatementAdapter.evaluate(StatementAdapter.java:36)
        at com.carrotsearch.randomizedtesting.rules.SystemPropertiesRestoreRule$1.evaluate(SystemPropertiesRestoreRule.java:57)
        at org.apache.lucene.util.AbstractBeforeAfterRule$1.evaluate(AbstractBeforeAfterRule.java:45)
        at com.carrotsearch.randomizedtesting.rules.StatementAdapter.evaluate(StatementAdapter.java:36)
        at org.apache.lucene.util.TestRuleStoreClassName$1.evaluate(TestRuleStoreClassName.java:41)
        at com.carrotsearch.randomizedtesting.rules.NoShadowingOrOverridesOnMethodsRule$1.evaluate(NoShadowingOrOverridesOnMethodsRule.java:40)
        at com.carrotsearch.randomizedtesting.rules.NoShadowingOrOverridesOnMethodsRule$1.evaluate(NoShadowingOrOverridesOnMethodsRule.java:40)
        at com.carrotsearch.randomizedtesting.rules.StatementAdapter.evaluate(StatementAdapter.java:36)
        at com.carrotsearch.randomizedtesting.rules.StatementAdapter.evaluate(StatementAdapter.java:36)
        at org.apache.lucene.util.TestRuleAssertionsRequired$1.evaluate(TestRuleAssertionsRequired.java:53)
        at org.apache.lucene.util.TestRuleMarkFailure$1.evaluate(TestRuleMarkFailure.java:47)
        at org.apache.lucene.util.TestRuleIgnoreAfterMaxFailures$1.evaluate(TestRuleIgnoreAfterMaxFailures.java:64)
        at org.apache.lucene.util.TestRuleIgnoreTestSuites$1.evaluate(TestRuleIgnoreTestSuites.java:54)
        at com.carrotsearch.randomizedtesting.rules.StatementAdapter.evaluate(StatementAdapter.java:36)
        at com.carrotsearch.randomizedtesting.ThreadLeakControl$StatementRunner.run(ThreadLeakControl.java:368)
        at java.base/java.lang.Thread.run(Thread.java:844)




Build Log:
[...truncated 13438 lines...]
   [junit4] Suite: org.apache.solr.cloud.autoscaling.SearchRateTriggerTest
   [junit4]   2> Creating dataDir: /home/jenkins/workspace/Lucene-Solr-7.x-Linux/solr/build/solr-core/test/J2/temp/solr.cloud.autoscaling.SearchRateTriggerTest_40DC3E4A6DE16D98-001/init-core-data-001
   [junit4]   2> 668294 INFO  (SUITE-SearchRateTriggerTest-seed#[40DC3E4A6DE16D98]-worker) [    ] o.a.s.SolrTestCaseJ4 Using TrieFields (NUMERIC_POINTS_SYSPROP=false) w/NUMERIC_DOCVALUES_SYSPROP=true
   [junit4]   2> 668294 INFO  (SUITE-SearchRateTriggerTest-seed#[40DC3E4A6DE16D98]-worker) [    ] o.a.s.SolrTestCaseJ4 Randomized ssl (true) and clientAuth (true) via: @org.apache.solr.util.RandomizeSSL(reason="", ssl=0.0/0.0, value=0.0/0.0, clientAuth=0.0/0.0)
   [junit4]   2> 668295 INFO  (SUITE-SearchRateTriggerTest-seed#[40DC3E4A6DE16D98]-worker) [    ] o.a.s.SolrTestCaseJ4 SecureRandom sanity checks: test.solr.allowed.securerandom=null & java.security.egd=file:/dev/./urandom
   [junit4]   2> 668295 INFO  (SUITE-SearchRateTriggerTest-seed#[40DC3E4A6DE16D98]-worker) [    ] o.a.s.c.MiniSolrCloudCluster Starting cluster of 4 servers in /home/jenkins/workspace/Lucene-Solr-7.x-Linux/solr/build/solr-core/test/J2/temp/solr.cloud.autoscaling.SearchRateTriggerTest_40DC3E4A6DE16D98-001/tempDir-001
   [junit4]   2> 668295 INFO  (SUITE-SearchRateTriggerTest-seed#[40DC3E4A6DE16D98]-worker) [    ] o.a.s.c.ZkTestServer STARTING ZK TEST SERVER
   [junit4]   2> 668296 INFO  (Thread-2518) [    ] o.a.s.c.ZkTestServer client port:0.0.0.0/0.0.0.0:0
   [junit4]   2> 668296 INFO  (Thread-2518) [    ] o.a.s.c.ZkTestServer Starting server
   [junit4]   2> 668297 ERROR (Thread-2518) [    ] o.a.z.s.ZooKeeperServer ZKShutdownHandler is not registered, so ZooKeeper server won't take any action on ERROR or SHUTDOWN server state changes
   [junit4]   2> 668396 INFO  (SUITE-SearchRateTriggerTest-seed#[40DC3E4A6DE16D98]-worker) [    ] o.a.s.c.ZkTestServer start zk server on port:40401
   [junit4]   2> 668397 INFO  (zkConnectionManagerCallback-4205-thread-1) [    ] o.a.s.c.c.ConnectionManager zkClient has connected
   [junit4]   2> 668399 WARN  (NIOServerCxn.Factory:0.0.0.0/0.0.0.0:0) [    ] o.a.z.s.NIOServerCnxn Unable to read additional data from client sessionid 0x100684cdeb50000, likely client has closed socket
   [junit4]   2> 668400 INFO  (jetty-launcher-4202-thread-3) [    ] o.e.j.s.Server jetty-9.4.10.v20180503; built: 2018-05-03T15:56:21.710Z; git: daa59876e6f384329b122929e70a80934569428c; jvm 9.0.4+11
   [junit4]   2> 668400 INFO  (jetty-launcher-4202-thread-2) [    ] o.e.j.s.Server jetty-9.4.10.v20180503; built: 2018-05-03T15:56:21.710Z; git: daa59876e6f384329b122929e70a80934569428c; jvm 9.0.4+11
   [junit4]   2> 668400 INFO  (jetty-launcher-4202-thread-4) [    ] o.e.j.s.Server jetty-9.4.10.v20180503; built: 2018-05-03T15:56:21.710Z; git: daa59876e6f384329b122929e70a80934569428c; jvm 9.0.4+11
   [junit4]   2> 668400 INFO  (jetty-launcher-4202-thread-1) [    ] o.e.j.s.Server jetty-9.4.10.v20180503; built: 2018-05-03T15:56:21.710Z; git: daa59876e6f384329b122929e70a80934569428c; jvm 9.0.4+11
   [junit4]   2> 668401 INFO  (jetty-launcher-4202-thread-3) [    ] o.e.j.s.session DefaultSessionIdManager workerName=node0
   [junit4]   2> 668401 INFO  (jetty-launcher-4202-thread-3) [    ] o.e.j.s.session No SessionScavenger set, using defaults
   [junit4]   2> 668401 INFO  (jetty-launcher-4202-thread-3) [    ] o.e.j.s.session node0 Scavenging every 600000ms
   [junit4]   2> 668401 INFO  (jetty-launcher-4202-thread-2) [    ] o.e.j.s.session DefaultSessionIdManager workerName=node0
   [junit4]   2> 668401 INFO  (jetty-launcher-4202-thread-2) [    ] o.e.j.s.session No SessionScavenger set, using defaults
   [junit4]   2> 668401 INFO  (jetty-launcher-4202-thread-2) [    ] o.e.j.s.session node0 Scavenging every 600000ms
   [junit4]   2> 668401 INFO  (jetty-launcher-4202-thread-3) [    ] o.e.j.s.h.ContextHandler Started o.e.j.s.ServletContextHandler@703ed11e{/solr,null,AVAILABLE}
   [junit4]   2> 668401 INFO  (jetty-launcher-4202-thread-4) [    ] o.e.j.s.session DefaultSessionIdManager workerName=node0
   [junit4]   2> 668401 INFO  (jetty-launcher-4202-thread-4) [    ] o.e.j.s.session No SessionScavenger set, using defaults
   [junit4]   2> 668402 INFO  (jetty-launcher-4202-thread-4) [    ] o.e.j.s.session node0 Scavenging every 600000ms
   [junit4]   2> 668402 INFO  (jetty-launcher-4202-thread-1) [    ] o.e.j.s.session DefaultSessionIdManager workerName=node0
   [junit4]   2> 668402 INFO  (jetty-launcher-4202-thread-1) [    ] o.e.j.s.session No SessionScavenger set, using defaults
   [junit4]   2> 668402 INFO  (jetty-launcher-4202-thread-1) [    ] o.e.j.s.session node0 Scavenging every 660000ms
   [junit4]   2> 668402 INFO  (jetty-launcher-4202-thread-2) [    ] o.e.j.s.h.ContextHandler Started o.e.j.s.ServletContextHandler@448af573{/solr,null,AVAILABLE}
   [junit4]   2> 668402 INFO  (jetty-launcher-4202-thread-4) [    ] o.e.j.s.h.ContextHandler Started o.e.j.s.ServletContextHandler@c0ef65{/solr,null,AVAILABLE}
   [junit4]   2> 668402 INFO  (jetty-launcher-4202-thread-1) [    ] o.e.j.s.h.ContextHandler Started o.e.j.s.ServletContextHandler@652ccdf6{/solr,null,AVAILABLE}
   [junit4]   2> 668402 INFO  (jetty-launcher-4202-thread-3) [    ] o.e.j.s.AbstractConnector Started ServerConnector@56096be{SSL,[ssl, http/1.1]}{127.0.0.1:40827}
   [junit4]   2> 668402 INFO  (jetty-launcher-4202-thread-2) [    ] o.e.j.s.AbstractConnector Started ServerConnector@7070fd4b{SSL,[ssl, http/1.1]}{127.0.0.1:40931}
   [junit4]   2> 668403 INFO  (jetty-launcher-4202-thread-3) [    ] o.e.j.s.Server Started @668446ms
   [junit4]   2> 668402 INFO  (jetty-launcher-4202-thread-1) [    ] o.e.j.s.AbstractConnector Started ServerConnector@6c4c25cc{SSL,[ssl, http/1.1]}{127.0.0.1:37655}
   [junit4]   2> 668403 INFO  (jetty-launcher-4202-thread-2) [    ] o.e.j.s.Server Started @668446ms
   [junit4]   2> 668403 INFO  (jetty-launcher-4202-thread-1) [    ] o.e.j.s.Server Started @668446ms
   [junit4]   2> 668403 INFO  (jetty-launcher-4202-thread-3) [    ] o.a.s.c.s.e.JettySolrRunner Jetty properties: {hostContext=/solr, hostPort=40827}
   [junit4]   2> 668403 INFO  (jetty-launcher-4202-thread-2) [    ] o.a.s.c.s.e.JettySolrRunner Jetty properties: {hostContext=/solr, hostPort=40931}
   [junit4]   2> 668403 INFO  (jetty-launcher-4202-thread-1) [    ] o.a.s.c.s.e.JettySolrRunner Jetty properties: {hostContext=/solr, hostPort=37655}
   [junit4]   2> 668403 ERROR (jetty-launcher-4202-thread-3) [    ] o.a.s.u.StartupLoggingUtils Missing Java Option solr.log.dir. Logging may be missing or incomplete.
   [junit4]   2> 668403 ERROR (jetty-launcher-4202-thread-2) [    ] o.a.s.u.StartupLoggingUtils Missing Java Option solr.log.dir. Logging may be missing or incomplete.
   [junit4]   2> 668403 INFO  (jetty-launcher-4202-thread-3) [    ] o.a.s.s.SolrDispatchFilter Using logger factory org.apache.logging.slf4j.Log4jLoggerFactory
   [junit4]   2> 668403 INFO  (jetty-launcher-4202-thread-2) [    ] o.a.s.s.SolrDispatchFilter Using logger factory org.apache.logging.slf4j.Log4jLoggerFactory
   [junit4]   2> 668403 INFO  (jetty-launcher-4202-thread-3) [    ] o.a.s.s.SolrDispatchFilter  ___      _       Welcome to Apache Solr™ version 7.4.0
   [junit4]   2> 668403 ERROR (jetty-launcher-4202-thread-1) [    ] o.a.s.u.StartupLoggingUtils Missing Java Option solr.log.dir. Logging may be missing or incomplete.
   [junit4]   2> 668403 INFO  (jetty-launcher-4202-thread-3) [    ] o.a.s.s.SolrDispatchFilter / __| ___| |_ _   Starting in cloud mode on port null
   [junit4]   2> 668403 INFO  (jetty-launcher-4202-thread-1) [    ] o.a.s.s.SolrDispatchFilter Using logger factory org.apache.logging.slf4j.Log4jLoggerFactory
   [junit4]   2> 668403 INFO  (jetty-launcher-4202-thread-3) [    ] o.a.s.s.SolrDispatchFilter \__ \/ _ \ | '_|  Install dir: null
   [junit4]   2> 668403 INFO  (jetty-launcher-4202-thread-2) [    ] o.a.s.s.SolrDispatchFilter  ___      _       Welcome to Apache Solr™ version 7.4.0
   [junit4]   2> 668403 INFO  (jetty-launcher-4202-thread-3) [    ] o.a.s.s.SolrDispatchFilter |___/\___/_|_|    Start time: 2018-05-16T15:17:55.379413Z
   [junit4]   2> 668403 INFO  (jetty-launcher-4202-thread-1) [    ] o.a.s.s.SolrDispatchFilter  ___      _       Welcome to Apache Solr™ version 7.4.0
   [junit4]   2> 668403 INFO  (jetty-launcher-4202-thread-2) [    ] o.a.s.s.SolrDispatchFilter / __| ___| |_ _   Starting in cloud mode on port null
   [junit4]   2> 668403 INFO  (jetty-launcher-4202-thread-1) [    ] o.a.s.s.SolrDispatchFilter / __| ___| |_ _   Starting in cloud mode on port null
   [junit4]   2> 668403 INFO  (jetty-launcher-4202-thread-2) [    ] o.a.s.s.SolrDispatchFilter \__ \/ _ \ | '_|  Install dir: null
   [junit4]   2> 668403 INFO  (jetty-launcher-4202-thread-2) [    ] o.a.s.s.SolrDispatchFilter |___/\___/_|_|    Start time: 2018-05-16T15:17:55.379511Z
   [junit4]   2> 668403 INFO  (jetty-launcher-4202-thread-1) [    ] o.a.s.s.SolrDispatchFilter \__ \/ _ \ | '_|  Install dir: null
   [junit4]   2> 668403 INFO  (jetty-launcher-4202-thread-1) [    ] o.a.s.s.SolrDispatchFilter |___/\___/_|_|    Start time: 2018-05-16T15:17:55.379552Z
   [junit4]   2> 668403 INFO  (jetty-launcher-4202-thread-4) [    ] o.e.j.s.AbstractConnector Started ServerConnector@4c24bab6{SSL,[ssl, http/1.1]}{127.0.0.1:44459}
   [junit4]   2> 668403 INFO  (jetty-launcher-4202-thread-4) [    ] o.e.j.s.Server Started @668446ms
   [junit4]   2> 668403 INFO  (jetty-launcher-4202-thread-4) [    ] o.a.s.c.s.e.JettySolrRunner Jetty properties: {hostContext=/solr, hostPort=44459}
   [junit4]   2> 668403 ERROR (jetty-launcher-4202-thread-4) [    ] o.a.s.u.StartupLoggingUtils Missing Java Option solr.log.dir. Logging may be missing or incomplete.
   [junit4]   2> 668403 INFO  (jetty-launcher-4202-thread-4) [    ] o.a.s.s.SolrDispatchFilter Using logger factory org.apache.logging.slf4j.Log4jLoggerFactory
   [junit4]   2> 668404 INFO  (jetty-launcher-4202-thread-4) [    ] o.a.s.s.SolrDispatchFilter  ___      _       Welcome to Apache Solr™ version 7.4.0
   [junit4]   2> 668404 INFO  (jetty-launcher-4202-thread-4) [    ] o.a.s.s.SolrDispatchFilter / __| ___| |_ _   Starting in cloud mode on port null
   [junit4]   2> 668404 INFO  (jetty-launcher-4202-thread-4) [    ] o.a.s.s.SolrDispatchFilter \__ \/ _ \ | '_|  Install dir: null
   [junit4]   2> 668404 INFO  (jetty-launcher-4202-thread-4) [    ] o.a.s.s.SolrDispatchFilter |___/\___/_|_|    Start time: 2018-05-16T15:17:55.380068Z
   [junit4]   2> 668404 INFO  (zkConnectionManagerCallback-4207-thread-1) [    ] o.a.s.c.c.ConnectionManager zkClient has connected
   [junit4]   2> 668404 INFO  (zkConnectionManagerCallback-4211-thread-1) [    ] o.a.s.c.c.ConnectionManager zkClient has connected
   [junit4]   2> 668405 INFO  (zkConnectionManagerCallback-4209-thread-1) [    ] o.a.s.c.c.ConnectionManager zkClient has connected
   [junit4]   2> 668405 INFO  (jetty-launcher-4202-thread-3) [    ] o.a.s.s.SolrDispatchFilter solr.xml found in ZooKeeper. Loading...
   [junit4]   2> 668405 INFO  (jetty-launcher-4202-thread-1) [    ] o.a.s.s.SolrDispatchFilter solr.xml found in ZooKeeper. Loading...
   [junit4]   2> 668405 INFO  (zkConnectionManagerCallback-4213-thread-1) [    ] o.a.s.c.c.ConnectionManager zkClient has connected
   [junit4]   2> 668405 INFO  (jetty-launcher-4202-thread-2) [    ] o.a.s.s.SolrDispatchFilter solr.xml found in ZooKeeper. Loading...
   [junit4]   2> 668405 INFO  (jetty-launcher-4202-thread-4) [    ] o.a.s.s.SolrDispatchFilter solr.xml found in ZooKeeper. Loading...
   [junit4]   2> 668414 WARN  (NIOServerCxn.Factory:0.0.0.0/0.0.0.0:0) [    ] o.a.z.s.NIOServerCnxn Unable to read additional data from client sessionid 0x100684cdeb50004, likely client has closed socket
   [junit4]   2> 668425 INFO  (jetty-launcher-4202-thread-4) [    ] o.a.s.c.ZkContainer Zookeeper client=127.0.0.1:40401/solr
   [junit4]   2> 668426 INFO  (jetty-launcher-4202-thread-1) [    ] o.a.s.c.ZkContainer Zookeeper client=127.0.0.1:40401/solr
   [junit4]   2> 668432 INFO  (jetty-launcher-4202-thread-2) [    ] o.a.s.c.ZkContainer Zookeeper client=127.0.0.1:40401/solr
   [junit4]   2> 668432 INFO  (zkConnectionManagerCallback-4219-thread-1) [    ] o.a.s.c.c.ConnectionManager zkClient has connected
   [junit4]   2> 668434 INFO  (zkConnectionManagerCallback-4222-thread-1) [    ] o.a.s.c.c.ConnectionManager zkClient has connected
   [junit4]   2> 668435 INFO  (jetty-launcher-4202-thread-3) [    ] o.a.s.c.ZkContainer Zookeeper client=127.0.0.1:40401/solr
   [junit4]   2> 668435 INFO  (zkConnectionManagerCallback-4226-thread-1) [    ] o.a.s.c.c.ConnectionManager zkClient has connected
   [junit4]   2> 668435 INFO  (zkConnectionManagerCallback-4229-thread-1) [    ] o.a.s.c.c.ConnectionManager zkClient has connected
   [junit4]   2> 668436 INFO  (zkConnectionManagerCallback-4231-thread-1) [    ] o.a.s.c.c.ConnectionManager zkClient has connected
   [junit4]   2> 668436 INFO  (zkConnectionManagerCallback-4233-thread-1) [    ] o.a.s.c.c.ConnectionManager zkClient has connected
   [junit4]   2> 668436 INFO  (zkConnectionManagerCallback-4235-thread-1) [    ] o.a.s.c.c.ConnectionManager zkClient has connected
   [junit4]   2> 668436 INFO  (zkConnectionManagerCallback-4237-thread-1) [    ] o.a.s.c.c.ConnectionManager zkClient has connected
   [junit4]   2> 668477 INFO  (jetty-launcher-4202-thread-1) [n:127.0.0.1:37655_solr    ] o.a.s.c.Overseer Overseer (id=null) closing
   [junit4]   2> 668477 INFO  (jetty-launcher-4202-thread-4) [n:127.0.0.1:44459_solr    ] o.a.s.c.Overseer Overseer (id=null) closing
   [junit4]   2> 668477 INFO  (jetty-launcher-4202-thread-3) [n:127.0.0.1:40827_solr    ] o.a.s.c.Overseer Overseer (id=null) closing
   [junit4]   2> 668477 INFO  (jetty-launcher-4202-thread-2) [n:127.0.0.1:40931_solr    ] o.a.s.c.Overseer Overseer (id=null) closing
   [junit4]   2> 668477 INFO  (jetty-launcher-4202-thread-3) [n:127.0.0.1:40827_solr    ] o.a.s.c.OverseerElectionContext I am going to be the leader 127.0.0.1:40827_solr
   [junit4]   2> 668477 INFO  (jetty-launcher-4202-thread-1) [n:127.0.0.1:37655_solr    ] o.a.s.c.ZkController Register node as live in ZooKeeper:/live_nodes/127.0.0.1:37655_solr
   [junit4]   2> 668477 INFO  (jetty-launcher-4202-thread-2) [n:127.0.0.1:40931_solr    ] o.a.s.c.ZkController Register node as live in ZooKeeper:/live_nodes/127.0.0.1:40931_solr
   [junit4]   2> 668477 INFO  (jetty-launcher-4202-thread-4) [n:127.0.0.1:44459_solr    ] o.a.s.c.ZkController Register node as live in ZooKeeper:/live_nodes/127.0.0.1:44459_solr
   [junit4]   2> 668478 INFO  (jetty-launcher-4202-thread-3) [n:127.0.0.1:40827_solr    ] o.a.s.c.Overseer Overseer (id=72172273401135116-127.0.0.1:40827_solr-n_0000000000) starting
   [junit4]   2> 668484 INFO  (zkCallback-4234-thread-1) [    ] o.a.s.c.c.ZkStateReader Updated live nodes from ZooKeeper... (0) -> (3)
   [junit4]   2> 668484 INFO  (zkCallback-4232-thread-1) [    ] o.a.s.c.c.ZkStateReader Updated live nodes from ZooKeeper... (0) -> (3)
   [junit4]   2> 668484 INFO  (zkCallback-4236-thread-1) [    ] o.a.s.c.c.ZkStateReader Updated live nodes from ZooKeeper... (0) -> (3)
   [junit4]   2> 668485 INFO  (zkCallback-4228-thread-1) [    ] o.a.s.c.c.ZkStateReader Updated live nodes from ZooKeeper... (0) -> (3)
   [junit4]   2> 668504 INFO  (zkConnectionManagerCallback-4250-thread-1) [    ] o.a.s.c.c.ConnectionManager zkClient has connected
   [junit4]   2> 668504 INFO  (jetty-launcher-4202-thread-3) [n:127.0.0.1:40827_solr    ] o.a.s.c.c.ZkStateReader Updated live nodes from ZooKeeper... (0) -> (3)
   [junit4]   2> 668505 INFO  (jetty-launcher-4202-thread-3) [n:127.0.0.1:40827_solr    ] o.a.s.c.s.i.ZkClientClusterStateProvider Cluster at 127.0.0.1:40401/solr ready
   [junit4]   2> 668528 INFO  (jetty-launcher-4202-thread-3) [n:127.0.0.1:40827_solr    ] o.a.s.c.TransientSolrCoreCacheDefault Allocating transient cache for 2147483647 transient cores
   [junit4]   2> 668528 INFO  (jetty-launcher-4202-thread-3) [n:127.0.0.1:40827_solr    ] o.a.s.c.ZkController Register node as live in ZooKeeper:/live_nodes/127.0.0.1:40827_solr
   [junit4]   2> 668529 INFO  (zkCallback-4232-thread-1) [    ] o.a.s.c.c.ZkStateReader Updated live nodes from ZooKeeper... (3) -> (4)
   [junit4]   2> 668532 INFO  (zkCallback-4236-thread-1) [    ] o.a.s.c.c.ZkStateReader Updated live nodes from ZooKeeper... (3) -> (4)
   [junit4]   2> 668542 INFO  (jetty-launcher-4202-thread-2) [n:127.0.0.1:40931_solr    ] o.a.s.m.r.SolrJmxReporter JMX monitoring for 'solr_40931.solr.node' (registry 'solr.node') enabled at server: com.sun.jmx.mbeanserver.JmxMBeanServer@4ae9b1ae
   [junit4]   2> 668558 INFO  (zkCallback-4249-thread-1) [    ] o.a.s.c.c.ZkStateReader Updated live nodes from ZooKeeper... (3) -> (4)
   [junit4]   2> 668558 INFO  (zkCallback-4228-thread-1) [    ] o.a.s.c.c.ZkStateReader Updated live nodes from ZooKeeper... (3) -> (4)
   [junit4]   2> 668560 INFO  (zkCallback-4234-thread-1) [    ] o.a.s.c.c.ZkStateReader Updated live nodes from ZooKeeper... (3) -> (4)
   [junit4]   2> 668562 INFO  (jetty-launcher-4202-thread-2) [n:127.0.0.1:40931_solr    ] o.a.s.m.r.SolrJmxReporter JMX monitoring for 'solr_40931.solr.jvm' (registry 'solr.jvm') enabled at server: com.sun.jmx.mbeanserver.JmxMBeanServer@4ae9b1ae
   [junit4]   2> 668565 INFO  (jetty-launcher-4202-thread-1) [n:127.0.0.1:37655_solr    ] o.a.s.m.r.SolrJmxReporter JMX monitoring for 'solr_37655.solr.node' (registry 'solr.node') enabled at server: com.sun.jmx.mbeanserver.JmxMBeanServer@4ae9b1ae
   [junit4]   2> 668572 INFO  (jetty-launcher-4202-thread-2) [n:127.0.0.1:40931_solr    ] o.a.s.m.r.SolrJmxReporter JMX monitoring for 'solr_40931.solr.jetty' (registry 'solr.jetty') enabled at server: com.sun.jmx.mbeanserver.JmxMBeanServer@4ae9b1ae
   [junit4]   2> 668573 INFO  (jetty-launcher-4202-thread-2) [n:127.0.0.1:40931_solr    ] o.a.s.c.CorePropertiesLocator Found 0 core definitions underneath /home/jenkins/workspace/Lucene-Solr-7.x-Linux/solr/build/solr-core/test/J2/temp/solr.cloud.autoscaling.SearchRateTriggerTest_40DC3E4A6DE16D98-001/tempDir-001/node2/.
   [junit4]   2> 668577 INFO  (jetty-launcher-4202-thread-1) [n:127.0.0.1:37655_solr    ] o.a.s.m.r.SolrJmxReporter JMX monitoring for 'solr_37655.solr.jvm' (registry 'solr.jvm') enabled at server: com.sun.jmx.mbeanserver.JmxMBeanServer@4ae9b1ae
   [junit4]   2> 668577 INFO  (jetty-launcher-4202-thread-1) [n:127.0.0.1:37655_solr    ] o.a.s.m.r.SolrJmxReporter JMX monitoring for 'solr_37655.solr.jetty' (registry 'solr.jetty') enabled at server: com.sun.jmx.mbeanserver.JmxMBeanServer@4ae9b1ae
   [junit4]   2> 668578 INFO  (jetty-launcher-4202-thread-1) [n:127.0.0.1:37655_solr    ] o.a.s.c.CorePropertiesLocator Found 0 core definitions underneath /home/jenkins/workspace/Lucene-Solr-7.x-Linux/solr/build/solr-core/test/J2/temp/solr.cloud.autoscaling.SearchRateTriggerTest_40DC3E4A6DE16D98-001/tempDir-001/node1/.
   [junit4]   2> 668586 INFO  (zkConnectionManagerCallback-4255-thread-1) [    ] o.a.s.c.c.ConnectionManager zkClient has connected
   [junit4]   2> 668587 INFO  (jetty-launcher-4202-thread-2) [n:127.0.0.1:40931_solr    ] o.a.s.c.c.ZkStateReader Updated live nodes from ZooKeeper... (0) -> (4)
   [junit4]   2> 668587 INFO  (jetty-launcher-4202-thread-2) [n:127.0.0.1:40931_solr    ] o.a.s.c.s.i.ZkClientClusterStateProvider Cluster at 127.0.0.1:40401/solr ready
   [junit4]   2> 668592 INFO  (zkConnectionManagerCallback-4260-thread-1) [    ] o.a.s.c.c.ConnectionManager zkClient has connected
   [junit4]   2> 668592 INFO  (jetty-launcher-4202-thread-1) [n:127.0.0.1:37655_solr    ] o.a.s.c.c.ZkStateReader Updated live nodes from ZooKeeper... (0) -> (4)
   [junit4]   2> 668593 INFO  (jetty-launcher-4202-thread-1) [n:127.0.0.1:37655_solr    ] o.a.s.c.s.i.ZkClientClusterStateProvider Cluster at 127.0.0.1:40401/solr ready
   [junit4]   2> 668609 INFO  (jetty-launcher-4202-thread-4) [n:127.0.0.1:44459_solr    ] o.a.s.m.r.SolrJmxReporter JMX monitoring for 'solr_44459.solr.node' (registry 'solr.node') enabled at server: com.sun.jmx.mbeanserver.JmxMBeanServer@4ae9b1ae
   [junit4]   2> 668616 INFO  (jetty-launcher-4202-thread-4) [n:127.0.0.1:44459_solr    ] o.a.s.m.r.SolrJmxReporter JMX monitoring for 'solr_44459.solr.jvm' (registry 'solr.jvm') enabled at server: com.sun.jmx.mbeanserver.JmxMBeanServer@4ae9b1ae
   [junit4]   2> 668616 INFO  (jetty-launcher-4202-thread-4) [n:127.0.0.1:44459_solr    ] o.a.s.m.r.SolrJmxReporter JMX monitoring for 'solr_44459.solr.jetty' (registry 'solr.jetty') enabled at server: com.sun.jmx.mbeanserver.JmxMBeanServer@4ae9b1ae
   [junit4]   2> 668617 INFO  (jetty-launcher-4202-thread-4) [n:127.0.0.1:44459_solr    ] o.a.s.c.CorePropertiesLocator Found 0 core definitions underneath /home/jenkins/workspace/Lucene-Solr-7.x-Linux/solr/build/solr-core/test/J2/temp/solr.cloud.autoscaling.SearchRateTriggerTest_40DC3E4A6DE16D98-001/tempDir-001/node4/.
   [junit4]   2> 668629 INFO  (jetty-launcher-4202-thread-3) [n:127.0.0.1:40827_solr    ] o.a.s.m.r.SolrJmxReporter JMX monitoring for 'solr_40827.solr.node' (registry 'solr.node') enabled at server: com.sun.jmx.mbeanserver.JmxMBeanServer@4ae9b1ae
   [junit4]   2> 668632 INFO  (zkConnectionManagerCallback-4265-thread-1) [    ] o.a.s.c.c.ConnectionManager zkClient has connected
   [junit4]   2> 668632 INFO  (jetty-launcher-4202-thread-4) [n:127.0.0.1:44459_solr    ] o.a.s.c.c.ZkStateReader Updated live nodes from ZooKeeper... (0) -> (4)
   [junit4]   2> 668633 INFO  (jetty-launcher-4202-thread-4) [n:127.0.0.1:44459_solr    ] o.a.s.c.s.i.ZkClientClusterStateProvider Cluster at 127.0.0.1:40401/solr ready
   [junit4]   2> 668635 INFO  (jetty-launcher-4202-thread-3) [n:127.0.0.1:40827_solr    ] o.a.s.m.r.SolrJmxReporter JMX monitoring for 'solr_40827.solr.jvm' (registry 'solr.jvm') enabled at server: com.sun.jmx.mbeanserver.JmxMBeanServer@4ae9b1ae
   [junit4]   2> 668635 INFO  (jetty-launcher-4202-thread-3) [n:127.0.0.1:40827_solr    ] o.a.s.m.r.SolrJmxReporter JMX monitoring for 'solr_40827.solr.jetty' (registry 'solr.jetty') enabled at server: com.sun.jmx.mbeanserver.JmxMBeanServer@4ae9b1ae
   [junit4]   2> 668636 INFO  (jetty-launcher-4202-thread-3) [n:127.0.0.1:40827_solr    ] o.a.s.c.CorePropertiesLocator Found 0 core definitions underneath /home/jenkins/workspace/Lucene-Solr-7.x-Linux/solr/build/solr-core/test/J2/temp/solr.cloud.autoscaling.SearchRateTriggerTest_40DC3E4A6DE16D98-001/tempDir-001/node3/.
   [junit4]   2> 668676 INFO  (zkConnectionManagerCallback-4267-thread-1) [    ] o.a.s.c.c.ConnectionManager zkClient has connected
   [junit4]   2> 668678 INFO  (zkConnectionManagerCallback-4272-thread-1) [    ] o.a.s.c.c.ConnectionManager zkClient has connected
   [junit4]   2> 668678 INFO  (SUITE-SearchRateTriggerTest-seed#[40DC3E4A6DE16D98]-worker) [    ] o.a.s.c.c.ZkStateReader Updated live nodes from ZooKeeper... (0) -> (4)
   [junit4]   2> 668679 INFO  (SUITE-SearchRateTriggerTest-seed#[40DC3E4A6DE16D98]-worker) [    ] o.a.s.c.s.i.ZkClientClusterStateProvider Cluster at 127.0.0.1:40401/solr ready
   [junit4]   2> 668695 INFO  (TEST-SearchRateTriggerTest.testWaitForElapsed-seed#[40DC3E4A6DE16D98]) [    ] o.a.s.SolrTestCaseJ4 ###Starting testWaitForElapsed
   [junit4]   2> 668695 INFO  (TEST-SearchRateTriggerTest.testWaitForElapsed-seed#[40DC3E4A6DE16D98]) [    ] o.a.s.c.c.ZkStateReader Updated live nodes from ZooKeeper... (0) -> (4)
   [junit4]   2> 668708 INFO  (qtp880287008-10591) [n:127.0.0.1:44459_solr    ] o.a.s.h.a.CollectionsHandler Invoked Collection Action :create with params replicationFactor=2&collection.configName=conf&maxShardsPerNode=1&name=SearchRateTriggerTest-collection1&nrtReplicas=2&action=CREATE&numShards=2&wt=javabin&version=2 and sendToOCPQueue=true
   [junit4]   2> 668709 INFO  (OverseerThreadFactory-3172-thread-1) [    ] o.a.s.c.a.c.CreateCollectionCmd Create collection SearchRateTriggerTest-collection1
   [junit4]   2> 668813 INFO  (OverseerStateUpdate-72172273401135116-127.0.0.1:40827_solr-n_0000000000) [    ] o.a.s.c.o.SliceMutator createReplica() {
   [junit4]   2>   "operation":"ADDREPLICA",
   [junit4]   2>   "collection":"SearchRateTriggerTest-collection1",
   [junit4]   2>   "shard":"shard1",
   [junit4]   2>   "core":"SearchRateTriggerTest-collection1_shard1_replica_n1",
   [junit4]   2>   "state":"down",
   [junit4]   2>   "base_url":"https://127.0.0.1:37655/solr",
   [junit4]   2>   "type":"NRT",
   [junit4]   2>   "waitForFinalState":"false"}
   [junit4]   2> 668814 INFO  (OverseerStateUpdate-72172273401135116-127.0.0.1:40827_solr-n_0000000000) [    ] o.a.s.c.o.SliceMutator createReplica() {
   [junit4]   2>   "operation":"ADDREPLICA",
   [junit4]   2>   "collection":"SearchRateTriggerTest-collection1",
   [junit4]   2>   "shard":"shard1",
   [junit4]   2>   "core":"SearchRateTriggerTest-collection1_shard1_replica_n2",
   [junit4]   2>   "state":"down",
   [junit4]   2>   "base_url":"https://127.0.0.1:44459/solr",
   [junit4]   2>   "type":"NRT",
   [junit4]   2>   "waitForFinalState":"false"}
   [junit4]   2> 668815 INFO  (OverseerStateUpdate-72172273401135116-127.0.0.1:40827_solr-n_0000000000) [    ] o.a.s.c.o.SliceMutator createReplica() {
   [junit4]   2>   "operation":"ADDREPLICA",
   [junit4]   2>   "collection":"SearchRateTriggerTest-collection1",
   [junit4]   2>   "shard":"shard2",
   [junit4]   2>   "core":"SearchRateTriggerTest-collection1_shard2_replica_n4",
   [junit4]   2>   "state":"down",
   [junit4]   2>   "base_url":"https://127.0.0.1:40931/solr",
   [junit4]   2>   "type":"NRT",
   [junit4]   2>   "waitForFinalState":"false"}
   [junit4]   2> 668816 INFO  (OverseerStateUpdate-72172273401135116-127.0.0.1:40827_solr-n_0000000000) [    ] o.a.s.c.o.SliceMutator createReplica() {
   [junit4]   2>   "operation":"ADDREPLICA",
   [junit4]   2>   "collection":"SearchRateTriggerTest-collection1",
   [junit4]   2>   "shard":"shard2",
   [junit4]   2>   "core":"SearchRateTriggerTest-collection1_shard2_replica_n6",
   [junit4]   2>   "state":"down",
   [junit4]   2>   "base_url":"https://127.0.0.1:40827/solr",
   [junit4]   2>   "type":"NRT",
   [junit4]   2>   "waitForFinalState":"false"}
   [junit4]   2> 669023 INFO  (qtp880287008-10707) [n:127.0.0.1:44459_solr    x:SearchRateTriggerTest-collection1_shard1_replica_n2] o.a.s.h.a.CoreAdminOperation core create command qt=/admin/cores&coreNodeName=core_node5&collection.configName=conf&newCollection=true&name=SearchRateTriggerTest-collection1_shard1_replica_n2&action=CREATE&numShards=2&collection=SearchRateTriggerTest-collection1&shard=shard1&wt=javabin&version=2&replicaType=NRT
   [junit4]   2> 669024 INFO  (qtp880287008-10707) [n:127.0.0.1:44459_solr    x:SearchRateTriggerTest-collection1_shard1_replica_n2] o.a.s.c.TransientSolrCoreCacheDefault Allocating transient cache for 2147483647 transient cores
   [junit4]   2> 669033 INFO  (qtp195687429-10595) [n:127.0.0.1:37655_solr    x:SearchRateTriggerTest-collection1_shard1_replica_n1] o.a.s.h.a.CoreAdminOperation core create command qt=/admin/cores&coreNodeName=core_node3&collection.configName=conf&newCollection=true&name=SearchRateTriggerTest-collection1_shard1_replica_n1&action=CREATE&numShards=2&collection=SearchRateTriggerTest-collection1&shard=shard1&wt=javabin&version=2&replicaType=NRT
   [junit4]   2> 669033 INFO  (qtp195687429-10595) [n:127.0.0.1:37655_solr    x:SearchRateTriggerTest-collection1_shard1_replica_n1] o.a.s.c.TransientSolrCoreCacheDefault Allocating transient cache for 2147483647 transient cores
   [junit4]   2> 669037 INFO  (qtp258547138-10581) [n:127.0.0.1:40827_solr    x:SearchRateTriggerTest-collection1_shard2_replica_n6] o.a.s.h.a.CoreAdminOperation core create command qt=/admin/cores&coreNodeName=core_node8&collection.configName=conf&newCollection=true&name=SearchRateTriggerTest-collection1_shard2_replica_n6&action=CREATE&numShards=2&collection=SearchRateTriggerTest-collection1&shard=shard2&wt=javabin&version=2&replicaType=NRT
   [junit4]   2> 669037 INFO  (qtp335700137-10590) [n:127.0.0.1:40931_solr    x:SearchRateTriggerTest-collection1_shard2_replica_n4] o.a.s.h.a.CoreAdminOperation core create command qt=/admin/cores&coreNodeName=core_node7&collection.configName=conf&newCollection=true&name=SearchRateTriggerTest-collection1_shard2_replica_n4&action=CREATE&numShards=2&collection=SearchRateTriggerTest-collection1&shard=shard2&wt=javabin&version=2&replicaType=NRT
   [junit4]   2> 669037 INFO  (qtp335700137-10590) [n:127.0.0.1:40931_solr    x:SearchRateTriggerTest-collection1_shard2_replica_n4] o.a.s.c.TransientSolrCoreCacheDefault Allocating transient cache for 2147483647 transient cores
   [junit4]   2> 670031 INFO  (qtp880287008-10707) [n:127.0.0.1:44459_solr c:SearchRateTriggerTest-collection1 s:shard1 r:core_node5 x:SearchRateTriggerTest-collection1_shard1_replica_n2] o.a.s.c.SolrConfig Using Lucene MatchVersion: 7.4.0
   [junit4]   2> 670035 INFO  (qtp880287008-10707) [n:127.0.0.1:44459_solr c:SearchRateTriggerTest-collection1 s:shard1 r:core_node5 x:SearchRateTriggerTest-collection1_shard1_replica_n2] o.a.s.s.IndexSchema [SearchRateTriggerTest-collection1_shard1_replica_n2] Schema name=minimal
   [junit4]   2> 670044 INFO  (qtp880287008-10707) [n:127.0.0.1:44459_solr c:SearchRateTriggerTest-collection1 s:shard1 r:core_node5 x:SearchRateTriggerTest-collection1_shard1_replica_n2] o.a.s.s.IndexSchema Loaded schema minimal/1.1 with uniqueid field id
   [junit4]   2> 670044 INFO  (qtp880287008-10707) [n:127.0.0.1:44459_solr c:SearchRateTriggerTest-collection1 s:shard1 r:core_node5 x:SearchRateTriggerTest-collection1_shard1_replica_n2] o.a.s.c.CoreContainer Creating SolrCore 'SearchRateTriggerTest-collection1_shard1_replica_n2' using configuration from collection SearchRateTriggerTest-collection1, trusted=true
   [junit4]   2> 670044 INFO  (qtp880287008-10707) [n:127.0.0.1:44459_solr c:SearchRateTriggerTest-collection1 s:shard1 r:core_node5 x:SearchRateTriggerTest-collection1_shard1_replica_n2] o.a.s.m.r.SolrJmxReporter JMX monitoring for 'solr_44459.solr.core.SearchRateTriggerTest-collection1.shard1.replica_n2' (registry 'solr.core.SearchRateTriggerTest-collection1.shard1.replica_n2') enabled at server: com.sun.jmx.mbeanserver.JmxMBeanServer@4ae9b1ae
   [junit4]   2> 670045 INFO  (qtp880287008-10707) [n:127.0.0.1:44459_solr c:SearchRateTriggerTest-collection1 s:shard1 r:core_node5 x:SearchRateTriggerTest-collection1_shard1_replica_n2] o.a.s.c.SolrCore solr.RecoveryStrategy.Builder
   [junit4]   2> 670045 INFO  (qtp880287008-10707) [n:127.0.0.1:44459_solr c:SearchRateTriggerTest-collection1 s:shard1 r:core_node5 x:SearchRateTriggerTest-collection1_shard1_replica_n2] o.a.s.c.SolrCore [[SearchRateTriggerTest-collection1_shard1_replica_n2] ] Opening new SolrCore at [/home/jenkins/workspace/Lucene-Solr-7.x-Linux/solr/build/solr-core/test/J2/temp/solr.cloud.autoscaling.SearchRateTriggerTest_40DC3E4A6DE16D98-001/tempDir-001/node4/SearchRateTriggerTest-collection1_shard1_replica_n2], dataDir=[/home/jenkins/workspace/Lucene-Solr-7.x-Linux/solr/build/solr-core/test/J2/temp/solr.cloud.autoscaling.SearchRateTriggerTest_40DC3E4A6DE16D98-001/tempDir-001/node4/./SearchRateTriggerTest-collection1_shard1_replica_n2/data/]
   [junit4]   2> 670047 INFO  (qtp195687429-10595) [n:127.0.0.1:37655_solr c:SearchRateTriggerTest-collection1 s:shard1 r:core_node3 x:SearchRateTriggerTest-collection1_shard1_replica_n1] o.a.s.c.SolrConfig Using Lucene MatchVersion: 7.4.0
   [junit4]   2> 670049 INFO  (qtp335700137-10590) [n:127.0.0.1:40931_solr c:SearchRateTriggerTest-collection1 s:shard2 r:core_node7 x:SearchRateTriggerTest-collection1_shard2_replica_n4] o.a.s.c.SolrConfig Using Lucene MatchVersion: 7.4.0
   [junit4]   2> 670051 INFO  (qtp195687429-10595) [n:127.0.0.1:37655_solr c:SearchRateTriggerTest-collection1 s:shard1 r:core_node3 x:SearchRateTriggerTest-collection1_shard1_replica_n1] o.a.s.s.IndexSchema [SearchRateTriggerTest-collection1_shard1_replica_n1] Schema name=minimal
   [junit4]   2> 670052 INFO  (qtp195687429-10595) [n:127.0.0.1:37655_solr c:SearchRateTriggerTest-collection1 s:shard1 r:core_node3 x:SearchRateTriggerTest-collection1_shard1_replica_n1] o.a.s.s.IndexSchema Loaded schema minimal/1.1 with uniqueid field id
   [junit4]   2> 670052 INFO  (qtp195687429-10595) [n:127.0.0.1:37655_solr c:SearchRateTriggerTest-collection1 s:shard1 r:core_node3 x:SearchRateTriggerTest-collection1_shard1_replica_n1] o.a.s.c.CoreContainer Creating SolrCore 'SearchRateTriggerTest-collection1_shard1_replica_n1' using configuration from collection SearchRateTriggerTest-collection1, trusted=true
   [junit4]   2> 670052 INFO  (qtp195687429-10595) [n:127.0.0.1:37655_solr c:SearchRateTriggerTest-collection1 s:shard1 r:core_node3 x:SearchRateTriggerTest-collection1_shard1_replica_n1] o.a.s.m.r.SolrJmxReporter JMX monitoring for 'solr_37655.solr.core.SearchRateTriggerTest-collection1.shard1.replica_n1' (registry 'solr.core.SearchRateTriggerTest-collection1.shard1.replica_n1') enabled at server: com.sun.jmx.mbeanserver.JmxMBeanServer@4ae9b1ae
   [junit4]   2> 670052 INFO  (qtp195687429-10595) [n:127.0.0.1:37655_solr c:SearchRateTriggerTest-collection1 s:shard1 r:core_node3 x:SearchRateTriggerTest-collection1_shard1_replica_n1] o.a.s.c.SolrCore solr.RecoveryStrategy.Builder
   [junit4]   2> 670052 INFO  (qtp195687429-10595) [n:127.0.0.1:37655_solr c:SearchRateTriggerTest-collection1 s:shard1 r:core_node3 x:SearchRateTriggerTest-collection1_shard1_replica_n1] o.a.s.c.SolrCore [[SearchRateTriggerTest-collection1_shard1_replica_n1] ] Opening new SolrCore at [/home/jenkins/workspace/Lucene-Solr-7.x-Linux/solr/build/solr-core/test/J2/temp/solr.cloud.autoscaling.SearchRateTriggerTest_40DC3E4A6DE16D98-001/tempDir-001/node1/SearchRateTriggerTest-collection1_shard1_replica_n1], dataDir=[/home/jenkins/workspace/Lucene-Solr-7.x-Linux/solr/build/solr-core/test/J2/temp/solr.cloud.autoscaling.SearchRateTriggerTest_40DC3E4A6DE16D98-001/tempDir-001/node1/./SearchRateTriggerTest-collection1_shard1_replica_n1/data/]
   [junit4]   2> 670053 INFO  (qtp258547138-10581) [n:127.0.0.1:40827_solr c:SearchRateTriggerTest-collection1 s:shard2 r:core_node8 x:SearchRateTriggerTest-collection1_shard2_replica_n6] o.a.s.c.SolrConfig Using Lucene MatchVersion: 7.4.0
   [junit4]   2> 670053 INFO  (qtp335700137-10590) [n:127.0.0.1:40931_solr c:SearchRateTriggerTest-collection1 s:shard2 r:core_node7 x:SearchRateTriggerTest-collection1_shard2_replica_n4] o.a.s.s.IndexSchema [SearchRateTriggerTest-collection1_shard2_replica_n4] Schema name=minimal
   [junit4]   2> 670055 INFO  (qtp335700137-10590) [n:127.0.0.1:40931_solr c:SearchRateTriggerTest-collection1 s:shard2 r:core_node7 x:SearchRateTriggerTest-collection1_shard2_replica_n4] o.a.s.s.IndexSchema Loaded schema minimal/1.1 with uniqueid field id
   [junit4]   2> 670055 INFO  (qtp335700137-10590) [n:127.0.0.1:40931_solr c:SearchRateTriggerTest-collection1 s:shard2 r:core_node7 x:SearchRateTriggerTest-collection1_shard2_replica_n4] o.a.s.c.CoreContainer Creating SolrCore 'SearchRateTriggerTest-collection1_shard2_replica_n4' using configuration from collection SearchRateTriggerTest-collection1, trusted=true
   [junit4]   2> 670055 INFO  (qtp335700137-10590) [n:127.0.0.1:40931_solr c:SearchRateTriggerTest-collection1 s:shard2 r:core_node7 x:SearchRateTriggerTest-collection1_shard2_replica_n4] o.a.s.m.r.SolrJmxReporter JMX monitoring for 'solr_40931.solr.core.SearchRateTriggerTest-collection1.shard2.replica_n4' (registry 'solr.core.SearchRateTriggerTest-collection1.shard2.replica_n4') enabled at server: com.sun.jmx.mbeanserver.JmxMBeanServer@4ae9b1ae
   [junit4]   2> 670055 INFO  (qtp335700137-10590) [n:127.0.0.1:40931_solr c:SearchRateTriggerTest-collection1 s:shard2 r:core_node7 x:SearchRateTriggerTest-collection1_shard2_replica_n4] o.a.s.c.SolrCore solr.RecoveryStrategy.Builder
   [junit4]   2> 670055 INFO  (qtp335700137-10590) [n:127.0.0.1:40931_solr c:SearchRateTriggerTest-collection1 s:shard2 r:core_node7 x:SearchRateTriggerTest-collection1_shard2_replica_n4] o.a.s.c.SolrCore [[SearchRateTriggerTest-collection1_shard2_replica_n4] ] Opening new SolrCore at [/home/jenkins/workspace/Lucene-Solr-7.x-Linux/solr/build/solr-core/test/J2/temp/solr.cloud.autoscaling.SearchRateTriggerTest_40DC3E4A6DE16D98-001/tempDir-001/node2/SearchRateTriggerTest-collection1_shard2_replica_n4], dataDir=[/home/jenkins/workspace/Lucene-Solr-7.x-Linux/solr/build/solr-core/test/J2/temp/solr.cloud.autoscaling.SearchRateTriggerTest_40DC3E4A6DE16D98-001/tempDir-001/node2/./SearchRateTriggerTest-collection1_shard2_replica_n4/data/]
   [junit4]   2> 670057 INFO  (qtp258547138-10581) [n:127.0.0.1:40827_solr c:SearchRateTriggerTest-collection1 s:shard2 r:core_node8 x:SearchRateTriggerTest-collection1_shard2_replica_n6] o.a.s.s.IndexSchema [SearchRateTriggerTest-collection1_shard2_replica_n6] Schema name=minimal
   [junit4]   2> 670058 INFO  (qtp258547138-10581) [n:127.0.0.1:40827_solr c:SearchRateTriggerTest-collection1 s:shard2 r:core_node8 x:SearchRateTriggerTest-collection1_shard2_replica_n6] o.a.s.s.IndexSchema Loaded schema minimal/1.1 with uniqueid field id
   [junit4]   2> 670058 INFO  (qtp258547138-10581) [n:127.0.0.1:40827_solr c:SearchRateTriggerTest-collection1 s:shard2 r:core_node8 x:SearchRateTriggerTest-collection1_shard2_replica_n6] o.a.s.c.CoreContainer Creating SolrCore 'SearchRateTriggerTest-collection1_shard2_replica_n6' using configuration from collection SearchRateTriggerTest-collection1, trusted=true
   [junit4]   2> 670058 INFO  (qtp258547138-10581) [n:127.0.0.1:40827_solr c:SearchRateTriggerTest-collection1 s:shard2 r:core_node8 x:SearchRateTriggerTest-collection1_shard2_replica_n6] o.a.s.m.r.SolrJmxReporter JMX monitoring for 'solr_40827.solr.core.SearchRateTriggerTest-collection1.shard2.replica_n6' (registry 'solr.core.SearchRateTriggerTest-collection1.shard2.replica_n6') enabled at server: com.sun.jmx.mbeanserver.JmxMBeanServer@4ae9b1ae
   [junit4]   2> 670059 INFO  (qtp258547138-10581) [n:127.0.0.1:40827_solr c:SearchRateTriggerTest-collection1 s:shard2 r:core_node8 x:SearchRateTriggerTest-collection1_shard2_replica_n6] o.a.s.c.SolrCore solr.RecoveryStrategy.Builder
   [junit4]   2> 670059 INFO  (qtp258547138-10581) [n:127.0.0.1:40827_solr c:SearchRateTriggerTest-collection1 s:shard2 r:core_node8 x:SearchRateTriggerTest-collection1_shard2_replica_n6] o.a.s.c.SolrCore [[SearchRateTriggerTest-collection1_shard2_replica_n6] ] Opening new SolrCore at [/home/jenkins/workspace/Lucene-Solr-7.x-Linux/solr/build/solr-core/test/J2/temp/solr.cloud.autoscaling.SearchRateTriggerTest_40DC3E4A6DE16D98-001/tempDir-001/node3/SearchRateTriggerTest-collection1_shard2_replica_n6], dataDir=[/home/jenkins/workspace/Lucene-Solr-7.x-Linux/solr/build/solr-core/test/J2/temp/solr.cloud.autoscaling.SearchRateTriggerTest_40DC3E4A6DE16D98-001/tempDir-001/node3/./SearchRateTriggerTest-collection1_shard2_replica_n6/data/]
   [junit4]   2> 670099 INFO  (qtp880287008-10707) [n:127.0.0.1:44459_solr c:SearchRateTriggerTest-collection1 s:shard1 r:core_node5 x:SearchRateTriggerTest-collection1_shard1_replica_n2] o.a.s.u.UpdateHandler Using UpdateLog implementation: org.apache.solr.update.UpdateLog
   [junit4]   2> 670099 INFO  (qtp880287008-10707) [n:127.0.0.1:44459_solr c:SearchRateTriggerTest-collection1 s:shard1 r:core_node5 x:SearchRateTriggerTest-collection1_shard1_replica_n2] o.a.s.u.UpdateLog Initializing UpdateLog: dataDir=null defaultSyncLevel=FLUSH numRecordsToKeep=100 maxNumLogsToKeep=10 numVersionBuckets=65536
   [junit4]   2> 670100 INFO  (qtp195687429-10595) [n:127.0.0.1:37655_solr c:SearchRateTriggerTest-collection1 s:shard1 r:core_node3 x:SearchRateTriggerTest-collection1_shard1_replica_n1] o.a.s.u.UpdateHandler Using UpdateLog implementation: org.apache.solr.update.UpdateLog
   [junit4]   2> 670100 INFO  (qtp195687429-10595) [n:127.0.0.1:37655_solr c:SearchRateTriggerTest-collection1 s:shard1 r:core_node3 x:SearchRateTriggerTest-collection1_shard1_replica_n1] o.a.s.u.UpdateLog Initializing UpdateLog: dataDir=null defaultSyncLevel=FLUSH numRecordsToKeep=100 maxNumLogsToKeep=10 numVersionBuckets=65536
   [junit4]   2> 670100 INFO  (qtp880287008-10707) [n:127.0.0.1:44459_solr c:SearchRateTriggerTest-collection1 s:shard1 r:core_node5 x:SearchRateTriggerTest-collection1_shard1_replica_n2] o.a.s.u.CommitTracker Hard AutoCommit: disabled
   [junit4]   2> 670100 INFO  (qtp880287008-10707) [n:127.0.0.1:44459_solr c:SearchRateTriggerTest-collection1 s:shard1 r:core_node5 x:SearchRateTriggerTest-collection1_shard1_replica_n2] o.a.s.u.CommitTracker Soft AutoCommit: disabled
   [junit4]   2> 670101 INFO  (qtp195687429-10595) [n:127.0.0.1:37655_solr c:SearchRateTriggerTest-collection1 s:shard1 r:core_node3 x:SearchRateTriggerTest-collection1_shard1_replica_n1] o.a.s.u.CommitTracker Hard AutoCommit: disabled
   [junit4]   2> 670101 INFO  (qtp195687429-10595) [n:127.0.0.1:37655_solr c:SearchRateTriggerTest-collection1 s:shard1 r:core_node3 x:SearchRateTriggerTest-collection1_shard1_replica_n1] o.a.s.u.CommitTracker Soft AutoCommit: disabled
   [junit4]   2> 670101 INFO  (qtp880287008-10707) [n:127.0.0.1:44459_solr c:SearchRateTriggerTest-collection1 s:shard1 r:core_node5 x:SearchRateTriggerTest-collection1_shard1_replica_n2] o.a.s.s.SolrIndexSearcher Opening [Searcher@68bda1b7[SearchRateTriggerTest-collection1_shard1_replica_n2] main]
   [junit4]   2> 670102 INFO  (qtp195687429-10595) [n:127.0.0.1:37655_solr c:SearchRateTriggerTest-collection1 s:shard1 r:core_node3 x:SearchRateTriggerTest-collection1_shard1_replica_n1] o.a.s.s.SolrIndexSearcher Opening [Searcher@7d1febc8[SearchRateTriggerTest-collection1_shard1_replica_n1] main]
   [junit4]   2> 670102 INFO  (qtp880287008-10707) [n:127.0.0.1:44459_solr c:SearchRateTriggerTest-collection1 s:shard1 r:core_node5 x:SearchRateTriggerTest-collection1_shard1_replica_n2] o.a.s.r.ManagedResourceStorage Configured ZooKeeperStorageIO with znodeBase: /configs/conf
   [junit4]   2> 670102 INFO  (qtp880287008-10707) [n:127.0.0.1:44459_solr c:SearchRateTriggerTest-collection1 s:shard1 r:core_node5 x:SearchRateTriggerTest-collection1_shard1_replica_n2] o.a.s.r.ManagedResourceStorage Loaded null at path _rest_managed.json using ZooKeeperStorageIO:path=/configs/conf
   [junit4]   2> 670102 INFO  (qtp195687429-10595) [n:127.0.0.1:37655_solr c:SearchRateTriggerTest-collection1 s:shard1 r:core_node3 x:SearchRateTriggerTest-collection1_shard1_replica_n1] o.a.s.r.ManagedResourceStorage Configured ZooKeeperStorageIO with znodeBase: /configs/conf
   [junit4]   2> 670103 INFO  (qtp195687429-10595) [n:127.0.0.1:37655_solr c:SearchRateTriggerTest-collection1 s:shard1 r:core_node3 x:SearchRateTriggerTest-collection1_shard1_replica_n1] o.a.s.r.ManagedResourceStorage Loaded null at path _rest_managed.json using ZooKeeperStorageIO:path=/configs/conf
   [junit4]   2> 670103 INFO  (qtp880287008-10707) [n:127.0.0.1:44459_solr c:SearchRateTriggerTest-collection1 s:shard1 r:core_node5 x:SearchRateTriggerTest-collection1_shard1_replica_n2] o.a.s.h.ReplicationHandler Commits will be reserved for 10000ms.
   [junit4]   2> 670103 INFO  (qtp880287008-10707) [n:127.0.0.1:44459_solr c:SearchRateTriggerTest-collection1 s:shard1 r:core_node5 x:SearchRateTriggerTest-collection1_shard1_replica_n2] o.a.s.u.UpdateLog Could not find max version in index or recent updates, using new clock 1600634357891989504
   [junit4]   2> 670103 INFO  (qtp195687429-10595) [n:127.0.0.1:37655_solr c:SearchRateTriggerTest-collection1 s:shard1 r:core_node3 x:SearchRateTriggerTest-collection1_shard1_replica_n1] o.a.s.h.ReplicationHandler Commits will be reserved for 10000ms.
   [junit4]   2> 670103 INFO  (qtp195687429-10595) [n:127.0.0.1:37655_solr c:SearchRateTriggerTest-collection1 s:shard1 r:core_node3 x:SearchRateTriggerTest-collection1_shard1_replica_n1] o.a.s.u.UpdateLog Could not find max version in index or recent updates, using new clock 1600634357891989504
   [junit4]   2> 670104 INFO  (searcherExecutor-3181-thread-1-processing-n:127.0.0.1:44459_solr x:SearchRateTriggerTest-collection1_shard1_replica_n2 c:SearchRateTriggerTest-collection1 s:shard1 r:core_node5) [n:127.0.0.1:44459_solr c:SearchRateTriggerTest-collection1 s:shard1 r:core_node5 x:SearchRateTriggerTest-collection1_shard1_replica_n2] o.a.s.c.SolrCore [SearchRateTriggerTest-collection1_shard1_replica_n2] Registered new searcher Searcher@68bda1b7[SearchRateTriggerTest-collection1_shard1_replica_n2] main{ExitableDirectoryReader(UninvertingDirectoryReader())}
   [junit4]   2> 670104 INFO  (searcherExecutor-3182-thread-1-processing-n:127.0.0.1:37655_solr x:SearchRateTriggerTest-collection1_shard1_replica_n1 c:SearchRateTriggerTest-collection1 s:shard1 r:core_node3) [n:127.0.0.1:37655_solr c:SearchRateTriggerTest-collection1 s:shard1 r:core_node3 x:SearchRateTriggerTest-collection1_shard1_replica_n1] o.a.s.c.SolrCore [SearchRateTriggerTest-collection1_shard1_replica_n1] Registered new searcher Searcher@7d1febc8[SearchRateTriggerTest-collection1_shard1_replica_n1] main{ExitableDirectoryReader(UninvertingDirectoryReader())}
   [junit4]   2> 670108 INFO  (qtp195687429-10595) [n:127.0.0.1:37655_solr c:SearchRateTriggerTest-collection1 s:shard1 r:core_node3 x:SearchRateTriggerTest-collection1_shard1_replica_n1] o.a.s.c.ZkShardTerms Successful update of terms at /collections/SearchRateTriggerTest-collection1/terms/shard1 to Terms{values={core_node3=0}, version=0}
   [junit4]   2> 670109 INFO  (qtp880287008-10707) [n:127.0.0.1:44459_solr c:SearchRateTriggerTest-collection1 s:shard1 r:core_node5 x:SearchRateTriggerTest-collection1_shard1_replica_n2] o.a.s.c.ZkShardTerms Successful update of terms at /collections/SearchRateTriggerTest-collection1/terms/shard1 to Terms{values={core_node3=0, core_node5=0}, version=1}
   [junit4]   2> 670110 INFO  (qtp195687429-10595) [n:127.0.0.1:37655_solr c:SearchRateTriggerTest-collection1 s:shard1 r:core_node3 x:SearchRateTriggerTest-collection1_shard1_replica_n1] o.a.s.c.ShardLeaderElectionContext Enough replicas found to continue.
   [junit4]   2> 670110 INFO  (qtp195687429-10595) [n:127.0.0.1:37655_solr c:SearchRateTriggerTest-collection1 s:shard1 r:core_node3 x:SearchRateTriggerTest-collection1_shard1_replica_n1] o.a.s.c.ShardLeaderElectionContext I may be the new leader - try and sync
   [junit4]   2> 670110 INFO  (qtp195687429-10595) [n:127.0.0.1:37655_solr c:SearchRateTriggerTest-collection1 s:shard1 r:core_node3 x:SearchRateTriggerTest-collection1_shard1_replica_n1] o.a.s.c.SyncStrategy Sync replicas to https://127.0.0.1:37655/solr/SearchRateTriggerTest-collection1_shard1_replica_n1/
   [junit4]   2> 670110 INFO  (qtp195687429-10595) [n:127.0.0.1:37655_solr c:SearchRateTriggerTest-collection1 s:shard1 r:core_node3 x:SearchRateTriggerTest-collection1_shard1_replica_n1] o.a.s.u.PeerSync PeerSync: core=SearchRateTriggerTest-collection1_shard1_replica_n1 url=https://127.0.0.1:37655/solr START replicas=[https://127.0.0.1:44459/solr/SearchRateTriggerTest-collection1_shard1_replica_n2/] nUpdates=100
   [junit4]   2> 670111 INFO  (qtp258547138-10581) [n:127.0.0.1:40827_solr c:SearchRateTriggerTest-collection1 s:shard2 r:core_node8 x:SearchRateTriggerTest-collection1_shard2_replica_n6] o.a.s.u.UpdateHandler Using UpdateLog implementation: org.apache.solr.update.UpdateLog
   [junit4]   2> 670111 INFO  (qtp258547138-10581) [n:127.0.0.1:40827_solr c:SearchRateTriggerTest-collection1 s:shard2 r:core_node8 x:SearchRateTriggerTest-collection1_shard2_replica_n6] o.a.s.u.UpdateLog Initializing UpdateLog: dataDir=null defaultSyncLevel=FLUSH numRecordsToKeep=100 maxNumLogsToKeep=10 numVersionBuckets=65536
   [junit4]   2> 670112 INFO  (qtp335700137-10590) [n:127.0.0.1:40931_solr c:SearchRateTriggerTest-collection1 s:shard2 r:core_node7 x:SearchRateTriggerTest-collection1_shard2_replica_n4] o.a.s.u.UpdateHandler Using UpdateLog implementation: org.apache.solr.update.UpdateLog
   [junit4]   2> 670112 INFO  (qtp335700137-10590) [n:127.0.0.1:40931_solr c:SearchRateTriggerTest-collection1 s:shard2 r:core_node7 x:SearchRateTriggerTest-collection1_shard2_replica_n4] o.a.s.u.UpdateLog Initializing UpdateLog: dataDir=null defaultSyncLevel=FLUSH numRecordsToKeep=100 maxNumLogsToKeep=10 numVersionBuckets=65536
   [junit4]   2> 670112 INFO  (qtp258547138-10581) [n:127.0.0.1:40827_solr c:SearchRateTriggerTest-collection1 s:shard2 r:core_node8 x:SearchRateTriggerTest-collection1_shard2_replica_n6] o.a.s.u.CommitTracker Hard AutoCommit: disabled
   [junit4]   2> 670112 INFO  (qtp258547138-10581) [n:127.0.0.1:40827_solr c:SearchRateTriggerTest-collection1 s:shard2 r:core_node8 x:SearchRateTriggerTest-collection1_shard2_replica_n6] o.a.s.u.CommitTracker Soft AutoCommit: disabled
   [junit4]   2> 670113 INFO  (qtp335700137-10590) [n:127.0.0.1:40931_solr c:SearchRateTriggerTest-collection1 s:shard2 r:core_node7 x:SearchRateTriggerTest-collection1_shard2_replica_n4] o.a.s.u.CommitTracker Hard AutoCommit: disabled
   [junit4]   2> 670113 INFO  (qtp335700137-10590) [n:127.0.0.1:40931_solr c:SearchRateTriggerTest-collection1 s:shard2 r:core_node7 x:SearchRateTriggerTest-collection1_shard2_replica_n4] o.a.s.u.CommitTracker Soft AutoCommit: disabled
   [junit4]   2> 670114 INFO  (qtp880287008-10600) [n:127.0.0.1:44459_solr c:SearchRateTriggerTest-collection1 s:shard1 r:core_node5 x:SearchRateTriggerTest-collection1_shard1_replica_n2] o.a.s.c.S.Request [SearchRateTriggerTest-collection1_shard1_replica_n2]  webapp=/solr path=/get params={distrib=false&qt=/get&fingerprint=false&getVersions=100&wt=javabin&version=2} status=0 QTime=0
   [junit4]   2> 670114 INFO  (qtp335700137-10590) [n:127.0.0.1:40931_solr c:SearchRateTriggerTest-collection1 s:shard2 r:core_node7 x:SearchRateTriggerTest-collection1_shard2_replica_n4] o.a.s.s.SolrIndexSearcher Opening [Searcher@a8067ce[SearchRateTriggerTest-collection1_shard2_replica_n4] main]
   [junit4]   2> 670120 INFO  (qtp335700137-10590) [n:127.0.0.1:40931_solr c:SearchRateTriggerTest-collection1 s:shard2 r:core_node7 x:SearchRateTriggerTest-collection1_shard2_replica_n4] o.a.s.r.ManagedResourceStorage Configured ZooKeeperStorageIO with znodeBase: /configs/conf
   [junit4]   2> 670120 INFO  (qtp258547138-10581) [n:127.0.0.1:40827_solr c:SearchRateTriggerTest-collection1 s:shard2 r:core_node8 x:SearchRateTriggerTest-collection1_shard2_replica_n6] o.a.s.s.SolrIndexSearcher Opening [Searcher@182e8f27[SearchRateTriggerTest-collection1_shard2_replica_n6] main]
   [junit4]   2> 670120 INFO  (qtp335700137-10590) [n:127.0.0.1:40931_solr c:SearchRateTriggerTest-collection1 s:shard2 r:core_node7 x:SearchRateTriggerTest-collection1_shard2_replica_n4] o.a.s.r.ManagedResourceStorage Loaded null at path _rest_managed.json using ZooKeeperStorageIO:path=/configs/conf
   [junit4]   2> 670121 INFO  (qtp335700137-10590) [n:127.0.0.1:40931_solr c:SearchRateTriggerTest-collection1 s:shard2 r:core_node7 x:SearchRateTriggerTest-collection1_shard2_replica_n4] o.a.s.h.ReplicationHandler Commits will be reserved for 10000ms.
   [junit4]   2> 670121 INFO  (qtp258547138-10581) [n:127.0.0.1:40827_solr c:SearchRateTriggerTest-collection1 s:shard2 r:core_node8 x:SearchRateTriggerTest-collection1_shard2_replica_n6] o.a.s.r.ManagedResourceStorage Configured ZooKeeperStorageIO with znodeBase: /configs/conf
   [junit4]   2> 670121 INFO  (qtp258547138-10581) [n:127.0.0.1:40827_solr c:SearchRateTriggerTest-collection1 s:shard2 r:core_node8 x:SearchRateTriggerTest-collection1_shard2_replica_n6] o.a.s.r.ManagedResourceStorage Loaded null at path _rest_managed.json using ZooKeeperStorageIO:path=/configs/conf
   [junit4]   2> 670122 INFO  (searcherExecutor-3183-thread-1-processing-n:127.0.0.1:40931_solr x:SearchRateTriggerTest-collection1_shard2_replica_n4 c:SearchRateTriggerTest-collection1 s:shard2 r:core_node7) [n:127.0.0.1:40931_solr c:SearchRateTriggerTest-collection1 s:shard2 r:core_node7 x:SearchRateTriggerTest-collection1_shard2_replica_n4] o.a.s.c.SolrCore [SearchRateTriggerTest-collection1_shard2_replica_n4] Registered new searcher Searcher@a8067ce[SearchRateTriggerTest-collection1_shard2_replica_n4] main{ExitableDirectoryReader(UninvertingDirectoryReader())}
   [junit4]   2> 670122 INFO  (qtp335700137-10590) [n:127.0.0.1:40931_solr c:SearchRateTriggerTest-collection1 s:shard2 r:core_node7 x:SearchRateTriggerTest-collection1_shard2_replica_n4] o.a.s.u.UpdateLog Could not find max version in index or recent updates, using new clock 1600634357911912448
   [junit4]   2> 670122 INFO  (qtp258547138-10581) [n:127.0.0.1:40827_solr c:SearchRateTriggerTest-collection1 s:shard2 r:core_node8 x:SearchRateTriggerTest-collection1_shard2_replica_n6] o.a.s.h.ReplicationHandler Commits will be reserved for 10000ms.
   [junit4]   2> 670122 INFO  (qtp258547138-10581) [n:127.0.0.1:40827_solr c:SearchRateTriggerTest-collection1 s:shard2 r:core_node8 x:SearchRateTriggerTest-collection1_shard2_replica_n6] o.a.s.u.UpdateLog Could not find max version in index or recent updates, using new clock 1600634357911912448
   [junit4]   2> 670124 INFO  (searcherExecutor-3184-thread-1-processing-n:127.0.0.1:40827_solr x:SearchRateTriggerTest-collection1_shard2_replica_n6 c:SearchRateTriggerTest-collection1 s:shard2 r:core_node8) [n:127.0.0.1:40827_solr c:SearchRateTriggerTest-collection1 s:shard2 r:core_node8 x:SearchRateTriggerTest-collection1_shard2_replica_n6] o.a.s.c.SolrCore [SearchRateTriggerTest-collection1_shard2_replica_n6] Registered new searcher Searcher@182e8f27[SearchRateTriggerTest-collection1_shard2_replica_n6] main{ExitableDirectoryReader(UninvertingDirectoryReader())}
   [junit4]   2> 670126 INFO  (qtp335700137-10590) [n:127.0.0.1:40931_solr c:SearchRateTriggerTest-collection1 s:shard2 r:core_node7 x:SearchRateTriggerTest-collection1_shard2_replica_n4] o.a.s.c.ZkShardTerms Successful update of terms at /collections/SearchRateTriggerTest-collection1/terms/shard2 to Terms{values={core_node7=0}, version=0}
   [junit4]   2> 670128 INFO  (qtp258547138-10581) [n:127.0.0.1:40827_solr c:SearchRateTriggerTest-collection1 s:shard2 r:core_node8 x:SearchRateTriggerTest-collection1_shard2_replica_n6] o.a.s.c.ZkShardTerms Successful update of terms at /collections/SearchRateTriggerTest-collection1/terms/shard2 to Terms{values={core_node7=0, core_node8=0}, version=1}
   [junit4]   2> 670128 INFO  (qtp335700137-10590) [n:127.0.0.1:40931_solr c:SearchRateTriggerTest-collection1 s:shard2 r:core_node7 x:SearchRateTriggerTest-collection1_shard2_replica_n4] o.a.s.c.ShardLeaderElectionContext Enough replicas found to continue.
   [junit4]   2> 670128 INFO  (qtp335700137-10590) [n:127.0.0.1:40931_solr c:SearchRateTriggerTest-collection1 s:shard2 r:core_node7 x:SearchRateTriggerTest-collection1_shard2_replica_n4] o.a.s.c.ShardLeaderElectionContext I may be the new leader - try and sync
   [junit4]   2> 670128 INFO  (qtp335700137-10590) [n:127.0.0.1:40931_solr c:SearchRateTriggerTest-collection1 s:shard2 r:core_node7 x:SearchRateTriggerTest-collection1_shard2_replica_n4] o.a.s.c.SyncStrategy Sync replicas to https://127.0.0.1:40931/solr/SearchRateTriggerTest-collection1_shard2_replica_n4/
   [junit4]   2> 670129 INFO  (qtp335700137-10590) [n:127.0.0.1:40931_solr c:SearchRateTriggerTest-collection1 s:shard2 r:core_node7 x:SearchRateTriggerTest-collection1_shard2_replica_n4] o.a.s.u.PeerSync PeerSync: core=SearchRateTriggerTest-collection1_shard2_replica_n4 url=https://127.0.0.1:40931/solr START replicas=[https://127.0.0.1:40827/solr/SearchRateTriggerTest-collection1_shard2_replica_n6/] nUpdates=100
   [junit4]   2> 670138 INFO  (qtp258547138-10592) [n:127.0.0.1:40827_solr c:SearchRateTriggerTest-collection1 s:shard2 r:core_node8 x:SearchRateTriggerTest-collection1_shard2_replica_n6] o.a.s.c.S.Request [SearchRateTriggerTest-collection1_shard2_replica_n6]  webapp=/solr path=/get params={distrib=false&qt=/get&fingerprint=false&getVersions=100&wt=javabin&version=2} status=0 QTime=0
   [junit4]   2> 670411 INFO  (qtp195687429-10595) [n:127.0.0.1:37655_solr c:SearchRateTriggerTest-collection1 s:shard1 r:core_node3 x:SearchRateTriggerTest-collection1_shard1_replica_n1] o.a.s.u.PeerSync PeerSync: core=SearchRateTriggerTest-collection1_shard1_replica_n1 url=https://127.0.0.1:37655/solr DONE.  We have no versions.  sync failed.
   [junit4]   2> 670411 INFO  (qtp195687429-10595) [n:127.0.0.1:37655_solr c:SearchRateTriggerTest-collection1 s:shard1 r:core_node3 x:SearchRateTriggerTest-collection1_shard1_replica_n1] o.a.s.c.SyncStrategy Leader's attempt to sync with shard failed, moving to the next candidate
   [junit4]   2> 670411 INFO  (qtp195687429-10595) [n:127.0.0.1:37655_solr c:SearchRateTriggerTest-collection1 s:shard1 r:core_node3 x:SearchRateTriggerTest-collection1_shard1_replica_n1] o.a.s.c.ShardLeaderElectionContext We failed sync, but we have no versions - we can't sync in that case - we were active before, so become leader anyway
   [junit4]   2> 670411 INFO  (qtp195687429-10595) [n:127.0.0.1:37655_solr c:SearchRateTriggerTest-collection1 s:shard1 r:core_node3 x:SearchRateTriggerTest-collection1_shard1_replica_n1] o.a.s.c.ShardLeaderElectionContext Found all replicas participating in election, clear LIR
   [junit4]   2> 670414 INFO  (qtp195687429-10595) [n:127.0.0.1:37655_solr c:SearchRateTriggerTest-collection1 s:shard1 r:core_node3 x:SearchRateTriggerTest-collection1_shard1_replica_n1] o.a.s.c.ShardLeaderElectionContext I am the new leader: https://127.0.0.1:37655/solr/SearchRateTriggerTest-collection1_shard1_replica_n1/ shard1
   [junit4]   2> 670429 INFO  (qtp335700137-10590) [n:127.0.0.1:40931_solr c:SearchRateTriggerTest-collection1 s:shard2 r:core_node7 x:SearchRateTriggerTest-collection1_shard2_replica_n4] o.a.s.u.PeerSync PeerSync: core=SearchRateTriggerTest-collection1_shard2_replica_n4 url=https://127.0.0.1:40931/solr DONE.  We have no versions.  sync failed.
   [junit4]   2> 670429 INFO  (qtp335700137-10590) [n:127.0.0.1:40931_solr c:SearchRateTriggerTest-collection1 s:shard2 r:core_node7 x:SearchRateTriggerTest-collection1_shard2_replica_n4] o.a.s.c.SyncStrategy Leader's attempt to sync with shard failed, moving to the next candidate
   [junit4]   2> 670429 INFO  (qtp335700137-10590) [n:127.0.0.1:40931_solr c:SearchRateTriggerTest-collection1 s:shard2 r:core_node7 x:SearchRateTriggerTest-collection1_shard2_replica_n4] o.a.s.c.ShardLeaderElectionContext We failed sync, but we have no versions - we can't sync in that case - we were active before, so become leader anyway
   [junit4]   2> 670429 INFO  (qtp335700137-10590) [n:127.0.0.1:40931_solr c:SearchRateTriggerTest-collection1 s:shard2 r:core_node7 x:SearchRateTriggerTest-collection1_shard2_replica_n4] o.a.s.c.ShardLeaderElectionContext Found all replicas participating in election, clear LIR
   [junit4]   2> 670432 INFO  (qtp335700137-10590) [n:127.0.0.1:40931_solr c:SearchRateTriggerTest-collection1 s:shard2 r:core_node7 x:SearchRateTriggerTest-collection1_shard2_replica_n4] o.a.s.c.ShardLeaderElectionContext I am the new leader: https://127.0.0.1:40931/solr/SearchRateTriggerTest-collection1_shard2_replica_n4/ shard2
   [junit4]   2> 670566 INFO  (qtp195687429-10595) [n:127.0.0.1:37655_solr c:SearchRateTriggerTest-collection1 s:shard1 r:core_node3 x:SearchRateTriggerTest-collection1_shard1_replica_n1] o.a.s.c.ZkController I am the leader, no recovery necessary
   [junit4]   2> 670583 INFO  (qtp335700137-10590) [n:127.0.0.1:40931_solr c:SearchRateTriggerTest-collection1 s:shard2 r:core_node7 x:SearchRateTriggerTest-collection1_shard2_replica_n4] o.a.s.c.ZkController I am the leader, no recovery necessary
   [junit4]   2> 670603 INFO  (qtp335700137-10590) [n:127.0.0.1:40931_solr c:SearchRateTriggerTest-collection1 s:shard2 r:core_node7 x:SearchRateTriggerTest-collection1_shard2_replica_n4] o.a.s.s.HttpSolrCall [admin] webapp=null path=/admin/cores params={qt=/admin/cores&coreNodeName=core_node7&collection.configName=conf&newCollection=true&name=SearchRateTriggerTest-collection1_shard2_replica_n4&action=CREATE&numShards=2&collection=SearchRateTriggerTest-collection1&shard=shard2&wt=javabin&version=2&replicaType=NRT} status=0 QTime=1565
   [junit4]   2> 670607 INFO  (qtp195687429-10595) [n:127.0.0.1:37655_solr c:SearchRateTriggerTest-collection1 s:shard1 r:core_node3 x:SearchRateTriggerTest-collection1_shard1_replica_n1] o.a.s.s.HttpSolrCall [admin] webapp=null path=/admin/cores params={qt=/admin/cores&coreNodeName=core_node3&collection.configName=conf&newCollection=true&name=SearchRateTriggerTest-collection1_shard1_replica_n1&action=CREATE&numShards=2&collection=SearchRateTriggerTest-collection1&shard=shard1&wt=javabin&version=2&replicaType=NRT} status=0 QTime=1574
   [junit4]   2> 670685 INFO  (zkCallback-4234-thread-1) [    ] o.a.s.c.c.ZkStateReader A cluster state change: [WatchedEvent state:SyncConnected type:NodeDataChanged path:/collections/SearchRateTriggerTest-collection1/state.json] for collection [SearchRateTriggerTest-collection1] has occurred - updating... (live nodes size: [4])
   [junit4]   2> 670685 INFO  (zkCallback-4232-thread-1) [    ] o.a.s.c.c.ZkStateReader A cluster state change: [WatchedEvent state:SyncConnected type:NodeDataChanged path:/collections/SearchRateTriggerTest-collection1/state.json] for collection [SearchRateTriggerTest-collection1] has occurred - updating... (live nodes size: [4])
   [junit4]   2> 671112 INFO  (qtp880287008-10707) [n:127.0.0.1:44459_solr c:SearchRateTriggerTest-collection1 s:shard1 r:core_node5 x:SearchRateTriggerTest-collection1_shard1_replica_n2] o.a.s.s.HttpSolrCall [admin] webapp=null path=/admin/cores params={qt=/admin/cores&coreNodeName=core_node5&collection.configName=conf&newCollection=true&name=SearchRateTriggerTest-collection1_shard1_replica_n2&action=CREATE&numShards=2&collection=SearchRateTriggerTest-collection1&shard=shard1&wt=javabin&version=2&replicaType=NRT} status=0 QTime=2088
   [junit4]   2> 671131 INFO  (qtp258547138-10581) [n:127.0.0.1:40827_solr c:SearchRateTriggerTest-collection1 s:shard2 r:core_node8 x:SearchRateTriggerTest-collection1_shard2_replica_n6] o.a.s.s.HttpSolrCall [admin] webapp=null path=/admin/cores params={qt=/admin/cores&coreNodeName=core_node8&collection.configName=conf&newCollection=true&name=SearchRateTriggerTest-collection1_shard2_replica_n6&action=CREATE&numShards=2&collection=SearchRateTriggerTest-collection1&shard=shard2&wt=javabin&version=2&replicaType=NRT} status=0 QTime=2094
   [junit4]   2> 671133 INFO  (qtp880287008-10591) [n:127.0.0.1:44459_solr    ] o.a.s.h.a.CollectionsHandler Wait for new collection to be active for at most 30 seconds. Check all shard replicas
   [junit4]   2> 671231 INFO  (zkCallback-4236-thread-1) [    ] o.a.s.c.c.ZkStateReader A cluster state change: [WatchedEvent state:SyncConnected type:NodeDataChanged path:/collections/SearchRateTriggerTest-collection1/state.json] for collection [SearchRateTriggerTest-collection1] has occurred - updating... (live nodes size: [4])
   [junit4]   2> 671231 INFO  (zkCallback-4232-thread-1) [    ] o.a.s.c.c.ZkStateReader A cluster state change: [WatchedEvent state:SyncConnected type:NodeDataChanged path:/collections/SearchRateTriggerTest-collection1/state.json] for collection [SearchRateTriggerTest-collection1] has occurred - updating... (live nodes size: [4])
   [junit4]   2> 671231 INFO  (zkCallback-4234-thread-1) [    ] o.a.s.c.c.ZkStateReader A cluster state change: [WatchedEvent state:SyncConnected type:NodeDataChanged path:/collections/SearchRateTriggerTest-collection1/state.json] for collection [SearchRateTriggerTest-collection1] has occurred - updating... (live nodes size: [4])
   [junit4]   2> 671231 INFO  (zkCallback-4228-thread-1) [    ] o.a.s.c.c.ZkStateReader A cluster state change: [WatchedEvent state:SyncConnected type:NodeDataChanged path:/collections/SearchRateTriggerTest-collection1/state.json] for collection [SearchRateTriggerTest-collection1] has occurred - updating... (live nodes size: [4])
   [junit4]   2> 672133 INFO  (qtp880287008-10591) [n:127.0.0.1:44459_solr    ] o.a.s.s.HttpSolrCall [admin] webapp=null path=/admin/collections params={replicationFactor=2&collection.configName=conf&maxShardsPerNode=1&name=SearchRateTriggerTest-collection1&nrtReplicas=2&action=CREATE&numShards=2&wt=javabin&version=2} status=0 QTime=3425
   [junit4]   2> 672142 INFO  (qtp880287008-10596) [n:127.0.0.1:44459_solr    ] o.a.s.s.HttpSolrCall [admin] webapp=null path=/admin/metrics params={wt=javabin&version=2&key=solr.core.SearchRateTriggerTest-collection1.shard1.replica_n2:QUERY./select.requestTimes:1minRate} status=0 QTime=0
   [junit4]   2> 672147 INFO  (qtp195687429-10595) [n:127.0.0.1:37655_solr    ] o.a.s.s.HttpSolrCall [admin] webapp=null path=/admin/metrics params={wt=javabin&version=2&key=solr.core.SearchRateTriggerTest-collection1.shard1.replica_n1:QUERY./select.requestTimes:1minRate} status=0 QTime=0
   [junit4]   2> 672150 INFO  (qtp335700137-10590) [n:127.0.0.1:40931_solr    ] o.a.s.s.HttpSolrCall [admin] webapp=null path=/admin/metrics params={wt=javabin&version=2&key=solr.core.SearchRateTriggerTest-collection1.shard2.replica_n4:QUERY./select.requestTimes:1minRate} status=0 QTime=0
   [junit4]   2> 672153 INFO  (qtp258547138-10581) [n:127.0.0.1:40827_solr    ] o.a.s.s.HttpSolrCall [admin] webapp=null path=/admin/metrics params={wt=javabin&version=2&key=solr.core.SearchRateTriggerTest-collection1.shard2.replica_n6:QUERY./select.requestTimes:1minRate} status=0 QTime=0
   [junit4]   2> 672165 INFO  (qtp880287008-10591) [n:127.0.0.1:44459_solr    ] o.a.s.s.HttpSolrCall [admin] webapp=null path=/admin/metrics params={wt=javabin&version=2&key=solr.core.SearchRateTriggerTest-collection1.shard1.replica_n2:QUERY./select.requestTimes:1minRate} status=0 QTime=0
   [junit4]   2> 672166 INFO  (qtp195687429-10595) [n:127.0.0.1:37655_solr    ] o.a.s.s.HttpSolrCall [admin] webapp=null path=/admin/metrics params={wt=javabin&version=2&key=solr.core.SearchRateTriggerTest-collection1.shard1.replica_n1:QUERY./select.requestTimes:1minRate} status=0 QTime=0
   [junit4]   2> 672167 INFO  (qtp335700137-10599) [n:127.0.0.1:40931_solr    ] o.a.s.s.HttpSolrCall [admin] webapp=null path=/admin/metrics params={wt=javabin&version=2&key=solr.core.SearchRateTriggerTest-collection1.shard2.replica_n4:QUERY./select.requestTimes:1minRate} status=0 QTime=0
   [junit4]   2> 672168 INFO  (qtp258547138-10581) [n:127.0.0.1:40827_solr    ] o.a.s.s.HttpSolrCall [admin] webapp=null path=/admin/metrics params={wt=javabin&version=2&key=solr.core.SearchRateTriggerTest-collection1.shard2.replica_n6:QUERY./select.requestTimes:1minRate} status=0 QTime=0
   [junit4]   2> 672713 INFO  (OverseerCollectionConfigSetProcessor-72172273401135116-127.0.0.1:40827_solr-n_0000000000) [    ] o.a.s.c.OverseerTaskQueue Response ZK path: /overseer/collection-queue-work/qnr-0000000000 doesn't exist.  Requestor may have disconnected from ZooKeeper
   [junit4]   2> 673170 INFO  (qtp880287008-10596) [n:127.0.0.1:44459_solr    ] o.a.s.s.HttpSolrCall [admin] webapp=null path=/admin/metrics params={wt=javabin&version=2&key=solr.core.SearchRateTriggerTest-collection1.shard1.replica_n2:QUERY./select.requestTimes:1minRate} status=0 QTime=0
   [junit4]   2> 673170 INFO  (qtp195687429-10595) [n:127.0.0.1:37655_solr    ] o.a.s.s.HttpSolrCall [admin] webapp=null path=/admin/metrics params={wt=javabin&version=2&key=solr.core.SearchRateTriggerTest-collection1.shard1.replica_n1:QUERY./select.requestTimes:1minRate} status=0 QTime=0
   [junit4]   2> 673171 INFO  (qtp335700137-10590) [n:127.0.0.1:40931_solr    ] o.a.s.s.HttpSolrCall [admin] webapp=null path=/admin/metrics params={wt=javabin&version=2&key=solr.core.SearchRateTriggerTest-collection1.shard2.replica_n4:QUERY./select.requestTimes:1minRate} status=0 QTime=0
   [junit4]   2> 673172 INFO  (qtp258547138-10581) [n:127.0.0.1:40827_solr    ] o.a.s.s.HttpSolrCall [admin] webapp=null path=/admin/metrics params={wt=javabin&version=2&key=solr.core.SearchRateTriggerTest-collection1.shard2.replica_n6:QUERY./select.requestTimes:1minRate} status=0 QTime=0
   [junit4]   2> 674173 INFO  (qtp880287008-10591) [n:127.0.0.1:44459_solr    ] o.a.s.s.HttpSolrCall [admin] webapp=null path=/admin/metrics params={wt=javabin&version=2&key=solr.core.SearchRateTriggerTest-collection1.shard1.replica_n2:QUERY./select.requestTimes:1minRate} status=0 QTime=0
   [junit4]   2> 674175 INFO  (qtp195687429-10579) [n:127.0.0.1:37655_solr    ] o.a.s.s.HttpSolrCall [admin] webapp=null path=/admin/metrics params={wt=javabin&version=2&key=solr.core.SearchRateTriggerTest-collection1.shard1.replica_n1:QUERY./select.requestTimes:1minRate} status=0 QTime=0
   [junit4]   2> 674176 INFO  (qtp335700137-10599) [n:127.0.0.1:40931_solr    ] o.a.s.s.HttpSolrCall [admin] webapp=null path=/admin/metrics params={wt=javabin&version=2&key=solr.core.SearchRateTriggerTest-collection1.shard2.replica_n4:QUERY./select.requestTimes:1minRate} status=0 QTime=0
   [junit4]   2> 674177 INFO  (qtp258547138-10592) [n:127.0.0.1:40827_solr    ] o.a.s.s.HttpSolrCall [admin] webapp=null path=/admin/metrics params={wt=javabin&version=2&key=solr.core.SearchRateTriggerTest-collection1.shard2.replica_n6:QUERY./select.requestTimes:1minRate} status=0 QTime=0
   [junit4]   2> 675179 INFO  (qtp880287008-10596) [n:127.0.0.1:44459_solr    ] o.a.s.s.HttpSolrCall [admin] webapp=null path=/admin/metrics params={wt=javabin&version=2&key=solr.core.SearchRateTriggerTest-collection1.shard1.replica_n2:QUERY./select.requestTimes:1minRate} status=0 QTime=0
   [junit4]   2> 675180 INFO  (qtp195687429-10595) [n:127.0.0.1:37655_solr    ] o.a.s.s.HttpSolrCall [admin] webapp=null path=/admin/metrics params={wt=javabin&version=2&key=solr.core.SearchRateTriggerTest-collection1.shard1.replica_n1:QUERY./select.requestTimes:1minRate} status=0 QTime=0
   [junit4]   2> 675180 INFO  (qtp335700137-10590) [n:127.0.0.1:40931_solr    ] o.a.s.s.HttpSolrCall [admin] webapp=null path=/admin/metrics params={wt=javabin&version=2&key=solr.core.SearchRateTriggerTest-collection1.shard2.replica_n4:QUERY./select.requestTimes:1minRate} status=0 QTime=0
   [junit4]   2> 675181 INFO  (qtp258547138-10581) [n:127.0.0.1:40827_solr    ] o.a.s.s.HttpSolrCall [admin] webapp=null path=/admin/metrics params={wt=javabin&version=2&key=solr.core.SearchRateTriggerTest-collection1.shard2.replica_n6:QUERY./select.requestTimes:1minRate} status=0 QTime=0
   [junit4]   2> 676183 INFO  (qtp880287008-10591) [n:127.0.0.1:44459_solr    ] o.a.s.s.HttpSolrCall [admin] webapp=null path=/admin/metrics params={wt=javabin&version=2&key=solr.core.SearchRateTriggerTest-collection1.shard1.replica_n2:QUERY./select.requestTimes:1minRate} status=0 QTime=0
   [junit4]   2> 676184 INFO  (qtp195687429-10579) [n:127.0.0.1:37655_solr    ] o.a.s.s.HttpSolrCall [admin] webapp=null path=/admin/metrics params={wt=javabin&version=2&key=solr.core.SearchRateTriggerTest-collection1.shard1.replica_n1:QUERY./select.requestTimes:1minRate} status=0 QTime=0
   [junit4]   2> 676185 INFO  (qtp335700137-10599) [n:127.0.0.1:40931_solr    ] o.a.s.s.HttpSolrCall [admin] webapp=null path=/admin/metrics params={wt=javabin&version=2&key=solr.core.SearchRateTriggerTest-collection1.shard2.replica_n4:QUERY./select.requestTimes:1minRate} status=0 QTime=0
   [junit4]   2> 676185 INFO  (qtp258547138-10592) [n:127.0.0.1:40827_solr    ] o.a.s.s.HttpSolrCall [admin] webapp=null path=/admin/metrics params={wt=javabin&version=2&key=solr.core.SearchRateTriggerTest-collection1.shard2.replica_n6:QUERY./select.requestTimes:1minRate} status=0 QTime=0
   [junit4]   2> 677187 INFO  (qtp880287008-10596) [n:127.0.0.1:44459_solr    ] o.a.s.s.HttpSolrCall [admin] webapp=null path=/admin/metrics params={wt=javabin&version=2&key=solr.core.SearchRateTriggerTest-collection1.shard1.replica_n2:QUERY./select.requestTimes:1minRate} status=0 QTime=0
   [junit4]   2> 677188 INFO  (qtp195687429-10595) [n:127.0.0.1:37655_solr    ] o.a.s.s.HttpSolrCall [admin] webapp=null path=/admin/metrics params={wt=javabin&version=2&key=solr.core.SearchRateTriggerTest-collection1.shard1.replica_n1:QUERY./select.requestTimes:1minRate} status=0 QTime=0
   [junit4]   2> 677188 INFO  (qtp335700137-10590) [n:127.0.0.1:40931_solr    ] o.a.s.s.HttpSolrCall [admin] webapp=null path=/admin/metrics params={wt=javabin&version=2&key=solr.core.SearchRateTriggerTest-collection1.shard2.replica_n4:QUERY./select.requestTimes:1minRate} status=0 QTime=0
   [junit4]   2> 677189 INFO  (qtp258547138-10581) [n:127.0.0.1:40827_solr    ] o.a.s.s.HttpSolrCall [admin] webapp=null path=/admin/metrics params={wt=javabin&version=2&key=solr.core.SearchRateTriggerTest-collection1.shard2.replica_n6:QUERY./select.requestTimes:1minRate} status=0 QTime=0
   [junit4]   2> 678191 INFO  (qtp880287008-10591) [n:127.0.0.1:44459_solr    ] o.a.s.s.HttpSolrCall [admin] webapp=null path=/admin/metrics params={wt=javabin&version=2&key=solr.core.SearchRateTriggerTest-collection1.shard1.replica_n2:QUERY./select.requestTimes:1minRate} status=0 QTime=0
   [junit4]   2> 678192 INFO  (qtp195687429-10579) [n:127.0.0.1:37655_solr    ] o.a.s.s.HttpSolrCall [admin] webapp=null path=/admin/metrics params={wt=javabin&version=2&key=solr.core.SearchRateTriggerTest-collection1.shard1.replica_n1:QUERY./select.requestTimes:1minRate} status=0 QTime=0
   [junit4]   2> 678192 INFO  (qtp335700137-10599) [n:127.0.0.1:40931_solr    ] o.a.s.s.HttpSolrCall [admin] webapp=null path=/admin/metrics params={wt=javabin&version=2&key=solr.core.SearchRateTriggerTest-collection1.shard2.replica_n4:QUERY./select.requestTimes:1minRate} status=0 QTime=0
   [junit4]   2> 678193 INFO  (qtp258547138-10592) [n:127.0.0.1:40827_solr    ] o.a.s.s.HttpSolrCall [admin] webapp=null path=/admin/metrics params={wt=javabin&version=2&key=solr.core.SearchRateTriggerTest-collection1.shard2.replica_n6:QUERY./select.requestTimes:1minRate} status=0 QTime=0
   [junit4]   2> 679200 INFO  (qtp880287008-10596) [n:127.0.0.1:44459_solr    ] o.a.s.s.HttpSolrCall [admin] webapp=null path=/admin/metrics params={wt=javabin&version=2&key=solr.core.SearchRateTriggerTest-collection1.shard1.replica_n2:QUERY./select.requestTimes:1minRate} status=0 QTime=0
   [junit4]   2> 679201 INFO  (qtp195687429-10595) [n:127.0.0.1:37655_solr    ] o.a.s.s.HttpSolrCall [admin] webapp=null path=/admin/metrics params={wt=javabin&version=2&key=solr.core.SearchRateTriggerTest-collection1.shard1.replica_n1:QUERY./select.requestTimes:1minRate} status=0 QTime=0
   [junit4]   2> 679202 INFO  (qtp335700137-10590) [n:127.0.0.1:40931_solr    ] o.a.s.s.HttpSolrCall [admin] webapp=null path=/admin/metrics params={wt=javabin&version=2&key=solr.core.SearchRateTriggerTest-collection1.shard2.replica_n4:QUERY./select.requestTimes:1minRate} status=0 QTime=0
   [junit4]   2> 679202 INFO  (qtp258547138-10581) [n:127.0.0.1:40827_solr    ] o.a.s.s.HttpSolrCall [admin] webapp=null path=/admin/metrics params={wt=javabin&version=2&key=solr.core.SearchRateTriggerTest-collection1.shard2.replica_n6:QUERY./select.requestTimes:1minRate} status=0 QTime=0
   [junit4]   2> 680205 INFO  (qtp880287008-10591) [n:127.0.0.1:44459_solr    ] o.a.s.s.HttpSolrCall [admin] webapp=null path=/admin/metrics params={wt=javabin&version=2&key=solr.core.SearchRateTriggerTest-collection1.shard1.replica_n2:QUERY./select.requestTimes:1minRate} status=0 QTime=0
   [junit4]   2> 680206 INFO  (qtp195687429-10579) [n:127.0.0.1:37655_solr    ] o.a.s.s.HttpSolrCall [admin] webapp=null path=/admin/metrics params={wt=javabin&version=2&key=solr.core.SearchRateTriggerTest-collection1.shard1.replica_n1:QUERY./select.requestTimes:1minRate} status=0 QTime=0
   [junit4]   2> 680207 INFO  (qtp335700137-10599) [n:127.0.0.1:40931_solr    ] o.a.s.s.HttpSolrCall [admin] webapp=null path=/admin/metrics params={wt=javabin&version=2&key=solr.core.SearchRateTriggerTest-collection1.shard2.replica_n4:QUERY./select.requestTimes:1minRate} status=0 QTime=0
   [junit4]   2> 680208 INFO  (qtp258547138-10592) [n:127.0.0.1:40827_solr    ] o.a.s.s.HttpSolrCall [admin] webapp=null path=/admin/metrics params={wt=javabin&version=2&key=solr.core.SearchRateTriggerTest-collection1.shard2.replica_n6:QUERY./select.requestTimes:1minRate} status=0 QTime=0
   [junit4]   2> 680209 INFO  (qtp880287008-10596) [n:127.0.0.1:44459_solr    ] o.a.s.s.HttpSolrCall [admin] webapp=null path=/admin/metrics params={wt=javabin&version=2&key=solr.core.SearchRateTriggerTest-collection1.shard1.replica_n2:QUERY./select.requestTimes:1minRate} status=0 QTime=0
   [junit4]   2> 680210 INFO  (qtp195687429-10595) [n:127.0.0.1:37655_solr    ] o.a.s.s.HttpSolrCall [admin] webapp=null path=/admin/metrics params={wt=javabin&version=2&key=solr.core.SearchRateTriggerTest-collection1.shard1.replica_n1:QUERY./select.requestTimes:1minRate} status=0 QTime=0
   [junit4]   2> 680211 INFO  (qtp335700137-10590) [n:127.0.0.1:40931_solr    ] o.a.s.s.HttpSolrCall [admin] webapp=null path=/admin/metrics params={wt=javabin&version=2&key=solr.core.SearchRateTriggerTest-collection1.shard2.replica_n4:QUERY./select.requestTimes:1minRate} status=0 QTime=0
   [junit4]   2> 680212 INFO  (qtp258547138-10581) [n:127.0.0.1:40827_solr    ] o.a.s.s.HttpSolrCall [admin] webapp=null path=/admin/metrics params={wt=javabin&version=2&key=solr.core.SearchRateTriggerTest-collection1.shard2.replica_n6:QUERY./select.requestTimes:1minRate} status=0 QTime=0
   [junit4]   2> 681213 INFO  (qtp880287008-10591) [n:127.0.0.1:44459_solr    ] o.a.s.s.HttpSolrCall [admin] webapp=null path=/admin/metrics params={wt=javabin&version=2&key=solr.core.SearchRateTriggerTest-collection1.shard1.replica_n2:QUERY./select.requestTimes:1minRate} status=0 QTime=0
   [junit4]   2> 681214 INFO  (qtp195687429-10579) [n:127.0.0.1:37655_solr    ] o.a.s.s.HttpSolrCall [admin] webapp=null path=/admin/metrics params={wt=javabin&version=2&key=solr.core.SearchRateTriggerTest-collection1.shard1.replica_n1:QUERY./select.requestTimes:1minRate} status=0 QTime=0
   [junit4]   2> 681214 INFO  (qtp335700137-10599) [n:127.0.0.1:40931_solr    ] o.a.s.s.HttpSolrCall [admin] webapp=null path=/admin/metrics params={wt=javabin&version=2&key=solr.core.SearchRateTriggerTest-collection1.shard2.replica_n4:QUERY./select.requestTimes:1minRate} status=0 QTime=0
   [junit4]   2> 681215 INFO  (qtp258547138-10592) [n:127.0.0.1:40827_solr    ] o.a.s.s.HttpSolrCall [admin] webapp=null path=/admin/metrics params={wt=javabin&version=2&key=solr.core.SearchRateTriggerTest-collection1.shard2.replica_n6:QUERY./select.requestTimes:1minRate} status=0 QTime=0
   [junit4]   2> 682216 INFO  (qtp880287008-10596) [n:127.0.0.1:44459_solr    ] o.a.s.s.HttpSolrCall [admin] webapp=null path=/admin/metrics params={wt=javabin&version=2&key=solr.core.SearchRateTriggerTest-collection1.shard1.replica_n2:QUERY./select.requestTimes:1minRate} status=0 QTime=0
   [junit4]   2> 682217 INFO  (qtp195687429-10595) [n:127.0.0.1:37655_solr    ] o.a.s.s.HttpSolrCall [admin] webapp=null path=/admin/metrics params={wt=javabin&version=2&key=solr.core.SearchRateTriggerTest-collection1.shard1.replica_n1:QUERY./select.requestTimes:1minRate} status=0 QTime=0
   [junit4]   2> 682218 INFO  (qtp335700137-10590) [n:127.0.0.1:40931_solr    ] o.a.s.s.HttpSolrCall [admin] webapp=null path=/admin/metrics params={wt=javabin&version=2&key=solr.core.SearchRateTriggerTest-collection1.shard2.replica_n4:QUERY./select.requestTimes:1minRate} status=0 QTime=0
   [junit4]   2> 682218 INFO  (qtp258547138-10581) [n:127.0.0.1:40827_solr    ] o.a.s.s.HttpSolrCall [admin] webapp=null path=/admin/metrics params={wt=javabin&version=2&key=solr.core.SearchRateTriggerTest-collection1.shard2.replica_n6:QUERY./select.requestTimes:1minRate} status=0 QTime=0
   [junit4]   2> 686221 INFO  (qtp880287008-10591) [n:127.0.0.1:44459_solr    ] o.a.s.s.HttpSolrCall [admin] webapp=null path=/admin/metrics params={wt=javabin&version=2&key=solr.core.SearchRateTriggerTest-collection1.shard1.replica_n2:QUERY./select.requestTimes:1minRate} status=0 QTime=0
   [junit4]   2> 686223 INFO  (qtp195687429-10579) [n:127.0.0.1:37655_solr    ] o.a.s.s.HttpSolrCall [admin] webapp=null path=/admin/metrics params={wt=javabin&version=2&key=solr.core.SearchRateTriggerTest-collection1.shard1.replica_n1:QUERY./select.requestTimes:1minRate} status=0 QTime=0
   [junit4]   2> 686225 INFO  (qtp335700137-10599) [n:127.0.0.1:40931_solr    ] o.a.s.s.HttpSolrCall [admin] webapp=null path=/admin/metrics params={wt=javabin&version=2&key=solr.core.SearchRateTriggerTest-collection1.shard2.replica_n4:QUERY./select.requestTimes:1minRate} status=0 QTime=0
   [junit4]   2> 686227 INFO  (qtp258547138-10592) [n:127.0.0.1:40827_solr    ] o.a.s.s.HttpSolrCall [admin] webapp=null path=/admin/metrics params={wt=javabin&version=2&key=solr.core.SearchRateTriggerTest-collection1.shard2.replica_n6:QUERY./select.requestTimes:1minRate} status=0 QTime=0
   [junit4]   2> 686230 INFO  (TEST-SearchRateTriggerTest.testWaitForElapsed-seed#[40DC3E4A6DE16D98]) [    ] o.a.s.SolrTestCaseJ4 ###Ending testWaitForElapsed
   [junit4]   2> 686246 INFO  (TEST-SearchRateTriggerTest.testTrigger-seed#[40DC3E4A6DE16D98]) [    ] o.a.s.SolrTestCaseJ4 ###Starting testTrigger
   [junit4]   2> 686246 INFO  (TEST-SearchRateTriggerTest.testTrigger-seed#[40DC3E4A6DE16D98]) [    ] o.a.s.c.c.ZkStateReader Updated live nodes from ZooKeeper... (0) -> (4)
   [junit4]   2> 686247 INFO  (qtp880287008-10596) [n:127.0.0.1:44459_solr    ] o.a.s.h.a.CollectionsHandler Invoked Collection Action :delete with params name=SearchRateTriggerTest-collection1&action=DELETE&wt=javabin&version=2 and sendToOCPQueue=true
   [junit4]   2> 686248 INFO  (OverseerThreadFactory-3172-thread-2) [    ] o.a.s.c.a.c.OverseerCollectionMessageHandler Executing Collection Cmd=action=UNLOAD&deleteInstanceDir=true&deleteDataDir=true, asyncId=null
   [junit4]   2> 686254 INFO  (qtp880287008-10710) [n:127.0.0.1:44459_solr    x:SearchRateTriggerTest-collection1_shard1_replica_n2] o.a.s.m.SolrMetricManager Closing metric reporters for registry=solr.core.SearchRateTriggerTest-collection1.shard1.replica_n2, tag=null
   [junit4]   2> 686254 INFO  (qtp195687429-10598) [n:127.0.0.1:37655_solr    x:SearchRateTriggerTest-collection1_shard1_replica_n1] o.a.s.m.SolrMetricManager Closing metric reporters for registry=solr.core.SearchRateTriggerTest-collection1.shard1.replica_n1, tag=null
   [junit4]   2> 686254 INFO  (qtp195687429-10598) [n:127.0.0.1:37655_solr    x:SearchRateTriggerTest-collection1_shard1_replica_n1] o.a.s.m.r.SolrJmxReporter Closing reporter [org.apache.solr.metrics.reporters.SolrJmxReporter@4df52306: rootName = solr_37655, domain = solr.core.SearchRateTriggerTest-collection1.shard1.replica_n1, service url = null, agent id = null] for registry solr.core.SearchRateTriggerTest-collection1.shard1.replica_n1 / com.codahale.metrics.MetricRegistry@56607db6
   [junit4]   2> 686254 INFO  (qtp880287008-10710) [n:127.0.0.1:44459_solr    x:SearchRateTriggerTest-collection1_shard1_replica_n2] o.a.s.m.r.SolrJmxReporter Closing reporter [org.apache.solr.metrics.reporters.SolrJmxReporter@78caf565: rootName = solr_44459, domain = solr.core.SearchRateTriggerTest-collection1.shard1.replica_n2, service url = null, agent id = null] for registry solr.core.SearchRateTriggerTest-collection1.shard1.replica_n2 / com.codahale.metrics.MetricRegistry@afc9254
   [junit4]   2> 686255 INFO  (qtp335700137-10594) [n:127.0.0.1:40931_solr    x:SearchRateTriggerTest-collection1_shard2_replica_n4] o.a.s.m.SolrMetricManager Closing metric reporters for registry=solr.core.SearchRateTriggerTest-collection1.shard2.replica_n4, tag=null
   [junit4]   2> 686255 INFO  (qtp258547138-10586) [n:127.0.0.1:40827_solr    x:SearchRateTriggerTest-collection1_shard2_replica_n6] o.a.s.m.SolrMetricManager Closing metric reporters for registry=solr.core.SearchRateTriggerTest-collection1.shard2.replica_n6, tag=null
   [junit4]   2> 686255 INFO  (qtp335700137-10594) [n:127.0.0.1:40931_solr    x:SearchRateTriggerTest-collection1_shard2_replica_n4] o.a.s.m.r.SolrJmxReporter Closing reporter [org.apache.solr.metrics.reporters.SolrJmxReporter@768d85ef: rootName = solr_40931, domain = solr.core.SearchRateTriggerTest-collection1.shard2.replica_n4, service url = null, agent id = null] for registry solr.core.SearchRateTriggerTest-collection1.shard2.replica_n4 / com.codahale.metrics.MetricRegistry@9e400e6
   [junit4]   2> 686255 INFO  (qtp258547138-10586) [n:127.0.0.1:40827_solr    x:SearchRateTriggerTest-collection1_shard2_replica_n6] o.a.s.m.r.SolrJmxReporter Closing reporter [org.apache.solr.metrics.reporters.SolrJmxReporter@e7150d1: rootName = solr_40827, domain = solr.core.SearchRateTriggerTest-collection1.shard2.replica_n6, service url = null, agent id = null] for registry solr.core.SearchRateTriggerTest-collection1.shard2.replica_n6 / com.codahale.metrics.MetricRegistry@3fb879fe
   [junit4]   2> 686270 INFO  (qtp880287008-10710) [n:127.0.0.1:44459_solr    x:SearchRateTriggerTest-collection1_shard1_replica_n2] o.a.s.c.SolrCore [SearchRateTriggerTest-collection1_shard1_replica_n2]  CLOSING SolrCore org.apache.solr.core.SolrCore@23f31bc5
   [junit4]   2> 686270 INFO  (qtp880287008-10710) [n:127.0.0.1:44459_solr    x:SearchRateTriggerTest-collection1_shard1_replica_n2] o.a.s.m.SolrMetricManager Closing metric reporters for registry=solr.core.SearchRateTriggerTest-collection1.shard1.replica_n2, tag=23f31bc5
   [junit4]   2> 686270 INFO  (qtp880287008-10710) [n:127.0.0.1:44459_solr    x:SearchRateTriggerTest-collection1_shard1_replica_n2] o.a.s.m.SolrM

[...truncated too long message...]

ServerCxn.Factory:0.0.0.0/0.0.0.0:0) [    ] o.a.z.s.NIOServerCnxn Unable to read additional data from client sessionid 0x100684cdeb50008, likely client has closed socket
   [junit4]   2> 707262 INFO  (zkCallback-4236-thread-3) [    ] o.a.s.c.c.ZkStateReader Updated live nodes from ZooKeeper... (3) -> (2)
   [junit4]   2> 707263 INFO  (jetty-closer-4203-thread-2) [    ] o.a.s.c.ZkController Remove node as live in ZooKeeper:/live_nodes/127.0.0.1:40931_solr
   [junit4]   2> 707263 INFO  (zkCallback-4254-thread-1) [    ] o.a.s.c.c.ZkStateReader Updated live nodes from ZooKeeper... (2) -> (1)
   [junit4]   2> 707263 INFO  (zkCallback-4249-thread-1) [    ] o.a.s.c.c.ZkStateReader Updated live nodes from ZooKeeper... (2) -> (1)
   [junit4]   2> 707263 INFO  (zkCallback-4236-thread-3) [    ] o.a.s.c.c.ZkStateReader Updated live nodes from ZooKeeper... (2) -> (1)
   [junit4]   2> 707263 INFO  (jetty-closer-4203-thread-4) [    ] o.a.s.c.ZkController Remove node as live in ZooKeeper:/live_nodes/127.0.0.1:40827_solr
   [junit4]   2> 707263 INFO  (jetty-closer-4203-thread-2) [    ] o.a.s.m.SolrMetricManager Closing metric reporters for registry=solr.cluster, tag=null
   [junit4]   2> 707263 INFO  (zkCallback-4234-thread-2) [    ] o.a.s.c.c.ZkStateReader Updated live nodes from ZooKeeper... (2) -> (1)
   [junit4]   2> 707264 INFO  (jetty-closer-4203-thread-4) [    ] o.a.s.m.SolrMetricManager Closing metric reporters for registry=solr.cluster, tag=null
   [junit4]   2> 707264 INFO  (zkCallback-4249-thread-1) [    ] o.a.s.c.c.ZkStateReader Updated live nodes from ZooKeeper... (1) -> (0)
   [junit4]   2> 707264 INFO  (zkCallback-4234-thread-1) [    ] o.a.s.c.c.ZkStateReader Updated live nodes from ZooKeeper... (1) -> (0)
   [junit4]   2> 707264 INFO  (zkCallback-4236-thread-3) [    ] o.a.s.c.c.ZkStateReader Updated live nodes from ZooKeeper... (1) -> (0)
   [junit4]   2> 707268 INFO  (jetty-closer-4203-thread-4) [    ] o.a.s.c.Overseer Overseer (id=72172273401135116-127.0.0.1:40827_solr-n_0000000000) closing
   [junit4]   2> 707268 INFO  (OverseerStateUpdate-72172273401135116-127.0.0.1:40827_solr-n_0000000000) [    ] o.a.s.c.Overseer Overseer Loop exiting : 127.0.0.1:40827_solr
   [junit4]   2> 707268 WARN  (OverseerAutoScalingTriggerThread-72172273401135116-127.0.0.1:40827_solr-n_0000000000) [    ] o.a.s.c.a.OverseerTriggerThread OverseerTriggerThread woken up but we are closed, exiting.
   [junit4]   2> 707270 INFO  (zkCallback-4234-thread-1) [    ] o.a.s.c.OverseerElectionContext I am going to be the leader 127.0.0.1:40931_solr
   [junit4]   2> 707270 INFO  (jetty-closer-4203-thread-4) [    ] o.e.j.s.h.ContextHandler Stopped o.e.j.s.ServletContextHandler@703ed11e{/solr,null,UNAVAILABLE}
   [junit4]   2> 707270 INFO  (jetty-closer-4203-thread-4) [    ] o.e.j.s.session node0 Stopped scavenging
   [junit4]   2> 708754 WARN  (zkCallback-4228-thread-1) [    ] o.a.s.c.c.ZkStateReader ZooKeeper watch triggered, but Solr cannot talk to ZK: [KeeperErrorCode = Session expired for /live_nodes]
   [junit4]   2> 708755 INFO  (jetty-closer-4203-thread-3) [    ] o.e.j.s.h.ContextHandler Stopped o.e.j.s.ServletContextHandler@c0ef65{/solr,null,UNAVAILABLE}
   [junit4]   2> 708755 INFO  (jetty-closer-4203-thread-3) [    ] o.e.j.s.session node0 Stopped scavenging
   [junit4]   2> 708763 WARN  (zkCallback-4232-thread-1) [    ] o.a.s.c.c.ZkStateReader ZooKeeper watch triggered, but Solr cannot talk to ZK: [KeeperErrorCode = Session expired for /live_nodes]
   [junit4]   2> 708763 INFO  (jetty-closer-4203-thread-1) [    ] o.e.j.s.h.ContextHandler Stopped o.e.j.s.ServletContextHandler@652ccdf6{/solr,null,UNAVAILABLE}
   [junit4]   2> 708764 INFO  (jetty-closer-4203-thread-1) [    ] o.e.j.s.session node0 Stopped scavenging
   [junit4]   2> 708765 WARN  (zkCallback-4254-thread-1) [    ] o.a.s.c.c.ZkStateReader ZooKeeper watch triggered, but Solr cannot talk to ZK: [KeeperErrorCode = Session expired for /live_nodes]
   [junit4]   2> 708765 INFO  (jetty-closer-4203-thread-2) [    ] o.e.j.s.h.ContextHandler Stopped o.e.j.s.ServletContextHandler@448af573{/solr,null,UNAVAILABLE}
   [junit4]   2> 708766 INFO  (jetty-closer-4203-thread-2) [    ] o.e.j.s.session node0 Stopped scavenging
   [junit4]   2> 708766 ERROR (SUITE-SearchRateTriggerTest-seed#[40DC3E4A6DE16D98]-worker) [    ] o.a.z.s.ZooKeeperServer ZKShutdownHandler is not registered, so ZooKeeper server won't take any action on ERROR or SHUTDOWN server state changes
   [junit4]   2> 708766 INFO  (SUITE-SearchRateTriggerTest-seed#[40DC3E4A6DE16D98]-worker) [    ] o.a.s.c.ZkTestServer connecting to 127.0.0.1:40401 40401
   [junit4]   2> 710390 INFO  (Thread-2518) [    ] o.a.s.c.ZkTestServer connecting to 127.0.0.1:40401 40401
   [junit4]   2> 710391 WARN  (Thread-2518) [    ] o.a.s.c.ZkTestServer Watch limit violations:
   [junit4]   2> Maximum concurrent create/delete watches above limit:
   [junit4]   2>
   [junit4]   2> 16 /solr/collections/SearchRateTriggerTest-collection1/terms/shard1
   [junit4]   2> 15 /solr/collections/SearchRateTriggerTest-collection1/terms/shard2
   [junit4]   2> 12 /solr/aliases.json
   [junit4]   2> 8 /solr/configs/conf
   [junit4]   2> 8 /solr/collections/SearchRateTriggerTest-collection2/terms/shard2
   [junit4]   2> 8 /solr/collections/SearchRateTriggerTest-collection2/terms/shard1
   [junit4]   2> 4 /solr/security.json
   [junit4]   2>
   [junit4]   2> Maximum concurrent data watches above limit:
   [junit4]   2>
   [junit4]   2> 12 /solr/clusterprops.json
   [junit4]   2> 12 /solr/clusterstate.json
   [junit4]   2> 8 /solr/collections/SearchRateTriggerTest-collection1/state.json
   [junit4]   2> 4 /solr/collections/SearchRateTriggerTest-collection2/state.json
   [junit4]   2> 3 /solr/overseer_elect/election/72172273401135116-127.0.0.1:40827_solr-n_0000000000
   [junit4]   2>
   [junit4]   2> Maximum concurrent children watches above limit:
   [junit4]   2>
   [junit4]   2> 25 /solr/collections
   [junit4]   2> 12 /solr/live_nodes
   [junit4]   2>
   [junit4]   2> NOTE: leaving temporary files on disk at: /home/jenkins/workspace/Lucene-Solr-7.x-Linux/solr/build/solr-core/test/J2/temp/solr.cloud.autoscaling.SearchRateTriggerTest_40DC3E4A6DE16D98-001
   [junit4]   2> NOTE: test params are: codec=Asserting(Lucene70): {}, docValues:{}, maxPointsInLeafNode=1573, maxMBSortInHeap=6.910510569567068, sim=RandomSimilarity(queryNorm=false): {}, locale=en-CK, timezone=SystemV/EST5EDT
   [junit4]   2> NOTE: Linux 4.13.0-39-generic amd64/Oracle Corporation 9.0.4 (64-bit)/cpus=8,threads=1,free=206548392,total=520093696
   [junit4]   2> NOTE: All tests run in this JVM: [DateMathParserTest, TestUtils, ScheduledTriggerIntegrationTest, TestSolrConfigHandlerConcurrent, TestRandomFlRTGCloud, TransactionLogTest, TestTestInjection, SuggestComponentContextFilterQueryTest, AssignTest, TestSimpleTextCodec, SpatialFilterTest, DisMaxRequestHandlerTest, ShowFileRequestHandlerTest, TestHdfsUpdateLog, TestBadConfig, DistributedVersionInfoTest, TestCoreContainer, TestRealTimeGet, TestCodecSupport, TestScoreJoinQPScore, NodeMarkersRegistrationTest, TestLazyCores, PreAnalyzedFieldTest, TestFieldSortValues, TestUtilizeNode, SolrTestCaseJ4Test, TestExportWriter, TestClusterStateMutator, OverseerRolesTest, SuggesterTSTTest, TestNodeAddedTrigger, NodeAddedTriggerTest, SimpleCollectionCreateDeleteTest, TestDFRSimilarityFactory, NumericFieldsTest, TestDistributedMissingSort, HLLSerializationTest, CoreAdminOperationTest, ClusterStateTest, AnalyticsQueryTest, TermVectorComponentTest, SolrGraphiteReporterTest, TestNoOpRegenerator, TestUnifiedSolrHighlighter, TestComplexPhraseLeadingWildcard, BufferStoreTest, TestLockTree, TestFaceting, MetricUtilsTest, UniqFieldsUpdateProcessorFactoryTest, TestFastWriter, TestCloudRecovery, CacheHeaderTest, SolrCloudExampleTest, EnumFieldTest, TestCoreAdminApis, PingRequestHandlerTest, TestTolerantSearch, TestApiFramework, TestCloudJSONFacetJoinDomain, URLClassifyProcessorTest, AddReplicaTest, CreateCollectionCleanupTest, CollectionPropsTest, TestTlogReplica, SaslZkACLProviderTest, UnloadDistributedZkTest, CircularListTest, TestBackupRepositoryFactory, TestPrepRecovery, BlobRepositoryCloudTest, MetricsConfigTest, SearchHandlerTest, HttpPartitionOnCommitTest, PeerSyncReplicationTest, TestCloudConsistency, TestIntervalFaceting, TestFiltering, TestJavabinTupleStreamParser, TestRequestStatusCollectionAPI, TestUpdate, TestLMJelinekMercerSimilarityFactory, ConvertedLegacyTest, TestSQLHandler, BitVectorTest, ConfigureRecoveryStrategyTest, InfoHandlerTest, TestZkAclsWithHadoopAuth, TestPKIAuthenticationPlugin, TestExecutePlanAction, SearchRateTriggerTest]
   [junit4] Completed [292/805 (1!)] on J2 in 42.11s, 3 tests, 1 failure <<< FAILURES!

[...truncated 45597 lines...]
[repro] Jenkins log URL: https://jenkins.thetaphi.de/job/Lucene-Solr-7.x-Linux/1912/consoleText

[repro] Revision: 5ad9f0d49d4ac4ac51c265517608f2ac36752eda

[repro] Ant options: "-Dargs=-XX:+UseCompressedOops -XX:+UseParallelGC"
[repro] Repro line:  ant test  -Dtestcase=SearchRateTriggerTest -Dtests.method=testTrigger -Dtests.seed=40DC3E4A6DE16D98 -Dtests.multiplier=3 -Dtests.slow=true -Dtests.locale=en-CK -Dtests.timezone=SystemV/EST5EDT -Dtests.asserts=true -Dtests.file.encoding=UTF-8

[repro] ant clean

[...truncated 6 lines...]
[repro] Test suites by module:
[repro]    solr/core
[repro]       SearchRateTriggerTest
[repro] ant compile-test

[...truncated 3321 lines...]
[repro] ant test-nocompile -Dtests.dups=5 -Dtests.maxfailures=5 -Dtests.class="*.SearchRateTriggerTest" -Dtests.showOutput=onerror "-Dargs=-XX:+UseCompressedOops -XX:+UseParallelGC" -Dtests.seed=40DC3E4A6DE16D98 -Dtests.multiplier=3 -Dtests.slow=true -Dtests.locale=en-CK -Dtests.timezone=SystemV/EST5EDT -Dtests.asserts=true -Dtests.file.encoding=UTF-8

[...truncated 86 lines...]
[repro] Failures:
[repro]   0/5 failed: org.apache.solr.cloud.autoscaling.SearchRateTriggerTest
[repro] Exiting with code 0

[...truncated 40 lines...]


---------------------------------------------------------------------
To unsubscribe, e-mail: [hidden email]
For additional commands, e-mail: [hidden email]