[JENKINS] Lucene-Solr-7.x-MacOSX (64bit/jdk1.8.0) - Build # 1017 - Failure!

classic Classic list List threaded Threaded
2 messages Options
Reply | Threaded
Open this post in threaded view
|

[JENKINS] Lucene-Solr-7.x-MacOSX (64bit/jdk1.8.0) - Build # 1017 - Failure!

Policeman Jenkins Server-2
Build: https://jenkins.thetaphi.de/job/Lucene-Solr-7.x-MacOSX/1017/
Java: 64bit/jdk1.8.0 -XX:+UseCompressedOops -XX:+UseConcMarkSweepGC

All tests passed

Build Log:
[...truncated 61276 lines...]
-ecj-javadoc-lint-src:
    [mkdir] Created dir: /var/folders/qg/h2dfw5s161s51l2bn79mrb7r0000gn/T/ecj317068099
 [ecj-lint] Compiling 1235 source files to /var/folders/qg/h2dfw5s161s51l2bn79mrb7r0000gn/T/ecj317068099
 [ecj-lint] Processing annotations
 [ecj-lint] Annotations processed
 [ecj-lint] Processing annotations
 [ecj-lint] No elements to process
 [ecj-lint] invalid Class-Path header in manifest of jar file: /Users/jenkins/.ivy2/cache/org.restlet.jee/org.restlet/jars/org.restlet-2.3.0.jar
 [ecj-lint] invalid Class-Path header in manifest of jar file: /Users/jenkins/.ivy2/cache/org.restlet.jee/org.restlet.ext.servlet/jars/org.restlet.ext.servlet-2.3.0.jar
 [ecj-lint] ----------
 [ecj-lint] 1. WARNING in /Users/jenkins/workspace/Lucene-Solr-7.x-MacOSX/solr/core/src/java/org/apache/solr/client/solrj/embedded/EmbeddedSolrServer.java (at line 219)
 [ecj-lint] return (NamedList<Object>) new JavaBinCodec(resolver).unmarshal(in);
 [ecj-lint]                           ^^^^^^^^^^^^^^^^^^^^^^^^^^
 [ecj-lint] Resource leak: '<unassigned Closeable value>' is never closed
 [ecj-lint] ----------
 [ecj-lint] ----------
 [ecj-lint] 2. WARNING in /Users/jenkins/workspace/Lucene-Solr-7.x-MacOSX/solr/core/src/java/org/apache/solr/cloud/api/collections/RestoreCmd.java (at line 257)
 [ecj-lint] throw new SolrException(ErrorCode.BAD_REQUEST, "Unexpected number of replicas, replicationFactor, " +
 [ecj-lint]               Replica.Type.NRT + " or " + Replica.Type.TLOG + " must be greater than 0");
 [ecj-lint] ^^^^^^^^^^^^^^^^^^^^^^^^^^^^^^^^^^^^^^^^^^^^^^^^^^^^^^^^^^^^^^^^^^^^^^^^^^^^^^^^^^^^^^^^^^^^^^^^^^^^^^^^^^^^^^^^^^^^^^^^^^^^^^^^^^^^^^^^^^^^^^^^^^^^^^^^^^^^^^^^^^^^^^^^^^^^^^^^^^^^^^^^^^^^^^^
 [ecj-lint] Resource leak: 'repository' is not closed at this location
 [ecj-lint] ----------
 [ecj-lint] ----------
 [ecj-lint] 3. WARNING in /Users/jenkins/workspace/Lucene-Solr-7.x-MacOSX/solr/core/src/java/org/apache/solr/handler/loader/JavabinLoader.java (at line 137)
 [ecj-lint] new JavaBinCodec() {
 [ecj-lint]       SolrParams params;
 [ecj-lint]       AddUpdateCommand addCmd = null;
 [ecj-lint]
 [ecj-lint]       @Override
 [ecj-lint]       public List<Object> readIterator(DataInputInputStream fis) throws IOException {
 [ecj-lint]         while (true) {
 [ecj-lint]           Object o = readVal(fis);
 [ecj-lint]           if (o == END_OBJ) break;
 [ecj-lint]           if (o instanceof NamedList) {
 [ecj-lint]             params = ((NamedList) o).toSolrParams();
 [ecj-lint]           } else {
 [ecj-lint]             try {
 [ecj-lint]               if (o instanceof byte[]) {
 [ecj-lint]                 if (params != null) req.setParams(params);
 [ecj-lint]                 byte[] buf = (byte[]) o;
 [ecj-lint]                 contentStreamLoader.load(req, rsp, new ContentStreamBase.ByteArrayStream(buf, null), processor);
 [ecj-lint]               } else {
 [ecj-lint]                 throw new RuntimeException("unsupported type ");
 [ecj-lint]               }
 [ecj-lint]             } catch (Exception e) {
 [ecj-lint]               throw new RuntimeException(e);
 [ecj-lint]             } finally {
 [ecj-lint]               params = null;
 [ecj-lint]               req.setParams(old);
 [ecj-lint]             }
 [ecj-lint]           }
 [ecj-lint]         }
 [ecj-lint]         return Collections.emptyList();
 [ecj-lint]       }
 [ecj-lint]
 [ecj-lint]     }.unmarshal(in);
 [ecj-lint] ^^^^^^^^^^^^^^^^^^^^^^^^^^^^^^^^^^^^^^^^^^^^^^^^^^^^^^^^^^^^^^^^^^^^^^^^^^^^^^^^^^^^^^^^^^^^^^^^^^^^^^^^^^^^^^^^^^^^^^^^^^^^^^^^^^^^^^^^^^^^^^^^^^^^^^^^^^^^^^^^^^^^^^^^^^^^^^^^^^^^^^^^^^^^^^^^^^^^^^^^^^^^^^^^^^^^^^^^^^^^^^^^^^^^^^^^^^^^^^^^^^^^^^^^^^^^^^^^^^^^^^^^^^^^^^^^^^^^^^^^^^^^^^^^^^^^^^^^^^^^^^^^^^^^^^^^^^^^^^^^^^^^^^^^^^^^^^^^^^^^^^^^^^^^^^^^^^^^^^^^^^^^^^^^^^^^^^^^^^^^^^^^^^^^^^^^^^^^^^^^^^^^^^^^^^^^^^^^^^^^^^^^^^^^^^^^^^^^^^^^^^^^^^^^^^^^^^^^^^^^^^^^^^^^^^^^^^^^^^^^^^^^^^^^^^^^^^^^^^^^^^^^^^^^^^^^^^^^^^^^^^^^^^^^^^^^^^^^^^^^^^^^^^^^^^^^^^^^^^^^^^^^^^^^^^^^^^^^^^^^^^^^^^^^^^^^^^^^^^^^^^^^^^^^^^^^^^^^^^^^^^^^^^^^^^^^^^^^^^^^^^^^^^^^^^^^^^^^^^^^^^^^^^^^^^^^^^^^^^^^^^^^^^^^^^^^^^^^^^^^^^^^^^^^^^^^^^^^^^^^^^^^^^^^^^^^^^^^^^^^^^^^^^^^^^^^^^^^^^^^^^^^^^^^^^^^^^^^^^^^^^^^^^^^^^^^^^^^^^^^^^^^^^^^^^^^^^^^^^^^^^^^^^^^^^^^^^^^^^^^^^^^^^^^^^^^^^^^^^^^^^^^^^^^^^^^^^^^^^^^^^^^^^^^^^^^^^^^^^^^^^^^^^^^^^^^^^^^^^^^^^^^^^^^^^^^^^^^^^^^^^^^^^^^^^^^^^^^^^^^^^^^^^^^^^^^^^^^^^^^^^^^^^^^^^^^^^^^^^^^^^^^^^^^^^^^^^^^^^^^^^^^^^
 [ecj-lint] Resource leak: '<unassigned Closeable value>' is never closed
 [ecj-lint] ----------
 [ecj-lint] ----------
 [ecj-lint] 4. ERROR in /Users/jenkins/workspace/Lucene-Solr-7.x-MacOSX/solr/core/src/java/org/apache/solr/update/DocumentBuilder.java (at line 32)
 [ecj-lint] import org.apache.solr.common.util.ByteArrayUtf8CharSequence;
 [ecj-lint]       ^^^^^^^^^^^^^^^^^^^^^^^^^^^^^^^^^^^^^^^^^^^^^^^^^^^^^
 [ecj-lint] The import org.apache.solr.common.util.ByteArrayUtf8CharSequence is never used
 [ecj-lint] ----------
 [ecj-lint] ----------
 [ecj-lint] 5. WARNING in /Users/jenkins/workspace/Lucene-Solr-7.x-MacOSX/solr/core/src/java/org/apache/solr/update/UpdateLog.java (at line 1867)
 [ecj-lint] if (exceptionOnExecuteUpdate.get() != null) throw exceptionOnExecuteUpdate.get();
 [ecj-lint]                                            ^^^^^^^^^^^^^^^^^^^^^^^^^^^^^^^^^^^^^
 [ecj-lint] Resource leak: 'proc' is not closed at this location
 [ecj-lint] ----------
 [ecj-lint] ----------
 [ecj-lint] 6. WARNING in /Users/jenkins/workspace/Lucene-Solr-7.x-MacOSX/solr/core/src/java/org/apache/solr/util/FileUtils.java (at line 50)
 [ecj-lint] in = new FileInputStream(src).getChannel();
 [ecj-lint]     ^^^^^^^^^^^^^^^^^^^^^^^^
 [ecj-lint] Resource leak: '<unassigned Closeable value>' is never closed
 [ecj-lint] ----------
 [ecj-lint] 7. WARNING in /Users/jenkins/workspace/Lucene-Solr-7.x-MacOSX/solr/core/src/java/org/apache/solr/util/FileUtils.java (at line 51)
 [ecj-lint] out = new FileOutputStream(destination).getChannel();
 [ecj-lint]      ^^^^^^^^^^^^^^^^^^^^^^^^^^^^^^^^^
 [ecj-lint] Resource leak: '<unassigned Closeable value>' is never closed
 [ecj-lint] ----------
 [ecj-lint] 7 problems (1 error, 6 warnings)

BUILD FAILED
/Users/jenkins/workspace/Lucene-Solr-7.x-MacOSX/build.xml:633: The following error occurred while executing this line:
/Users/jenkins/workspace/Lucene-Solr-7.x-MacOSX/build.xml:101: The following error occurred while executing this line:
/Users/jenkins/workspace/Lucene-Solr-7.x-MacOSX/solr/build.xml:680: The following error occurred while executing this line:
/Users/jenkins/workspace/Lucene-Solr-7.x-MacOSX/lucene/common-build.xml:2093: The following error occurred while executing this line:
/Users/jenkins/workspace/Lucene-Solr-7.x-MacOSX/lucene/common-build.xml:2132: Compile failed; see the compiler error output for details.

Total time: 104 minutes 49 seconds
Build step 'Invoke Ant' marked build as failure
Archiving artifacts
Setting ANT_1_8_2_HOME=/Users/jenkins/tools/hudson.tasks.Ant_AntInstallation/ANT_1.8.2
[WARNINGS] Skipping publisher since build result is FAILURE
Recording test results
Setting ANT_1_8_2_HOME=/Users/jenkins/tools/hudson.tasks.Ant_AntInstallation/ANT_1.8.2
Email was triggered for: Failure - Any
Sending email for trigger: Failure - Any
Setting ANT_1_8_2_HOME=/Users/jenkins/tools/hudson.tasks.Ant_AntInstallation/ANT_1.8.2
Setting ANT_1_8_2_HOME=/Users/jenkins/tools/hudson.tasks.Ant_AntInstallation/ANT_1.8.2
Setting ANT_1_8_2_HOME=/Users/jenkins/tools/hudson.tasks.Ant_AntInstallation/ANT_1.8.2
Setting ANT_1_8_2_HOME=/Users/jenkins/tools/hudson.tasks.Ant_AntInstallation/ANT_1.8.2


---------------------------------------------------------------------
To unsubscribe, e-mail: [hidden email]
For additional commands, e-mail: [hidden email]
Reply | Threaded
Open this post in threaded view
|

[JENKINS] Lucene-Solr-7.x-MacOSX (64bit/jdk1.8.0) - Build # 1018 - Still Failing!

Policeman Jenkins Server-2
Build: https://jenkins.thetaphi.de/job/Lucene-Solr-7.x-MacOSX/1018/
Java: 64bit/jdk1.8.0 -XX:+UseCompressedOops -XX:+UseParallelGC

All tests passed

Build Log:
[...truncated 16101 lines...]
   [junit4] JVM J0: stdout was not empty, see: /Users/jenkins/workspace/Lucene-Solr-7.x-MacOSX/solr/build/solr-solrj/test/temp/junit4-J0-20190110_190246_6611542699491279777258.sysout
   [junit4] >>> JVM J0 emitted unexpected output (verbatim) ----
   [junit4] [thread 46859 also had an error]
   [junit4] [thread 47115 also had an error]
   [junit4] #
   [junit4] # A fatal error has been detected by the Java Runtime Environment:
   [junit4] #
   [junit4] #  SIGFPE (0x8) at pc=0x00007fff8874d143, pid=3304, tid=0x0000000000002a03
   [junit4] #
   [junit4] # JRE version: Java(TM) SE Runtime Environment (8.0_172-b11) (build 1.8.0_172-b11)
   [junit4] # Java VM: Java HotSpot(TM) 64-Bit Server VM (25.172-b11 mixed mode bsd-amd64 compressed oops)
   [junit4] # Problematic frame:
   [junit4] # C  [libsystem_kernel.dylib+0x11143]  __commpage_gettimeofday+0x43
   [junit4] #
   [junit4] # Failed to write core dump. Core dumps have been disabled. To enable core dumping, try "ulimit -c unlimited" before starting Java again
   [junit4] #
   [junit4] # An error report file with more information is saved as:
   [junit4] # /Users/jenkins/workspace/Lucene-Solr-7.x-MacOSX/solr/build/solr-solrj/test/J0/hs_err_pid3304.log
   [junit4] #
   [junit4] # If you would like to submit a bug report, please visit:
   [junit4] #   http://bugreport.java.com/bugreport/crash.jsp
   [junit4] #
   [junit4] <<< JVM J0: EOF ----

[...truncated 358 lines...]
   [junit4] ERROR: JVM J0 ended with an exception, command line: /Library/Java/JavaVirtualMachines/jdk1.8.0_172.jdk/Contents/Home/jre/bin/java -XX:+UseCompressedOops -XX:+UseParallelGC -XX:+HeapDumpOnOutOfMemoryError -XX:HeapDumpPath=/Users/jenkins/workspace/Lucene-Solr-7.x-MacOSX/heapdumps -ea -esa -Dtests.prefix=tests -Dtests.seed=3C14B89169668A91 -Xmx512M -Dtests.iters= -Dtests.verbose=false -Dtests.infostream=false -Dtests.codec=random -Dtests.postingsformat=random -Dtests.docvaluesformat=random -Dtests.locale=random -Dtests.timezone=random -Dtests.directory=random -Dtests.linedocsfile=europarl.lines.txt.gz -Dtests.luceneMatchVersion=7.7.0 -Dtests.cleanthreads=perClass -Djava.util.logging.config.file=/Users/jenkins/workspace/Lucene-Solr-7.x-MacOSX/lucene/tools/junit4/logging.properties -Dtests.nightly=false -Dtests.weekly=false -Dtests.monster=false -Dtests.slow=true -Dtests.asserts=true -Dtests.multiplier=1 -DtempDir=./temp -Djava.io.tmpdir=./temp -Dcommon.dir=/Users/jenkins/workspace/Lucene-Solr-7.x-MacOSX/lucene -Dclover.db.dir=/Users/jenkins/workspace/Lucene-Solr-7.x-MacOSX/lucene/build/clover/db -Djava.security.policy=/Users/jenkins/workspace/Lucene-Solr-7.x-MacOSX/lucene/tools/junit4/solr-tests.policy -Dtests.LUCENE_VERSION=7.7.0 -Djetty.testMode=1 -Djetty.insecurerandom=1 -Dsolr.directoryFactory=org.apache.solr.core.MockDirectoryFactory -Djava.awt.headless=true -Djdk.map.althashing.threshold=0 -Dtests.src.home=/Users/jenkins/workspace/Lucene-Solr-7.x-MacOSX -Djava.security.egd=file:/dev/./urandom -Djunit4.childvm.cwd=/Users/jenkins/workspace/Lucene-Solr-7.x-MacOSX/solr/build/solr-solrj/test/J0 -Djunit4.tempDir=/Users/jenkins/workspace/Lucene-Solr-7.x-MacOSX/solr/build/solr-solrj/test/temp -Djunit4.childvm.id=0 -Djunit4.childvm.count=2 -Dtests.leaveTemporary=false -Dtests.filterstacks=true -Dtests.disableHdfs=true -Dtests.badapples=false -Djava.security.manager=org.apache.lucene.util.TestSecurityManager -Dfile.encoding=ISO-8859-1 -classpath /Users/jenkins/workspace/Lucene-Solr-7.x-MacOSX/solr/build/solr-solrj/classes/test:/Users/jenkins/workspace/Lucene-Solr-7.x-MacOSX/solr/solrj/test-lib/byte-buddy-1.9.3.jar:/Users/jenkins/workspace/Lucene-Solr-7.x-MacOSX/solr/solrj/test-lib/log4j-slf4j-impl-2.11.0.jar:/Users/jenkins/workspace/Lucene-Solr-7.x-MacOSX/solr/solrj/test-lib/mockito-core-2.23.4.jar:/Users/jenkins/workspace/Lucene-Solr-7.x-MacOSX/solr/solrj/test-lib/objenesis-2.6.jar:/Users/jenkins/workspace/Lucene-Solr-7.x-MacOSX/solr/build/solr-test-framework/classes/java:/Users/jenkins/workspace/Lucene-Solr-7.x-MacOSX/solr/solrj/src/test-files:/Users/jenkins/workspace/Lucene-Solr-7.x-MacOSX/lucene/build/test-framework/classes/java:/Users/jenkins/workspace/Lucene-Solr-7.x-MacOSX/lucene/build/codecs/classes/java:/Users/jenkins/workspace/Lucene-Solr-7.x-MacOSX/solr/solrj/lib/commons-io-2.5.jar:/Users/jenkins/workspace/Lucene-Solr-7.x-MacOSX/solr/solrj/lib/commons-math3-3.6.1.jar:/Users/jenkins/workspace/Lucene-Solr-7.x-MacOSX/solr/solrj/lib/httpclient-4.5.6.jar:/Users/jenkins/workspace/Lucene-Solr-7.x-MacOSX/solr/solrj/lib/httpcore-4.4.10.jar:/Users/jenkins/workspace/Lucene-Solr-7.x-MacOSX/solr/solrj/lib/httpmime-4.5.6.jar:/Users/jenkins/workspace/Lucene-Solr-7.x-MacOSX/solr/solrj/lib/jcl-over-slf4j-1.7.24.jar:/Users/jenkins/workspace/Lucene-Solr-7.x-MacOSX/solr/solrj/lib/noggit-0.8.jar:/Users/jenkins/workspace/Lucene-Solr-7.x-MacOSX/solr/solrj/lib/slf4j-api-1.7.24.jar:/Users/jenkins/workspace/Lucene-Solr-7.x-MacOSX/solr/solrj/lib/stax2-api-3.1.4.jar:/Users/jenkins/workspace/Lucene-Solr-7.x-MacOSX/solr/solrj/lib/woodstox-core-asl-4.4.1.jar:/Users/jenkins/workspace/Lucene-Solr-7.x-MacOSX/solr/solrj/lib/zookeeper-3.4.13.jar:/Users/jenkins/workspace/Lucene-Solr-7.x-MacOSX/lucene/test-framework/lib/hamcrest-core-1.3.jar:/Users/jenkins/workspace/Lucene-Solr-7.x-MacOSX/lucene/test-framework/lib/junit-4.12.jar:/Users/jenkins/workspace/Lucene-Solr-7.x-MacOSX/lucene/test-framework/lib/randomizedtesting-runner-2.7.2.jar:/Users/jenkins/workspace/Lucene-Solr-7.x-MacOSX/solr/build/solr-solrj/classes/java:/Users/jenkins/workspace/Lucene-Solr-7.x-MacOSX/solr/build/solr-core/classes/java:/Users/jenkins/workspace/Lucene-Solr-7.x-MacOSX/lucene/build/analysis/common/lucene-analyzers-common-7.7.0-SNAPSHOT.jar:/Users/jenkins/workspace/Lucene-Solr-7.x-MacOSX/lucene/build/analysis/kuromoji/lucene-analyzers-kuromoji-7.7.0-SNAPSHOT.jar:/Users/jenkins/workspace/Lucene-Solr-7.x-MacOSX/lucene/build/analysis/nori/lucene-analyzers-nori-7.7.0-SNAPSHOT.jar:/Users/jenkins/workspace/Lucene-Solr-7.x-MacOSX/lucene/build/analysis/phonetic/lucene-analyzers-phonetic-7.7.0-SNAPSHOT.jar:/Users/jenkins/workspace/Lucene-Solr-7.x-MacOSX/lucene/build/codecs/lucene-codecs-7.7.0-SNAPSHOT.jar:/Users/jenkins/workspace/Lucene-Solr-7.x-MacOSX/lucene/build/backward-codecs/lucene-backward-codecs-7.7.0-SNAPSHOT.jar:/Users/jenkins/workspace/Lucene-Solr-7.x-MacOSX/lucene/build/highlighter/lucene-highlighter-7.7.0-SNAPSHOT.jar:/Users/jenkins/workspace/Lucene-Solr-7.x-MacOSX/lucene/build/memory/lucene-memory-7.7.0-SNAPSHOT.jar:/Users/jenkins/workspace/Lucene-Solr-7.x-MacOSX/lucene/build/misc/lucene-misc-7.7.0-SNAPSHOT.jar:/Users/jenkins/workspace/Lucene-Solr-7.x-MacOSX/lucene/build/spatial-extras/lucene-spatial-extras-7.7.0-SNAPSHOT.jar:/Users/jenkins/workspace/Lucene-Solr-7.x-MacOSX/lucene/build/spatial3d/lucene-spatial3d-7.7.0-SNAPSHOT.jar:/Users/jenkins/workspace/Lucene-Solr-7.x-MacOSX/lucene/build/expressions/lucene-expressions-7.7.0-SNAPSHOT.jar:/Users/jenkins/workspace/Lucene-Solr-7.x-MacOSX/lucene/build/suggest/lucene-suggest-7.7.0-SNAPSHOT.jar:/Users/jenkins/workspace/Lucene-Solr-7.x-MacOSX/lucene/build/grouping/lucene-grouping-7.7.0-SNAPSHOT.jar:/Users/jenkins/workspace/Lucene-Solr-7.x-MacOSX/lucene/build/queries/lucene-queries-7.7.0-SNAPSHOT.jar:/Users/jenkins/workspace/Lucene-Solr-7.x-MacOSX/lucene/build/queryparser/lucene-queryparser-7.7.0-SNAPSHOT.jar:/Users/jenkins/workspace/Lucene-Solr-7.x-MacOSX/lucene/build/join/lucene-join-7.7.0-SNAPSHOT.jar:/Users/jenkins/workspace/Lucene-Solr-7.x-MacOSX/lucene/build/sandbox/lucene-sandbox-7.7.0-SNAPSHOT.jar:/Users/jenkins/workspace/Lucene-Solr-7.x-MacOSX/lucene/build/classification/lucene-classification-7.7.0-SNAPSHOT.jar:/Users/jenkins/workspace/Lucene-Solr-7.x-MacOSX/solr/core/lib/antlr4-runtime-4.5.1-1.jar:/Users/jenkins/workspace/Lucene-Solr-7.x-MacOSX/solr/core/lib/asm-5.1.jar:/Users/jenkins/workspace/Lucene-Solr-7.x-MacOSX/solr/core/lib/asm-commons-5.1.jar:/Users/jenkins/workspace/Lucene-Solr-7.x-MacOSX/solr/core/lib/avatica-core-1.10.0.jar:/Users/jenkins/workspace/Lucene-Solr-7.x-MacOSX/solr/core/lib/caffeine-2.4.0.jar:/Users/jenkins/workspace/Lucene-Solr-7.x-MacOSX/solr/core/lib/calcite-core-1.13.0.jar:/Users/jenkins/workspace/Lucene-Solr-7.x-MacOSX/solr/core/lib/calcite-linq4j-1.13.0.jar:/Users/jenkins/workspace/Lucene-Solr-7.x-MacOSX/solr/core/lib/commons-cli-1.2.jar:/Users/jenkins/workspace/Lucene-Solr-7.x-MacOSX/solr/core/lib/commons-codec-1.11.jar:/Users/jenkins/workspace/Lucene-Solr-7.x-MacOSX/solr/core/lib/commons-collections-3.2.2.jar:/Users/jenkins/workspace/Lucene-Solr-7.x-MacOSX/solr/core/lib/commons-compiler-2.7.6.jar:/Users/jenkins/workspace/Lucene-Solr-7.x-MacOSX/solr/core/lib/commons-configuration-1.6.jar:/Users/jenkins/workspace/Lucene-Solr-7.x-MacOSX/solr/core/lib/commons-exec-1.3.jar:/Users/jenkins/workspace/Lucene-Solr-7.x-MacOSX/solr/core/lib/commons-fileupload-1.3.3.jar:/Users/jenkins/workspace/Lucene-Solr-7.x-MacOSX/solr/core/lib/commons-io-2.5.jar:/Users/jenkins/workspace/Lucene-Solr-7.x-MacOSX/solr/core/lib/commons-lang-2.6.jar:/Users/jenkins/workspace/Lucene-Solr-7.x-MacOSX/solr/core/lib/commons-lang3-3.6.jar:/Users/jenkins/workspace/Lucene-Solr-7.x-MacOSX/solr/core/lib/commons-math3-3.6.1.jar:/Users/jenkins/workspace/Lucene-Solr-7.x-MacOSX/solr/core/lib/curator-client-2.8.0.jar:/Users/jenkins/workspace/Lucene-Solr-7.x-MacOSX/solr/core/lib/curator-framework-2.8.0.jar:/Users/jenkins/workspace/Lucene-Solr-7.x-MacOSX/solr/core/lib/curator-recipes-2.8.0.jar:/Users/jenkins/workspace/Lucene-Solr-7.x-MacOSX/solr/core/lib/disruptor-3.4.0.jar:/Users/jenkins/workspace/Lucene-Solr-7.x-MacOSX/solr/core/lib/dom4j-1.6.1.jar:/Users/jenkins/workspace/Lucene-Solr-7.x-MacOSX/solr/core/lib/eigenbase-properties-1.1.5.jar:/Users/jenkins/workspace/Lucene-Solr-7.x-MacOSX/solr/core/lib/guava-14.0.1.jar:/Users/jenkins/workspace/Lucene-Solr-7.x-MacOSX/solr/core/lib/hadoop-annotations-2.7.4.jar:/Users/jenkins/workspace/Lucene-Solr-7.x-MacOSX/solr/core/lib/hadoop-auth-2.7.4.jar:/Users/jenkins/workspace/Lucene-Solr-7.x-MacOSX/solr/core/lib/hadoop-common-2.7.4.jar:/Users/jenkins/workspace/Lucene-Solr-7.x-MacOSX/solr/core/lib/hadoop-hdfs-2.7.4.jar:/Users/jenkins/workspace/Lucene-Solr-7.x-MacOSX/solr/core/lib/hppc-0.8.1.jar:/Users/jenkins/workspace/Lucene-Solr-7.x-MacOSX/solr/core/lib/htrace-core-3.2.0-incubating.jar:/Users/jenkins/workspace/Lucene-Solr-7.x-MacOSX/solr/core/lib/jackson-annotations-2.9.6.jar:/Users/jenkins/workspace/Lucene-Solr-7.x-MacOSX/solr/core/lib/jackson-core-2.9.6.jar:/Users/jenkins/workspace/Lucene-Solr-7.x-MacOSX/solr/core/lib/jackson-core-asl-1.9.13.jar:/Users/jenkins/workspace/Lucene-Solr-7.x-MacOSX/solr/core/lib/jackson-databind-2.9.6.jar:/Users/jenkins/workspace/Lucene-Solr-7.x-MacOSX/solr/core/lib/jackson-dataformat-smile-2.9.6.jar:/Users/jenkins/workspace/Lucene-Solr-7.x-MacOSX/solr/core/lib/jackson-mapper-asl-1.9.13.jar:/Users/jenkins/workspace/Lucene-Solr-7.x-MacOSX/solr/core/lib/janino-2.7.6.jar:/Users/jenkins/workspace/Lucene-Solr-7.x-MacOSX/solr/core/lib/jcl-over-slf4j-1.7.24.jar:/Users/jenkins/workspace/Lucene-Solr-7.x-MacOSX/solr/core/lib/joda-time-2.2.jar:/Users/jenkins/workspace/Lucene-Solr-7.x-MacOSX/solr/core/lib/log4j-1.2-api-2.11.0.jar:/Users/jenkins/workspace/Lucene-Solr-7.x-MacOSX/solr/core/lib/log4j-api-2.11.0.jar:/Users/jenkins/workspace/Lucene-Solr-7.x-MacOSX/solr/core/lib/log4j-core-2.11.0.jar:/Users/jenkins/workspace/Lucene-Solr-7.x-MacOSX/solr/core/lib/log4j-slf4j-impl-2.11.0.jar:/Users/jenkins/workspace/Lucene-Solr-7.x-MacOSX/solr/core/lib/org.restlet-2.3.0.jar:/Users/jenkins/workspace/Lucene-Solr-7.x-MacOSX/solr/core/lib/org.restlet.ext.servlet-2.3.0.jar:/Users/jenkins/workspace/Lucene-Solr-7.x-MacOSX/solr/core/lib/protobuf-java-3.1.0.jar:/Users/jenkins/workspace/Lucene-Solr-7.x-MacOSX/solr/core/lib/rrd4j-3.2.jar:/Users/jenkins/workspace/Lucene-Solr-7.x-MacOSX/solr/core/lib/spatial4j-0.7.jar:/Users/jenkins/workspace/Lucene-Solr-7.x-MacOSX/solr/core/lib/t-digest-3.1.jar:/Users/jenkins/workspace/Lucene-Solr-7.x-MacOSX/solr/server/lib/gmetric4j-1.0.7.jar:/Users/jenkins/workspace/Lucene-Solr-7.x-MacOSX/solr/server/lib/javax.servlet-api-3.1.0.jar:/Users/jenkins/workspace/Lucene-Solr-7.x-MacOSX/solr/server/lib/jetty-continuation-9.4.14.v20181114.jar:/Users/jenkins/workspace/Lucene-Solr-7.x-MacOSX/solr/server/lib/jetty-deploy-9.4.14.v20181114.jar:/Users/jenkins/workspace/Lucene-Solr-7.x-MacOSX/solr/server/lib/jetty-http-9.4.14.v20181114.jar:/Users/jenkins/workspace/Lucene-Solr-7.x-MacOSX/solr/server/lib/jetty-io-9.4.14.v20181114.jar:/Users/jenkins/workspace/Lucene-Solr-7.x-MacOSX/solr/server/lib/jetty-jmx-9.4.14.v20181114.jar:/Users/jenkins/workspace/Lucene-Solr-7.x-MacOSX/solr/server/lib/jetty-rewrite-9.4.14.v20181114.jar:/Users/jenkins/workspace/Lucene-Solr-7.x-MacOSX/solr/server/lib/jetty-security-9.4.14.v20181114.jar:/Users/jenkins/workspace/Lucene-Solr-7.x-MacOSX/solr/server/lib/jetty-server-9.4.14.v20181114.jar:/Users/jenkins/workspace/Lucene-Solr-7.x-MacOSX/solr/server/lib/jetty-servlet-9.4.14.v20181114.jar:/Users/jenkins/workspace/Lucene-Solr-7.x-MacOSX/solr/server/lib/jetty-servlets-9.4.14.v20181114.jar:/Users/jenkins/workspace/Lucene-Solr-7.x-MacOSX/solr/server/lib/jetty-util-9.4.14.v20181114.jar:/Users/jenkins/workspace/Lucene-Solr-7.x-MacOSX/solr/server/lib/jetty-webapp-9.4.14.v20181114.jar:/Users/jenkins/workspace/Lucene-Solr-7.x-MacOSX/solr/server/lib/jetty-xml-9.4.14.v20181114.jar:/Users/jenkins/workspace/Lucene-Solr-7.x-MacOSX/solr/server/lib/metrics-core-3.2.6.jar:/Users/jenkins/workspace/Lucene-Solr-7.x-MacOSX/solr/server/lib/metrics-ganglia-3.2.6.jar:/Users/jenkins/workspace/Lucene-Solr-7.x-MacOSX/solr/server/lib/metrics-graphite-3.2.6.jar:/Users/jenkins/workspace/Lucene-Solr-7.x-MacOSX/solr/server/lib/metrics-jetty9-3.2.6.jar:/Users/jenkins/workspace/Lucene-Solr-7.x-MacOSX/solr/server/lib/metrics-jvm-3.2.6.jar:/Users/jenkins/workspace/Lucene-Solr-7.x-MacOSX/solr/example/example-DIH/solr/db/lib/derby-10.9.1.0.jar:/Users/jenkins/workspace/Lucene-Solr-7.x-MacOSX/solr/example/example-DIH/solr/db/lib/hsqldb-2.4.0.jar:/Users/jenkins/workspace/Lucene-Solr-7.x-MacOSX/lucene/build/core/classes/java:/Users/jenkins/tools/hudson.tasks.Ant_AntInstallation/ANT_1.8.2/lib/ant-launcher.jar:/Users/jenkins/.ant/lib/ivy-2.4.0.jar:/Users/jenkins/tools/hudson.tasks.Ant_AntInstallation/ANT_1.8.2/lib/ant-antlr.jar:/Users/jenkins/tools/hudson.tasks.Ant_AntInstallation/ANT_1.8.2/lib/ant-apache-bcel.jar:/Users/jenkins/tools/hudson.tasks.Ant_AntInstallation/ANT_1.8.2/lib/ant-apache-bsf.jar:/Users/jenkins/tools/hudson.tasks.Ant_AntInstallation/ANT_1.8.2/lib/ant-apache-log4j.jar:/Users/jenkins/tools/hudson.tasks.Ant_AntInstallation/ANT_1.8.2/lib/ant-apache-oro.jar:/Users/jenkins/tools/hudson.tasks.Ant_AntInstallation/ANT_1.8.2/lib/ant-apache-regexp.jar:/Users/jenkins/tools/hudson.tasks.Ant_AntInstallation/ANT_1.8.2/lib/ant-apache-resolver.jar:/Users/jenkins/tools/hudson.tasks.Ant_AntInstallation/ANT_1.8.2/lib/ant-apache-xalan2.jar:/Users/jenkins/tools/hudson.tasks.Ant_AntInstallation/ANT_1.8.2/lib/ant-commons-logging.jar:/Users/jenkins/tools/hudson.tasks.Ant_AntInstallation/ANT_1.8.2/lib/ant-commons-net.jar:/Users/jenkins/tools/hudson.tasks.Ant_AntInstallation/ANT_1.8.2/lib/ant-jai.jar:/Users/jenkins/tools/hudson.tasks.Ant_AntInstallation/ANT_1.8.2/lib/ant-javamail.jar:/Users/jenkins/tools/hudson.tasks.Ant_AntInstallation/ANT_1.8.2/lib/ant-jdepend.jar:/Users/jenkins/tools/hudson.tasks.Ant_AntInstallation/ANT_1.8.2/lib/ant-jmf.jar:/Users/jenkins/tools/hudson.tasks.Ant_AntInstallation/ANT_1.8.2/lib/ant-jsch.jar:/Users/jenkins/tools/hudson.tasks.Ant_AntInstallation/ANT_1.8.2/lib/ant-junit.jar:/Users/jenkins/tools/hudson.tasks.Ant_AntInstallation/ANT_1.8.2/lib/ant-junit4.jar:/Users/jenkins/tools/hudson.tasks.Ant_AntInstallation/ANT_1.8.2/lib/ant-netrexx.jar:/Users/jenkins/tools/hudson.tasks.Ant_AntInstallation/ANT_1.8.2/lib/ant-swing.jar:/Users/jenkins/tools/hudson.tasks.Ant_AntInstallation/ANT_1.8.2/lib/ant-testutil.jar:/Users/jenkins/tools/hudson.tasks.Ant_AntInstallation/ANT_1.8.2/lib/ant.jar:/Library/Java/JavaVirtualMachines/jdk1.8.0_172.jdk/Contents/Home/lib/tools.jar:/Users/jenkins/.ivy2/cache/com.carrotsearch.randomizedtesting/junit4-ant/jars/junit4-ant-2.7.2.jar com.carrotsearch.ant.tasks.junit4.slave.SlaveMainSafe -eventsfile /Users/jenkins/workspace/Lucene-Solr-7.x-MacOSX/solr/build/solr-solrj/test/temp/junit4-J0-20190110_190246_6612731350760659182833.events @/Users/jenkins/workspace/Lucene-Solr-7.x-MacOSX/solr/build/solr-solrj/test/temp/junit4-J0-20190110_190246_6618140703691388708408.suites -stdin
   [junit4] ERROR: JVM J0 ended with an exception: Forked process returned with error code: 134. Very likely a JVM crash.  See process stdout at: /Users/jenkins/workspace/Lucene-Solr-7.x-MacOSX/solr/build/solr-solrj/test/temp/junit4-J0-20190110_190246_6611542699491279777258.sysout
   [junit4] at com.carrotsearch.ant.tasks.junit4.JUnit4.executeSlave(JUnit4.java:1542)
   [junit4] at com.carrotsearch.ant.tasks.junit4.JUnit4.access$000(JUnit4.java:123)
   [junit4] at com.carrotsearch.ant.tasks.junit4.JUnit4$2.call(JUnit4.java:997)
   [junit4] at com.carrotsearch.ant.tasks.junit4.JUnit4$2.call(JUnit4.java:994)
   [junit4] at java.util.concurrent.FutureTask.run(FutureTask.java:266)
   [junit4] at java.util.concurrent.ThreadPoolExecutor.runWorker(ThreadPoolExecutor.java:1149)
   [junit4] at java.util.concurrent.ThreadPoolExecutor$Worker.run(ThreadPoolExecutor.java:624)
   [junit4] at java.lang.Thread.run(Thread.java:748)

BUILD FAILED
/Users/jenkins/workspace/Lucene-Solr-7.x-MacOSX/build.xml:633: The following error occurred while executing this line:
/Users/jenkins/workspace/Lucene-Solr-7.x-MacOSX/build.xml:577: The following error occurred while executing this line:
/Users/jenkins/workspace/Lucene-Solr-7.x-MacOSX/build.xml:59: The following error occurred while executing this line:
/Users/jenkins/workspace/Lucene-Solr-7.x-MacOSX/solr/build.xml:280: The following error occurred while executing this line:
/Users/jenkins/workspace/Lucene-Solr-7.x-MacOSX/solr/common-build.xml:558: The following error occurred while executing this line:
/Users/jenkins/workspace/Lucene-Solr-7.x-MacOSX/lucene/common-build.xml:1572: The following error occurred while executing this line:
/Users/jenkins/workspace/Lucene-Solr-7.x-MacOSX/lucene/common-build.xml:1099: At least one slave process threw an exception, first: Forked process returned with error code: 134. Very likely a JVM crash.  See process stdout at: /Users/jenkins/workspace/Lucene-Solr-7.x-MacOSX/solr/build/solr-solrj/test/temp/junit4-J0-20190110_190246_6611542699491279777258.sysout

Total time: 90 minutes 53 seconds
Build step 'Invoke Ant' marked build as failure
Archiving artifacts
Setting ANT_1_8_2_HOME=/Users/jenkins/tools/hudson.tasks.Ant_AntInstallation/ANT_1.8.2
[WARNINGS] Skipping publisher since build result is FAILURE
Recording test results
Setting ANT_1_8_2_HOME=/Users/jenkins/tools/hudson.tasks.Ant_AntInstallation/ANT_1.8.2
Email was triggered for: Failure - Any
Sending email for trigger: Failure - Any
Setting ANT_1_8_2_HOME=/Users/jenkins/tools/hudson.tasks.Ant_AntInstallation/ANT_1.8.2
Setting ANT_1_8_2_HOME=/Users/jenkins/tools/hudson.tasks.Ant_AntInstallation/ANT_1.8.2
Setting ANT_1_8_2_HOME=/Users/jenkins/tools/hudson.tasks.Ant_AntInstallation/ANT_1.8.2
Setting ANT_1_8_2_HOME=/Users/jenkins/tools/hudson.tasks.Ant_AntInstallation/ANT_1.8.2


---------------------------------------------------------------------
To unsubscribe, e-mail: [hidden email]
For additional commands, e-mail: [hidden email]