[JENKINS] Lucene-Solr-7.x-Solaris (64bit/jdk1.8.0) - Build # 817 - Unstable!

classic Classic list List threaded Threaded
1 message Options
Reply | Threaded
Open this post in threaded view
|

[JENKINS] Lucene-Solr-7.x-Solaris (64bit/jdk1.8.0) - Build # 817 - Unstable!

Policeman Jenkins Server-2
Build: https://jenkins.thetaphi.de/job/Lucene-Solr-7.x-Solaris/817/
Java: 64bit/jdk1.8.0 -XX:-UseCompressedOops -XX:+UseSerialGC

1 tests failed.
FAILED:  org.apache.solr.cloud.TestCloudSearcherWarming.testPeersyncFailureReplicationSuccess

Error Message:
No registered leader was found after waiting for 4000ms , collection: testPeersyncFailureReplicationSuccess slice: shard1 saw state=DocCollection(testPeersyncFailureReplicationSuccess//collections/testPeersyncFailureReplicationSuccess/state.json/10)={   "pullReplicas":"0",   "replicationFactor":"1",   "shards":{"shard1":{       "range":"80000000-7fffffff",       "state":"active",       "replicas":{         "core_node2":{           "core":"testPeersyncFailureReplicationSuccess_shard1_replica_n1",           "base_url":"http://127.0.0.1:58527/solr",           "node_name":"127.0.0.1:58527_solr",           "state":"down",           "type":"NRT",           "force_set_state":"false"},         "core_node4":{           "core":"testPeersyncFailureReplicationSuccess_shard1_replica_n3",           "base_url":"http://127.0.0.1:59081/solr",           "node_name":"127.0.0.1:59081_solr",           "state":"recovering",           "type":"NRT",           "force_set_state":"false"}}}},   "router":{"name":"compositeId"},   "maxShardsPerNode":"1",   "autoAddReplicas":"false",   "nrtReplicas":"1",   "tlogReplicas":"0"} with live_nodes=[127.0.0.1:59081_solr]

Stack Trace:
org.apache.solr.common.SolrException: No registered leader was found after waiting for 4000ms , collection: testPeersyncFailureReplicationSuccess slice: shard1 saw state=DocCollection(testPeersyncFailureReplicationSuccess//collections/testPeersyncFailureReplicationSuccess/state.json/10)={
  "pullReplicas":"0",
  "replicationFactor":"1",
  "shards":{"shard1":{
      "range":"80000000-7fffffff",
      "state":"active",
      "replicas":{
        "core_node2":{
          "core":"testPeersyncFailureReplicationSuccess_shard1_replica_n1",
          "base_url":"http://127.0.0.1:58527/solr",
          "node_name":"127.0.0.1:58527_solr",
          "state":"down",
          "type":"NRT",
          "force_set_state":"false"},
        "core_node4":{
          "core":"testPeersyncFailureReplicationSuccess_shard1_replica_n3",
          "base_url":"http://127.0.0.1:59081/solr",
          "node_name":"127.0.0.1:59081_solr",
          "state":"recovering",
          "type":"NRT",
          "force_set_state":"false"}}}},
  "router":{"name":"compositeId"},
  "maxShardsPerNode":"1",
  "autoAddReplicas":"false",
  "nrtReplicas":"1",
  "tlogReplicas":"0"} with live_nodes=[127.0.0.1:59081_solr]
        at __randomizedtesting.SeedInfo.seed([E802AC554978EB6E:3C53CF1A98C6DC0D]:0)
        at org.apache.solr.common.cloud.ZkStateReader.getLeaderRetry(ZkStateReader.java:861)
        at org.apache.solr.common.cloud.ZkStateReader.getLeaderRetry(ZkStateReader.java:845)
        at org.apache.solr.cloud.TestCloudSearcherWarming.testPeersyncFailureReplicationSuccess(TestCloudSearcherWarming.java:188)
        at sun.reflect.NativeMethodAccessorImpl.invoke0(Native Method)
        at sun.reflect.NativeMethodAccessorImpl.invoke(NativeMethodAccessorImpl.java:62)
        at sun.reflect.DelegatingMethodAccessorImpl.invoke(DelegatingMethodAccessorImpl.java:43)
        at java.lang.reflect.Method.invoke(Method.java:498)
        at com.carrotsearch.randomizedtesting.RandomizedRunner.invoke(RandomizedRunner.java:1742)
        at com.carrotsearch.randomizedtesting.RandomizedRunner$8.evaluate(RandomizedRunner.java:935)
        at com.carrotsearch.randomizedtesting.RandomizedRunner$9.evaluate(RandomizedRunner.java:971)
        at com.carrotsearch.randomizedtesting.RandomizedRunner$10.evaluate(RandomizedRunner.java:985)
        at com.carrotsearch.randomizedtesting.rules.SystemPropertiesRestoreRule$1.evaluate(SystemPropertiesRestoreRule.java:57)
        at org.apache.lucene.util.TestRuleSetupTeardownChained$1.evaluate(TestRuleSetupTeardownChained.java:49)
        at org.apache.lucene.util.AbstractBeforeAfterRule$1.evaluate(AbstractBeforeAfterRule.java:45)
        at org.apache.lucene.util.TestRuleThreadAndTestName$1.evaluate(TestRuleThreadAndTestName.java:48)
        at org.apache.lucene.util.TestRuleIgnoreAfterMaxFailures$1.evaluate(TestRuleIgnoreAfterMaxFailures.java:64)
        at org.apache.lucene.util.TestRuleMarkFailure$1.evaluate(TestRuleMarkFailure.java:47)
        at com.carrotsearch.randomizedtesting.rules.StatementAdapter.evaluate(StatementAdapter.java:36)
        at com.carrotsearch.randomizedtesting.ThreadLeakControl$StatementRunner.run(ThreadLeakControl.java:368)
        at com.carrotsearch.randomizedtesting.ThreadLeakControl.forkTimeoutingTask(ThreadLeakControl.java:817)
        at com.carrotsearch.randomizedtesting.ThreadLeakControl$3.evaluate(ThreadLeakControl.java:468)
        at com.carrotsearch.randomizedtesting.RandomizedRunner.runSingleTest(RandomizedRunner.java:944)
        at com.carrotsearch.randomizedtesting.RandomizedRunner$5.evaluate(RandomizedRunner.java:830)
        at com.carrotsearch.randomizedtesting.RandomizedRunner$6.evaluate(RandomizedRunner.java:880)
        at com.carrotsearch.randomizedtesting.RandomizedRunner$7.evaluate(RandomizedRunner.java:891)
        at com.carrotsearch.randomizedtesting.rules.StatementAdapter.evaluate(StatementAdapter.java:36)
        at com.carrotsearch.randomizedtesting.rules.SystemPropertiesRestoreRule$1.evaluate(SystemPropertiesRestoreRule.java:57)
        at org.apache.lucene.util.AbstractBeforeAfterRule$1.evaluate(AbstractBeforeAfterRule.java:45)
        at com.carrotsearch.randomizedtesting.rules.StatementAdapter.evaluate(StatementAdapter.java:36)
        at org.apache.lucene.util.TestRuleStoreClassName$1.evaluate(TestRuleStoreClassName.java:41)
        at com.carrotsearch.randomizedtesting.rules.NoShadowingOrOverridesOnMethodsRule$1.evaluate(NoShadowingOrOverridesOnMethodsRule.java:40)
        at com.carrotsearch.randomizedtesting.rules.NoShadowingOrOverridesOnMethodsRule$1.evaluate(NoShadowingOrOverridesOnMethodsRule.java:40)
        at com.carrotsearch.randomizedtesting.rules.StatementAdapter.evaluate(StatementAdapter.java:36)
        at com.carrotsearch.randomizedtesting.rules.StatementAdapter.evaluate(StatementAdapter.java:36)
        at com.carrotsearch.randomizedtesting.rules.StatementAdapter.evaluate(StatementAdapter.java:36)
        at org.apache.lucene.util.TestRuleAssertionsRequired$1.evaluate(TestRuleAssertionsRequired.java:53)
        at org.apache.lucene.util.TestRuleMarkFailure$1.evaluate(TestRuleMarkFailure.java:47)
        at org.apache.lucene.util.TestRuleIgnoreAfterMaxFailures$1.evaluate(TestRuleIgnoreAfterMaxFailures.java:64)
        at org.apache.lucene.util.TestRuleIgnoreTestSuites$1.evaluate(TestRuleIgnoreTestSuites.java:54)
        at com.carrotsearch.randomizedtesting.rules.StatementAdapter.evaluate(StatementAdapter.java:36)
        at com.carrotsearch.randomizedtesting.ThreadLeakControl$StatementRunner.run(ThreadLeakControl.java:368)
        at java.lang.Thread.run(Thread.java:748)




Build Log:
[...truncated 12396 lines...]
   [junit4] Suite: org.apache.solr.cloud.TestCloudSearcherWarming
   [junit4]   2> 55268 INFO  (SUITE-TestCloudSearcherWarming-seed#[E802AC554978EB6E]-worker) [    ] o.a.s.SolrTestCaseJ4 SecureRandom sanity checks: test.solr.allowed.securerandom=null & java.security.egd=file:/dev/./urandom
   [junit4]   2> Creating dataDir: /export/home/jenkins/workspace/Lucene-Solr-7.x-Solaris/solr/build/solr-core/test/J1/temp/solr.cloud.TestCloudSearcherWarming_E802AC554978EB6E-001/init-core-data-001
   [junit4]   2> 55269 WARN  (SUITE-TestCloudSearcherWarming-seed#[E802AC554978EB6E]-worker) [    ] o.a.s.SolrTestCaseJ4 startTrackingSearchers: numOpens=5 numCloses=5
   [junit4]   2> 55269 INFO  (SUITE-TestCloudSearcherWarming-seed#[E802AC554978EB6E]-worker) [    ] o.a.s.SolrTestCaseJ4 Using PointFields (NUMERIC_POINTS_SYSPROP=true) w/NUMERIC_DOCVALUES_SYSPROP=true
   [junit4]   2> 55271 INFO  (SUITE-TestCloudSearcherWarming-seed#[E802AC554978EB6E]-worker) [    ] o.a.s.SolrTestCaseJ4 Randomized ssl (false) and clientAuth (false) via: @org.apache.solr.util.RandomizeSSL(reason=, value=NaN, ssl=NaN, clientAuth=NaN)
   [junit4]   2> 55273 INFO  (SUITE-TestCloudSearcherWarming-seed#[E802AC554978EB6E]-worker) [    ] o.a.s.c.MiniSolrCloudCluster Starting cluster of 1 servers in /export/home/jenkins/workspace/Lucene-Solr-7.x-Solaris/solr/build/solr-core/test/J1/temp/solr.cloud.TestCloudSearcherWarming_E802AC554978EB6E-001/tempDir-001
   [junit4]   2> 55273 INFO  (SUITE-TestCloudSearcherWarming-seed#[E802AC554978EB6E]-worker) [    ] o.a.s.c.ZkTestServer STARTING ZK TEST SERVER
   [junit4]   2> 55273 INFO  (Thread-81) [    ] o.a.s.c.ZkTestServer client port:0.0.0.0/0.0.0.0:0
   [junit4]   2> 55273 INFO  (Thread-81) [    ] o.a.s.c.ZkTestServer Starting server
   [junit4]   2> 55274 ERROR (Thread-81) [    ] o.a.z.s.ZooKeeperServer ZKShutdownHandler is not registered, so ZooKeeper server won't take any action on ERROR or SHUTDOWN server state changes
   [junit4]   2> 55373 INFO  (SUITE-TestCloudSearcherWarming-seed#[E802AC554978EB6E]-worker) [    ] o.a.s.c.ZkTestServer start zk server on port:41468
   [junit4]   2> 55384 INFO  (zkConnectionManagerCallback-115-thread-1) [    ] o.a.s.c.c.ConnectionManager zkClient has connected
   [junit4]   2> 55391 INFO  (jetty-launcher-112-thread-1) [    ] o.e.j.s.Server jetty-9.4.11.v20180605; built: 2018-06-05T18:24:03.829Z; git: d5fc0523cfa96bfebfbda19606cad384d772f04c; jvm 1.8.0_172-b11
   [junit4]   2> 55393 INFO  (jetty-launcher-112-thread-1) [    ] o.e.j.s.session DefaultSessionIdManager workerName=node0
   [junit4]   2> 55393 INFO  (jetty-launcher-112-thread-1) [    ] o.e.j.s.session No SessionScavenger set, using defaults
   [junit4]   2> 55393 INFO  (jetty-launcher-112-thread-1) [    ] o.e.j.s.session node0 Scavenging every 600000ms
   [junit4]   2> 55393 INFO  (jetty-launcher-112-thread-1) [    ] o.e.j.s.h.ContextHandler Started o.e.j.s.ServletContextHandler@1d15d5ed{/solr,null,AVAILABLE}
   [junit4]   2> 55393 INFO  (jetty-launcher-112-thread-1) [    ] o.e.j.s.AbstractConnector Started ServerConnector@35df63c6{HTTP/1.1,[http/1.1]}{127.0.0.1:47304}
   [junit4]   2> 55393 INFO  (jetty-launcher-112-thread-1) [    ] o.e.j.s.Server Started @55509ms
   [junit4]   2> 55393 INFO  (jetty-launcher-112-thread-1) [    ] o.a.s.c.s.e.JettySolrRunner Jetty properties: {hostContext=/solr, hostPort=47304}
   [junit4]   2> 55403 ERROR (jetty-launcher-112-thread-1) [    ] o.a.s.u.StartupLoggingUtils Missing Java Option solr.log.dir. Logging may be missing or incomplete.
   [junit4]   2> 55404 INFO  (jetty-launcher-112-thread-1) [    ] o.a.s.s.SolrDispatchFilter Using logger factory org.apache.logging.slf4j.Log4jLoggerFactory
   [junit4]   2> 55404 INFO  (jetty-launcher-112-thread-1) [    ] o.a.s.s.SolrDispatchFilter  ___      _       Welcome to Apache Solr? version 7.6.0
   [junit4]   2> 55404 INFO  (jetty-launcher-112-thread-1) [    ] o.a.s.s.SolrDispatchFilter / __| ___| |_ _   Starting in cloud mode on port null
   [junit4]   2> 55404 INFO  (jetty-launcher-112-thread-1) [    ] o.a.s.s.SolrDispatchFilter \__ \/ _ \ | '_|  Install dir: null
   [junit4]   2> 55404 INFO  (jetty-launcher-112-thread-1) [    ] o.a.s.s.SolrDispatchFilter |___/\___/_|_|    Start time: 2018-09-14T13:15:49.062Z
   [junit4]   2> 55404 INFO  (jetty-launcher-112-thread-1) [    ] o.a.s.c.SolrResourceLoader solr home defaulted to 'solr/' (could not find system property or JNDI)
   [junit4]   2> 55407 INFO  (zkConnectionManagerCallback-117-thread-1) [    ] o.a.s.c.c.ConnectionManager zkClient has connected
   [junit4]   2> 55409 INFO  (jetty-launcher-112-thread-1) [    ] o.a.s.s.SolrDispatchFilter solr.xml found in ZooKeeper. Loading...
   [junit4]   2> 55870 INFO  (jetty-launcher-112-thread-1) [    ] o.a.s.c.ZkContainer Zookeeper client=127.0.0.1:41468/solr
   [junit4]   2> 55873 INFO  (zkConnectionManagerCallback-121-thread-1) [    ] o.a.s.c.c.ConnectionManager zkClient has connected
   [junit4]   2> 55881 INFO  (zkConnectionManagerCallback-123-thread-1) [    ] o.a.s.c.c.ConnectionManager zkClient has connected
   [junit4]   2> 56092 INFO  (jetty-launcher-112-thread-1) [n:127.0.0.1:47304_solr    ] o.a.s.c.OverseerElectionContext I am going to be the leader 127.0.0.1:47304_solr
   [junit4]   2> 56093 INFO  (jetty-launcher-112-thread-1) [n:127.0.0.1:47304_solr    ] o.a.s.c.Overseer Overseer (id=72335065039437827-127.0.0.1:47304_solr-n_0000000000) starting
   [junit4]   2> 56124 INFO  (zkConnectionManagerCallback-130-thread-1) [    ] o.a.s.c.c.ConnectionManager zkClient has connected
   [junit4]   2> 56134 INFO  (jetty-launcher-112-thread-1) [n:127.0.0.1:47304_solr    ] o.a.s.c.s.i.ZkClientClusterStateProvider Cluster at 127.0.0.1:41468/solr ready
   [junit4]   2> 56143 INFO  (jetty-launcher-112-thread-1) [n:127.0.0.1:47304_solr    ] o.a.s.c.ZkController Register node as live in ZooKeeper:/live_nodes/127.0.0.1:47304_solr
   [junit4]   2> 56143 INFO  (OverseerStateUpdate-72335065039437827-127.0.0.1:47304_solr-n_0000000000) [n:127.0.0.1:47304_solr    ] o.a.s.c.Overseer Starting to work on the main queue : 127.0.0.1:47304_solr
   [junit4]   2> 56159 INFO  (OverseerStateUpdate-72335065039437827-127.0.0.1:47304_solr-n_0000000000) [n:127.0.0.1:47304_solr    ] o.a.s.c.c.ZkStateReader Updated live nodes from ZooKeeper... (0) -> (1)
   [junit4]   2> 56162 INFO  (zkCallback-129-thread-1) [    ] o.a.s.c.c.ZkStateReader Updated live nodes from ZooKeeper... (0) -> (1)
   [junit4]   2> 56204 INFO  (jetty-launcher-112-thread-1) [n:127.0.0.1:47304_solr    ] o.a.s.h.a.MetricsHistoryHandler No .system collection, keeping metrics history in memory.
   [junit4]   2> 56254 INFO  (jetty-launcher-112-thread-1) [n:127.0.0.1:47304_solr    ] o.a.s.m.r.SolrJmxReporter JMX monitoring for 'solr_47304.solr.node' (registry 'solr.node') enabled at server: com.sun.jmx.mbeanserver.JmxMBeanServer@2b608828
   [junit4]   2> 56260 INFO  (jetty-launcher-112-thread-1) [n:127.0.0.1:47304_solr    ] o.a.s.m.r.SolrJmxReporter JMX monitoring for 'solr_47304.solr.jvm' (registry 'solr.jvm') enabled at server: com.sun.jmx.mbeanserver.JmxMBeanServer@2b608828
   [junit4]   2> 56260 INFO  (jetty-launcher-112-thread-1) [n:127.0.0.1:47304_solr    ] o.a.s.m.r.SolrJmxReporter JMX monitoring for 'solr_47304.solr.jetty' (registry 'solr.jetty') enabled at server: com.sun.jmx.mbeanserver.JmxMBeanServer@2b608828
   [junit4]   2> 56261 INFO  (jetty-launcher-112-thread-1) [n:127.0.0.1:47304_solr    ] o.a.s.c.CorePropertiesLocator Found 0 core definitions underneath /export/home/jenkins/workspace/Lucene-Solr-7.x-Solaris/solr/build/solr-core/test/J1/temp/solr.cloud.TestCloudSearcherWarming_E802AC554978EB6E-001/tempDir-001/node1/.
   [junit4]   2> 56373 INFO  (zkConnectionManagerCallback-133-thread-1) [    ] o.a.s.c.c.ConnectionManager zkClient has connected
   [junit4]   2> 56379 INFO  (zkConnectionManagerCallback-138-thread-1) [    ] o.a.s.c.c.ConnectionManager zkClient has connected
   [junit4]   2> 56381 INFO  (SUITE-TestCloudSearcherWarming-seed#[E802AC554978EB6E]-worker) [    ] o.a.s.c.c.ZkStateReader Updated live nodes from ZooKeeper... (0) -> (1)
   [junit4]   2> 56383 INFO  (SUITE-TestCloudSearcherWarming-seed#[E802AC554978EB6E]-worker) [    ] o.a.s.c.s.i.ZkClientClusterStateProvider Cluster at 127.0.0.1:41468/solr ready
   [junit4]   2> 56431 INFO  (TEST-TestCloudSearcherWarming.testRepFactor1LeaderStartup-seed#[E802AC554978EB6E]) [    ] o.a.s.SolrTestCaseJ4 ###Starting testRepFactor1LeaderStartup
   [junit4]   2> 56435 INFO  (qtp472044690-386) [n:127.0.0.1:47304_solr    ] o.a.s.h.a.CollectionsHandler Invoked Collection Action :delete with params name=testRepFactor1LeaderStartup&action=DELETE&wt=javabin&version=2 and sendToOCPQueue=true
   [junit4]   2> 56461 INFO  (OverseerThreadFactory-197-thread-1-processing-n:127.0.0.1:47304_solr) [n:127.0.0.1:47304_solr    ] o.a.s.c.a.c.OverseerCollectionMessageHandler Executing Collection Cmd=action=UNLOAD&deleteInstanceDir=true&deleteDataDir=true&deleteMetricsHistory=true, asyncId=null
   [junit4]   2> 56461 ERROR (OverseerThreadFactory-197-thread-1-processing-n:127.0.0.1:47304_solr) [n:127.0.0.1:47304_solr    ] o.a.s.c.a.c.OverseerCollectionMessageHandler Collection: testRepFactor1LeaderStartup operation: delete failed:org.apache.solr.common.SolrException: Could not find collection : testRepFactor1LeaderStartup
   [junit4]   2> at org.apache.solr.common.cloud.ClusterState.getCollection(ClusterState.java:118)
   [junit4]   2> at org.apache.solr.cloud.api.collections.OverseerCollectionMessageHandler.collectionCmd(OverseerCollectionMessageHandler.java:797)
   [junit4]   2> at org.apache.solr.cloud.api.collections.DeleteCollectionCmd.call(DeleteCollectionCmd.java:117)
   [junit4]   2> at org.apache.solr.cloud.api.collections.OverseerCollectionMessageHandler.processMessage(OverseerCollectionMessageHandler.java:259)
   [junit4]   2> at org.apache.solr.cloud.OverseerTaskProcessor$Runner.run(OverseerTaskProcessor.java:478)
   [junit4]   2> at org.apache.solr.common.util.ExecutorUtil$MDCAwareThreadPoolExecutor.lambda$execute$0(ExecutorUtil.java:209)
   [junit4]   2> at java.util.concurrent.ThreadPoolExecutor.runWorker(ThreadPoolExecutor.java:1149)
   [junit4]   2> at java.util.concurrent.ThreadPoolExecutor$Worker.run(ThreadPoolExecutor.java:624)
   [junit4]   2> at java.lang.Thread.run(Thread.java:748)
   [junit4]   2>
   [junit4]   2> 56491 INFO  (qtp472044690-386) [n:127.0.0.1:47304_solr    ] o.a.s.s.HttpSolrCall [admin] webapp=null path=/admin/collections params={name=testRepFactor1LeaderStartup&action=DELETE&wt=javabin&version=2} status=400 QTime=56
   [junit4]   2> 56495 INFO  (qtp472044690-381) [n:127.0.0.1:47304_solr    ] o.a.s.h.a.CollectionsHandler Invoked Collection Action :delete with params name=testPeersyncFailureReplicationSuccess&action=DELETE&wt=javabin&version=2 and sendToOCPQueue=true
   [junit4]   2> 56508 INFO  (OverseerCollectionConfigSetProcessor-72335065039437827-127.0.0.1:47304_solr-n_0000000000) [n:127.0.0.1:47304_solr    ] o.a.s.c.OverseerTaskQueue Response ZK path: /overseer/collection-queue-work/qnr-0000000000 doesn't exist.  Requestor may have disconnected from ZooKeeper
   [junit4]   2> 56508 INFO  (OverseerThreadFactory-197-thread-2-processing-n:127.0.0.1:47304_solr) [n:127.0.0.1:47304_solr    ] o.a.s.c.a.c.OverseerCollectionMessageHandler Executing Collection Cmd=action=UNLOAD&deleteInstanceDir=true&deleteDataDir=true&deleteMetricsHistory=true, asyncId=null
   [junit4]   2> 56509 ERROR (OverseerThreadFactory-197-thread-2-processing-n:127.0.0.1:47304_solr) [n:127.0.0.1:47304_solr    ] o.a.s.c.a.c.OverseerCollectionMessageHandler Collection: testPeersyncFailureReplicationSuccess operation: delete failed:org.apache.solr.common.SolrException: Could not find collection : testPeersyncFailureReplicationSuccess
   [junit4]   2> at org.apache.solr.common.cloud.ClusterState.getCollection(ClusterState.java:118)
   [junit4]   2> at org.apache.solr.cloud.api.collections.OverseerCollectionMessageHandler.collectionCmd(OverseerCollectionMessageHandler.java:797)
   [junit4]   2> at org.apache.solr.cloud.api.collections.DeleteCollectionCmd.call(DeleteCollectionCmd.java:117)
   [junit4]   2> at org.apache.solr.cloud.api.collections.OverseerCollectionMessageHandler.processMessage(OverseerCollectionMessageHandler.java:259)
   [junit4]   2> at org.apache.solr.cloud.OverseerTaskProcessor$Runner.run(OverseerTaskProcessor.java:478)
   [junit4]   2> at org.apache.solr.common.util.ExecutorUtil$MDCAwareThreadPoolExecutor.lambda$execute$0(ExecutorUtil.java:209)
   [junit4]   2> at java.util.concurrent.ThreadPoolExecutor.runWorker(ThreadPoolExecutor.java:1149)
   [junit4]   2> at java.util.concurrent.ThreadPoolExecutor$Worker.run(ThreadPoolExecutor.java:624)
   [junit4]   2> at java.lang.Thread.run(Thread.java:748)
   [junit4]   2>
   [junit4]   2> 56538 INFO  (qtp472044690-381) [n:127.0.0.1:47304_solr    ] o.a.s.s.HttpSolrCall [admin] webapp=null path=/admin/collections params={name=testPeersyncFailureReplicationSuccess&action=DELETE&wt=javabin&version=2} status=400 QTime=43
   [junit4]   2> 56543 INFO  (qtp472044690-384) [n:127.0.0.1:47304_solr    ] o.a.s.h.a.CollectionsHandler Invoked Collection Action :create with params pullReplicas=0&name=testRepFactor1LeaderStartup&nrtReplicas=1&action=CREATE&numShards=1&tlogReplicas=0&createNodeSet=127.0.0.1:47304_solr&wt=javabin&version=2 and sendToOCPQueue=true
   [junit4]   2> 56545 INFO  (OverseerThreadFactory-197-thread-3-processing-n:127.0.0.1:47304_solr) [n:127.0.0.1:47304_solr    ] o.a.s.c.a.c.CreateCollectionCmd Create collection testRepFactor1LeaderStartup
   [junit4]   2> 56545 INFO  (OverseerCollectionConfigSetProcessor-72335065039437827-127.0.0.1:47304_solr-n_0000000000) [n:127.0.0.1:47304_solr    ] o.a.s.c.OverseerTaskQueue Response ZK path: /overseer/collection-queue-work/qnr-0000000002 doesn't exist.  Requestor may have disconnected from ZooKeeper
   [junit4]   2> 56547 INFO  (OverseerThreadFactory-197-thread-3-processing-n:127.0.0.1:47304_solr) [n:127.0.0.1:47304_solr    ] o.a.s.c.c.ZkConfigManager Copying zk node /configs/_default/protwords.txt to /configs/testRepFactor1LeaderStartup.AUTOCREATED/protwords.txt
   [junit4]   2> 56552 INFO  (OverseerThreadFactory-197-thread-3-processing-n:127.0.0.1:47304_solr) [n:127.0.0.1:47304_solr    ] o.a.s.c.c.ZkConfigManager Copying zk node /configs/_default/managed-schema to /configs/testRepFactor1LeaderStartup.AUTOCREATED/managed-schema
   [junit4]   2> 56556 INFO  (OverseerThreadFactory-197-thread-3-processing-n:127.0.0.1:47304_solr) [n:127.0.0.1:47304_solr    ] o.a.s.c.c.ZkConfigManager Copying zk node /configs/_default/solrconfig.xml to /configs/testRepFactor1LeaderStartup.AUTOCREATED/solrconfig.xml
   [junit4]   2> 56558 INFO  (OverseerThreadFactory-197-thread-3-processing-n:127.0.0.1:47304_solr) [n:127.0.0.1:47304_solr    ] o.a.s.c.c.ZkConfigManager Copying zk node /configs/_default/synonyms.txt to /configs/testRepFactor1LeaderStartup.AUTOCREATED/synonyms.txt
   [junit4]   2> 56560 INFO  (OverseerThreadFactory-197-thread-3-processing-n:127.0.0.1:47304_solr) [n:127.0.0.1:47304_solr    ] o.a.s.c.c.ZkConfigManager Copying zk node /configs/_default/stopwords.txt to /configs/testRepFactor1LeaderStartup.AUTOCREATED/stopwords.txt
   [junit4]   2> 56561 INFO  (OverseerThreadFactory-197-thread-3-processing-n:127.0.0.1:47304_solr) [n:127.0.0.1:47304_solr    ] o.a.s.c.c.ZkConfigManager Copying zk node /configs/_default/params.json to /configs/testRepFactor1LeaderStartup.AUTOCREATED/params.json
   [junit4]   2> 56564 INFO  (OverseerThreadFactory-197-thread-3-processing-n:127.0.0.1:47304_solr) [n:127.0.0.1:47304_solr    ] o.a.s.c.c.ZkConfigManager Copying zk node /configs/_default/lang/contractions_it.txt to /configs/testRepFactor1LeaderStartup.AUTOCREATED/lang/contractions_it.txt
   [junit4]   2> 56566 INFO  (OverseerThreadFactory-197-thread-3-processing-n:127.0.0.1:47304_solr) [n:127.0.0.1:47304_solr    ] o.a.s.c.c.ZkConfigManager Copying zk node /configs/_default/lang/stopwords_hy.txt to /configs/testRepFactor1LeaderStartup.AUTOCREATED/lang/stopwords_hy.txt
   [junit4]   2> 56568 INFO  (OverseerThreadFactory-197-thread-3-processing-n:127.0.0.1:47304_solr) [n:127.0.0.1:47304_solr    ] o.a.s.c.c.ZkConfigManager Copying zk node /configs/_default/lang/stopwords_no.txt to /configs/testRepFactor1LeaderStartup.AUTOCREATED/lang/stopwords_no.txt
   [junit4]   2> 56569 INFO  (OverseerThreadFactory-197-thread-3-processing-n:127.0.0.1:47304_solr) [n:127.0.0.1:47304_solr    ] o.a.s.c.c.ZkConfigManager Copying zk node /configs/_default/lang/contractions_ca.txt to /configs/testRepFactor1LeaderStartup.AUTOCREATED/lang/contractions_ca.txt
   [junit4]   2> 56575 INFO  (OverseerThreadFactory-197-thread-3-processing-n:127.0.0.1:47304_solr) [n:127.0.0.1:47304_solr    ] o.a.s.c.c.ZkConfigManager Copying zk node /configs/_default/lang/stemdict_nl.txt to /configs/testRepFactor1LeaderStartup.AUTOCREATED/lang/stemdict_nl.txt
   [junit4]   2> 56577 INFO  (OverseerThreadFactory-197-thread-3-processing-n:127.0.0.1:47304_solr) [n:127.0.0.1:47304_solr    ] o.a.s.c.c.ZkConfigManager Copying zk node /configs/_default/lang/stopwords_id.txt to /configs/testRepFactor1LeaderStartup.AUTOCREATED/lang/stopwords_id.txt
   [junit4]   2> 56579 INFO  (OverseerThreadFactory-197-thread-3-processing-n:127.0.0.1:47304_solr) [n:127.0.0.1:47304_solr    ] o.a.s.c.c.ZkConfigManager Copying zk node /configs/_default/lang/stopwords_ga.txt to /configs/testRepFactor1LeaderStartup.AUTOCREATED/lang/stopwords_ga.txt
   [junit4]   2> 56582 INFO  (OverseerThreadFactory-197-thread-3-processing-n:127.0.0.1:47304_solr) [n:127.0.0.1:47304_solr    ] o.a.s.c.c.ZkConfigManager Copying zk node /configs/_default/lang/stopwords_hi.txt to /configs/testRepFactor1LeaderStartup.AUTOCREATED/lang/stopwords_hi.txt
   [junit4]   2> 56585 INFO  (OverseerThreadFactory-197-thread-3-processing-n:127.0.0.1:47304_solr) [n:127.0.0.1:47304_solr    ] o.a.s.c.c.ZkConfigManager Copying zk node /configs/_default/lang/stopwords_da.txt to /configs/testRepFactor1LeaderStartup.AUTOCREATED/lang/stopwords_da.txt
   [junit4]   2> 56588 INFO  (OverseerThreadFactory-197-thread-3-processing-n:127.0.0.1:47304_solr) [n:127.0.0.1:47304_solr    ] o.a.s.c.c.ZkConfigManager Copying zk node /configs/_default/lang/stopwords_ja.txt to /configs/testRepFactor1LeaderStartup.AUTOCREATED/lang/stopwords_ja.txt
   [junit4]   2> 56591 INFO  (OverseerThreadFactory-197-thread-3-processing-n:127.0.0.1:47304_solr) [n:127.0.0.1:47304_solr    ] o.a.s.c.c.ZkConfigManager Copying zk node /configs/_default/lang/stopwords_pt.txt to /configs/testRepFactor1LeaderStartup.AUTOCREATED/lang/stopwords_pt.txt
   [junit4]   2> 56606 INFO  (OverseerThreadFactory-197-thread-3-processing-n:127.0.0.1:47304_solr) [n:127.0.0.1:47304_solr    ] o.a.s.c.c.ZkConfigManager Copying zk node /configs/_default/lang/stopwords_hu.txt to /configs/testRepFactor1LeaderStartup.AUTOCREATED/lang/stopwords_hu.txt
   [junit4]   2> 56612 INFO  (OverseerThreadFactory-197-thread-3-processing-n:127.0.0.1:47304_solr) [n:127.0.0.1:47304_solr    ] o.a.s.c.c.ZkConfigManager Copying zk node /configs/_default/lang/stopwords_el.txt to /configs/testRepFactor1LeaderStartup.AUTOCREATED/lang/stopwords_el.txt
   [junit4]   2> 56615 INFO  (OverseerThreadFactory-197-thread-3-processing-n:127.0.0.1:47304_solr) [n:127.0.0.1:47304_solr    ] o.a.s.c.c.ZkConfigManager Copying zk node /configs/_default/lang/stopwords_ru.txt to /configs/testRepFactor1LeaderStartup.AUTOCREATED/lang/stopwords_ru.txt
   [junit4]   2> 56617 INFO  (OverseerThreadFactory-197-thread-3-processing-n:127.0.0.1:47304_solr) [n:127.0.0.1:47304_solr    ] o.a.s.c.c.ZkConfigManager Copying zk node /configs/_default/lang/stopwords_tr.txt to /configs/testRepFactor1LeaderStartup.AUTOCREATED/lang/stopwords_tr.txt
   [junit4]   2> 56622 INFO  (OverseerThreadFactory-197-thread-3-processing-n:127.0.0.1:47304_solr) [n:127.0.0.1:47304_solr    ] o.a.s.c.c.ZkConfigManager Copying zk node /configs/_default/lang/stopwords_ar.txt to /configs/testRepFactor1LeaderStartup.AUTOCREATED/lang/stopwords_ar.txt
   [junit4]   2> 56625 INFO  (OverseerThreadFactory-197-thread-3-processing-n:127.0.0.1:47304_solr) [n:127.0.0.1:47304_solr    ] o.a.s.c.c.ZkConfigManager Copying zk node /configs/_default/lang/userdict_ja.txt to /configs/testRepFactor1LeaderStartup.AUTOCREATED/lang/userdict_ja.txt
   [junit4]   2> 56627 INFO  (OverseerThreadFactory-197-thread-3-processing-n:127.0.0.1:47304_solr) [n:127.0.0.1:47304_solr    ] o.a.s.c.c.ZkConfigManager Copying zk node /configs/_default/lang/stopwords_it.txt to /configs/testRepFactor1LeaderStartup.AUTOCREATED/lang/stopwords_it.txt
   [junit4]   2> 56629 INFO  (OverseerThreadFactory-197-thread-3-processing-n:127.0.0.1:47304_solr) [n:127.0.0.1:47304_solr    ] o.a.s.c.c.ZkConfigManager Copying zk node /configs/_default/lang/stopwords_eu.txt to /configs/testRepFactor1LeaderStartup.AUTOCREATED/lang/stopwords_eu.txt
   [junit4]   2> 56634 INFO  (OverseerThreadFactory-197-thread-3-processing-n:127.0.0.1:47304_solr) [n:127.0.0.1:47304_solr    ] o.a.s.c.c.ZkConfigManager Copying zk node /configs/_default/lang/stopwords_cz.txt to /configs/testRepFactor1LeaderStartup.AUTOCREATED/lang/stopwords_cz.txt
   [junit4]   2> 56641 INFO  (OverseerThreadFactory-197-thread-3-processing-n:127.0.0.1:47304_solr) [n:127.0.0.1:47304_solr    ] o.a.s.c.c.ZkConfigManager Copying zk node /configs/_default/lang/stoptags_ja.txt to /configs/testRepFactor1LeaderStartup.AUTOCREATED/lang/stoptags_ja.txt
   [junit4]   2> 56647 INFO  (OverseerThreadFactory-197-thread-3-processing-n:127.0.0.1:47304_solr) [n:127.0.0.1:47304_solr    ] o.a.s.c.c.ZkConfigManager Copying zk node /configs/_default/lang/contractions_fr.txt to /configs/testRepFactor1LeaderStartup.AUTOCREATED/lang/contractions_fr.txt
   [junit4]   2> 56649 INFO  (OverseerThreadFactory-197-thread-3-processing-n:127.0.0.1:47304_solr) [n:127.0.0.1:47304_solr    ] o.a.s.c.c.ZkConfigManager Copying zk node /configs/_default/lang/stopwords_fa.txt to /configs/testRepFactor1LeaderStartup.AUTOCREATED/lang/stopwords_fa.txt
   [junit4]   2> 56653 INFO  (OverseerThreadFactory-197-thread-3-processing-n:127.0.0.1:47304_solr) [n:127.0.0.1:47304_solr    ] o.a.s.c.c.ZkConfigManager Copying zk node /configs/_default/lang/stopwords_de.txt to /configs/testRepFactor1LeaderStartup.AUTOCREATED/lang/stopwords_de.txt
   [junit4]   2> 56656 INFO  (OverseerThreadFactory-197-thread-3-processing-n:127.0.0.1:47304_solr) [n:127.0.0.1:47304_solr    ] o.a.s.c.c.ZkConfigManager Copying zk node /configs/_default/lang/contractions_ga.txt to /configs/testRepFactor1LeaderStartup.AUTOCREATED/lang/contractions_ga.txt
   [junit4]   2> 56659 INFO  (OverseerThreadFactory-197-thread-3-processing-n:127.0.0.1:47304_solr) [n:127.0.0.1:47304_solr    ] o.a.s.c.c.ZkConfigManager Copying zk node /configs/_default/lang/stopwords_ca.txt to /configs/testRepFactor1LeaderStartup.AUTOCREATED/lang/stopwords_ca.txt
   [junit4]   2> 56663 INFO  (OverseerThreadFactory-197-thread-3-processing-n:127.0.0.1:47304_solr) [n:127.0.0.1:47304_solr    ] o.a.s.c.c.ZkConfigManager Copying zk node /configs/_default/lang/stopwords_nl.txt to /configs/testRepFactor1LeaderStartup.AUTOCREATED/lang/stopwords_nl.txt
   [junit4]   2> 56665 INFO  (OverseerThreadFactory-197-thread-3-processing-n:127.0.0.1:47304_solr) [n:127.0.0.1:47304_solr    ] o.a.s.c.c.ZkConfigManager Copying zk node /configs/_default/lang/stopwords_bg.txt to /configs/testRepFactor1LeaderStartup.AUTOCREATED/lang/stopwords_bg.txt
   [junit4]   2> 56669 INFO  (OverseerThreadFactory-197-thread-3-processing-n:127.0.0.1:47304_solr) [n:127.0.0.1:47304_solr    ] o.a.s.c.c.ZkConfigManager Copying zk node /configs/_default/lang/stopwords_lv.txt to /configs/testRepFactor1LeaderStartup.AUTOCREATED/lang/stopwords_lv.txt
   [junit4]   2> 56674 INFO  (OverseerThreadFactory-197-thread-3-processing-n:127.0.0.1:47304_solr) [n:127.0.0.1:47304_solr    ] o.a.s.c.c.ZkConfigManager Copying zk node /configs/_default/lang/stopwords_es.txt to /configs/testRepFactor1LeaderStartup.AUTOCREATED/lang/stopwords_es.txt
   [junit4]   2> 56677 INFO  (OverseerThreadFactory-197-thread-3-processing-n:127.0.0.1:47304_solr) [n:127.0.0.1:47304_solr    ] o.a.s.c.c.ZkConfigManager Copying zk node /configs/_default/lang/stopwords_en.txt to /configs/testRepFactor1LeaderStartup.AUTOCREATED/lang/stopwords_en.txt
   [junit4]   2> 56680 INFO  (OverseerThreadFactory-197-thread-3-processing-n:127.0.0.1:47304_solr) [n:127.0.0.1:47304_solr    ] o.a.s.c.c.ZkConfigManager Copying zk node /configs/_default/lang/stopwords_ro.txt to /configs/testRepFactor1LeaderStartup.AUTOCREATED/lang/stopwords_ro.txt
   [junit4]   2> 56685 INFO  (OverseerThreadFactory-197-thread-3-processing-n:127.0.0.1:47304_solr) [n:127.0.0.1:47304_solr    ] o.a.s.c.c.ZkConfigManager Copying zk node /configs/_default/lang/stopwords_th.txt to /configs/testRepFactor1LeaderStartup.AUTOCREATED/lang/stopwords_th.txt
   [junit4]   2> 56688 INFO  (OverseerThreadFactory-197-thread-3-processing-n:127.0.0.1:47304_solr) [n:127.0.0.1:47304_solr    ] o.a.s.c.c.ZkConfigManager Copying zk node /configs/_default/lang/stopwords_fr.txt to /configs/testRepFactor1LeaderStartup.AUTOCREATED/lang/stopwords_fr.txt
   [junit4]   2> 56695 INFO  (OverseerThreadFactory-197-thread-3-processing-n:127.0.0.1:47304_solr) [n:127.0.0.1:47304_solr    ] o.a.s.c.c.ZkConfigManager Copying zk node /configs/_default/lang/stopwords_sv.txt to /configs/testRepFactor1LeaderStartup.AUTOCREATED/lang/stopwords_sv.txt
   [junit4]   2> 56698 INFO  (OverseerThreadFactory-197-thread-3-processing-n:127.0.0.1:47304_solr) [n:127.0.0.1:47304_solr    ] o.a.s.c.c.ZkConfigManager Copying zk node /configs/_default/lang/stopwords_fi.txt to /configs/testRepFactor1LeaderStartup.AUTOCREATED/lang/stopwords_fi.txt
   [junit4]   2> 56702 INFO  (OverseerThreadFactory-197-thread-3-processing-n:127.0.0.1:47304_solr) [n:127.0.0.1:47304_solr    ] o.a.s.c.c.ZkConfigManager Copying zk node /configs/_default/lang/hyphenations_ga.txt to /configs/testRepFactor1LeaderStartup.AUTOCREATED/lang/hyphenations_ga.txt
   [junit4]   2> 56704 INFO  (OverseerThreadFactory-197-thread-3-processing-n:127.0.0.1:47304_solr) [n:127.0.0.1:47304_solr    ] o.a.s.c.c.ZkConfigManager Copying zk node /configs/_default/lang/stopwords_gl.txt to /configs/testRepFactor1LeaderStartup.AUTOCREATED/lang/stopwords_gl.txt
   [junit4]   2> 56828 INFO  (OverseerStateUpdate-72335065039437827-127.0.0.1:47304_solr-n_0000000000) [n:127.0.0.1:47304_solr    ] o.a.s.c.o.SliceMutator createReplica() {
   [junit4]   2>   "operation":"ADDREPLICA",
   [junit4]   2>   "collection":"testRepFactor1LeaderStartup",
   [junit4]   2>   "shard":"shard1",
   [junit4]   2>   "core":"testRepFactor1LeaderStartup_shard1_replica_n1",
   [junit4]   2>   "state":"down",
   [junit4]   2>   "base_url":"http://127.0.0.1:47304/solr",
   [junit4]   2>   "type":"NRT",
   [junit4]   2>   "waitForFinalState":"false"}
   [junit4]   2> 57032 INFO  (qtp472044690-385) [n:127.0.0.1:47304_solr    x:testRepFactor1LeaderStartup_shard1_replica_n1] o.a.s.h.a.CoreAdminOperation core create command qt=/admin/cores&coreNodeName=core_node2&collection.configName=testRepFactor1LeaderStartup.AUTOCREATED&newCollection=true&name=testRepFactor1LeaderStartup_shard1_replica_n1&action=CREATE&numShards=1&collection=testRepFactor1LeaderStartup&shard=shard1&wt=javabin&version=2&replicaType=NRT
   [junit4]   2> 57033 INFO  (qtp472044690-385) [n:127.0.0.1:47304_solr    x:testRepFactor1LeaderStartup_shard1_replica_n1] o.a.s.c.TransientSolrCoreCacheDefault Allocating transient cache for 2147483647 transient cores
   [junit4]   2> 58186 INFO  (qtp472044690-385) [n:127.0.0.1:47304_solr c:testRepFactor1LeaderStartup s:shard1 r:core_node2 x:testRepFactor1LeaderStartup_shard1_replica_n1] o.a.s.c.RequestParams conf resource params.json loaded . version : 0
   [junit4]   2> 58188 INFO  (qtp472044690-385) [n:127.0.0.1:47304_solr c:testRepFactor1LeaderStartup s:shard1 r:core_node2 x:testRepFactor1LeaderStartup_shard1_replica_n1] o.a.s.c.RequestParams request params refreshed to version 0
   [junit4]   2> 58190 WARN  (qtp472044690-385) [n:127.0.0.1:47304_solr c:testRepFactor1LeaderStartup s:shard1 r:core_node2 x:testRepFactor1LeaderStartup_shard1_replica_n1] o.a.s.c.SolrConfig Couldn't add files from /export/home/jenkins/workspace/Lucene-Solr-7.x-Solaris/solr/build/solr-core/test/J1/temp/solr.cloud.TestCloudSearcherWarming_E802AC554978EB6E-001/tempDir-001/node1/testRepFactor1LeaderStartup_shard1_replica_n1/../../../../contrib/extraction/lib filtered by .*\.jar to classpath: /export/home/jenkins/workspace/Lucene-Solr-7.x-Solaris/solr/build/solr-core/test/J1/temp/solr.cloud.TestCloudSearcherWarming_E802AC554978EB6E-001/tempDir-001/node1/testRepFactor1LeaderStartup_shard1_replica_n1/../../../../contrib/extraction/lib
   [junit4]   2> 58190 WARN  (qtp472044690-385) [n:127.0.0.1:47304_solr c:testRepFactor1LeaderStartup s:shard1 r:core_node2 x:testRepFactor1LeaderStartup_shard1_replica_n1] o.a.s.c.SolrConfig Couldn't add files from /export/home/jenkins/workspace/Lucene-Solr-7.x-Solaris/solr/build/solr-core/test/J1/temp/solr.cloud.TestCloudSearcherWarming_E802AC554978EB6E-001/tempDir-001/node1/testRepFactor1LeaderStartup_shard1_replica_n1/../../../../dist filtered by solr-cell-\d.*\.jar to classpath: /export/home/jenkins/workspace/Lucene-Solr-7.x-Solaris/solr/build/solr-core/test/J1/temp/solr.cloud.TestCloudSearcherWarming_E802AC554978EB6E-001/tempDir-001/node1/testRepFactor1LeaderStartup_shard1_replica_n1/../../../../dist
   [junit4]   2> 58191 WARN  (qtp472044690-385) [n:127.0.0.1:47304_solr c:testRepFactor1LeaderStartup s:shard1 r:core_node2 x:testRepFactor1LeaderStartup_shard1_replica_n1] o.a.s.c.SolrConfig Couldn't add files from /export/home/jenkins/workspace/Lucene-Solr-7.x-Solaris/solr/build/solr-core/test/J1/temp/solr.cloud.TestCloudSearcherWarming_E802AC554978EB6E-001/tempDir-001/node1/testRepFactor1LeaderStartup_shard1_replica_n1/../../../../contrib/clustering/lib filtered by .*\.jar to classpath: /export/home/jenkins/workspace/Lucene-Solr-7.x-Solaris/solr/build/solr-core/test/J1/temp/solr.cloud.TestCloudSearcherWarming_E802AC554978EB6E-001/tempDir-001/node1/testRepFactor1LeaderStartup_shard1_replica_n1/../../../../contrib/clustering/lib
   [junit4]   2> 58191 WARN  (qtp472044690-385) [n:127.0.0.1:47304_solr c:testRepFactor1LeaderStartup s:shard1 r:core_node2 x:testRepFactor1LeaderStartup_shard1_replica_n1] o.a.s.c.SolrConfig Couldn't add files from /export/home/jenkins/workspace/Lucene-Solr-7.x-Solaris/solr/build/solr-core/test/J1/temp/solr.cloud.TestCloudSearcherWarming_E802AC554978EB6E-001/tempDir-001/node1/testRepFactor1LeaderStartup_shard1_replica_n1/../../../../dist filtered by solr-clustering-\d.*\.jar to classpath: /export/home/jenkins/workspace/Lucene-Solr-7.x-Solaris/solr/build/solr-core/test/J1/temp/solr.cloud.TestCloudSearcherWarming_E802AC554978EB6E-001/tempDir-001/node1/testRepFactor1LeaderStartup_shard1_replica_n1/../../../../dist
   [junit4]   2> 58191 WARN  (qtp472044690-385) [n:127.0.0.1:47304_solr c:testRepFactor1LeaderStartup s:shard1 r:core_node2 x:testRepFactor1LeaderStartup_shard1_replica_n1] o.a.s.c.SolrConfig Couldn't add files from /export/home/jenkins/workspace/Lucene-Solr-7.x-Solaris/solr/build/solr-core/test/J1/temp/solr.cloud.TestCloudSearcherWarming_E802AC554978EB6E-001/tempDir-001/node1/testRepFactor1LeaderStartup_shard1_replica_n1/../../../../contrib/langid/lib filtered by .*\.jar to classpath: /export/home/jenkins/workspace/Lucene-Solr-7.x-Solaris/solr/build/solr-core/test/J1/temp/solr.cloud.TestCloudSearcherWarming_E802AC554978EB6E-001/tempDir-001/node1/testRepFactor1LeaderStartup_shard1_replica_n1/../../../../contrib/langid/lib
   [junit4]   2> 58191 WARN  (qtp472044690-385) [n:127.0.0.1:47304_solr c:testRepFactor1LeaderStartup s:shard1 r:core_node2 x:testRepFactor1LeaderStartup_shard1_replica_n1] o.a.s.c.SolrConfig Couldn't add files from /export/home/jenkins/workspace/Lucene-Solr-7.x-Solaris/solr/build/solr-core/test/J1/temp/solr.cloud.TestCloudSearcherWarming_E802AC554978EB6E-001/tempDir-001/node1/testRepFactor1LeaderStartup_shard1_replica_n1/../../../../dist filtered by solr-langid-\d.*\.jar to classpath: /export/home/jenkins/workspace/Lucene-Solr-7.x-Solaris/solr/build/solr-core/test/J1/temp/solr.cloud.TestCloudSearcherWarming_E802AC554978EB6E-001/tempDir-001/node1/testRepFactor1LeaderStartup_shard1_replica_n1/../../../../dist
   [junit4]   2> 58192 WARN  (qtp472044690-385) [n:127.0.0.1:47304_solr c:testRepFactor1LeaderStartup s:shard1 r:core_node2 x:testRepFactor1LeaderStartup_shard1_replica_n1] o.a.s.c.SolrConfig Couldn't add files from /export/home/jenkins/workspace/Lucene-Solr-7.x-Solaris/solr/build/solr-core/test/J1/temp/solr.cloud.TestCloudSearcherWarming_E802AC554978EB6E-001/tempDir-001/node1/testRepFactor1LeaderStartup_shard1_replica_n1/../../../../contrib/velocity/lib filtered by .*\.jar to classpath: /export/home/jenkins/workspace/Lucene-Solr-7.x-Solaris/solr/build/solr-core/test/J1/temp/solr.cloud.TestCloudSearcherWarming_E802AC554978EB6E-001/tempDir-001/node1/testRepFactor1LeaderStartup_shard1_replica_n1/../../../../contrib/velocity/lib
   [junit4]   2> 58192 WARN  (qtp472044690-385) [n:127.0.0.1:47304_solr c:testRepFactor1LeaderStartup s:shard1 r:core_node2 x:testRepFactor1LeaderStartup_shard1_replica_n1] o.a.s.c.SolrConfig Couldn't add files from /export/home/jenkins/workspace/Lucene-Solr-7.x-Solaris/solr/build/solr-core/test/J1/temp/solr.cloud.TestCloudSearcherWarming_E802AC554978EB6E-001/tempDir-001/node1/testRepFactor1LeaderStartup_shard1_replica_n1/../../../../dist filtered by solr-velocity-\d.*\.jar to classpath: /export/home/jenkins/workspace/Lucene-Solr-7.x-Solaris/solr/build/solr-core/test/J1/temp/solr.cloud.TestCloudSearcherWarming_E802AC554978EB6E-001/tempDir-001/node1/testRepFactor1LeaderStartup_shard1_replica_n1/../../../../dist
   [junit4]   2> 58201 INFO  (qtp472044690-385) [n:127.0.0.1:47304_solr c:testRepFactor1LeaderStartup s:shard1 r:core_node2 x:testRepFactor1LeaderStartup_shard1_replica_n1] o.a.s.c.SolrConfig Using Lucene MatchVersion: 7.6.0
   [junit4]   2> 58297 INFO  (qtp472044690-385) [n:127.0.0.1:47304_solr c:testRepFactor1LeaderStartup s:shard1 r:core_node2 x:testRepFactor1LeaderStartup_shard1_replica_n1] o.a.s.s.IndexSchema [testRepFactor1LeaderStartup_shard1_replica_n1] Schema name=default-config
   [junit4]   2> 58803 INFO  (qtp472044690-385) [n:127.0.0.1:47304_solr c:testRepFactor1LeaderStartup s:shard1 r:core_node2 x:testRepFactor1LeaderStartup_shard1_replica_n1] o.a.s.s.IndexSchema Loaded schema default-config/1.6 with uniqueid field id
   [junit4]   2> 58890 INFO  (qtp472044690-385) [n:127.0.0.1:47304_solr c:testRepFactor1LeaderStartup s:shard1 r:core_node2 x:testRepFactor1LeaderStartup_shard1_replica_n1] o.a.s.c.CoreContainer Creating SolrCore 'testRepFactor1LeaderStartup_shard1_replica_n1' using configuration from collection testRepFactor1LeaderStartup, trusted=true
   [junit4]   2> 58893 INFO  (qtp472044690-385) [n:127.0.0.1:47304_solr c:testRepFactor1LeaderStartup s:shard1 r:core_node2 x:testRepFactor1LeaderStartup_shard1_replica_n1] o.a.s.m.r.SolrJmxReporter JMX monitoring for 'solr_47304.solr.core.testRepFactor1LeaderStartup.shard1.replica_n1' (registry 'solr.core.testRepFactor1LeaderStartup.shard1.replica_n1') enabled at server: com.sun.jmx.mbeanserver.JmxMBeanServer@2b608828
   [junit4]   2> 58915 INFO  (qtp472044690-385) [n:127.0.0.1:47304_solr c:testRepFactor1LeaderStartup s:shard1 r:core_node2 x:testRepFactor1LeaderStartup_shard1_replica_n1] o.a.s.c.SolrCore [[testRepFactor1LeaderStartup_shard1_replica_n1] ] Opening new SolrCore at [/export/home/jenkins/workspace/Lucene-Solr-7.x-Solaris/solr/build/solr-core/test/J1/temp/solr.cloud.TestCloudSearcherWarming_E802AC554978EB6E-001/tempDir-001/node1/testRepFactor1LeaderStartup_shard1_replica_n1], dataDir=[/export/home/jenkins/workspace/Lucene-Solr-7.x-Solaris/solr/build/solr-core/test/J1/temp/solr.cloud.TestCloudSearcherWarming_E802AC554978EB6E-001/tempDir-001/node1/./testRepFactor1LeaderStartup_shard1_replica_n1/data/]
   [junit4]   2> 59100 INFO  (qtp472044690-385) [n:127.0.0.1:47304_solr c:testRepFactor1LeaderStartup s:shard1 r:core_node2 x:testRepFactor1LeaderStartup_shard1_replica_n1] o.a.s.r.XSLTResponseWriter xsltCacheLifetimeSeconds=5
   [junit4]   2> 59446 INFO  (qtp472044690-385) [n:127.0.0.1:47304_solr c:testRepFactor1LeaderStartup s:shard1 r:core_node2 x:testRepFactor1LeaderStartup_shard1_replica_n1] o.a.s.u.UpdateHandler Using UpdateLog implementation: org.apache.solr.update.UpdateLog
   [junit4]   2> 59446 INFO  (qtp472044690-385) [n:127.0.0.1:47304_solr c:testRepFactor1LeaderStartup s:shard1 r:core_node2 x:testRepFactor1LeaderStartup_shard1_replica_n1] o.a.s.u.UpdateLog Initializing UpdateLog: dataDir= defaultSyncLevel=FLUSH numRecordsToKeep=100 maxNumLogsToKeep=10 numVersionBuckets=65536
   [junit4]   2> 59447 INFO  (qtp472044690-385) [n:127.0.0.1:47304_solr c:testRepFactor1LeaderStartup s:shard1 r:core_node2 x:testRepFactor1LeaderStartup_shard1_replica_n1] o.a.s.u.CommitTracker Hard AutoCommit: if uncommitted for 15000ms;
   [junit4]   2> 59447 INFO  (qtp472044690-385) [n:127.0.0.1:47304_solr c:testRepFactor1LeaderStartup s:shard1 r:core_node2 x:testRepFactor1LeaderStartup_shard1_replica_n1] o.a.s.u.CommitTracker Soft AutoCommit: disabled
   [junit4]   2> 59450 INFO  (qtp472044690-385) [n:127.0.0.1:47304_solr c:testRepFactor1LeaderStartup s:shard1 r:core_node2 x:testRepFactor1LeaderStartup_shard1_replica_n1] o.a.s.s.SolrIndexSearcher Opening [Searcher@61b89c3[testRepFactor1LeaderStartup_shard1_replica_n1] main]
   [junit4]   2> 59454 INFO  (qtp472044690-385) [n:127.0.0.1:47304_solr c:testRepFactor1LeaderStartup s:shard1 r:core_node2 x:testRepFactor1LeaderStartup_shard1_replica_n1] o.a.s.r.ManagedResourceStorage Configured ZooKeeperStorageIO with znodeBase: /configs/testRepFactor1LeaderStartup.AUTOCREATED
   [junit4]   2> 59455 INFO  (qtp472044690-385) [n:127.0.0.1:47304_solr c:testRepFactor1LeaderStartup s:shard1 r:core_node2 x:testRepFactor1LeaderStartup_shard1_replica_n1] o.a.s.r.ManagedResourceStorage Loaded null at path _rest_managed.json using ZooKeeperStorageIO:path=/configs/testRepFactor1LeaderStartup.AUTOCREATED
   [junit4]   2> 59467 INFO  (qtp472044690-385) [n:127.0.0.1:47304_solr c:testRepFactor1LeaderStartup s:shard1 r:core_node2 x:testRepFactor1LeaderStartup_shard1_replica_n1] o.a.s.s.ZkIndexSchemaReader Creating ZooKeeper watch for the managed schema at /configs/testRepFactor1LeaderStartup.AUTOCREATED/managed-schema
   [junit4]   2> 59471 INFO  (qtp472044690-385) [n:127.0.0.1:47304_solr c:testRepFactor1LeaderStartup s:shard1 r:core_node2 x:testRepFactor1LeaderStartup_shard1_replica_n1] o.a.s.s.ZkIndexSchemaReader Current schema version 0 is already the latest
   [junit4]   2> 59473 INFO  (qtp472044690-385) [n:127.0.0.1:47304_solr c:testRepFactor1LeaderStartup s:shard1 r:core_node2 x:testRepFactor1LeaderStartup_shard1_replica_n1] o.a.s.h.c.SpellCheckComponent Initializing spell checkers
   [junit4]   2> 59485 INFO  (qtp472044690-385) [n:127.0.0.1:47304_solr c:testRepFactor1LeaderStartup s:shard1 r:core_node2 x:testRepFactor1LeaderStartup_shard1_replica_n1] o.a.s.s.DirectSolrSpellChecker init: {name=default,field=_text_,classname=solr.DirectSolrSpellChecker,distanceMeasure=internal,accuracy=0.5,maxEdits=2,minPrefix=1,maxInspections=5,minQueryLength=4,maxQueryFrequency=0.01}
   [junit4]   2> 59503 INFO  (qtp472044690-385) [n:127.0.0.1:47304_solr c:testRepFactor1LeaderStartup s:shard1 r:core_node2 x:testRepFactor1LeaderStartup_shard1_replica_n1] o.a.s.h.ReplicationHandler Commits will be reserved for 10000ms.
   [junit4]   2> 59504 INFO  (qtp472044690-385) [n:127.0.0.1:47304_solr c:testRepFactor1LeaderStartup s:shard1 r:core_node2 x:testRepFactor1LeaderStartup_shard1_replica_n1] o.a.s.u.UpdateLog Could not find max version in index or recent updates, using new clock 1611588911142797312
   [junit4]   2> 59507 INFO  (searcherExecutor-202-thread-1-processing-n:127.0.0.1:47304_solr x:testRepFactor1LeaderStartup_shard1_replica_n1 c:testRepFactor1LeaderStartup s:shard1 r:core_node2) [n:127.0.0.1:47304_solr c:testRepFactor1LeaderStartup s:shard1 r:core_node2 x:testRepFactor1LeaderStartup_shard1_replica_n1] o.a.s.c.QuerySenderListener QuerySenderListener sending requests to Searcher@61b89c3[testRepFactor1LeaderStartup_shard1_replica_n1] main{ExitableDirectoryReader(UninvertingDirectoryReader())}
   [junit4]   2> 59508 INFO  (searcherExecutor-202-thread-1-processing-n:127.0.0.1:47304_solr x:testRepFactor1LeaderStartup_shard1_replica_n1 c:testRepFactor1LeaderStartup s:shard1 r:core_node2) [n:127.0.0.1:47304_solr c:testRepFactor1LeaderStartup s:shard1 r:core_node2 x:testRepFactor1LeaderStartup_shard1_replica_n1] o.a.s.c.QuerySenderListener QuerySenderListener done.
   [junit4]   2> 59508 INFO  (searcherExecutor-202-thread-1-processing-n:127.0.0.1:47304_solr x:testRepFactor1LeaderStartup_shard1_replica_n1 c:testRepFactor1LeaderStartup s:shard1 r:core_node2) [n:127.0.0.1:47304_solr c:testRepFactor1LeaderStartup s:shard1 r:core_node2 x:testRepFactor1LeaderStartup_shard1_replica_n1] o.a.s.h.c.SpellCheckComponent Loading spell index for spellchecker: default
   [junit4]   2> 59511 INFO  (searcherExecutor-202-thread-1-processing-n:127.0.0.1:47304_solr x:testRepFactor1LeaderStartup_shard1_replica_n1 c:testRepFactor1LeaderStartup s:shard1 r:core_node2) [n:127.0.0.1:47304_solr c:testRepFactor1LeaderStartup s:shard1 r:core_node2 x:testRepFactor1LeaderStartup_shard1_replica_n1] o.a.s.c.SolrCore [testRepFactor1LeaderStartup_shard1_replica_n1] Registered new searcher Searcher@61b89c3[testRepFactor1LeaderStartup_shard1_replica_n1] main{ExitableDirectoryReader(UninvertingDirectoryReader())}
   [junit4]   2> 59521 INFO  (qtp472044690-385) [n:127.0.0.1:47304_solr c:testRepFactor1LeaderStartup s:shard1 r:core_node2 x:testRepFactor1LeaderStartup_shard1_replica_n1] o.a.s.c.ZkShardTerms Successful update of terms at /collections/testRepFactor1LeaderStartup/terms/shard1 to Terms{values={core_node2=0}, version=0}
   [junit4]   2> 59528 INFO  (qtp472044690-385) [n:127.0.0.1:47304_solr c:testRepFactor1LeaderStartup s:shard1 r:core_node2 x:testRepFactor1LeaderStartup_shard1_replica_n1] o.a.s.c.ShardLeaderElectionContext Enough replicas found to continue.
   [junit4]   2> 59528 INFO  (qtp472044690-385) [n:127.0.0.1:47304_solr c:testRepFactor1LeaderStartup s:shard1 r:core_node2 x:testRepFactor1LeaderStartup_shard1_replica_n1] o.a.s.c.ShardLeaderElectionContext I may be the new leader - try and sync
   [junit4]   2> 59528 INFO  (qtp472044690-385) [n:127.0.0.1:47304_solr c:testRepFactor1LeaderStartup s:shard1 r:core_node2 x:testRepFactor1LeaderStartup_shard1_replica_n1] o.a.s.c.SyncStrategy Sync replicas to http://127.0.0.1:47304/solr/testRepFactor1LeaderStartup_shard1_replica_n1/
   [junit4]   2> 59528 INFO  (qtp472044690-385) [n:127.0.0.1:47304_solr c:testRepFactor1LeaderStartup s:shard1 r:core_node2 x:testRepFactor1LeaderStartup_shard1_replica_n1] o.a.s.c.SyncStrategy Sync Success - now sync replicas to me
   [junit4]   2> 59529 INFO  (qtp472044690-385) [n:127.0.0.1:47304_solr c:testRepFactor1LeaderStartup s:shard1 r:core_node2 x:testRepFactor1LeaderStartup_shard1_replica_n1] o.a.s.c.SyncStrategy http://127.0.0.1:47304/solr/testRepFactor1LeaderStartup_shard1_replica_n1/ has no replicas
   [junit4]   2> 59529 INFO  (qtp472044690-385) [n:127.0.0.1:47304_solr c:testRepFactor1LeaderStartup s:shard1 r:core_node2 x:testRepFactor1LeaderStartup_shard1_replica_n1] o.a.s.c.ShardLeaderElectionContext Found all replicas participating in election, clear LIR
   [junit4]   2> 59539 INFO  (qtp472044690-385) [n:127.0.0.1:47304_solr c:testRepFactor1LeaderStartup s:shard1 r:core_node2 x:testRepFactor1LeaderStartup_shard1_replica_n1] o.a.s.c.ShardLeaderElectionContext I am the new leader: http://127.0.0.1:47304/solr/testRepFactor1LeaderStartup_shard1_replica_n1/ shard1
   [junit4]   2> 59543 INFO  (qtp472044690-385) [n:127.0.0.1:47304_solr c:testRepFactor1LeaderStartup s:shard1 r:core_node2 x:testRepFactor1LeaderStartup_shard1_replica_n1] o.a.s.c.ZkController I am the leader, no recovery necessary
   [junit4]   2> 59560 INFO  (qtp472044690-385) [n:127.0.0.1:47304_solr c:testRepFactor1LeaderStartup s:shard1 r:core_node2 x:testRepFactor1LeaderStartup_shard1_replica_n1] o.a.s.s.HttpSolrCall [admin] webapp=null path=/admin/cores params={qt=/admin/cores&coreNodeName=core_node2&collection.configName=testRepFactor1LeaderStartup.AUTOCREATED&newCollection=true&name=testRepFactor1LeaderStartup_shard1_replica_n1&action=CREATE&numShards=1&collection=testRepFactor1LeaderStartup&shard=shard1&wt=javabin&version=2&replicaType=NRT} status=0 QTime=2529
   [junit4]   2> 59566 INFO  (qtp472044690-384) [n:127.0.0.1:47304_solr    ] o.a.s.h.a.CollectionsHandler Wait for new collection to be active for at most 30 seconds. Check all shard replicas
   [junit4]   2> 59647 INFO  (zkCallback-122-thread-2) [    ] o.a.s.c.c.ZkStateReader A cluster state change: [WatchedEvent state:SyncConnected type:NodeDataChanged path:/collections/testRepFactor1LeaderStartup/state.json] for collection [testRepFactor1LeaderStartup] has occurred - updating... (live nodes size: [1])
   [junit4]   2> 60550 INFO  (OverseerCollectionConfigSetProcessor-72335065039437827-127.0.0.1:47304_solr-n_0000000000) [n:127.0.0.1:47304_solr    ] o.a.s.c.OverseerTaskQueue Response ZK path: /overseer/collection-queue-work/qnr-0000000004 doesn't exist.  Requestor may have disconnected from ZooKeeper
   [junit4]   2> 60567 INFO  (qtp472044690-384) [n:127.0.0.1:47304_solr    ] o.a.s.s.HttpSolrCall [admin] webapp=null path=/admin/collections params={pullReplicas=0&name=testRepFactor1LeaderStartup&nrtReplicas=1&action=CREATE&numShards=1&tlogReplicas=0&createNodeSet=127.0.0.1:47304_solr&wt=javabin&version=2} status=0 QTime=4025
   [junit4]   2> java.lang.RuntimeException
   [junit4]   2> at org.apache.solr.cloud.TestCloudSearcherWarming$SleepingSolrEventListener.init(TestCloudSearcherWarming.java:294)
   [junit4]   2> at org.apache.solr.core.SolrCore.createInitInstance(SolrCore.java:852)
   [junit4]   2> at org.apache.solr.handler.SolrConfigHandler$Command.verifyClass(SolrConfigHandler.java:558)
   [junit4]   2> at org.apache.solr.handler.SolrConfigHandler$Command.updateNamedPlugin(SolrConfigHandler.java:529)
   [junit4]   2> at org.apache.solr.handler.SolrConfigHandler$Command.handleCommands(SolrConfigHandler.java:480)
   [junit4]   2> at org.apache.solr.handler.SolrConfigHandler$Command.handlePOST(SolrConfigHandler.java:345)
   [junit4]   2> at org.apache.solr.handler.SolrConfigHandler$Command.access$100(SolrConfigHandler.java:158)
   [junit4]   2> at org.apache.solr.handler.SolrConfigHandler.handleRequestBody(SolrConfigHandler.java:136)
   [junit4]   2> at org.apache.solr.handler.RequestHandlerBase.handleRequest(RequestHandlerBase.java:199)
   [junit4]   2> at org.apache.solr.core.SolrCore.execute(SolrCore.java:2541)
   [junit4]   2> at org.apache.solr.servlet.HttpSolrCall.execute(HttpSolrCall.java:709)
   [junit4]   2> at org.apache.solr.servlet.HttpSolrCall.call(HttpSolrCall.java:515)
   [junit4]   2> at org.apache.solr.servlet.SolrDispatchFilter.doFilter(SolrDispatchFilter.java:377)
   [junit4]   2> at org.apache.solr.servlet.SolrDispatchFilter.doFilter(SolrDispatchFilter.java:323)
   [junit4]   2> at org.eclipse.jetty.servlet.ServletHandler$CachedChain.doFilter(ServletHandler.java:1642)
   [junit4]   2> at org.apache.solr.client.solrj.embedded.JettySolrRunner$DebugFilter.doFilter(JettySolrRunner.java:139)
   [junit4]   2> at org.eclipse.jetty.servlet.ServletHandler$CachedChain.doFilter(ServletHandler.java:1642)
   [junit4]   2> at org.eclipse.jetty.servlet.ServletHandler.doHandle(ServletHandler.java:533)
   [junit4]   2> at org.eclipse.jetty.server.handler.ScopedHandler.nextHandle(ScopedHandler.java:255)
   [junit4]   2> at org.eclipse.jetty.server.session.SessionHandler.doHandle(SessionHandler.java:1595)
   [junit4]   2> at org.eclipse.jetty.server.handler.ScopedHandler.nextHandle(ScopedHandler.java:255)
   [junit4]   2> at org.eclipse.jetty.server.handler.ContextHandler.doHandle(ContextHandler.java:1317)
   [junit4]   2> at org.eclipse.jetty.server.handler.ScopedHandler.nextScope(ScopedHandler.java:203)
   [junit4]   2> at org.eclipse.jetty.servlet.ServletHandler.doScope(ServletHandler.java:473)
   [junit4]   2> at org.eclipse.jetty.server.session.SessionHandler.doScope(SessionHandler.java:1564)
   [junit4]   2> at org.eclipse.jetty.server.handler.ScopedHandler.nextScope(ScopedHandler.java:201)
   [junit4]   2> at org.eclipse.jetty.server.handler.ContextHandler.doScope(ContextHandler.java:1219)
   [junit4]   2> at org.eclipse.jetty.server.handler.ScopedHandler.handle(ScopedHandler.java:144)
   [junit4]   2> at org.eclipse.jetty.server.handler.gzip.GzipHandler.handle(GzipHandler.java:674)
   [junit4]   2> at org.eclipse.jetty.server.handler.HandlerWrapper.handle(HandlerWrapper.java:132)
   [junit4]   2> at org.eclipse.jetty.server.Server.handle(Server.java:531)
   [junit4]   2> at org.eclipse.jetty.server.HttpChannel.handle(HttpChannel.java:352)
   [junit4]   2> at org.eclipse.jetty.server.HttpConnection.onFillable(HttpConnection.java:260)
   [junit4]   2> at org.eclipse.jetty.io.AbstractConnection$ReadCallback.succeeded(AbstractConnection.java:281)
   [junit4]   2> at org.eclipse.jetty.io.FillInterest.fillable(FillInterest.java:102)
   [junit4]   2> at org.eclipse.jetty.io.ChannelEndPoint$2.run(ChannelEndPoint.java:118)
   [junit4]   2> at org.eclipse.jetty.util.thread.strategy.EatWhatYouKill.runTask(EatWhatYouKill.java:333)
   [junit4]   2> at org.eclipse.jetty.util.thread.strategy.EatWhatYouKill.doProduce(EatWhatYouKill.java:310)
   [junit4]   2> at org.eclipse.jetty.util.thread.strategy.EatWhatYouKill.tryProduce(EatWhatYouKill.java:168)
   [junit4]   2> at org.eclipse.jetty.util.thread.strategy.EatWhatYouKill.run(EatWhatYouKill.java:126)
   [junit4]   2> at org.eclipse.jetty.util.thread.ReservedThreadExecutor$ReservedThread.run(ReservedThreadExecutor.java:366)
   [junit4]   2> at org.eclipse.jetty.util.thread.QueuedThreadPool.runJob(QueuedThreadPool.java:762)
   [junit4]   2> at org.eclipse.jetty.util.thread.QueuedThreadPool$2.run(QueuedThreadPool.java:680)
   [junit4]   2> at java.lang.Thread.run(Thread.java:748)
   [junit4]   1> {event=newSearcher}
   [junit4]   2> java.lang.RuntimeException
   [junit4]   2> at org.apache.solr.cloud.TestCloudSearcherWarming$SleepingSolrEventListener.init(TestCloudSearcherWarming.java:294)
   [junit4]   2> at org.apache.solr.core.SolrCore.createInitInstance(SolrCore.java:852)
   [junit4]   2> at org.apache.solr.handler.SolrConfigHandler$Command.verifyClass(SolrConfigHandler.java:558)
   [junit4]   2> at org.apache.solr.handler.SolrConfigHandler$Command.updateNamedPlugin(SolrConfigHandler.java:529)
   [junit4]   2> at org.apache.solr.handler.SolrConfigHandler$Command.handleCommands(SolrConfigHandler.java:480)
   [junit4]   2> at org.apache.solr.handler.SolrConfigHandler$Command.handlePOST(SolrConfigHandler.java:345)
   [junit4]   2> at org.apache.solr.handler.SolrConfigHandler$Command.access$100(SolrConfigHandler.java:158)
   [junit4]   2> at org.apache.solr.handler.SolrConfigHandler.handleRequestBody(SolrConfigHandler.java:136)
   [junit4]   2> at org.apache.solr.handler.RequestHandlerBase.handleRequest(RequestHandlerBase.java:199)
   [junit4]   2> at org.apache.solr.core.SolrCore.execute(SolrCore.java:2541)
   [junit4]   2> at org.apache.solr.servlet.HttpSolrCall.execute(HttpSolrCall.java:709)
   [junit4]   2> at org.apache.solr.servlet.HttpSolrCall.call(HttpSolrCall.java:515)
   [junit4]   2> at org.apache.solr.servlet.SolrDispatchFilter.doFilter(SolrDispatchFilter.java:377)
   [junit4]   2> at org.apache.solr.servlet.SolrDispatchFilter.doFilter(SolrDispatchFilter.java:323)
   [junit4]   2> at org.eclipse.jetty.servlet.ServletHandler$CachedChain.doFilter(ServletHandler.java:1642)
   [junit4]   2> at org.apache.solr.client.solrj.embedded.JettySolrRunner$DebugFilter.doFilter(JettySolrRunner.java:139)
   [junit4]   2> at org.eclipse.jetty.servlet.ServletHandler$CachedChain.doFilter(ServletHandler.java:1642)
   [junit4]   2> at org.eclipse.jetty.servlet.ServletHandler.doHandle(ServletHandler.java:533)
   [junit4]   2> at org.eclipse.jetty.server.handler.ScopedHandler.nextHandle(ScopedHandler.java:255)
   [junit4]   2> at org.eclipse.jetty.server.session.SessionHandler.doHandle(SessionHandler.java:1595)
   [junit4]   2> at org.eclipse.jetty.server.handler.ScopedHandler.nextHandle(ScopedHandler.java:255)
   [junit4]   2> at org.eclipse.jetty.server.handler.ContextHandler.doHandle(ContextHandler.java:1317)
   [junit4]   2> at org.eclipse.jetty.server.handler.ScopedHandler.nextScope(ScopedHandler.java:203)
   [junit4]   2> at org.eclipse.jetty.servlet.ServletHandler.doScope(ServletHandler.java:473)
   [junit4]   2> at org.eclipse.jetty.server.session.SessionHandler.doScope(SessionHandler.java:1564)
   [junit4]   2> at org.eclipse.jetty.server.handler.ScopedHandler.nextScope(ScopedHandler.java:201)
   [junit4]   2> at org.eclipse.jetty.server.handler.ContextHandler.doScope(ContextHandler.java:1219)
   [junit4]   2> at org.eclipse.jetty.server.handler.ScopedHandler.handle(ScopedHandler.java:144)
   [junit4]   2> at org.eclipse.jetty.server.handler.gzip.GzipHandler.handle(GzipHandler.java:674)
   [junit4]   2> at org.eclipse.jetty.server.handler.HandlerWrapper.handle(HandlerWrapper.java:132)
   [junit4]   2> at org.eclipse.jetty.server.Server.handle(Server.java:531)
   [junit4]   2> at org.eclipse.jetty.server.HttpChannel.handle(HttpChannel.java:352)
   [junit4]   2> at org.eclipse.jetty.server.HttpConnection.onFillable(HttpConnection.java:260)
   [junit4]   2> at org.eclipse.jetty.io.AbstractConnection$ReadCallback.succeeded(AbstractConnection.java:281)
   [junit4]   2> at org.eclipse.jetty.io.FillInterest.fillable(FillInterest.java:102)
   [junit4]   2> at org.eclipse.jetty.io.ChannelEndPoint$2.run(ChannelEndPoint.java:118)
   [junit4]   2> at org.eclipse.jetty.util.thread.strategy.EatWhatYouKill.runTask(EatWhatYouKill.java:333)
   [junit4]   2> at org.eclipse.jetty.util.thread.strategy.EatWhatYouKill.doProduce(EatWhatYouKill.java:310)
   [junit4]   2> at org.eclipse.jetty.util.thread.strategy.EatWhatYouKill.tryProduce(EatWhatYouKill.java:168)
   [junit4]   2> at org.eclipse.jetty.util.thread.strategy.EatWhatYouKill.run(EatWhatYouKill.java:126)
   [junit4]   2> at org.eclipse.jetty.util.thread.ReservedThreadExecutor$ReservedThread.run(ReservedThreadExecutor.java:366)
   [junit4]   2> at org.eclipse.jetty.util.thread.QueuedThreadPool.runJob(QueuedThreadPool.java:762)
   [junit4]   2> at org.eclipse.jetty.util.thread.QueuedThreadPool$2.run(QueuedThreadPool.java:680)
   [junit4]   2> at java.lang.Thread.run(Thread.java:748)
   [junit4]   1> {event=firstSearcher}
   [junit4]   2> 60637 INFO  (qtp472044690-387) [n:127.0.0.1:47304_solr c:testRepFactor1LeaderStartup s:shard1 r:core_node2 x:testRepFactor1LeaderStartup_shard1_replica_n1] o.a.s.h.SolrConfigHandler Executed config commands successfully and persisted to ZK [{"add-listener":{
   [junit4]   2>     "name":"newSearcherListener",
   [junit4]   2>     "event":"newSearcher",
   [junit4]   2>     "class":"org.apache.solr.cloud.TestCloudSearcherWarming$SleepingSolrEventListener"}}, {"add-listener":{
   [junit4]   2>     "name":"firstSearcherListener",
   [junit4]   2>     "event":"firstSearcher",
   [junit4]   2>     "class":"org.apache.solr.cloud.TestCloudSearcherWarming$SleepingSolrEventListener"}}]
   [junit4]   2> 60642 INFO  (qtp472044690-387) [n:127.0.0.1:47304_solr c:testRepFactor1LeaderStartup s:shard1 r:core_node2 x:testRepFactor1LeaderStartup_shard1_replica_n1] o.a.s.h.SolrConfigHandler Waiting up to 30 secs for 1 replicas to set the property overlay to be of version 0 for collection testRepFactor1LeaderStartup
   [junit4]   2> 60642 INFO  (Thread-91) [    ] o.a.s.c.SolrCore config update listener called for core testRepFactor1LeaderStartup_shard1_replica_n1
   [junit4]   2> 60644 INFO  (solrHandlerExecutor-207-thread-1-processing-n:127.0.0.1:47304_solr x:testRepFactor1LeaderStartup_shard1_replica_n1 c:testRepFactor1LeaderStartup s:shard1 r:core_node2) [n:127.0.0.1:47304_solr c:testRepFactor1LeaderStartup s:shard1 r:core_node2 x:testRepFactor1LeaderStartup_shard1_replica_n1] o.a.s.h.SolrConfigHandler Time elapsed : 0 secs, maxWait 30
   [junit4]   2> 60646 INFO  (Thread-91) [    ] o.a.s.c.SolrCore core reload testRepFactor1LeaderStartup_shard1_replica_n1
   [junit4]   2> 60689 INFO  (Thread-91) [    ] o.a.s.c.RequestParams conf resource params.json loaded . version : 0
   [junit4]   2> 60689 INFO  (Thread-91) [    ] o.a.s.c.RequestParams request params refreshed to version 0
   [junit4]   2> 60690 WARN  (Thread-91) [    ] o.a.s.c.SolrConfig Couldn't add files from /export/home/jenkins/workspace/Lucene-Solr-7.x-Solaris/solr/build/solr-core/test/J1/temp/solr.cloud.TestCloudSearcherWarming_E802AC554978EB6E-001/tempDir-001/node1/testRepFactor1LeaderStartup_shard1_replica_n1/../../../../contrib/extraction/lib filtered by .*\.jar to classpath: /export/home/jenkins/workspace/Lucene-Solr-7.x-Solaris/solr/build/solr-core/test/J1/temp/solr.cloud.TestCloudSearcherWarming_E802AC554978EB6E-001/tempDir-001/node1/testRepFactor1LeaderStartup_shard1_replica_n1/../../../../contrib/extraction/lib
   [junit4]   2> 60690 WARN  (Thread-91) [    ] o.a.s.c.SolrConfig Couldn't add files from /export/home/jenkins/workspace/Lucene-Solr-7.x-Solaris/solr/build/solr-core/test/J1/temp/solr.cloud.TestCloudSearcherWarming_E802AC554978EB6E-001/tempDir-001/node1/testRepFactor1LeaderStartup_shard1_replica_n1/../../../../dist filtered by solr-cell-\d.*\.jar to classpath: /export/home/jenkins/workspace/Lucene-Solr-7.x-Solaris/solr/build/solr-core/test/J1/temp/solr.cloud.TestCloudSearcherWarming_E802AC554978EB6E-001/tempDir-001/node1/testRepFactor1LeaderStartup_shard1_replica_n1/../../../../dist
   [junit4]   2> 60690 WARN  (Thread-91) [    ] o.a.s.c.SolrConfig Couldn't add files from /export/home/jenkins/workspace/Lucene-Solr-7.x-Solaris/solr/build/solr-core/test/J1/temp/solr.cloud.TestCloudSearcherWarming_E802AC554978EB6E-001/tempDir-001/node1/testRepFactor1LeaderStartup_shard1_replica_n1/../../../../contrib/clustering/lib filtered by .*\.jar to classpath: /export/home/jenkins/workspace/Lucene-Solr-7.x-Solaris/solr/build/solr-core/test/J1/temp/solr.cloud.TestCloudSearcherWarming_E802AC554978EB6E-001/tempDir-001/node1/testRepFactor1LeaderStartup_shard1_replica_n1/../../../../contrib/clustering/lib
   [junit4]   2> 60690 WARN  (Thread-91) [    ] o.a.s.c.SolrConfig Couldn't add files from /export/home/jenkins/workspace/Lucene-Solr-7.x-Solaris/solr/build/solr-core/test/J1/temp/solr.cloud.TestCloudSearcherWarming_E802AC554978EB6E-001/tempDir-001/node1/testRepFactor1LeaderStartup_shard1_replica_n1/../../../../dist filtered by solr-clustering-\d.*\.jar to classpath: /export/home/jenkins/workspace/Lucene-Solr-7.x-Solaris/solr/build/solr-core/test/J1/temp/solr.cloud.TestCloudSearcherWarming_E802AC554978EB6E-001/tempDir-001/node1/testRepFactor1LeaderStartup_shard1_replica_n1/../../../../dist
   [junit4]   2> 60690 WARN  (Thread-91) [    ] o.a.s.c.SolrConfig Couldn't add files from /export/home/jenkins/workspace/Lucene-Solr-7.x-Solaris/solr/build/solr-core/test/J1/temp/solr.cloud.TestCloudSearcherWarming_E802AC554978EB6E-001/tempDir-001/node1/testRepFactor1LeaderStartup_shard1_replica_n1/../../../../contrib/langid/lib filtered by .*\.jar to classpath: /export/home/jenkins/workspace/Lucene-Solr-7.x-Solaris/solr/build/solr-core/test/J1/temp/solr.cloud.TestCloudSearcherWarming_E802AC554978EB6E-001/tempDir-001/node1/testRepFactor1LeaderStartup_shard1_replica_n1/../../../../contrib/langid/lib
   [junit4]   2> 60691 WARN  (Thread-91) [    ] o.a.s.c.SolrConfig Couldn't add files from /export/home/jenkins/workspace/Lucene-Solr-7.x-Solaris/solr/build/solr-core/test/J1/temp/solr.cloud.TestCloudSearcherWarming_E802AC554978EB6E-001/tempDir-001/node1/testRepFactor1LeaderStartup_shard1_replica_n1/../../../../dist filtered by solr-langid-\d.*\.jar to classpath: /export/home/jenkins/workspace/Lucene-Solr-7.x-Solaris/solr/build/solr-core/test/J1/temp/solr.cloud.TestCloudSearcherWarming_E802AC554978EB6E-001/tempDir-001/node1/testRepFactor1LeaderStartup_shard1_replica_n1/../../../../dist
   [junit4]   2> 60691 WARN  (Thread-91) [    ] o.a.s.c.SolrConfig Couldn't add files from /export/home/jenkins/workspace/Lucene-Solr-7.x-Solaris/solr/build/solr-core/test/J1/temp/solr.cloud.TestCloudSearcherWarming_E802AC554978EB6E-001/tempDir-001/node1/testRepFactor1LeaderStartup_shard1_replica_n1/../../../../contrib/velocity/lib filtered by .*\.jar to classpath: /export/home/jenkins/workspace/Lucene-Solr-7.x-Solaris/solr/build/solr-core/test/J1/temp/solr.cloud.TestCloudSearcherWarming_E802AC554978EB6E-001/tempDir-001/node1/testRepFactor1LeaderStartup_shard1_replica_n1/../../../../contrib/velocity/lib
   [junit4]   2> 60691 WARN  (Thread-91) [    ] o.a.s.c.SolrConfig Couldn't add files from /export/home/jenkins/workspace/Lucene-Solr-7.x-Solaris/solr/build/solr-core/test/J1/temp/solr.cloud.TestCloudSearcherWarming_E802AC554978EB6E-001/tempDir-001/node1/testRepFactor1LeaderStartup_shard1_replica_n1/../../../../dist filtered by solr-velocity-\d.*\.jar to classpath: /export/home/jenkins/workspace/Lucene-Solr-7.x-Solaris/solr/build/solr-core/test/J1/temp/solr.cloud.TestCloudSearcherWarming_E802AC554978EB6E-001/tempDir-001/node1/testRepFactor1LeaderStartup_shard1_replica_n1/../../../../dist
   [junit4]   2> 60697 INFO  (Thread-91) [    ] o.a.s.c.SolrConfig Using Lucene MatchVersion: 7.6.0
   [junit4]   2> 60741 INFO  (Thread-91) [    ] o.a.s.s.IndexSchema [testRepFactor1LeaderStartup_shard1_replica_n1] Schema name=default-config
   [junit4]   2> 60817 INFO  (qtp472044690-384) [n:127.0.0.1:47304_solr c:testRepFactor1LeaderStartup s:shard1 r:core_node2 x:testRepFactor1LeaderStartup_shard1_replica_n1] o.a.s.h.SolrConfigHandler expecting overlay version 0 but my version is -1
   [junit4]   2> 60818 INFO  (qtp472044690-384) [n:127.0.0.1:47304_solr c:testRepFactor1LeaderStartup s:shard1 r:core_node2 x:testRepFactor1LeaderStartup_shard1_replica_n1] o.a.s.c.S.Request [testRepFactor1LeaderStartup_shard1_replica_n1]  webapp=/solr path=/config/znodeVersion params={overlay=0&wt=javabin&version=2} status=0 QTime=5
   [junit4]   2> 60818 INFO  (SolrConfigHandler-refreshconf) [    ] o.a.s.h.SolrConfigHandler Another reload is in progress . Not doing anything
   [junit4]   2> 60821 INFO  (solrHandlerExecutor-207-thread-1-processing-n:127.0.0.1:47304_solr x:testRepFactor1LeaderStartup_shard1_replica_n1 c:testRepFactor1LeaderStartup s:shard1 r:core_node2) [n:127.0.0.1:47304_solr c:testRepFactor1LeaderStartup s:shard1 r:core_node2 x:testRepFactor1LeaderStartup_shard1_replica_n1] o.a.s.h.SolrConfigHandler Could not get expectedVersion 0 from http://127.0.0.1:47304/solr/testRepFactor1LeaderStartup_shard1_replica_n1/ for prop overlay   after 1 attempts
   [junit4]   2> 60821 INFO  (solrHandlerExecutor-207-thread-1-processing-n:127.0.0.1:47304_solr x:testRepFactor1LeaderStartup_shard1_replica_n1 c:testRepFactor1LeaderStartup s:shard1 r:core_node2) [n:127.0.0.1:47304_solr c:testRepFactor1LeaderStartup s:shard1 r:core_node2 x:testRepFactor1LeaderStartup_shard1_replica_n1] o.a.s.h.SolrConfigHandler Time elapsed : 0 secs, maxWait 30
   [junit4]   2> 60934 INFO  (qtp472044690-385) [n:127.0.0.1:47304_solr c:testRepFactor1LeaderStartup s:shard1 r:core_node2 x:testRepFactor1LeaderStartup_shard1_replica_n1] o.a.s.h.SolrConfigHandler expecting overlay version 0 but my version is -1
   [junit4]   2> 60934 INFO  (qtp472044690-385) [n:127.0.0.1:47304_solr c:testRepFactor1LeaderStartup s:shard1 r:core_node2 x:testRepFactor1LeaderStartup_shard1_replica_n1] o.a.s.c.S.Request [testRepFactor1LeaderStartup_shard1_replica_n1]  webapp=/solr path=/config/znodeVersion params={overlay=0&wt=javabin&version=2} status=0 QTime=0
   [junit4]   2> 60934 INFO  (SolrConfigHandler-refreshconf) [    ] o.a.s.h.SolrConfigHandler Another reload is in progress . Not doing anything
   [junit4]   2> 60935 INFO  (solrHandlerExecutor-207-thread-1-processing-n:127.0.0.1:47304_solr x:testRepFactor1LeaderStartup_shard1_replica_n1 c:testRepFactor1LeaderStartup s:shard1 r:core_node2) [n:127.0.0.1:47304_solr c:testRepFactor1LeaderStartup s:shard1 r:core_node2 x:testRepFactor1LeaderStartup_shard1_replica_n1] o.a.s.h.SolrConfigHandler Could not get expectedVersion 0 from http://127.0.0.1:47304/solr/testRepFactor1LeaderStartup_shard1_replica_n1/ for prop overlay   after 2 attempts
   [junit4]   2> 60936 INFO  (solrHandlerExecutor-207-thread-1-processing-n:127.0.0.1:47304_solr x:testRepFactor1LeaderStartup_shard1_replica_n1 c:testRepFactor1LeaderStartup s:shard1 r:core_node2) [n:127.0.0.1:47304_solr c:testRepFactor1LeaderStartup s:shard1 r:core_node2 x:testRepFactor1LeaderStartup_shard1_replica_n1] o.a.s.h.SolrConfigHandler Time elapsed : 0 secs, maxWait 30
   [junit4]   2> 61037 INFO  (qtp472044690-384) [n:127.0.0.1:47304_solr c:testRepFactor1LeaderStartup s:shard1 r:core_node2 x:testRepFactor1LeaderStartup_shard1_replica_n1] o.a.s.h.SolrConfigHandler expecting overlay version 0 but my version is -1
   [junit4]   2> 61037 INFO  (qtp472044690-384) [n:127.0.0.1:47304_solr c:testRepFactor1LeaderStartup s:shard1 r:core_node2 x:testRepFactor1LeaderStartup_shard1_replica_n1] o.a.s.c.S.Request [testRepFactor1LeaderStartup_shard1_replica_n1]  webapp=/solr path=/config/znodeVersion params={overlay=0&wt=javabin&version=2} status=0 QTime=0
   [junit4]   2> 61038 INFO  (solrHandlerExecutor-207-thread-1-processing-n:127.0.0.1:47304_solr x:testRepFactor1LeaderStartup_shard1_replica_n1 c:testRepFactor1LeaderStartup s:shard1 r:core_node2) [n:127.0.0.1:47304_solr c:testRepFactor1LeaderStartup s:shard1 r:core_node2 x:testRepFactor1LeaderStartup_shard1_replica_n1] o.a.s.h.SolrConfigHandler Could not get expectedVersion 0 from http://127.0.0.1:47304/solr/testRepFactor1LeaderStartup_shard1_replica_n1/ for prop overlay   after 3 attempts
   [junit4]   2> 61038 INFO  (solrHandlerExecutor-207-thread-1-processing-n:127.0.0.1:47304_solr x:testRepFactor1LeaderStartup_shard1_replica_n1 c:testRepFactor1LeaderStartup s:shard1 r:core_node2) [n:127.0.0.1:47304_solr c:testRepFactor1LeaderStartup s:shard1 r:core_node2 x:testRepFactor1LeaderStartup_shard1_replica_n1] o.a.s.h.SolrConfigHandler Time elapsed : 0 secs, maxWait 30
   [junit4]   2> 61041 INFO  (Thread-91) [    ] o.a.s.s.IndexSchema Loaded schema default-config/1.6 with uniqueid field id
   [junit4]   2> 61111 INFO  (Thread-91) [    ] o.a.s.c.CoreContainer Reloading SolrCore 'testRepFactor1LeaderStartup_shard1_replica_n1' using configuration from collection testRepFactor1LeaderStartup
   [junit4]   2> 61124 INFO  (SolrConfigHandler-refreshconf) [    ] o.a.s.h.SolrConfigHandler Another reload is in progress . Not doing anything
   [junit4]   2> 61163 INFO  (Thread-91) [n:127.0.0.1:47304_solr c:testRepFactor1LeaderStartup s:shard1 r:core_node2 x:testRepFactor1LeaderStartup_shard1_replica_n1] o.a.s.m.r.SolrJmxReporter JMX monitoring for 'solr_47304.solr.core.testRepFactor1LeaderStartup.shard1.replica_n1' (registry 'solr.core.testRepFactor1LeaderStartup.shard1.replica_n1') enabled at server: com.sun.jmx.mbeanserver.JmxMBeanServer@2b608828
   [junit4]   2> 61164 INFO  (Thread-91) [n:127.0.0.1:47304_solr c:testRepFactor1LeaderStartup s:shard1 r:core_node2 x:testRepFactor1LeaderStartup_shard1_replica_n1] o.a.s.c.SolrCore [[testRepFactor1LeaderStartup_shard1_replica_n1] ] Opening new SolrCore at [/export/home/jenkins/workspace/Lucene-Solr-7.x-Solaris/solr/build/solr-core/test/J1/temp/solr.cloud.TestCloudSearcherWarming_E802AC554978EB6E-001/tempDir-001/node1/testRepFactor1LeaderStartup_shard1_replica_n1], dataDir=[/export/home/jenkins/workspace/Lucene-Solr-7.x-Solaris/solr/build/solr-core/test/J1/temp/solr.cloud.TestCloudSearcherWarming_E802AC554978EB6E-001/tempDir-001/node1/./testRepFactor1LeaderStartup_shard1_replica_n1/data/]
   [junit4]   2> java.lang.RuntimeException
   [junit4]   2> at org.apache.solr.cloud.TestCloudSearcherWarming$SleepingSolrEventListener.init(TestCloudSearcherWarming.java:294)
   [junit4]   2> at org.apache.solr.core.SolrCore.createInitInstance(SolrCore.java:852)
   [junit4]   2> at org.apache.solr.core.SolrCore.initListeners(SolrCore.java:602)
   [junit4]   2> at org.apache.solr.core.SolrCore.<init>(SolrCore.java:952)
   [junit4]   2> at org.apache.solr.core.SolrCore.reload(SolrCore.java:665)
   [junit4]   2> at org.apache.solr.core.CoreContainer.reload(CoreContainer.java:1393)
   [junit4]   2> at org.apache.solr.core.SolrCore.lambda$getConfListener$20(SolrCore.java:3031)
   [junit4]   2> at org.apache.solr.cloud.ZkController.lambda$fireEventListeners$7(ZkController.java:2743)
   [junit4]   2> at java.lang.Thread.run(Thread.java:748)
   [junit4]   1> {event=newSearcher}
   [junit4]   2> java.lang.RuntimeException
   [junit4]   2> at org.apache.solr.cloud.TestCloudSearcherWarming$SleepingSolrEventListener.init(TestCloudSearcherWarming.java:294)
   [junit4]   2> at org.apache.solr.core.SolrCore.createInitInstance(SolrCore.java:852)
   [junit4]   2> at org.apache.solr.core.SolrCore.initListeners(SolrCore.java:598)
   [junit4]   2> at org.apache.solr.core.SolrCore.<init>(SolrCore.java:952)
   [junit4]   2> at org.apache.solr.core.SolrCore.reload(SolrCore.java:665)
   [junit4]   2> at org.apache.solr.core.CoreContainer.reload(CoreContainer.java:1393)
   [junit4]   2> at org.apache.solr.core.SolrCore.lambda$getConfListener$20(SolrCore.java:3031)
   [junit4]   2> at org.apache.solr.cloud.ZkController.lambda$fireEventListeners$7(ZkController.java:2743)
   [junit4]   2> at java.lang.Thread.run(Thread.java:748)
   [junit4]   1> {event=firstSearcher}
   [junit4]   2> 61176 INFO  (Thread-91) [n:127.0.0.1:47304_solr c:testRepFactor1LeaderStartup s:shard1 r:core_node2 x:testRepFactor1LeaderStartup_shard1_replica_n1] o.a.s.r.XSLTResponseWriter xsltCacheLifetimeSeconds=5
   [junit4]   2> 61180 INFO  (qtp472044690-384) [n:127.0.0.1:47304_solr c:testRepFactor1LeaderStartup s:shard1 r:core_node2 x:testRepFactor1LeaderStartup_shard1_replica_n1] o.a.s.h.SolrConfigHandler expecting overlay version 0 but my version is -1
   [junit4]   2> 61181 INFO  (qtp472044690-384) [n:127.0.0.1:47304_solr c:testRepFactor1LeaderStartup s:shard1 r:core_node2 x:testRepFactor1LeaderStartup_shard1_replica_n1] o.a.s.c.S.Request [testRepFactor1LeaderStartup_shard1_replica_n1]  webapp=/solr path=/config/znodeVersion params={overlay=0&wt=javabin&version=2} status=0 QTime=41
   [junit4]   2> 61181 INFO  (SolrConfigHandler-refreshconf) [    ] o.a.s.h.SolrConfigHandler Another reload is in progress . Not doing anything
   [junit4]   2> 61195 INFO  (solrHandlerExecutor-207-thread-1-processing-n:127.0.0.1:47304_solr x:testRepFactor1LeaderStartup_shard1_replica_n1 c:testRepFactor1LeaderStartup s:shard1 r:core_node2) [n:127.0.0.1:47304_solr c:testRepFactor1LeaderStartup s:shard1 r:core_node2 x:testRepFactor1LeaderStartup_shard1_replica_n1] o.a.s.h.SolrConfigHandler Could not get expectedVersion 0 from http://127.0.0.1:47304/solr/testRepFactor1LeaderStartup_shard1_replica_n1/ for prop overlay   after 4 attempts
   [junit4]   2> 61195 INFO  (solrHandlerExecutor-207-thread-1-processing-n:127.0.0.1:47304_solr x:testRepFactor1LeaderStartup_shard1_replica_n1 c:testRepFactor1LeaderStartup s:shard1 r:core_node2) [n:127.0.0.1:47304_solr c:testRepFactor1LeaderStartup s:shard1 r:core_node2 x:testRepFactor1LeaderStartup_shard1_replica_n1] o.a.s.h.SolrConfigHandler Time elapsed : 0 secs, maxWait 30
   [junit4]   2> 61290 INFO  (Thread-91) [n:127.0.0.1:47304_solr c:testRepFactor1LeaderStartup s:shard1 r:core_node2 x:testRepFactor1LeaderStartup_shard1_replica_n1] o.a.s.u.CommitTracker Hard AutoCommit: if uncommitted for 15000ms;
   [junit4]   2> 61290 INFO  (Thread-91) [n:127.0.0.1:47304_solr c:testRepFactor1LeaderStartup s:shard1 r:core_node2 x:testRepFactor1LeaderStartup_shard1_replica_n1] o.a.s.u.CommitTracker Soft AutoCommit: disabled
   [junit4]   2> 61297 INFO  (qtp472044690-385) [n:127.0.0.1:47304_solr c:testRepFactor1LeaderStartup s:shard1 r:core_node2 x:testRepFactor1LeaderStartup_shard1_replica_n1] o.a.s.h.SolrConfigHandler expecting overlay version 0 but my version is -1
   [junit4]   2> 61297 INFO  (Thread-91) [n:127.0.0.1:47304_solr c:testRepFactor1LeaderStartup s:shard1 r:core_node2 x:testRepFactor1LeaderStartup_shard1_replica_n1] o.a.s.s.SolrIndexSearcher Opening [Searcher@6aef3227[testRepFactor1LeaderStartup_shard1_replica_n1] main]
   [junit4]   2> 61297 INFO  (qtp472044690-385) [n:127.0.0.1:47304_solr c:testRepFactor1LeaderStartup s:shard1 r:core_node2 x:testRepFactor1LeaderStartup_shard1_replica_n1] o.a.s.c.S.Request [testRepFactor1LeaderStartup_shard1_replica_n1]  webapp=/solr path=/config/znodeVersion params={overlay=0&wt=javabin&version=2} status=0 QTime=0
   [junit4]   2> 61298 INFO  (SolrConfigHandler-refreshconf) [    ] o.a.s.h.SolrConfigHandler Another reload is in progress . Not doing anything
   [junit4]   2> 61301 INFO  (solrHandlerExecutor-207-thread-1-processing-n:127.0.0.1:47304_solr x:testRepFactor1LeaderStartup_shard1_replica_n1 c:testRepFactor1LeaderStartup s:shard1 r:core_node2) [n:127.0.0.1:47304_solr c:testRepFactor1LeaderStartup s:shard1 r:core_node2 x:testRepFactor1LeaderStartup_shard1_replica_n1] o.a.s.h.SolrConfigHandler Could not get expectedVersion 0 from http://127.0.0.1:47304/solr/testRepFactor1LeaderStartup_shard1_replica_n1/ for prop overlay   after 5 attempts
   [junit4]   2> 61301 INFO  (solrHandlerExecutor-207-thread-1-processing-n:127.0.0.1:47304_solr x:testRepFactor1LeaderStartup_shard1_replica_n1 c:testRepFactor1LeaderStartup s:shard1 r:core_node2) [n:127.0.0.1:47304_solr c:testRepFactor1LeaderStartup s:shard1 r:core_node2 x:testRepFactor1LeaderStartup_shard1_replica_n1] o.a.s.h.SolrConfigHandler Time elapsed : 0 secs, maxWait 30
   [junit4]   2> 61302 INFO  (Thread-91) [n:127.0.0.1:47304_solr c:testRepFactor1LeaderStartup s:shard1 r:core_node2 x:testRepFactor1LeaderStartup_shard1_replica_n1] o.a.s.r.ManagedResourceStorage Configured ZooKeeperStorageIO with znodeBase: /configs/testRepFactor1LeaderStartup.AUTOCREATED
   [junit4]   2> 61303 INFO  (Thread-91) [n:127.0.0.1:47304_solr c:testRepFactor1LeaderStartup s:shard1 r:core_node2 x:testRepFactor1LeaderStartup_shard1_replica_n1] o.a.s.r.ManagedResourceStorage Loaded null at path _rest_managed.json using ZooKeeperStorageIO:path=/configs/testRepFactor1LeaderStartup.AUTOCREATED
   [junit4]   2> 61303 INFO  (Thread-91) [n:127.0.0.1:47304_solr c:testRepFactor1LeaderStartup s:shard1 r:core_node2 x:testRepFactor1LeaderStartup_shard1_replica_n1] o.a.s.s.ZkIndexSchemaReader Creating ZooKeeper watch for the managed schema at /configs/testRepFactor1LeaderStartup.AUTOCREATED/managed-schema
   [junit4]   2> 61304 INFO  (Thread-91) [n:127.0.0.1:47304_solr c:testRepFactor1LeaderStartup s:shard1 r:core_node2 x:testRepFactor1LeaderStartup_shard1_replica_n1] o.a.s.s.ZkIndexSchemaReader Current schema version 0 is already the latest
   [junit4]   2> 61305 INFO  (Thread-91) [n:127.0.0.1:47304_solr c:testRepFactor1LeaderStartup s:shard1 r:core_node2 x:testRepFactor1LeaderStartup_shard1_replica_n1] o.a.s.h.c.SpellCheckComponent Initializing spell checkers
   [junit4]   2> 61305 INFO  (Thread-91) [n:127.0.0.1:47304_solr c:testRepFactor1LeaderStartup s:shard1 r:core_node2 x:testRepFactor1LeaderStartup_shard1_replica_n1] o.a.s.s.DirectSolrSpellChecker init: {name=default,field=_text_,classname=solr.DirectSolrSpellChecker,distanceMeasure=internal,accuracy=0.5,maxEdits=2,minPrefix=1,maxInspections=5,minQueryLength=4,maxQueryFrequency=0.01}
   [junit4]   2> 61308 INFO  (Thread-91) [n:127.0.0.1:47304_solr c:testRepFactor1LeaderStartup s:shard1 r:core_node2 x:testRepFactor1LeaderStartup_shard1_replica_n1] o.a.s.h.ReplicationHandler Commits will be reserved for 10000ms.
   [junit4]   2> 61309 INFO  (searcherExecutor-208-thread-1-processing-n:127.0.0.1:47304_solr x:testRepFactor1LeaderStartup_shard1_replica_n1 c:testRepFactor1LeaderStartup s:shard1 r:core_node2) [n:127.0.0.1:47304_solr c:testRepFactor1LeaderStartup s:shard1 r:core_node2 x:testRepFactor1LeaderStartup_shard1_replica_n1] o.a.s.c.QuerySenderListener QuerySenderListener sending requests to Searcher@6aef3227[testRepFactor1LeaderStartup_shard1_replica_n1] main{ExitableDirectoryReader(UninvertingDirectoryReader())}
   [junit4]   2> 61309 INFO  (searcherExecutor-208-thread-1-processing-n:127.0.0.1:47304_solr x:testRepFactor1LeaderStartup_shard1_replica_n1 c:testRepFactor1LeaderStartup s:shard1 r:core_node2) [n:127.0.0.1:47304_solr c:testRepFactor1LeaderStartup s:shard1 r:core_node2 x:testRepFactor1LeaderStartup_shard1_replica_n1] o.a.s.c.QuerySenderListener QuerySenderListener done.
   [junit4]   2> 61309 INFO  (searcherExecutor-208-thread-1-processing-n:127.0.0.1:47304_solr x:testRepFactor1LeaderStartup_shard1_replica_n1 c:testRepFactor1LeaderStartup s:shard1 r:core_node2) [n:127.0.0.1:47304_solr c:testRepFactor1LeaderStartup s:shard1 r:core_node2 x:testRepFactor1LeaderStartup_shard1_replica_n1] o.a.s.h.c.SpellCheckComponent Loading spell index for spellchecker: default
   [junit4]   2> 61314 INFO  (searcherExecutor-208-thread-1-processing-n:127.0.0.1:47304_solr x:testRepFactor1LeaderStartup_shard1_replica_n1 c:testRepFactor1LeaderStartup s:shard1 r:core_node2) [n:127.0.0.1:47304_solr c:testRepFactor1LeaderStartup s:shard1 r:core_node2 x:testRepFactor1LeaderStartup_shard1_replica_n1] o.a.s.c.SolrCore [testRepFactor1LeaderStartup_shard1_replica_n1] Registered new searcher Searcher@6aef3227[testRepFactor1LeaderStartup_shard1_replica_n1] main{ExitableDirectoryReader(UninvertingDirectoryReader())}
   [junit4]   2> 61315 INFO  (Thread-91) [n:127.0.0.1:47304_solr c:testRepFactor1LeaderStartup s:shard1 r:core_node2 x:testRepFactor1LeaderStartup_shard1_replica_n1] o.a.s.u.UpdateLog Could not find max version in index or recent updates, using new clock 1611588913041768448
   [junit4]   2> 61328 INFO  (Thread-91) [n:127.0.0.1:47304_solr c:testRepFactor1LeaderStartup s:shard1 r:core_node2 x:testRepFactor1LeaderStartup_shard1_replica_n1] o.a.s.u.DefaultSolrCoreState New IndexWriter is ready to be used.
   [junit4]   2> 61329 INFO  (Thread-91) [n:127.0.0.1:47304_solr c:testRepFactor1LeaderStartup s:shard1 r:core_node2 x:testRepFactor1LeaderStartup_shard1_replica_n1] o.a.s.s.SolrIndexSearcher Opening [Searcher@7d17cd77[testRepFactor1LeaderStartup_shard1_replica_n1] main]
   [junit4]   2> 61330 INFO  (searcherExecutor-208-thread-1-processing-n:127.0.0.1:47304_solr x:testRepFactor1LeaderStartup_shard1_replica_n1 c:testRepFactor1LeaderStartup s:shard1 r:core_node2) [n:127.0.0.1:47304_solr c:testRepFactor1LeaderStartup s:shard1 r:core_node2 x:testRepFactor1LeaderStartup_shard1_replica_n1] o.a.s.c.QuerySenderListener QuerySenderListener sending requests to Searcher@7d17cd77[testRepFactor1LeaderStartup_shard1_replica_n1] main{ExitableDirectoryReader(UninvertingDirectoryReader())}
   [junit4]   2> 61330 INFO  (searcherExecutor-208-thread-1-processing-n:127.0.0.1:47304_solr x:testRepFactor1LeaderStartup_shard1_replica_n1 c:testRepFactor1LeaderStartup s:shard1 r:core_node2) [n:127.0.0.1:47304_solr c:testRepFactor1LeaderStartup s:shard1 r:core_node2 x:testRepFactor1LeaderStartup_shard1_replica_n1] o.a.s.c.QuerySenderListener QuerySenderListener done.
   [junit4]   2> 61336 INFO  (searcherExecutor-208-thread-1-processing-n:127.0.0.1:47304_solr x:testRepFactor1LeaderStartup_shard1_replica_n1 c:testRepFactor1LeaderStartup s:shard1 r:core_node2) [n:127.0.0.1:47304_solr c:testRepFactor1LeaderStartup s:shard1 r:core_node2 x:testRepFactor1LeaderStartup_shard1_replica_n1] o.a.s.c.SolrCore [testRepFactor1LeaderStartup_shard1_replica_n1] Registered new searcher Searcher@7d17cd77[testRepFactor1LeaderStartup_shard1_replica_n1] main{ExitableDirectoryReader(UninvertingDirectoryReader())}
   [junit4]   2> 61405 INFO  (qtp472044690-384) [n:127.0.0.1:47304_solr c:testRepFactor1LeaderStartup s:shard1 r:core_node2 x:testRepFactor1LeaderStartup_shard1_replica_n1] o.a.s.h.SolrConfigHandler I already have the expected version 0 of config
   [junit4]   2> 61406 INFO  (qtp472044690-384) [n:127.0.0.1:47304_solr c:testRepFactor1LeaderStartup s:shard1 r:core_node2 x:testRepFactor1LeaderStartup_shard1_replica_n1] o.a.s.h.SolrConfigHandler isStale false , resourceloader org.apache.solr.cloud.ZkSolrResourceLoader
   [junit4]   2> 61406 INFO  (qtp472044690-384) [n:127.0.0.1:47304_solr c:testRepFactor1LeaderStartup s:shard1 r:core_node2 x:testRepFactor1LeaderStartup_shard1_replica_n1] o.a.s.c.S.Request [testRepFactor1LeaderStartup_shard1_replica_n1]  webapp=/solr path=/config/znodeVersion params={overlay=0&wt=javabin&version=2} status=0 QTime=0
   [junit4]   2> 61410 INFO  (qtp472044690-387) [n:127.0.0.1:47304_solr c:testRepFactor1LeaderStartup s:shard1 r:core_node2 x:testRepFactor1LeaderStartup_shard1_replica_n1] o.a.s.h.SolrConfigHandler Took 772.0ms to set the property overlay to be of version 0 for collection testRepFactor1LeaderStartup
   [junit4]   2> 61410 INFO  (qtp472044690-387) [n:127.0.0.1:47304_solr c:testRepFactor1LeaderStartup s:shard1 r:core_node2 x:testRepFactor1LeaderStartup_shard1_replica_n1] o.a.s.c.S.Request [testRepFactor1LeaderStartup_shard1_replica_n1]  webapp=/solr path=/config params={wt=javabin&version=2} status=0 QTime=827
   [junit4]   2> 61410 INFO  (qtp472044690-387) [n:127.0.0.1:47304_solr c:testRepFactor1LeaderStartup s:shard1 r:core_node2 x:testRepFactor1LeaderStartup_shard1_replica_n1] o.a.s.c.SolrCore [testRepFactor1LeaderStartup_shard1_replica_n1]  CLOSING SolrCore org.apache.solr.core.SolrCore@3704bdb1
   [junit4]   2> 61410 INFO  (qtp472044690-387) [n:127.0.0.1:47304_solr c:testRepFactor1LeaderStartup s:shard1 r:core_node2 x:testRepFactor1LeaderStartup_shard1_replica_n1] o.a.s.m.SolrMetricManager Closing metric reporters for registry=solr.core.testRepFactor1LeaderStartup.shard1.replica_n1, tag=3704bdb1
   [junit4]   2> 61410 INFO  (qtp472044690-387) [n:127.0.0.1:47304_solr c:testRepFactor1LeaderStartup s:shard1 r:core_node2 x:testRepFactor1LeaderStartup_shard1_replica_n1] o.a.s.m.r.SolrJmxReporter Closing reporter [org.apache.solr.metrics.reporters.SolrJmxReporter@12a0ae8d: rootName = solr_47304, domain = solr.core.testRepFactor1LeaderStartup.shard1.replica_n1, service url = null, agent id = null] for registry solr.core.testRepFactor1LeaderStartup.shard1.replica_n1 / com.codahale.metrics.MetricRegistry@59a25f81
   [junit4]   2> 61419 INFO  (qtp472044690-387) [n:127.0.0.1:47304_solr c:testRepFactor1LeaderStartup s:shard1 r:core_node2 x:testRepFactor1LeaderStartup_shard1_replica_n1] o.a.s.m.SolrMetricManager Closing metric reporters for registry=solr.collection.testRepFactor1LeaderStartup.shard1.lead

[...truncated too long message...]

.class="*.TestCloudSearcherWarming" -Dtests.showOutput=onerror "-Dargs=-XX:-UseCompressedOops -XX:+UseSerialGC" -Dtests.seed=E802AC554978EB6E -Dtests.slow=true -Dtests.locale=es-SV -Dtests.timezone=Africa/Addis_Ababa -Dtests.asserts=true -Dtests.file.encoding=US-ASCII
Buildfile: /export/home/jenkins/workspace/Lucene-Solr-7.x-Solaris/solr/core/build.xml

-clover.disable:

ivy-configure:
[ivy:configure] :: Apache Ivy 2.4.0 - 20141213170938 :: http://ant.apache.org/ivy/ ::
[ivy:configure] :: loading settings :: file = /export/home/jenkins/workspace/Lucene-Solr-7.x-Solaris/lucene/top-level-ivy-settings.xml

install-junit4-taskdef:

ivy-availability-check:
[loadresource] Do not set property disallowed.ivy.jars.list as its length is 0.

-ivy-fail-disallowed-ivy-version:

ivy-fail:

resolve-groovy:
[ivy:cachepath] :: resolving dependencies :: org.codehaus.groovy#groovy-all-caller;working
[ivy:cachepath] confs: [default]
[ivy:cachepath] found org.codehaus.groovy#groovy-all;2.4.15 in public
[ivy:cachepath] :: resolution report :: resolve 16ms :: artifacts dl 0ms
        ---------------------------------------------------------------------
        |                  |            modules            ||   artifacts   |
        |       conf       | number| search|dwnlded|evicted|| number|dwnlded|
        ---------------------------------------------------------------------
        |      default     |   1   |   0   |   0   |   0   ||   1   |   0   |
        ---------------------------------------------------------------------

-init-totals:

-test:
    [mkdir] Created dir: /export/home/jenkins/workspace/Lucene-Solr-7.x-Solaris/solr/build/solr-core/test
[junit4:pickseed] Seed property 'tests.seed' already defined: E802AC554978EB6E
    [mkdir] Created dir: /export/home/jenkins/workspace/Lucene-Solr-7.x-Solaris/solr/build/solr-core/test/temp
   [junit4] <JUnit4> says ┬íHola! Master seed: E802AC554978EB6E
   [junit4] Executing 5 suites with 2 JVMs.
   [junit4]
   [junit4] Started J0 PID(20132@serv1-vm3).
   [junit4] Started J1 PID(20131@serv1-vm3).
   [junit4] Suite: org.apache.solr.cloud.TestCloudSearcherWarming
   [junit4] OK      19.8s J1 | TestCloudSearcherWarming.testRepFactor1LeaderStartup
   [junit4] OK      42.6s J1 | TestCloudSearcherWarming.testPeersyncFailureReplicationSuccess
   [junit4] Completed [1/5] on J1 in 67.75s, 2 tests
   [junit4]
   [junit4] Suite: org.apache.solr.cloud.TestCloudSearcherWarming
   [junit4] OK      19.2s J0 | TestCloudSearcherWarming.testRepFactor1LeaderStartup
   [junit4] OK      42.7s J0 | TestCloudSearcherWarming.testPeersyncFailureReplicationSuccess
   [junit4] Completed [2/5] on J0 in 69.49s, 2 tests
   [junit4]
   [junit4] Duplicate suite name used with XML reports: org.apache.solr.cloud.TestCloudSearcherWarming. This may confuse tools that process XML reports. Set 'ignoreDuplicateSuites' to true to skip this message.
   [junit4] Suite: org.apache.solr.cloud.TestCloudSearcherWarming
   [junit4] OK      15.4s J1 | TestCloudSearcherWarming.testRepFactor1LeaderStartup
   [junit4] OK      41.5s J1 | TestCloudSearcherWarming.testPeersyncFailureReplicationSuccess
   [junit4] Completed [3/5] on J1 in 58.59s, 2 tests
   [junit4]
   [junit4] Suite: org.apache.solr.cloud.TestCloudSearcherWarming
   [junit4] OK      15.8s J0 | TestCloudSearcherWarming.testRepFactor1LeaderStartup
   [junit4] OK      42.5s J0 | TestCloudSearcherWarming.testPeersyncFailureReplicationSuccess
   [junit4] Completed [4/5] on J0 in 60.13s, 2 tests
   [junit4]
   [junit4] Suite: org.apache.solr.cloud.TestCloudSearcherWarming
   [junit4] OK      15.2s J1 | TestCloudSearcherWarming.testRepFactor1LeaderStartup
   [junit4] OK      41.4s J1 | TestCloudSearcherWarming.testPeersyncFailureReplicationSuccess
   [junit4] Completed [5/5] on J1 in 58.37s, 2 tests
   [junit4]
   [junit4] JVM J0:     0.69 ..   130.75 =   130.07s
   [junit4] JVM J1:     0.70 ..   186.45 =   185.75s
   [junit4] Execution time total: 3 minutes 6 seconds
   [junit4] Tests summary: 5 suites, 10 tests
   [junit4] Could not remove temporary path: /export/home/jenkins/workspace/Lucene-Solr-7.x-Solaris/solr/build/solr-core/test/J0 (java.nio.file.DirectoryNotEmptyException: Remaining files: [/export/home/jenkins/workspace/Lucene-Solr-7.x-Solaris/solr/build/solr-core/test/J0/temp])
   [junit4] Could not remove temporary path: /export/home/jenkins/workspace/Lucene-Solr-7.x-Solaris/solr/build/solr-core/test/J1 (java.nio.file.DirectoryNotEmptyException: Remaining files: [/export/home/jenkins/workspace/Lucene-Solr-7.x-Solaris/solr/build/solr-core/test/J1/temp])
     [echo] 5 slowest tests:
[junit4:tophints] 562.68s | org.apache.solr.cloud.BasicDistributedZkTest
[junit4:tophints] 482.81s | org.apache.solr.cloud.cdcr.CdcrWithNodesRestartsTest
[junit4:tophints] 445.48s | org.apache.solr.cloud.api.collections.ShardSplitTest
[junit4:tophints] 266.56s | org.apache.solr.cloud.cdcr.CdcrOpsAndBoundariesTest
[junit4:tophints] 218.37s | org.apache.solr.update.TestInPlaceUpdatesDistrib

-check-totals:

test-nocompile:

BUILD SUCCESSFUL
Total time: 3 minutes 9 seconds
[repro] Failures:
[repro]   0/5 failed: org.apache.solr.cloud.TestCloudSearcherWarming
[repro] Exiting with code 0
+ mv lucene/build lucene/build.repro
+ mv solr/build solr/build.repro
+ mv lucene/build.orig lucene/build
+ mv solr/build.orig solr/build
Archiving artifacts
Setting ANT_1_8_2_HOME=/export/home/jenkins/tools/hudson.tasks.Ant_AntInstallation/ANT_1.8.2
java.lang.InterruptedException: no matches found within 10000
        at hudson.FilePath$ValidateAntFileMask.hasMatch(FilePath.java:2845)
        at hudson.FilePath$ValidateAntFileMask.invoke(FilePath.java:2724)
        at hudson.FilePath$ValidateAntFileMask.invoke(FilePath.java:2705)
        at hudson.FilePath$FileCallableWrapper.call(FilePath.java:3084)
Also:   hudson.remoting.Channel$CallSiteStackTrace: Remote call to Solaris VBOX
                at hudson.remoting.Channel.attachCallSiteStackTrace(Channel.java:1741)
                at hudson.remoting.UserRequest$ExceptionResponse.retrieve(UserRequest.java:357)
                at hudson.remoting.Channel.call(Channel.java:955)
                at hudson.FilePath.act(FilePath.java:1070)
                at hudson.FilePath.act(FilePath.java:1059)
                at hudson.FilePath.validateAntFileMask(FilePath.java:2703)
                at hudson.tasks.ArtifactArchiver.perform(ArtifactArchiver.java:243)
                at hudson.tasks.BuildStepCompatibilityLayer.perform(BuildStepCompatibilityLayer.java:81)
                at hudson.tasks.BuildStepMonitor$1.perform(BuildStepMonitor.java:20)
                at hudson.model.AbstractBuild$AbstractBuildExecution.perform(AbstractBuild.java:744)
                at hudson.model.AbstractBuild$AbstractBuildExecution.performAllBuildSteps(AbstractBuild.java:690)
                at hudson.model.Build$BuildExecution.post2(Build.java:186)
                at hudson.model.AbstractBuild$AbstractBuildExecution.post(AbstractBuild.java:635)
                at hudson.model.Run.execute(Run.java:1840)
                at hudson.model.FreeStyleBuild.run(FreeStyleBuild.java:43)
                at hudson.model.ResourceController.execute(ResourceController.java:97)
                at hudson.model.Executor.run(Executor.java:429)
Caused: hudson.FilePath$TunneledInterruptedException
        at hudson.FilePath$FileCallableWrapper.call(FilePath.java:3086)
        at hudson.remoting.UserRequest.perform(UserRequest.java:212)
        at hudson.remoting.UserRequest.perform(UserRequest.java:54)
        at hudson.remoting.Request$2.run(Request.java:369)
        at hudson.remoting.InterceptingExecutorService$1.call(InterceptingExecutorService.java:72)
        at java.util.concurrent.FutureTask.run(FutureTask.java:266)
        at java.util.concurrent.ThreadPoolExecutor.runWorker(ThreadPoolExecutor.java:1149)
        at java.util.concurrent.ThreadPoolExecutor$Worker.run(ThreadPoolExecutor.java:624)
        at java.lang.Thread.run(Thread.java:748)
Caused: java.lang.InterruptedException: java.lang.InterruptedException: no matches found within 10000
        at hudson.FilePath.act(FilePath.java:1072)
        at hudson.FilePath.act(FilePath.java:1059)
        at hudson.FilePath.validateAntFileMask(FilePath.java:2703)
        at hudson.tasks.ArtifactArchiver.perform(ArtifactArchiver.java:243)
        at hudson.tasks.BuildStepCompatibilityLayer.perform(BuildStepCompatibilityLayer.java:81)
        at hudson.tasks.BuildStepMonitor$1.perform(BuildStepMonitor.java:20)
        at hudson.model.AbstractBuild$AbstractBuildExecution.perform(AbstractBuild.java:744)
        at hudson.model.AbstractBuild$AbstractBuildExecution.performAllBuildSteps(AbstractBuild.java:690)
        at hudson.model.Build$BuildExecution.post2(Build.java:186)
        at hudson.model.AbstractBuild$AbstractBuildExecution.post(AbstractBuild.java:635)
        at hudson.model.Run.execute(Run.java:1840)
        at hudson.model.FreeStyleBuild.run(FreeStyleBuild.java:43)
        at hudson.model.ResourceController.execute(ResourceController.java:97)
        at hudson.model.Executor.run(Executor.java:429)
No artifacts found that match the file pattern "**/*.events,heapdumps/**,**/*_pid*.log". Configuration error?
[WARNINGS] Parsing warnings in console log with parser Java Compiler (javac)
Setting ANT_1_8_2_HOME=/export/home/jenkins/tools/hudson.tasks.Ant_AntInstallation/ANT_1.8.2
Setting ANT_1_8_2_HOME=/export/home/jenkins/tools/hudson.tasks.Ant_AntInstallation/ANT_1.8.2
<Git Blamer> Using GitBlamer to create author and commit information for all warnings.
<Git Blamer> GIT_COMMIT=ae6ceb5cb302b6db17637b5097f5f07740287fb3, workspace=/export/home/jenkins/workspace/Lucene-Solr-7.x-Solaris
[WARNINGS] Computing warning deltas based on reference build #816
Recording test results
Setting ANT_1_8_2_HOME=/export/home/jenkins/tools/hudson.tasks.Ant_AntInstallation/ANT_1.8.2
Build step 'Publish JUnit test result report' changed build result to UNSTABLE
Email was triggered for: Unstable (Test Failures)
Sending email for trigger: Unstable (Test Failures)
Setting ANT_1_8_2_HOME=/export/home/jenkins/tools/hudson.tasks.Ant_AntInstallation/ANT_1.8.2
Setting ANT_1_8_2_HOME=/export/home/jenkins/tools/hudson.tasks.Ant_AntInstallation/ANT_1.8.2
Setting ANT_1_8_2_HOME=/export/home/jenkins/tools/hudson.tasks.Ant_AntInstallation/ANT_1.8.2
Setting ANT_1_8_2_HOME=/export/home/jenkins/tools/hudson.tasks.Ant_AntInstallation/ANT_1.8.2


---------------------------------------------------------------------
To unsubscribe, e-mail: [hidden email]
For additional commands, e-mail: [hidden email]