[JENKINS] Lucene-Solr-7.x-Windows (32bit/jdk1.8.0_131) - Build # 47 - Unstable!

Previous Topic Next Topic
 
classic Classic list List threaded Threaded
1 message Options
Reply | Threaded
Open this post in threaded view
|  
Report Content as Inappropriate

[JENKINS] Lucene-Solr-7.x-Windows (32bit/jdk1.8.0_131) - Build # 47 - Unstable!

Policeman Jenkins Server-2
Build: https://jenkins.thetaphi.de/job/Lucene-Solr-7.x-Windows/47/
Java: 32bit/jdk1.8.0_131 -server -XX:+UseSerialGC

3 tests failed.
FAILED:  org.apache.solr.cloud.ChaosMonkeyNothingIsSafeTest.test

Error Message:
Timeout occured while waiting response from server at: http://127.0.0.1:55748/collection1

Stack Trace:
org.apache.solr.client.solrj.SolrServerException: Timeout occured while waiting response from server at: http://127.0.0.1:55748/collection1
        at __randomizedtesting.SeedInfo.seed([1F4C7C087F1CC38B:971843D2D1E0AE73]:0)
        at org.apache.solr.client.solrj.impl.HttpSolrClient.executeMethod(HttpSolrClient.java:637)
        at org.apache.solr.client.solrj.impl.HttpSolrClient.request(HttpSolrClient.java:252)
        at org.apache.solr.client.solrj.impl.HttpSolrClient.request(HttpSolrClient.java:241)
        at org.apache.solr.client.solrj.impl.LBHttpSolrClient.doRequest(LBHttpSolrClient.java:483)
        at org.apache.solr.client.solrj.impl.LBHttpSolrClient.request(LBHttpSolrClient.java:413)
        at org.apache.solr.client.solrj.impl.CloudSolrClient.sendRequest(CloudSolrClient.java:1121)
        at org.apache.solr.client.solrj.impl.CloudSolrClient.requestWithRetryOnStaleState(CloudSolrClient.java:862)
        at org.apache.solr.client.solrj.impl.CloudSolrClient.request(CloudSolrClient.java:793)
        at org.apache.solr.client.solrj.SolrRequest.process(SolrRequest.java:178)
        at org.apache.solr.client.solrj.SolrClient.commit(SolrClient.java:484)
        at org.apache.solr.client.solrj.SolrClient.commit(SolrClient.java:463)
        at org.apache.solr.cloud.AbstractFullDistribZkTestBase.commit(AbstractFullDistribZkTestBase.java:1581)
        at org.apache.solr.cloud.ChaosMonkeyNothingIsSafeTest.test(ChaosMonkeyNothingIsSafeTest.java:213)
        at sun.reflect.NativeMethodAccessorImpl.invoke0(Native Method)
        at sun.reflect.NativeMethodAccessorImpl.invoke(NativeMethodAccessorImpl.java:62)
        at sun.reflect.DelegatingMethodAccessorImpl.invoke(DelegatingMethodAccessorImpl.java:43)
        at java.lang.reflect.Method.invoke(Method.java:498)
        at com.carrotsearch.randomizedtesting.RandomizedRunner.invoke(RandomizedRunner.java:1713)
        at com.carrotsearch.randomizedtesting.RandomizedRunner$8.evaluate(RandomizedRunner.java:907)
        at com.carrotsearch.randomizedtesting.RandomizedRunner$9.evaluate(RandomizedRunner.java:943)
        at com.carrotsearch.randomizedtesting.RandomizedRunner$10.evaluate(RandomizedRunner.java:957)
        at org.apache.solr.BaseDistributedSearchTestCase$ShardsRepeatRule$ShardsFixedStatement.callStatement(BaseDistributedSearchTestCase.java:985)
        at org.apache.solr.BaseDistributedSearchTestCase$ShardsRepeatRule$ShardsStatement.evaluate(BaseDistributedSearchTestCase.java:960)
        at com.carrotsearch.randomizedtesting.rules.SystemPropertiesRestoreRule$1.evaluate(SystemPropertiesRestoreRule.java:57)
        at org.apache.lucene.util.TestRuleSetupTeardownChained$1.evaluate(TestRuleSetupTeardownChained.java:49)
        at org.apache.lucene.util.AbstractBeforeAfterRule$1.evaluate(AbstractBeforeAfterRule.java:45)
        at org.apache.lucene.util.TestRuleThreadAndTestName$1.evaluate(TestRuleThreadAndTestName.java:48)
        at org.apache.lucene.util.TestRuleIgnoreAfterMaxFailures$1.evaluate(TestRuleIgnoreAfterMaxFailures.java:64)
        at org.apache.lucene.util.TestRuleMarkFailure$1.evaluate(TestRuleMarkFailure.java:47)
        at com.carrotsearch.randomizedtesting.rules.StatementAdapter.evaluate(StatementAdapter.java:36)
        at com.carrotsearch.randomizedtesting.ThreadLeakControl$StatementRunner.run(ThreadLeakControl.java:368)
        at com.carrotsearch.randomizedtesting.ThreadLeakControl.forkTimeoutingTask(ThreadLeakControl.java:817)
        at com.carrotsearch.randomizedtesting.ThreadLeakControl$3.evaluate(ThreadLeakControl.java:468)
        at com.carrotsearch.randomizedtesting.RandomizedRunner.runSingleTest(RandomizedRunner.java:916)
        at com.carrotsearch.randomizedtesting.RandomizedRunner$5.evaluate(RandomizedRunner.java:802)
        at com.carrotsearch.randomizedtesting.RandomizedRunner$6.evaluate(RandomizedRunner.java:852)
        at com.carrotsearch.randomizedtesting.RandomizedRunner$7.evaluate(RandomizedRunner.java:863)
        at com.carrotsearch.randomizedtesting.rules.StatementAdapter.evaluate(StatementAdapter.java:36)
        at com.carrotsearch.randomizedtesting.rules.SystemPropertiesRestoreRule$1.evaluate(SystemPropertiesRestoreRule.java:57)
        at org.apache.lucene.util.AbstractBeforeAfterRule$1.evaluate(AbstractBeforeAfterRule.java:45)
        at com.carrotsearch.randomizedtesting.rules.StatementAdapter.evaluate(StatementAdapter.java:36)
        at org.apache.lucene.util.TestRuleStoreClassName$1.evaluate(TestRuleStoreClassName.java:41)
        at com.carrotsearch.randomizedtesting.rules.NoShadowingOrOverridesOnMethodsRule$1.evaluate(NoShadowingOrOverridesOnMethodsRule.java:40)
        at com.carrotsearch.randomizedtesting.rules.NoShadowingOrOverridesOnMethodsRule$1.evaluate(NoShadowingOrOverridesOnMethodsRule.java:40)
        at com.carrotsearch.randomizedtesting.rules.StatementAdapter.evaluate(StatementAdapter.java:36)
        at com.carrotsearch.randomizedtesting.rules.StatementAdapter.evaluate(StatementAdapter.java:36)
        at com.carrotsearch.randomizedtesting.rules.StatementAdapter.evaluate(StatementAdapter.java:36)
        at org.apache.lucene.util.TestRuleAssertionsRequired$1.evaluate(TestRuleAssertionsRequired.java:53)
        at org.apache.lucene.util.TestRuleMarkFailure$1.evaluate(TestRuleMarkFailure.java:47)
        at org.apache.lucene.util.TestRuleIgnoreAfterMaxFailures$1.evaluate(TestRuleIgnoreAfterMaxFailures.java:64)
        at org.apache.lucene.util.TestRuleIgnoreTestSuites$1.evaluate(TestRuleIgnoreTestSuites.java:54)
        at com.carrotsearch.randomizedtesting.rules.StatementAdapter.evaluate(StatementAdapter.java:36)
        at com.carrotsearch.randomizedtesting.ThreadLeakControl$StatementRunner.run(ThreadLeakControl.java:368)
        at java.lang.Thread.run(Thread.java:748)
Caused by: java.net.SocketTimeoutException: Read timed out
        at java.net.SocketInputStream.socketRead0(Native Method)
        at java.net.SocketInputStream.socketRead(SocketInputStream.java:116)
        at java.net.SocketInputStream.read(SocketInputStream.java:171)
        at java.net.SocketInputStream.read(SocketInputStream.java:141)
        at org.apache.http.impl.io.SessionInputBufferImpl.streamRead(SessionInputBufferImpl.java:139)
        at org.apache.http.impl.io.SessionInputBufferImpl.fillBuffer(SessionInputBufferImpl.java:155)
        at org.apache.http.impl.io.SessionInputBufferImpl.readLine(SessionInputBufferImpl.java:284)
        at org.apache.http.impl.conn.DefaultHttpResponseParser.parseHead(DefaultHttpResponseParser.java:140)
        at org.apache.http.impl.conn.DefaultHttpResponseParser.parseHead(DefaultHttpResponseParser.java:57)
        at org.apache.http.impl.io.AbstractMessageParser.parse(AbstractMessageParser.java:261)
        at org.apache.http.impl.DefaultBHttpClientConnection.receiveResponseHeader(DefaultBHttpClientConnection.java:165)
        at org.apache.http.impl.conn.CPoolProxy.receiveResponseHeader(CPoolProxy.java:167)
        at org.apache.http.protocol.HttpRequestExecutor.doReceiveResponse(HttpRequestExecutor.java:272)
        at org.apache.http.protocol.HttpRequestExecutor.execute(HttpRequestExecutor.java:124)
        at org.apache.http.impl.execchain.MainClientExec.execute(MainClientExec.java:271)
        at org.apache.http.impl.execchain.ProtocolExec.execute(ProtocolExec.java:184)
        at org.apache.http.impl.execchain.RetryExec.execute(RetryExec.java:88)
        at org.apache.http.impl.execchain.RedirectExec.execute(RedirectExec.java:110)
        at org.apache.http.impl.client.InternalHttpClient.doExecute(InternalHttpClient.java:184)
        at org.apache.http.impl.client.CloseableHttpClient.execute(CloseableHttpClient.java:82)
        at org.apache.http.impl.client.CloseableHttpClient.execute(CloseableHttpClient.java:55)
        at org.apache.solr.client.solrj.impl.HttpSolrClient.executeMethod(HttpSolrClient.java:523)
        ... 53 more


FAILED:  junit.framework.TestSuite.org.apache.solr.cloud.ChaosMonkeyNothingIsSafeTest

Error Message:
9 threads leaked from SUITE scope at org.apache.solr.cloud.ChaosMonkeyNothingIsSafeTest:     1) Thread[id=4106, name=zkCallback-1325-thread-6, state=TIMED_WAITING, group=TGRP-ChaosMonkeyNothingIsSafeTest]         at sun.misc.Unsafe.park(Native Method)         at java.util.concurrent.locks.LockSupport.parkNanos(LockSupport.java:215)         at java.util.concurrent.SynchronousQueue$TransferStack.awaitFulfill(SynchronousQueue.java:460)         at java.util.concurrent.SynchronousQueue$TransferStack.transfer(SynchronousQueue.java:362)         at java.util.concurrent.SynchronousQueue.poll(SynchronousQueue.java:941)         at java.util.concurrent.ThreadPoolExecutor.getTask(ThreadPoolExecutor.java:1066)         at java.util.concurrent.ThreadPoolExecutor.runWorker(ThreadPoolExecutor.java:1127)         at java.util.concurrent.ThreadPoolExecutor$Worker.run(ThreadPoolExecutor.java:617)         at java.lang.Thread.run(Thread.java:748)    2) Thread[id=3976, name=zkCallback-1325-thread-1, state=TIMED_WAITING, group=TGRP-ChaosMonkeyNothingIsSafeTest]         at sun.misc.Unsafe.park(Native Method)         at java.util.concurrent.locks.LockSupport.parkNanos(LockSupport.java:215)         at java.util.concurrent.SynchronousQueue$TransferStack.awaitFulfill(SynchronousQueue.java:460)         at java.util.concurrent.SynchronousQueue$TransferStack.transfer(SynchronousQueue.java:362)         at java.util.concurrent.SynchronousQueue.poll(SynchronousQueue.java:941)         at java.util.concurrent.ThreadPoolExecutor.getTask(ThreadPoolExecutor.java:1066)         at java.util.concurrent.ThreadPoolExecutor.runWorker(ThreadPoolExecutor.java:1127)         at java.util.concurrent.ThreadPoolExecutor$Worker.run(ThreadPoolExecutor.java:617)         at java.lang.Thread.run(Thread.java:748)    3) Thread[id=4105, name=zkCallback-1325-thread-5, state=TIMED_WAITING, group=TGRP-ChaosMonkeyNothingIsSafeTest]         at sun.misc.Unsafe.park(Native Method)         at java.util.concurrent.locks.LockSupport.parkNanos(LockSupport.java:215)         at java.util.concurrent.SynchronousQueue$TransferStack.awaitFulfill(SynchronousQueue.java:460)         at java.util.concurrent.SynchronousQueue$TransferStack.transfer(SynchronousQueue.java:362)         at java.util.concurrent.SynchronousQueue.poll(SynchronousQueue.java:941)         at java.util.concurrent.ThreadPoolExecutor.getTask(ThreadPoolExecutor.java:1066)         at java.util.concurrent.ThreadPoolExecutor.runWorker(ThreadPoolExecutor.java:1127)         at java.util.concurrent.ThreadPoolExecutor$Worker.run(ThreadPoolExecutor.java:617)         at java.lang.Thread.run(Thread.java:748)    4) Thread[id=3973, name=Connection evictor, state=TIMED_WAITING, group=TGRP-ChaosMonkeyNothingIsSafeTest]         at java.lang.Thread.sleep(Native Method)         at org.apache.http.impl.client.IdleConnectionEvictor$1.run(IdleConnectionEvictor.java:66)         at java.lang.Thread.run(Thread.java:748)    5) Thread[id=3975, name=TEST-ChaosMonkeyNothingIsSafeTest.test-seed#[1F4C7C087F1CC38B]-EventThread, state=WAITING, group=TGRP-ChaosMonkeyNothingIsSafeTest]         at sun.misc.Unsafe.park(Native Method)         at java.util.concurrent.locks.LockSupport.park(LockSupport.java:175)         at java.util.concurrent.locks.AbstractQueuedSynchronizer$ConditionObject.await(AbstractQueuedSynchronizer.java:2039)         at java.util.concurrent.LinkedBlockingQueue.take(LinkedBlockingQueue.java:442)         at org.apache.zookeeper.ClientCnxn$EventThread.run(ClientCnxn.java:501)    6) Thread[id=4102, name=zkCallback-1325-thread-2, state=TIMED_WAITING, group=TGRP-ChaosMonkeyNothingIsSafeTest]         at sun.misc.Unsafe.park(Native Method)         at java.util.concurrent.locks.LockSupport.parkNanos(LockSupport.java:215)         at java.util.concurrent.SynchronousQueue$TransferStack.awaitFulfill(SynchronousQueue.java:460)         at java.util.concurrent.SynchronousQueue$TransferStack.transfer(SynchronousQueue.java:362)         at java.util.concurrent.SynchronousQueue.poll(SynchronousQueue.java:941)         at java.util.concurrent.ThreadPoolExecutor.getTask(ThreadPoolExecutor.java:1066)         at java.util.concurrent.ThreadPoolExecutor.runWorker(ThreadPoolExecutor.java:1127)         at java.util.concurrent.ThreadPoolExecutor$Worker.run(ThreadPoolExecutor.java:617)         at java.lang.Thread.run(Thread.java:748)    7) Thread[id=4103, name=zkCallback-1325-thread-3, state=TIMED_WAITING, group=TGRP-ChaosMonkeyNothingIsSafeTest]         at sun.misc.Unsafe.park(Native Method)         at java.util.concurrent.locks.LockSupport.parkNanos(LockSupport.java:215)         at java.util.concurrent.SynchronousQueue$TransferStack.awaitFulfill(SynchronousQueue.java:460)         at java.util.concurrent.SynchronousQueue$TransferStack.transfer(SynchronousQueue.java:362)         at java.util.concurrent.SynchronousQueue.poll(SynchronousQueue.java:941)         at java.util.concurrent.ThreadPoolExecutor.getTask(ThreadPoolExecutor.java:1066)         at java.util.concurrent.ThreadPoolExecutor.runWorker(ThreadPoolExecutor.java:1127)         at java.util.concurrent.ThreadPoolExecutor$Worker.run(ThreadPoolExecutor.java:617)         at java.lang.Thread.run(Thread.java:748)    8) Thread[id=3974, name=TEST-ChaosMonkeyNothingIsSafeTest.test-seed#[1F4C7C087F1CC38B]-SendThread(127.0.0.1:55672), state=RUNNABLE, group=TGRP-ChaosMonkeyNothingIsSafeTest]         at sun.nio.ch.WindowsSelectorImpl$SubSelector.poll0(Native Method)         at sun.nio.ch.WindowsSelectorImpl$SubSelector.poll(WindowsSelectorImpl.java:296)         at sun.nio.ch.WindowsSelectorImpl$SubSelector.access$400(WindowsSelectorImpl.java:278)         at sun.nio.ch.WindowsSelectorImpl.doSelect(WindowsSelectorImpl.java:159)         at sun.nio.ch.SelectorImpl.lockAndDoSelect(SelectorImpl.java:86)         at sun.nio.ch.SelectorImpl.select(SelectorImpl.java:97)         at org.apache.zookeeper.ClientCnxnSocketNIO.doTransport(ClientCnxnSocketNIO.java:349)         at org.apache.zookeeper.ClientCnxn$SendThread.run(ClientCnxn.java:1141)    9) Thread[id=4104, name=zkCallback-1325-thread-4, state=TIMED_WAITING, group=TGRP-ChaosMonkeyNothingIsSafeTest]         at sun.misc.Unsafe.park(Native Method)         at java.util.concurrent.locks.LockSupport.parkNanos(LockSupport.java:215)         at java.util.concurrent.SynchronousQueue$TransferStack.awaitFulfill(SynchronousQueue.java:460)         at java.util.concurrent.SynchronousQueue$TransferStack.transfer(SynchronousQueue.java:362)         at java.util.concurrent.SynchronousQueue.poll(SynchronousQueue.java:941)         at java.util.concurrent.ThreadPoolExecutor.getTask(ThreadPoolExecutor.java:1066)         at java.util.concurrent.ThreadPoolExecutor.runWorker(ThreadPoolExecutor.java:1127)         at java.util.concurrent.ThreadPoolExecutor$Worker.run(ThreadPoolExecutor.java:617)         at java.lang.Thread.run(Thread.java:748)

Stack Trace:
com.carrotsearch.randomizedtesting.ThreadLeakError: 9 threads leaked from SUITE scope at org.apache.solr.cloud.ChaosMonkeyNothingIsSafeTest:
   1) Thread[id=4106, name=zkCallback-1325-thread-6, state=TIMED_WAITING, group=TGRP-ChaosMonkeyNothingIsSafeTest]
        at sun.misc.Unsafe.park(Native Method)
        at java.util.concurrent.locks.LockSupport.parkNanos(LockSupport.java:215)
        at java.util.concurrent.SynchronousQueue$TransferStack.awaitFulfill(SynchronousQueue.java:460)
        at java.util.concurrent.SynchronousQueue$TransferStack.transfer(SynchronousQueue.java:362)
        at java.util.concurrent.SynchronousQueue.poll(SynchronousQueue.java:941)
        at java.util.concurrent.ThreadPoolExecutor.getTask(ThreadPoolExecutor.java:1066)
        at java.util.concurrent.ThreadPoolExecutor.runWorker(ThreadPoolExecutor.java:1127)
        at java.util.concurrent.ThreadPoolExecutor$Worker.run(ThreadPoolExecutor.java:617)
        at java.lang.Thread.run(Thread.java:748)
   2) Thread[id=3976, name=zkCallback-1325-thread-1, state=TIMED_WAITING, group=TGRP-ChaosMonkeyNothingIsSafeTest]
        at sun.misc.Unsafe.park(Native Method)
        at java.util.concurrent.locks.LockSupport.parkNanos(LockSupport.java:215)
        at java.util.concurrent.SynchronousQueue$TransferStack.awaitFulfill(SynchronousQueue.java:460)
        at java.util.concurrent.SynchronousQueue$TransferStack.transfer(SynchronousQueue.java:362)
        at java.util.concurrent.SynchronousQueue.poll(SynchronousQueue.java:941)
        at java.util.concurrent.ThreadPoolExecutor.getTask(ThreadPoolExecutor.java:1066)
        at java.util.concurrent.ThreadPoolExecutor.runWorker(ThreadPoolExecutor.java:1127)
        at java.util.concurrent.ThreadPoolExecutor$Worker.run(ThreadPoolExecutor.java:617)
        at java.lang.Thread.run(Thread.java:748)
   3) Thread[id=4105, name=zkCallback-1325-thread-5, state=TIMED_WAITING, group=TGRP-ChaosMonkeyNothingIsSafeTest]
        at sun.misc.Unsafe.park(Native Method)
        at java.util.concurrent.locks.LockSupport.parkNanos(LockSupport.java:215)
        at java.util.concurrent.SynchronousQueue$TransferStack.awaitFulfill(SynchronousQueue.java:460)
        at java.util.concurrent.SynchronousQueue$TransferStack.transfer(SynchronousQueue.java:362)
        at java.util.concurrent.SynchronousQueue.poll(SynchronousQueue.java:941)
        at java.util.concurrent.ThreadPoolExecutor.getTask(ThreadPoolExecutor.java:1066)
        at java.util.concurrent.ThreadPoolExecutor.runWorker(ThreadPoolExecutor.java:1127)
        at java.util.concurrent.ThreadPoolExecutor$Worker.run(ThreadPoolExecutor.java:617)
        at java.lang.Thread.run(Thread.java:748)
   4) Thread[id=3973, name=Connection evictor, state=TIMED_WAITING, group=TGRP-ChaosMonkeyNothingIsSafeTest]
        at java.lang.Thread.sleep(Native Method)
        at org.apache.http.impl.client.IdleConnectionEvictor$1.run(IdleConnectionEvictor.java:66)
        at java.lang.Thread.run(Thread.java:748)
   5) Thread[id=3975, name=TEST-ChaosMonkeyNothingIsSafeTest.test-seed#[1F4C7C087F1CC38B]-EventThread, state=WAITING, group=TGRP-ChaosMonkeyNothingIsSafeTest]
        at sun.misc.Unsafe.park(Native Method)
        at java.util.concurrent.locks.LockSupport.park(LockSupport.java:175)
        at java.util.concurrent.locks.AbstractQueuedSynchronizer$ConditionObject.await(AbstractQueuedSynchronizer.java:2039)
        at java.util.concurrent.LinkedBlockingQueue.take(LinkedBlockingQueue.java:442)
        at org.apache.zookeeper.ClientCnxn$EventThread.run(ClientCnxn.java:501)
   6) Thread[id=4102, name=zkCallback-1325-thread-2, state=TIMED_WAITING, group=TGRP-ChaosMonkeyNothingIsSafeTest]
        at sun.misc.Unsafe.park(Native Method)
        at java.util.concurrent.locks.LockSupport.parkNanos(LockSupport.java:215)
        at java.util.concurrent.SynchronousQueue$TransferStack.awaitFulfill(SynchronousQueue.java:460)
        at java.util.concurrent.SynchronousQueue$TransferStack.transfer(SynchronousQueue.java:362)
        at java.util.concurrent.SynchronousQueue.poll(SynchronousQueue.java:941)
        at java.util.concurrent.ThreadPoolExecutor.getTask(ThreadPoolExecutor.java:1066)
        at java.util.concurrent.ThreadPoolExecutor.runWorker(ThreadPoolExecutor.java:1127)
        at java.util.concurrent.ThreadPoolExecutor$Worker.run(ThreadPoolExecutor.java:617)
        at java.lang.Thread.run(Thread.java:748)
   7) Thread[id=4103, name=zkCallback-1325-thread-3, state=TIMED_WAITING, group=TGRP-ChaosMonkeyNothingIsSafeTest]
        at sun.misc.Unsafe.park(Native Method)
        at java.util.concurrent.locks.LockSupport.parkNanos(LockSupport.java:215)
        at java.util.concurrent.SynchronousQueue$TransferStack.awaitFulfill(SynchronousQueue.java:460)
        at java.util.concurrent.SynchronousQueue$TransferStack.transfer(SynchronousQueue.java:362)
        at java.util.concurrent.SynchronousQueue.poll(SynchronousQueue.java:941)
        at java.util.concurrent.ThreadPoolExecutor.getTask(ThreadPoolExecutor.java:1066)
        at java.util.concurrent.ThreadPoolExecutor.runWorker(ThreadPoolExecutor.java:1127)
        at java.util.concurrent.ThreadPoolExecutor$Worker.run(ThreadPoolExecutor.java:617)
        at java.lang.Thread.run(Thread.java:748)
   8) Thread[id=3974, name=TEST-ChaosMonkeyNothingIsSafeTest.test-seed#[1F4C7C087F1CC38B]-SendThread(127.0.0.1:55672), state=RUNNABLE, group=TGRP-ChaosMonkeyNothingIsSafeTest]
        at sun.nio.ch.WindowsSelectorImpl$SubSelector.poll0(Native Method)
        at sun.nio.ch.WindowsSelectorImpl$SubSelector.poll(WindowsSelectorImpl.java:296)
        at sun.nio.ch.WindowsSelectorImpl$SubSelector.access$400(WindowsSelectorImpl.java:278)
        at sun.nio.ch.WindowsSelectorImpl.doSelect(WindowsSelectorImpl.java:159)
        at sun.nio.ch.SelectorImpl.lockAndDoSelect(SelectorImpl.java:86)
        at sun.nio.ch.SelectorImpl.select(SelectorImpl.java:97)
        at org.apache.zookeeper.ClientCnxnSocketNIO.doTransport(ClientCnxnSocketNIO.java:349)
        at org.apache.zookeeper.ClientCnxn$SendThread.run(ClientCnxn.java:1141)
   9) Thread[id=4104, name=zkCallback-1325-thread-4, state=TIMED_WAITING, group=TGRP-ChaosMonkeyNothingIsSafeTest]
        at sun.misc.Unsafe.park(Native Method)
        at java.util.concurrent.locks.LockSupport.parkNanos(LockSupport.java:215)
        at java.util.concurrent.SynchronousQueue$TransferStack.awaitFulfill(SynchronousQueue.java:460)
        at java.util.concurrent.SynchronousQueue$TransferStack.transfer(SynchronousQueue.java:362)
        at java.util.concurrent.SynchronousQueue.poll(SynchronousQueue.java:941)
        at java.util.concurrent.ThreadPoolExecutor.getTask(ThreadPoolExecutor.java:1066)
        at java.util.concurrent.ThreadPoolExecutor.runWorker(ThreadPoolExecutor.java:1127)
        at java.util.concurrent.ThreadPoolExecutor$Worker.run(ThreadPoolExecutor.java:617)
        at java.lang.Thread.run(Thread.java:748)
        at __randomizedtesting.SeedInfo.seed([1F4C7C087F1CC38B]:0)


FAILED:  junit.framework.TestSuite.org.apache.solr.cloud.ChaosMonkeyNothingIsSafeTest

Error Message:
There are still zombie threads that couldn't be terminated:    1) Thread[id=4106, name=zkCallback-1325-thread-6, state=TIMED_WAITING, group=TGRP-ChaosMonkeyNothingIsSafeTest]         at sun.misc.Unsafe.park(Native Method)         at java.util.concurrent.locks.LockSupport.parkNanos(LockSupport.java:215)         at java.util.concurrent.SynchronousQueue$TransferStack.awaitFulfill(SynchronousQueue.java:460)         at java.util.concurrent.SynchronousQueue$TransferStack.transfer(SynchronousQueue.java:362)         at java.util.concurrent.SynchronousQueue.poll(SynchronousQueue.java:941)         at java.util.concurrent.ThreadPoolExecutor.getTask(ThreadPoolExecutor.java:1066)         at java.util.concurrent.ThreadPoolExecutor.runWorker(ThreadPoolExecutor.java:1127)         at java.util.concurrent.ThreadPoolExecutor$Worker.run(ThreadPoolExecutor.java:617)         at java.lang.Thread.run(Thread.java:748)    2) Thread[id=3976, name=zkCallback-1325-thread-1, state=TIMED_WAITING, group=TGRP-ChaosMonkeyNothingIsSafeTest]         at sun.misc.Unsafe.park(Native Method)         at java.util.concurrent.locks.LockSupport.parkNanos(LockSupport.java:215)         at java.util.concurrent.SynchronousQueue$TransferStack.awaitFulfill(SynchronousQueue.java:460)         at java.util.concurrent.SynchronousQueue$TransferStack.transfer(SynchronousQueue.java:362)         at java.util.concurrent.SynchronousQueue.poll(SynchronousQueue.java:941)         at java.util.concurrent.ThreadPoolExecutor.getTask(ThreadPoolExecutor.java:1066)         at java.util.concurrent.ThreadPoolExecutor.runWorker(ThreadPoolExecutor.java:1127)         at java.util.concurrent.ThreadPoolExecutor$Worker.run(ThreadPoolExecutor.java:617)         at java.lang.Thread.run(Thread.java:748)    3) Thread[id=4105, name=zkCallback-1325-thread-5, state=TIMED_WAITING, group=TGRP-ChaosMonkeyNothingIsSafeTest]         at sun.misc.Unsafe.park(Native Method)         at java.util.concurrent.locks.LockSupport.parkNanos(LockSupport.java:215)         at java.util.concurrent.SynchronousQueue$TransferStack.awaitFulfill(SynchronousQueue.java:460)         at java.util.concurrent.SynchronousQueue$TransferStack.transfer(SynchronousQueue.java:362)         at java.util.concurrent.SynchronousQueue.poll(SynchronousQueue.java:941)         at java.util.concurrent.ThreadPoolExecutor.getTask(ThreadPoolExecutor.java:1066)         at java.util.concurrent.ThreadPoolExecutor.runWorker(ThreadPoolExecutor.java:1127)         at java.util.concurrent.ThreadPoolExecutor$Worker.run(ThreadPoolExecutor.java:617)         at java.lang.Thread.run(Thread.java:748)    4) Thread[id=4102, name=zkCallback-1325-thread-2, state=TIMED_WAITING, group=TGRP-ChaosMonkeyNothingIsSafeTest]         at sun.misc.Unsafe.park(Native Method)         at java.util.concurrent.locks.LockSupport.parkNanos(LockSupport.java:215)         at java.util.concurrent.SynchronousQueue$TransferStack.awaitFulfill(SynchronousQueue.java:460)         at java.util.concurrent.SynchronousQueue$TransferStack.transfer(SynchronousQueue.java:362)         at java.util.concurrent.SynchronousQueue.poll(SynchronousQueue.java:941)         at java.util.concurrent.ThreadPoolExecutor.getTask(ThreadPoolExecutor.java:1066)         at java.util.concurrent.ThreadPoolExecutor.runWorker(ThreadPoolExecutor.java:1127)         at java.util.concurrent.ThreadPoolExecutor$Worker.run(ThreadPoolExecutor.java:617)         at java.lang.Thread.run(Thread.java:748)    5) Thread[id=4103, name=zkCallback-1325-thread-3, state=TIMED_WAITING, group=TGRP-ChaosMonkeyNothingIsSafeTest]         at sun.misc.Unsafe.park(Native Method)         at java.util.concurrent.locks.LockSupport.parkNanos(LockSupport.java:215)         at java.util.concurrent.SynchronousQueue$TransferStack.awaitFulfill(SynchronousQueue.java:460)         at java.util.concurrent.SynchronousQueue$TransferStack.transfer(SynchronousQueue.java:362)         at java.util.concurrent.SynchronousQueue.poll(SynchronousQueue.java:941)         at java.util.concurrent.ThreadPoolExecutor.getTask(ThreadPoolExecutor.java:1066)         at java.util.concurrent.ThreadPoolExecutor.runWorker(ThreadPoolExecutor.java:1127)         at java.util.concurrent.ThreadPoolExecutor$Worker.run(ThreadPoolExecutor.java:617)         at java.lang.Thread.run(Thread.java:748)    6) Thread[id=3974, name=TEST-ChaosMonkeyNothingIsSafeTest.test-seed#[1F4C7C087F1CC38B]-SendThread(127.0.0.1:55672), state=TIMED_WAITING, group=TGRP-ChaosMonkeyNothingIsSafeTest]         at java.lang.Thread.sleep(Native Method)         at org.apache.zookeeper.client.StaticHostProvider.next(StaticHostProvider.java:101)         at org.apache.zookeeper.ClientCnxn$SendThread.startConnect(ClientCnxn.java:997)         at org.apache.zookeeper.ClientCnxn$SendThread.run(ClientCnxn.java:1060)    7) Thread[id=4104, name=zkCallback-1325-thread-4, state=TIMED_WAITING, group=TGRP-ChaosMonkeyNothingIsSafeTest]         at sun.misc.Unsafe.park(Native Method)         at java.util.concurrent.locks.LockSupport.parkNanos(LockSupport.java:215)         at java.util.concurrent.SynchronousQueue$TransferStack.awaitFulfill(SynchronousQueue.java:460)         at java.util.concurrent.SynchronousQueue$TransferStack.transfer(SynchronousQueue.java:362)         at java.util.concurrent.SynchronousQueue.poll(SynchronousQueue.java:941)         at java.util.concurrent.ThreadPoolExecutor.getTask(ThreadPoolExecutor.java:1066)         at java.util.concurrent.ThreadPoolExecutor.runWorker(ThreadPoolExecutor.java:1127)         at java.util.concurrent.ThreadPoolExecutor$Worker.run(ThreadPoolExecutor.java:617)         at java.lang.Thread.run(Thread.java:748)

Stack Trace:
com.carrotsearch.randomizedtesting.ThreadLeakError: There are still zombie threads that couldn't be terminated:
   1) Thread[id=4106, name=zkCallback-1325-thread-6, state=TIMED_WAITING, group=TGRP-ChaosMonkeyNothingIsSafeTest]
        at sun.misc.Unsafe.park(Native Method)
        at java.util.concurrent.locks.LockSupport.parkNanos(LockSupport.java:215)
        at java.util.concurrent.SynchronousQueue$TransferStack.awaitFulfill(SynchronousQueue.java:460)
        at java.util.concurrent.SynchronousQueue$TransferStack.transfer(SynchronousQueue.java:362)
        at java.util.concurrent.SynchronousQueue.poll(SynchronousQueue.java:941)
        at java.util.concurrent.ThreadPoolExecutor.getTask(ThreadPoolExecutor.java:1066)
        at java.util.concurrent.ThreadPoolExecutor.runWorker(ThreadPoolExecutor.java:1127)
        at java.util.concurrent.ThreadPoolExecutor$Worker.run(ThreadPoolExecutor.java:617)
        at java.lang.Thread.run(Thread.java:748)
   2) Thread[id=3976, name=zkCallback-1325-thread-1, state=TIMED_WAITING, group=TGRP-ChaosMonkeyNothingIsSafeTest]
        at sun.misc.Unsafe.park(Native Method)
        at java.util.concurrent.locks.LockSupport.parkNanos(LockSupport.java:215)
        at java.util.concurrent.SynchronousQueue$TransferStack.awaitFulfill(SynchronousQueue.java:460)
        at java.util.concurrent.SynchronousQueue$TransferStack.transfer(SynchronousQueue.java:362)
        at java.util.concurrent.SynchronousQueue.poll(SynchronousQueue.java:941)
        at java.util.concurrent.ThreadPoolExecutor.getTask(ThreadPoolExecutor.java:1066)
        at java.util.concurrent.ThreadPoolExecutor.runWorker(ThreadPoolExecutor.java:1127)
        at java.util.concurrent.ThreadPoolExecutor$Worker.run(ThreadPoolExecutor.java:617)
        at java.lang.Thread.run(Thread.java:748)
   3) Thread[id=4105, name=zkCallback-1325-thread-5, state=TIMED_WAITING, group=TGRP-ChaosMonkeyNothingIsSafeTest]
        at sun.misc.Unsafe.park(Native Method)
        at java.util.concurrent.locks.LockSupport.parkNanos(LockSupport.java:215)
        at java.util.concurrent.SynchronousQueue$TransferStack.awaitFulfill(SynchronousQueue.java:460)
        at java.util.concurrent.SynchronousQueue$TransferStack.transfer(SynchronousQueue.java:362)
        at java.util.concurrent.SynchronousQueue.poll(SynchronousQueue.java:941)
        at java.util.concurrent.ThreadPoolExecutor.getTask(ThreadPoolExecutor.java:1066)
        at java.util.concurrent.ThreadPoolExecutor.runWorker(ThreadPoolExecutor.java:1127)
        at java.util.concurrent.ThreadPoolExecutor$Worker.run(ThreadPoolExecutor.java:617)
        at java.lang.Thread.run(Thread.java:748)
   4) Thread[id=4102, name=zkCallback-1325-thread-2, state=TIMED_WAITING, group=TGRP-ChaosMonkeyNothingIsSafeTest]
        at sun.misc.Unsafe.park(Native Method)
        at java.util.concurrent.locks.LockSupport.parkNanos(LockSupport.java:215)
        at java.util.concurrent.SynchronousQueue$TransferStack.awaitFulfill(SynchronousQueue.java:460)
        at java.util.concurrent.SynchronousQueue$TransferStack.transfer(SynchronousQueue.java:362)
        at java.util.concurrent.SynchronousQueue.poll(SynchronousQueue.java:941)
        at java.util.concurrent.ThreadPoolExecutor.getTask(ThreadPoolExecutor.java:1066)
        at java.util.concurrent.ThreadPoolExecutor.runWorker(ThreadPoolExecutor.java:1127)
        at java.util.concurrent.ThreadPoolExecutor$Worker.run(ThreadPoolExecutor.java:617)
        at java.lang.Thread.run(Thread.java:748)
   5) Thread[id=4103, name=zkCallback-1325-thread-3, state=TIMED_WAITING, group=TGRP-ChaosMonkeyNothingIsSafeTest]
        at sun.misc.Unsafe.park(Native Method)
        at java.util.concurrent.locks.LockSupport.parkNanos(LockSupport.java:215)
        at java.util.concurrent.SynchronousQueue$TransferStack.awaitFulfill(SynchronousQueue.java:460)
        at java.util.concurrent.SynchronousQueue$TransferStack.transfer(SynchronousQueue.java:362)
        at java.util.concurrent.SynchronousQueue.poll(SynchronousQueue.java:941)
        at java.util.concurrent.ThreadPoolExecutor.getTask(ThreadPoolExecutor.java:1066)
        at java.util.concurrent.ThreadPoolExecutor.runWorker(ThreadPoolExecutor.java:1127)
        at java.util.concurrent.ThreadPoolExecutor$Worker.run(ThreadPoolExecutor.java:617)
        at java.lang.Thread.run(Thread.java:748)
   6) Thread[id=3974, name=TEST-ChaosMonkeyNothingIsSafeTest.test-seed#[1F4C7C087F1CC38B]-SendThread(127.0.0.1:55672), state=TIMED_WAITING, group=TGRP-ChaosMonkeyNothingIsSafeTest]
        at java.lang.Thread.sleep(Native Method)
        at org.apache.zookeeper.client.StaticHostProvider.next(StaticHostProvider.java:101)
        at org.apache.zookeeper.ClientCnxn$SendThread.startConnect(ClientCnxn.java:997)
        at org.apache.zookeeper.ClientCnxn$SendThread.run(ClientCnxn.java:1060)
   7) Thread[id=4104, name=zkCallback-1325-thread-4, state=TIMED_WAITING, group=TGRP-ChaosMonkeyNothingIsSafeTest]
        at sun.misc.Unsafe.park(Native Method)
        at java.util.concurrent.locks.LockSupport.parkNanos(LockSupport.java:215)
        at java.util.concurrent.SynchronousQueue$TransferStack.awaitFulfill(SynchronousQueue.java:460)
        at java.util.concurrent.SynchronousQueue$TransferStack.transfer(SynchronousQueue.java:362)
        at java.util.concurrent.SynchronousQueue.poll(SynchronousQueue.java:941)
        at java.util.concurrent.ThreadPoolExecutor.getTask(ThreadPoolExecutor.java:1066)
        at java.util.concurrent.ThreadPoolExecutor.runWorker(ThreadPoolExecutor.java:1127)
        at java.util.concurrent.ThreadPoolExecutor$Worker.run(ThreadPoolExecutor.java:617)
        at java.lang.Thread.run(Thread.java:748)
        at __randomizedtesting.SeedInfo.seed([1F4C7C087F1CC38B]:0)




Build Log:
[...truncated 11213 lines...]
   [junit4] Suite: org.apache.solr.cloud.ChaosMonkeyNothingIsSafeTest
   [junit4]   2> Creating dataDir: C:\Users\jenkins\workspace\Lucene-Solr-7.x-Windows\solr\build\solr-core\test\J0\temp\solr.cloud.ChaosMonkeyNothingIsSafeTest_1F4C7C087F1CC38B-001\init-core-data-001
   [junit4]   2> 359330 WARN  (SUITE-ChaosMonkeyNothingIsSafeTest-seed#[1F4C7C087F1CC38B]-worker) [    ] o.a.s.SolrTestCaseJ4 startTrackingSearchers: numOpens=1 numCloses=1
   [junit4]   2> 359330 INFO  (SUITE-ChaosMonkeyNothingIsSafeTest-seed#[1F4C7C087F1CC38B]-worker) [    ] o.a.s.SolrTestCaseJ4 Using PointFields (NUMERIC_POINTS_SYSPROP=true) w/NUMERIC_DOCVALUES_SYSPROP=true
   [junit4]   2> 359335 INFO  (SUITE-ChaosMonkeyNothingIsSafeTest-seed#[1F4C7C087F1CC38B]-worker) [    ] o.a.s.SolrTestCaseJ4 Randomized ssl (false) and clientAuth (false) via: @org.apache.solr.SolrTestCaseJ4$SuppressSSL(bugUrl=https://issues.apache.org/jira/browse/SOLR-5776)
   [junit4]   2> 359335 INFO  (SUITE-ChaosMonkeyNothingIsSafeTest-seed#[1F4C7C087F1CC38B]-worker) [    ] o.a.s.BaseDistributedSearchTestCase Setting hostContext system property: /
   [junit4]   2> 359339 INFO  (TEST-ChaosMonkeyNothingIsSafeTest.test-seed#[1F4C7C087F1CC38B]) [    ] o.a.s.c.ZkTestServer STARTING ZK TEST SERVER
   [junit4]   2> 359340 INFO  (Thread-639) [    ] o.a.s.c.ZkTestServer client port:0.0.0.0/0.0.0.0:0
   [junit4]   2> 359340 INFO  (Thread-639) [    ] o.a.s.c.ZkTestServer Starting server
   [junit4]   2> 359344 ERROR (Thread-639) [    ] o.a.z.s.ZooKeeperServer ZKShutdownHandler is not registered, so ZooKeeper server won't take any action on ERROR or SHUTDOWN server state changes
   [junit4]   2> 359440 INFO  (TEST-ChaosMonkeyNothingIsSafeTest.test-seed#[1F4C7C087F1CC38B]) [    ] o.a.s.c.ZkTestServer start zk server on port:55672
   [junit4]   2> 359458 INFO  (TEST-ChaosMonkeyNothingIsSafeTest.test-seed#[1F4C7C087F1CC38B]) [    ] o.a.s.c.AbstractZkTestCase put C:\Users\jenkins\workspace\Lucene-Solr-7.x-Windows\solr\core\src\test-files\solr\collection1\conf\solrconfig-tlog.xml to /configs/conf1/solrconfig.xml
   [junit4]   2> 359460 INFO  (TEST-ChaosMonkeyNothingIsSafeTest.test-seed#[1F4C7C087F1CC38B]) [    ] o.a.s.c.AbstractZkTestCase put C:\Users\jenkins\workspace\Lucene-Solr-7.x-Windows\solr\core\src\test-files\solr\collection1\conf\schema15.xml to /configs/conf1/schema.xml
   [junit4]   2> 359461 INFO  (TEST-ChaosMonkeyNothingIsSafeTest.test-seed#[1F4C7C087F1CC38B]) [    ] o.a.s.c.AbstractZkTestCase put C:\Users\jenkins\workspace\Lucene-Solr-7.x-Windows\solr\core\src\test-files\solr\collection1\conf\solrconfig.snippet.randomindexconfig.xml to /configs/conf1/solrconfig.snippet.randomindexconfig.xml
   [junit4]   2> 359464 INFO  (TEST-ChaosMonkeyNothingIsSafeTest.test-seed#[1F4C7C087F1CC38B]) [    ] o.a.s.c.AbstractZkTestCase put C:\Users\jenkins\workspace\Lucene-Solr-7.x-Windows\solr\core\src\test-files\solr\collection1\conf\stopwords.txt to /configs/conf1/stopwords.txt
   [junit4]   2> 359465 INFO  (TEST-ChaosMonkeyNothingIsSafeTest.test-seed#[1F4C7C087F1CC38B]) [    ] o.a.s.c.AbstractZkTestCase put C:\Users\jenkins\workspace\Lucene-Solr-7.x-Windows\solr\core\src\test-files\solr\collection1\conf\protwords.txt to /configs/conf1/protwords.txt
   [junit4]   2> 359468 INFO  (TEST-ChaosMonkeyNothingIsSafeTest.test-seed#[1F4C7C087F1CC38B]) [    ] o.a.s.c.AbstractZkTestCase put C:\Users\jenkins\workspace\Lucene-Solr-7.x-Windows\solr\core\src\test-files\solr\collection1\conf\currency.xml to /configs/conf1/currency.xml
   [junit4]   2> 359469 INFO  (TEST-ChaosMonkeyNothingIsSafeTest.test-seed#[1F4C7C087F1CC38B]) [    ] o.a.s.c.AbstractZkTestCase put C:\Users\jenkins\workspace\Lucene-Solr-7.x-Windows\solr\core\src\test-files\solr\collection1\conf\enumsConfig.xml to /configs/conf1/enumsConfig.xml
   [junit4]   2> 359471 INFO  (TEST-ChaosMonkeyNothingIsSafeTest.test-seed#[1F4C7C087F1CC38B]) [    ] o.a.s.c.AbstractZkTestCase put C:\Users\jenkins\workspace\Lucene-Solr-7.x-Windows\solr\core\src\test-files\solr\collection1\conf\open-exchange-rates.json to /configs/conf1/open-exchange-rates.json
   [junit4]   2> 359473 INFO  (TEST-ChaosMonkeyNothingIsSafeTest.test-seed#[1F4C7C087F1CC38B]) [    ] o.a.s.c.AbstractZkTestCase put C:\Users\jenkins\workspace\Lucene-Solr-7.x-Windows\solr\core\src\test-files\solr\collection1\conf\mapping-ISOLatin1Accent.txt to /configs/conf1/mapping-ISOLatin1Accent.txt
   [junit4]   2> 359475 INFO  (TEST-ChaosMonkeyNothingIsSafeTest.test-seed#[1F4C7C087F1CC38B]) [    ] o.a.s.c.AbstractZkTestCase put C:\Users\jenkins\workspace\Lucene-Solr-7.x-Windows\solr\core\src\test-files\solr\collection1\conf\old_synonyms.txt to /configs/conf1/old_synonyms.txt
   [junit4]   2> 359477 INFO  (TEST-ChaosMonkeyNothingIsSafeTest.test-seed#[1F4C7C087F1CC38B]) [    ] o.a.s.c.AbstractZkTestCase put C:\Users\jenkins\workspace\Lucene-Solr-7.x-Windows\solr\core\src\test-files\solr\collection1\conf\synonyms.txt to /configs/conf1/synonyms.txt
   [junit4]   2> 359479 INFO  (TEST-ChaosMonkeyNothingIsSafeTest.test-seed#[1F4C7C087F1CC38B]) [    ] o.a.s.c.AbstractFullDistribZkTestBase Will use TLOG replicas unless explicitly asked otherwise
   [junit4]   2> 360068 INFO  (TEST-ChaosMonkeyNothingIsSafeTest.test-seed#[1F4C7C087F1CC38B]) [    ] o.e.j.s.Server jetty-9.3.14.v20161028
   [junit4]   2> 360069 INFO  (TEST-ChaosMonkeyNothingIsSafeTest.test-seed#[1F4C7C087F1CC38B]) [    ] o.e.j.s.h.ContextHandler Started o.e.j.s.ServletContextHandler@1fabfd7{/,null,AVAILABLE}
   [junit4]   2> 360071 INFO  (TEST-ChaosMonkeyNothingIsSafeTest.test-seed#[1F4C7C087F1CC38B]) [    ] o.e.j.s.AbstractConnector Started ServerConnector@1fd71ee{HTTP/1.1,[http/1.1]}{127.0.0.1:55679}
   [junit4]   2> 360071 INFO  (TEST-ChaosMonkeyNothingIsSafeTest.test-seed#[1F4C7C087F1CC38B]) [    ] o.e.j.s.Server Started @364102ms
   [junit4]   2> 360071 INFO  (TEST-ChaosMonkeyNothingIsSafeTest.test-seed#[1F4C7C087F1CC38B]) [    ] o.a.s.c.s.e.JettySolrRunner Jetty properties: {solr.data.dir=C:\Users\jenkins\workspace\Lucene-Solr-7.x-Windows\solr\build\solr-core\test\J0\temp\solr.cloud.ChaosMonkeyNothingIsSafeTest_1F4C7C087F1CC38B-001\tempDir-001/control/data, hostContext=/, hostPort=55679, coreRootDirectory=C:\Users\jenkins\workspace\Lucene-Solr-7.x-Windows\solr\build\solr-core\test\J0\..\..\..\..\..\..\..\..\..\Users\jenkins\workspace\Lucene-Solr-7.x-Windows\solr\build\solr-core\test\J0\temp\solr.cloud.ChaosMonkeyNothingIsSafeTest_1F4C7C087F1CC38B-001\control-001\cores}
   [junit4]   2> 360072 ERROR (TEST-ChaosMonkeyNothingIsSafeTest.test-seed#[1F4C7C087F1CC38B]) [    ] o.a.s.s.StartupLoggingUtils Missing Java Option solr.log.dir. Logging may be missing or incomplete.
   [junit4]   2> 360072 INFO  (TEST-ChaosMonkeyNothingIsSafeTest.test-seed#[1F4C7C087F1CC38B]) [    ] o.a.s.s.SolrDispatchFilter  ___      _       Welcome to Apache Solr™ version 7.1.0
   [junit4]   2> 360072 INFO  (TEST-ChaosMonkeyNothingIsSafeTest.test-seed#[1F4C7C087F1CC38B]) [    ] o.a.s.s.SolrDispatchFilter / __| ___| |_ _   Starting in cloud mode on port null
   [junit4]   2> 360072 INFO  (TEST-ChaosMonkeyNothingIsSafeTest.test-seed#[1F4C7C087F1CC38B]) [    ] o.a.s.s.SolrDispatchFilter \__ \/ _ \ | '_|  Install dir: null, Default config dir: null
   [junit4]   2> 360072 INFO  (TEST-ChaosMonkeyNothingIsSafeTest.test-seed#[1F4C7C087F1CC38B]) [    ] o.a.s.s.SolrDispatchFilter |___/\___/_|_|    Start time: 2017-07-16T20:54:19.664Z
   [junit4]   2> 360075 INFO  (TEST-ChaosMonkeyNothingIsSafeTest.test-seed#[1F4C7C087F1CC38B]) [    ] o.a.s.s.SolrDispatchFilter Loading solr.xml from SolrHome (not found in ZooKeeper)
   [junit4]   2> 360075 INFO  (TEST-ChaosMonkeyNothingIsSafeTest.test-seed#[1F4C7C087F1CC38B]) [    ] o.a.s.c.SolrXmlConfig Loading container configuration from C:\Users\jenkins\workspace\Lucene-Solr-7.x-Windows\solr\build\solr-core\test\J0\temp\solr.cloud.ChaosMonkeyNothingIsSafeTest_1F4C7C087F1CC38B-001\control-001\solr.xml
   [junit4]   2> 360095 INFO  (TEST-ChaosMonkeyNothingIsSafeTest.test-seed#[1F4C7C087F1CC38B]) [    ] o.a.s.c.SolrXmlConfig MBean server found: com.sun.jmx.mbeanserver.JmxMBeanServer@1f17132, but no JMX reporters were configured - adding default JMX reporter.
   [junit4]   2> 360105 INFO  (TEST-ChaosMonkeyNothingIsSafeTest.test-seed#[1F4C7C087F1CC38B]) [    ] o.a.s.c.ZkContainer Zookeeper client=127.0.0.1:55672/solr
   [junit4]   2> 360109 WARN  (NIOServerCxn.Factory:0.0.0.0/0.0.0.0:0) [    ] o.a.z.s.NIOServerCnxn caught end of stream exception
   [junit4]   2> EndOfStreamException: Unable to read additional data from client sessionid 0x15d4d2e30380003, likely client has closed socket
   [junit4]   2> at org.apache.zookeeper.server.NIOServerCnxn.doIO(NIOServerCnxn.java:239)
   [junit4]   2> at org.apache.zookeeper.server.NIOServerCnxnFactory.run(NIOServerCnxnFactory.java:203)
   [junit4]   2> at java.lang.Thread.run(Thread.java:748)
   [junit4]   2> 360219 INFO  (TEST-ChaosMonkeyNothingIsSafeTest.test-seed#[1F4C7C087F1CC38B]) [n:127.0.0.1:55679_    ] o.a.s.c.Overseer Overseer (id=null) closing
   [junit4]   2> 360219 INFO  (TEST-ChaosMonkeyNothingIsSafeTest.test-seed#[1F4C7C087F1CC38B]) [n:127.0.0.1:55679_    ] o.a.s.c.OverseerElectionContext I am going to be the leader 127.0.0.1:55679_
   [junit4]   2> 360220 INFO  (TEST-ChaosMonkeyNothingIsSafeTest.test-seed#[1F4C7C087F1CC38B]) [n:127.0.0.1:55679_    ] o.a.s.c.Overseer Overseer (id=98319627644829700-127.0.0.1:55679_-n_0000000000) starting
   [junit4]   2> 360235 INFO  (TEST-ChaosMonkeyNothingIsSafeTest.test-seed#[1F4C7C087F1CC38B]) [n:127.0.0.1:55679_    ] o.a.s.c.ZkController Register node as live in ZooKeeper:/live_nodes/127.0.0.1:55679_
   [junit4]   2> 360244 INFO  (zkCallback-1318-thread-1-processing-n:127.0.0.1:55679_) [n:127.0.0.1:55679_    ] o.a.s.c.c.ZkStateReader Updated live nodes from ZooKeeper... (0) -> (1)
   [junit4]   2> 360395 INFO  (TEST-ChaosMonkeyNothingIsSafeTest.test-seed#[1F4C7C087F1CC38B]) [n:127.0.0.1:55679_    ] o.a.s.m.r.SolrJmxReporter JMX monitoring for 'solr.node' (registry 'solr.node') enabled at server: com.sun.jmx.mbeanserver.JmxMBeanServer@1f17132
   [junit4]   2> 360397 INFO  (TEST-ChaosMonkeyNothingIsSafeTest.test-seed#[1F4C7C087F1CC38B]) [n:127.0.0.1:55679_    ] o.a.s.m.r.SolrJmxReporter JMX monitoring for 'solr.jvm' (registry 'solr.jvm') enabled at server: com.sun.jmx.mbeanserver.JmxMBeanServer@1f17132
   [junit4]   2> 360397 INFO  (TEST-ChaosMonkeyNothingIsSafeTest.test-seed#[1F4C7C087F1CC38B]) [n:127.0.0.1:55679_    ] o.a.s.m.r.SolrJmxReporter JMX monitoring for 'solr.jetty' (registry 'solr.jetty') enabled at server: com.sun.jmx.mbeanserver.JmxMBeanServer@1f17132
   [junit4]   2> 360400 INFO  (TEST-ChaosMonkeyNothingIsSafeTest.test-seed#[1F4C7C087F1CC38B]) [n:127.0.0.1:55679_    ] o.a.s.c.CorePropertiesLocator Found 0 core definitions underneath C:\Users\jenkins\workspace\Lucene-Solr-7.x-Windows\solr\build\solr-core\test\J0\..\..\..\..\..\..\..\..\..\Users\jenkins\workspace\Lucene-Solr-7.x-Windows\solr\build\solr-core\test\J0\temp\solr.cloud.ChaosMonkeyNothingIsSafeTest_1F4C7C087F1CC38B-001\control-001\cores
   [junit4]   2> 360431 INFO  (TEST-ChaosMonkeyNothingIsSafeTest.test-seed#[1F4C7C087F1CC38B]) [    ] o.a.s.c.c.ZkStateReader Updated live nodes from ZooKeeper... (0) -> (1)
   [junit4]   2> 360432 INFO  (TEST-ChaosMonkeyNothingIsSafeTest.test-seed#[1F4C7C087F1CC38B]) [    ] o.a.s.c.s.i.ZkClientClusterStateProvider Cluster at 127.0.0.1:55672/solr ready
   [junit4]   2> 360434 INFO  (qtp31979969-3937) [n:127.0.0.1:55679_    ] o.a.s.h.a.CollectionsHandler Invoked Collection Action :create with params replicationFactor=1&collection.configName=conf1&name=control_collection&nrtReplicas=1&action=CREATE&numShards=1&createNodeSet=127.0.0.1:55679_&wt=javabin&version=2 and sendToOCPQueue=true
   [junit4]   2> 360438 INFO  (OverseerThreadFactory-1209-thread-1-processing-n:127.0.0.1:55679_) [n:127.0.0.1:55679_    ] o.a.s.c.CreateCollectionCmd Create collection control_collection
   [junit4]   2> 360546 INFO  (qtp31979969-3940) [n:127.0.0.1:55679_    ] o.a.s.h.a.CoreAdminOperation core create command qt=/admin/cores&collection.configName=conf1&newCollection=true&name=control_collection_shard1_replica_n1&action=CREATE&numShards=1&collection=control_collection&shard=shard1&wt=javabin&version=2&replicaType=NRT
   [junit4]   2> 360547 INFO  (qtp31979969-3940) [n:127.0.0.1:55679_    ] o.a.s.c.TransientSolrCoreCacheDefault Allocating transient cache for 4 transient cores
   [junit4]   2> 360655 INFO  (zkCallback-1318-thread-1-processing-n:127.0.0.1:55679_) [n:127.0.0.1:55679_    ] o.a.s.c.c.ZkStateReader A cluster state change: [WatchedEvent state:SyncConnected type:NodeDataChanged path:/collections/control_collection/state.json] for collection [control_collection] has occurred - updating... (live nodes size: [1])
   [junit4]   2> 361573 INFO  (qtp31979969-3940) [n:127.0.0.1:55679_ c:control_collection s:shard1  x:control_collection_shard1_replica_n1] o.a.s.c.SolrConfig Using Lucene MatchVersion: 7.1.0
   [junit4]   2> 361593 INFO  (qtp31979969-3940) [n:127.0.0.1:55679_ c:control_collection s:shard1  x:control_collection_shard1_replica_n1] o.a.s.s.IndexSchema [control_collection_shard1_replica_n1] Schema name=test
   [junit4]   2> 361687 INFO  (qtp31979969-3940) [n:127.0.0.1:55679_ c:control_collection s:shard1  x:control_collection_shard1_replica_n1] o.a.s.s.IndexSchema Loaded schema test/1.6 with uniqueid field id
   [junit4]   2> 361709 INFO  (qtp31979969-3940) [n:127.0.0.1:55679_ c:control_collection s:shard1  x:control_collection_shard1_replica_n1] o.a.s.c.CoreContainer Creating SolrCore 'control_collection_shard1_replica_n1' using configuration from collection control_collection, trusted=true
   [junit4]   2> 361709 INFO  (qtp31979969-3940) [n:127.0.0.1:55679_ c:control_collection s:shard1  x:control_collection_shard1_replica_n1] o.a.s.m.r.SolrJmxReporter JMX monitoring for 'solr.core.control_collection.shard1.replica_n1' (registry 'solr.core.control_collection.shard1.replica_n1') enabled at server: com.sun.jmx.mbeanserver.JmxMBeanServer@1f17132
   [junit4]   2> 361710 INFO  (qtp31979969-3940) [n:127.0.0.1:55679_ c:control_collection s:shard1  x:control_collection_shard1_replica_n1] o.a.s.c.SolrCore solr.RecoveryStrategy.Builder
   [junit4]   2> 361710 INFO  (qtp31979969-3940) [n:127.0.0.1:55679_ c:control_collection s:shard1  x:control_collection_shard1_replica_n1] o.a.s.c.SolrCore [[control_collection_shard1_replica_n1] ] Opening new SolrCore at [C:\Users\jenkins\workspace\Lucene-Solr-7.x-Windows\solr\build\solr-core\test\J0\temp\solr.cloud.ChaosMonkeyNothingIsSafeTest_1F4C7C087F1CC38B-001\control-001\cores\control_collection_shard1_replica_n1], dataDir=[C:\Users\jenkins\workspace\Lucene-Solr-7.x-Windows\solr\build\solr-core\test\J0\..\..\..\..\..\..\..\..\..\Users\jenkins\workspace\Lucene-Solr-7.x-Windows\solr\build\solr-core\test\J0\temp\solr.cloud.ChaosMonkeyNothingIsSafeTest_1F4C7C087F1CC38B-001\control-001\cores\control_collection_shard1_replica_n1\data\]
   [junit4]   2> 361721 INFO  (qtp31979969-3940) [n:127.0.0.1:55679_ c:control_collection s:shard1  x:control_collection_shard1_replica_n1] o.a.s.u.RandomMergePolicy RandomMergePolicy wrapping class org.apache.lucene.index.LogByteSizeMergePolicy: [LogByteSizeMergePolicy: minMergeSize=1677721, mergeFactor=14, maxMergeSize=2147483648, maxMergeSizeForForcedMerge=9223372036854775807, calibrateSizeByDeletes=false, maxMergeDocs=2147483647, maxCFSSegmentSizeMB=8.796093022207999E12, noCFSRatio=0.8285116883486613]
   [junit4]   2> 361731 WARN  (qtp31979969-3940) [n:127.0.0.1:55679_ c:control_collection s:shard1  x:control_collection_shard1_replica_n1] o.a.s.c.RequestHandlers INVALID paramSet a in requestHandler {type = requestHandler,name = /dump,class = DumpRequestHandler,attributes = {initParams=a, name=/dump, class=DumpRequestHandler},args = {defaults={a=A,b=B}}}
   [junit4]   2> 361824 INFO  (qtp31979969-3940) [n:127.0.0.1:55679_ c:control_collection s:shard1  x:control_collection_shard1_replica_n1] o.a.s.u.UpdateHandler Using UpdateLog implementation: org.apache.solr.update.UpdateLog
   [junit4]   2> 361824 INFO  (qtp31979969-3940) [n:127.0.0.1:55679_ c:control_collection s:shard1  x:control_collection_shard1_replica_n1] o.a.s.u.UpdateLog Initializing UpdateLog: dataDir= defaultSyncLevel=FLUSH numRecordsToKeep=100 maxNumLogsToKeep=10 numVersionBuckets=65536
   [junit4]   2> 361826 INFO  (qtp31979969-3940) [n:127.0.0.1:55679_ c:control_collection s:shard1  x:control_collection_shard1_replica_n1] o.a.s.u.CommitTracker Hard AutoCommit: if uncommited for 15000ms;
   [junit4]   2> 361826 INFO  (qtp31979969-3940) [n:127.0.0.1:55679_ c:control_collection s:shard1  x:control_collection_shard1_replica_n1] o.a.s.u.CommitTracker Soft AutoCommit: disabled
   [junit4]   2> 361827 INFO  (qtp31979969-3940) [n:127.0.0.1:55679_ c:control_collection s:shard1  x:control_collection_shard1_replica_n1] o.a.s.u.RandomMergePolicy RandomMergePolicy wrapping class org.apache.lucene.index.TieredMergePolicy: [TieredMergePolicy: maxMergeAtOnce=2, maxMergeAtOnceExplicit=2, maxMergedSegmentMB=33.4736328125, floorSegmentMB=0.5771484375, forceMergeDeletesPctAllowed=5.747476825549848, segmentsPerTier=11.0, maxCFSSegmentSizeMB=8.796093022207999E12, noCFSRatio=0.11652470293535266
   [junit4]   2> 361828 INFO  (qtp31979969-3940) [n:127.0.0.1:55679_ c:control_collection s:shard1  x:control_collection_shard1_replica_n1] o.a.s.s.SolrIndexSearcher Opening [Searcher@646d44[control_collection_shard1_replica_n1] main]
   [junit4]   2> 361829 INFO  (qtp31979969-3940) [n:127.0.0.1:55679_ c:control_collection s:shard1  x:control_collection_shard1_replica_n1] o.a.s.r.ManagedResourceStorage Configured ZooKeeperStorageIO with znodeBase: /configs/conf1
   [junit4]   2> 361830 INFO  (qtp31979969-3940) [n:127.0.0.1:55679_ c:control_collection s:shard1  x:control_collection_shard1_replica_n1] o.a.s.r.ManagedResourceStorage Loaded null at path _rest_managed.json using ZooKeeperStorageIO:path=/configs/conf1
   [junit4]   2> 361830 INFO  (qtp31979969-3940) [n:127.0.0.1:55679_ c:control_collection s:shard1  x:control_collection_shard1_replica_n1] o.a.s.h.ReplicationHandler Commits will be reserved for  10000
   [junit4]   2> 361830 INFO  (qtp31979969-3940) [n:127.0.0.1:55679_ c:control_collection s:shard1  x:control_collection_shard1_replica_n1] o.a.s.u.UpdateLog Could not find max version in index or recent updates, using new clock 1573114044924035072
   [junit4]   2> 361831 INFO  (searcherExecutor-1212-thread-1-processing-n:127.0.0.1:55679_ x:control_collection_shard1_replica_n1 s:shard1 c:control_collection) [n:127.0.0.1:55679_ c:control_collection s:shard1  x:control_collection_shard1_replica_n1] o.a.s.c.SolrCore [control_collection_shard1_replica_n1] Registered new searcher Searcher@646d44[control_collection_shard1_replica_n1] main{ExitableDirectoryReader(UninvertingDirectoryReader())}
   [junit4]   2> 361838 INFO  (qtp31979969-3940) [n:127.0.0.1:55679_ c:control_collection s:shard1  x:control_collection_shard1_replica_n1] o.a.s.c.ShardLeaderElectionContext Enough replicas found to continue.
   [junit4]   2> 361839 INFO  (qtp31979969-3940) [n:127.0.0.1:55679_ c:control_collection s:shard1  x:control_collection_shard1_replica_n1] o.a.s.c.ShardLeaderElectionContext I may be the new leader - try and sync
   [junit4]   2> 361839 INFO  (qtp31979969-3940) [n:127.0.0.1:55679_ c:control_collection s:shard1  x:control_collection_shard1_replica_n1] o.a.s.c.SyncStrategy Sync replicas to http://127.0.0.1:55679/control_collection_shard1_replica_n1/
   [junit4]   2> 361839 INFO  (qtp31979969-3940) [n:127.0.0.1:55679_ c:control_collection s:shard1  x:control_collection_shard1_replica_n1] o.a.s.c.SyncStrategy Sync Success - now sync replicas to me
   [junit4]   2> 361839 INFO  (qtp31979969-3940) [n:127.0.0.1:55679_ c:control_collection s:shard1  x:control_collection_shard1_replica_n1] o.a.s.c.SyncStrategy http://127.0.0.1:55679/control_collection_shard1_replica_n1/ has no replicas
   [junit4]   2> 361839 INFO  (qtp31979969-3940) [n:127.0.0.1:55679_ c:control_collection s:shard1  x:control_collection_shard1_replica_n1] o.a.s.c.ShardLeaderElectionContext Found all replicas participating in election, clear LIR
   [junit4]   2> 361842 INFO  (qtp31979969-3940) [n:127.0.0.1:55679_ c:control_collection s:shard1  x:control_collection_shard1_replica_n1] o.a.s.c.ShardLeaderElectionContext I am the new leader: http://127.0.0.1:55679/control_collection_shard1_replica_n1/ shard1
   [junit4]   2> 361947 INFO  (zkCallback-1318-thread-1-processing-n:127.0.0.1:55679_) [n:127.0.0.1:55679_    ] o.a.s.c.c.ZkStateReader A cluster state change: [WatchedEvent state:SyncConnected type:NodeDataChanged path:/collections/control_collection/state.json] for collection [control_collection] has occurred - updating... (live nodes size: [1])
   [junit4]   2> 361997 INFO  (qtp31979969-3940) [n:127.0.0.1:55679_ c:control_collection s:shard1  x:control_collection_shard1_replica_n1] o.a.s.c.ZkController I am the leader, no recovery necessary
   [junit4]   2> 362004 INFO  (qtp31979969-3940) [n:127.0.0.1:55679_ c:control_collection s:shard1  x:control_collection_shard1_replica_n1] o.a.s.s.HttpSolrCall [admin] webapp=null path=/admin/cores params={qt=/admin/cores&collection.configName=conf1&newCollection=true&name=control_collection_shard1_replica_n1&action=CREATE&numShards=1&collection=control_collection&shard=shard1&wt=javabin&version=2&replicaType=NRT} status=0 QTime=1458
   [junit4]   2> 362006 INFO  (qtp31979969-3937) [n:127.0.0.1:55679_    ] o.a.s.h.a.CollectionsHandler Wait for new collection to be active for at most 30 seconds. Check all shard replicas
   [junit4]   2> 362103 INFO  (zkCallback-1318-thread-1-processing-n:127.0.0.1:55679_) [n:127.0.0.1:55679_    ] o.a.s.c.c.ZkStateReader A cluster state change: [WatchedEvent state:SyncConnected type:NodeDataChanged path:/collections/control_collection/state.json] for collection [control_collection] has occurred - updating... (live nodes size: [1])
   [junit4]   2> 362439 INFO  (OverseerCollectionConfigSetProcessor-98319627644829700-127.0.0.1:55679_-n_0000000000) [n:127.0.0.1:55679_    ] o.a.s.c.OverseerTaskQueue Response ZK path: /overseer/collection-queue-work/qnr-0000000000 doesn't exist.  Requestor may have disconnected from ZooKeeper
   [junit4]   2> 363008 INFO  (qtp31979969-3937) [n:127.0.0.1:55679_    ] o.a.s.s.HttpSolrCall [admin] webapp=null path=/admin/collections params={replicationFactor=1&collection.configName=conf1&name=control_collection&nrtReplicas=1&action=CREATE&numShards=1&createNodeSet=127.0.0.1:55679_&wt=javabin&version=2} status=0 QTime=2574
   [junit4]   2> 363009 WARN  (NIOServerCxn.Factory:0.0.0.0/0.0.0.0:0) [    ] o.a.z.s.NIOServerCnxn caught end of stream exception
   [junit4]   2> EndOfStreamException: Unable to read additional data from client sessionid 0x15d4d2e30380005, likely client has closed socket
   [junit4]   2> at org.apache.zookeeper.server.NIOServerCnxn.doIO(NIOServerCnxn.java:239)
   [junit4]   2> at org.apache.zookeeper.server.NIOServerCnxnFactory.run(NIOServerCnxnFactory.java:203)
   [junit4]   2> at java.lang.Thread.run(Thread.java:748)
   [junit4]   2> 363024 INFO  (TEST-ChaosMonkeyNothingIsSafeTest.test-seed#[1F4C7C087F1CC38B]) [    ] o.a.s.c.c.ZkStateReader Updated live nodes from ZooKeeper... (0) -> (1)
   [junit4]   2> 363025 INFO  (TEST-ChaosMonkeyNothingIsSafeTest.test-seed#[1F4C7C087F1CC38B]) [    ] o.a.s.c.s.i.ZkClientClusterStateProvider Cluster at 127.0.0.1:55672/solr ready
   [junit4]   2> 363025 INFO  (TEST-ChaosMonkeyNothingIsSafeTest.test-seed#[1F4C7C087F1CC38B]) [    ] o.a.s.c.ChaosMonkey monkey: init - expire sessions:false cause connection loss:false
   [junit4]   2> 363027 INFO  (qtp31979969-3941) [n:127.0.0.1:55679_    ] o.a.s.h.a.CollectionsHandler Invoked Collection Action :create with params replicationFactor=1&collection.configName=conf1&name=collection1&nrtReplicas=1&action=CREATE&numShards=1&createNodeSet=&stateFormat=1&wt=javabin&version=2 and sendToOCPQueue=true
   [junit4]   2> 363029 INFO  (OverseerThreadFactory-1209-thread-2-processing-n:127.0.0.1:55679_) [n:127.0.0.1:55679_    ] o.a.s.c.CreateCollectionCmd Create collection collection1
   [junit4]   2> 363030 WARN  (OverseerThreadFactory-1209-thread-2-processing-n:127.0.0.1:55679_) [n:127.0.0.1:55679_    ] o.a.s.c.CreateCollectionCmd It is unusual to create a collection (collection1) without cores.
   [junit4]   2> 363235 INFO  (qtp31979969-3941) [n:127.0.0.1:55679_    ] o.a.s.h.a.CollectionsHandler Wait for new collection to be active for at most 30 seconds. Check all shard replicas
   [junit4]   2> 363235 INFO  (qtp31979969-3941) [n:127.0.0.1:55679_    ] o.a.s.s.HttpSolrCall [admin] webapp=null path=/admin/collections params={replicationFactor=1&collection.configName=conf1&name=collection1&nrtReplicas=1&action=CREATE&numShards=1&createNodeSet=&stateFormat=1&wt=javabin&version=2} status=0 QTime=207
   [junit4]   2> 363757 INFO  (TEST-ChaosMonkeyNothingIsSafeTest.test-seed#[1F4C7C087F1CC38B]) [    ] o.a.s.c.AbstractFullDistribZkTestBase create jetty 1 in directory C:\Users\jenkins\workspace\Lucene-Solr-7.x-Windows\solr\build\solr-core\test\J0\temp\solr.cloud.ChaosMonkeyNothingIsSafeTest_1F4C7C087F1CC38B-001\shard-1-001 of type TLOG
   [junit4]   2> 363758 INFO  (TEST-ChaosMonkeyNothingIsSafeTest.test-seed#[1F4C7C087F1CC38B]) [    ] o.e.j.s.Server jetty-9.3.14.v20161028
   [junit4]   2> 363758 INFO  (TEST-ChaosMonkeyNothingIsSafeTest.test-seed#[1F4C7C087F1CC38B]) [    ] o.e.j.s.h.ContextHandler Started o.e.j.s.ServletContextHandler@729e26{/,null,AVAILABLE}
   [junit4]   2> 363759 INFO  (TEST-ChaosMonkeyNothingIsSafeTest.test-seed#[1F4C7C087F1CC38B]) [    ] o.e.j.s.AbstractConnector Started ServerConnector@1f936a9{HTTP/1.1,[http/1.1]}{127.0.0.1:55728}
   [junit4]   2> 363759 INFO  (TEST-ChaosMonkeyNothingIsSafeTest.test-seed#[1F4C7C087F1CC38B]) [    ] o.e.j.s.Server Started @367790ms
   [junit4]   2> 363759 INFO  (TEST-ChaosMonkeyNothingIsSafeTest.test-seed#[1F4C7C087F1CC38B]) [    ] o.a.s.c.s.e.JettySolrRunner Jetty properties: {solr.data.dir=C:\Users\jenkins\workspace\Lucene-Solr-7.x-Windows\solr\build\solr-core\test\J0\temp\solr.cloud.ChaosMonkeyNothingIsSafeTest_1F4C7C087F1CC38B-001\tempDir-001/jetty1, replicaType=TLOG, solrconfig=solrconfig.xml, hostContext=/, hostPort=55728, coreRootDirectory=C:\Users\jenkins\workspace\Lucene-Solr-7.x-Windows\solr\build\solr-core\test\J0\temp\solr.cloud.ChaosMonkeyNothingIsSafeTest_1F4C7C087F1CC38B-001\shard-1-001\cores}
   [junit4]   2> 363760 ERROR (TEST-ChaosMonkeyNothingIsSafeTest.test-seed#[1F4C7C087F1CC38B]) [    ] o.a.s.s.StartupLoggingUtils Missing Java Option solr.log.dir. Logging may be missing or incomplete.
   [junit4]   2> 363760 INFO  (TEST-ChaosMonkeyNothingIsSafeTest.test-seed#[1F4C7C087F1CC38B]) [    ] o.a.s.s.SolrDispatchFilter  ___      _       Welcome to Apache Solr™ version 7.1.0
   [junit4]   2> 363760 INFO  (TEST-ChaosMonkeyNothingIsSafeTest.test-seed#[1F4C7C087F1CC38B]) [    ] o.a.s.s.SolrDispatchFilter / __| ___| |_ _   Starting in cloud mode on port null
   [junit4]   2> 363760 INFO  (TEST-ChaosMonkeyNothingIsSafeTest.test-seed#[1F4C7C087F1CC38B]) [    ] o.a.s.s.SolrDispatchFilter \__ \/ _ \ | '_|  Install dir: null, Default config dir: null
   [junit4]   2> 363760 INFO  (TEST-ChaosMonkeyNothingIsSafeTest.test-seed#[1F4C7C087F1CC38B]) [    ] o.a.s.s.SolrDispatchFilter |___/\___/_|_|    Start time: 2017-07-16T20:54:23.352Z
   [junit4]   2> 363764 INFO  (TEST-ChaosMonkeyNothingIsSafeTest.test-seed#[1F4C7C087F1CC38B]) [    ] o.a.s.s.SolrDispatchFilter Loading solr.xml from SolrHome (not found in ZooKeeper)
   [junit4]   2> 363764 INFO  (TEST-ChaosMonkeyNothingIsSafeTest.test-seed#[1F4C7C087F1CC38B]) [    ] o.a.s.c.SolrXmlConfig Loading container configuration from C:\Users\jenkins\workspace\Lucene-Solr-7.x-Windows\solr\build\solr-core\test\J0\temp\solr.cloud.ChaosMonkeyNothingIsSafeTest_1F4C7C087F1CC38B-001\shard-1-001\solr.xml
   [junit4]   2> 363774 INFO  (TEST-ChaosMonkeyNothingIsSafeTest.test-seed#[1F4C7C087F1CC38B]) [    ] o.a.s.c.SolrXmlConfig MBean server found: com.sun.jmx.mbeanserver.JmxMBeanServer@1f17132, but no JMX reporters were configured - adding default JMX reporter.
   [junit4]   2> 363780 INFO  (TEST-ChaosMonkeyNothingIsSafeTest.test-seed#[1F4C7C087F1CC38B]) [    ] o.a.s.c.ZkContainer Zookeeper client=127.0.0.1:55672/solr
   [junit4]   2> 363792 INFO  (TEST-ChaosMonkeyNothingIsSafeTest.test-seed#[1F4C7C087F1CC38B]) [n:127.0.0.1:55728_    ] o.a.s.c.c.ZkStateReader Updated live nodes from ZooKeeper... (0) -> (1)
   [junit4]   2> 363795 INFO  (TEST-ChaosMonkeyNothingIsSafeTest.test-seed#[1F4C7C087F1CC38B]) [n:127.0.0.1:55728_    ] o.a.s.c.Overseer Overseer (id=null) closing
   [junit4]   2> 363797 INFO  (TEST-ChaosMonkeyNothingIsSafeTest.test-seed#[1F4C7C087F1CC38B]) [n:127.0.0.1:55728_    ] o.a.s.c.ZkController Register node as live in ZooKeeper:/live_nodes/127.0.0.1:55728_
   [junit4]   2> 363800 INFO  (zkCallback-1330-thread-1-processing-n:127.0.0.1:55728_) [n:127.0.0.1:55728_    ] o.a.s.c.c.ZkStateReader Updated live nodes from ZooKeeper... (1) -> (2)
   [junit4]   2> 363800 INFO  (zkCallback-1325-thread-1) [    ] o.a.s.c.c.ZkStateReader Updated live nodes from ZooKeeper... (1) -> (2)
   [junit4]   2> 363800 INFO  (zkCallback-1318-thread-1-processing-n:127.0.0.1:55679_) [n:127.0.0.1:55679_    ] o.a.s.c.c.ZkStateReader Updated live nodes from ZooKeeper... (1) -> (2)
   [junit4]   2> 363999 INFO  (TEST-ChaosMonkeyNothingIsSafeTest.test-seed#[1F4C7C087F1CC38B]) [n:127.0.0.1:55728_    ] o.a.s.m.r.SolrJmxReporter JMX monitoring for 'solr.node' (registry 'solr.node') enabled at server: com.sun.jmx.mbeanserver.JmxMBeanServer@1f17132
   [junit4]   2> 364002 INFO  (TEST-ChaosMonkeyNothingIsSafeTest.test-seed#[1F4C7C087F1CC38B]) [n:127.0.0.1:55728_    ] o.a.s.m.r.SolrJmxReporter JMX monitoring for 'solr.jvm' (registry 'solr.jvm') enabled at server: com.sun.jmx.mbeanserver.JmxMBeanServer@1f17132
   [junit4]   2> 364002 INFO  (TEST-ChaosMonkeyNothingIsSafeTest.test-seed#[1F4C7C087F1CC38B]) [n:127.0.0.1:55728_    ] o.a.s.m.r.SolrJmxReporter JMX monitoring for 'solr.jetty' (registry 'solr.jetty') enabled at server: com.sun.jmx.mbeanserver.JmxMBeanServer@1f17132
   [junit4]   2> 364003 INFO  (TEST-ChaosMonkeyNothingIsSafeTest.test-seed#[1F4C7C087F1CC38B]) [n:127.0.0.1:55728_    ] o.a.s.c.CorePropertiesLocator Found 0 core definitions underneath C:\Users\jenkins\workspace\Lucene-Solr-7.x-Windows\solr\build\solr-core\test\J0\temp\solr.cloud.ChaosMonkeyNothingIsSafeTest_1F4C7C087F1CC38B-001\shard-1-001\cores
   [junit4]   2> 364028 INFO  (qtp20670542-3980) [n:127.0.0.1:55728_    ] o.a.s.h.a.CollectionsHandler Invoked Collection Action :addreplica with params node=127.0.0.1:55728_&action=ADDREPLICA&collection=collection1&shard=shard1&type=TLOG&wt=javabin&version=2 and sendToOCPQueue=true
   [junit4]   2> 364039 INFO  (OverseerCollectionConfigSetProcessor-98319627644829700-127.0.0.1:55679_-n_0000000000) [n:127.0.0.1:55679_    ] o.a.s.c.OverseerTaskQueue Response ZK path: /overseer/collection-queue-work/qnr-0000000002 doesn't exist.  Requestor may have disconnected from ZooKeeper
   [junit4]   2> 364040 INFO  (OverseerThreadFactory-1209-thread-3-processing-n:127.0.0.1:55679_) [n:127.0.0.1:55679_    ] o.a.s.c.AddReplicaCmd Node Identified 127.0.0.1:55728_ for creating new replica
   [junit4]   2> 364043 INFO  (qtp20670542-3982) [n:127.0.0.1:55728_    ] o.a.s.h.a.CoreAdminOperation core create command qt=/admin/cores&collection.configName=conf1&name=collection1_shard1_replica_t0&action=CREATE&collection=collection1&shard=shard1&wt=javabin&version=2&replicaType=TLOG
   [junit4]   2> 364044 INFO  (qtp20670542-3982) [n:127.0.0.1:55728_    ] o.a.s.c.TransientSolrCoreCacheDefault Allocating transient cache for 4 transient cores
   [junit4]   2> 365087 INFO  (qtp20670542-3982) [n:127.0.0.1:55728_ c:collection1 s:shard1  x:collection1_shard1_replica_t0] o.a.s.c.SolrConfig Using Lucene MatchVersion: 7.1.0
   [junit4]   2> 365099 INFO  (qtp20670542-3982) [n:127.0.0.1:55728_ c:collection1 s:shard1  x:collection1_shard1_replica_t0] o.a.s.s.IndexSchema [collection1_shard1_replica_t0] Schema name=test
   [junit4]   2> 365193 INFO  (qtp20670542-3982) [n:127.0.0.1:55728_ c:collection1 s:shard1  x:collection1_shard1_replica_t0] o.a.s.s.IndexSchema Loaded schema test/1.6 with uniqueid field id
   [junit4]   2> 365234 INFO  (qtp20670542-3982) [n:127.0.0.1:55728_ c:collection1 s:shard1  x:collection1_shard1_replica_t0] o.a.s.c.CoreContainer Creating SolrCore 'collection1_shard1_replica_t0' using configuration from collection collection1, trusted=true
   [junit4]   2> 365236 INFO  (qtp20670542-3982) [n:127.0.0.1:55728_ c:collection1 s:shard1  x:collection1_shard1_replica_t0] o.a.s.m.r.SolrJmxReporter JMX monitoring for 'solr.core.collection1.shard1.replica_t0' (registry 'solr.core.collection1.shard1.replica_t0') enabled at server: com.sun.jmx.mbeanserver.JmxMBeanServer@1f17132
   [junit4]   2> 365236 INFO  (qtp20670542-3982) [n:127.0.0.1:55728_ c:collection1 s:shard1  x:collection1_shard1_replica_t0] o.a.s.c.SolrCore solr.RecoveryStrategy.Builder
   [junit4]   2> 365236 INFO  (qtp20670542-3982) [n:127.0.0.1:55728_ c:collection1 s:shard1  x:collection1_shard1_replica_t0] o.a.s.c.SolrCore [[collection1_shard1_replica_t0] ] Opening new SolrCore at [C:\Users\jenkins\workspace\Lucene-Solr-7.x-Windows\solr\build\solr-core\test\J0\temp\solr.cloud.ChaosMonkeyNothingIsSafeTest_1F4C7C087F1CC38B-001\shard-1-001\cores\collection1_shard1_replica_t0], dataDir=[C:\Users\jenkins\workspace\Lucene-Solr-7.x-Windows\solr\build\solr-core\test\J0\temp\solr.cloud.ChaosMonkeyNothingIsSafeTest_1F4C7C087F1CC38B-001\shard-1-001\cores\collection1_shard1_replica_t0\data\]
   [junit4]   2> 365243 INFO  (qtp20670542-3982) [n:127.0.0.1:55728_ c:collection1 s:shard1  x:collection1_shard1_replica_t0] o.a.s.u.RandomMergePolicy RandomMergePolicy wrapping class org.apache.lucene.index.LogByteSizeMergePolicy: [LogByteSizeMergePolicy: minMergeSize=1677721, mergeFactor=14, maxMergeSize=2147483648, maxMergeSizeForForcedMerge=9223372036854775807, calibrateSizeByDeletes=false, maxMergeDocs=2147483647, maxCFSSegmentSizeMB=8.796093022207999E12, noCFSRatio=0.8285116883486613]
   [junit4]   2> 365247 WARN  (qtp20670542-3982) [n:127.0.0.1:55728_ c:collection1 s:shard1  x:collection1_shard1_replica_t0] o.a.s.c.RequestHandlers INVALID paramSet a in requestHandler {type = requestHandler,name = /dump,class = DumpRequestHandler,attributes = {initParams=a, name=/dump, class=DumpRequestHandler},args = {defaults={a=A,b=B}}}
   [junit4]   2> 365321 INFO  (qtp20670542-3982) [n:127.0.0.1:55728_ c:collection1 s:shard1  x:collection1_shard1_replica_t0] o.a.s.u.UpdateHandler Using UpdateLog implementation: org.apache.solr.update.UpdateLog
   [junit4]   2> 365321 INFO  (qtp20670542-3982) [n:127.0.0.1:55728_ c:collection1 s:shard1  x:collection1_shard1_replica_t0] o.a.s.u.UpdateLog Initializing UpdateLog: dataDir= defaultSyncLevel=FLUSH numRecordsToKeep=100 maxNumLogsToKeep=10 numVersionBuckets=65536
   [junit4]   2> 365326 INFO  (qtp20670542-3982) [n:127.0.0.1:55728_ c:collection1 s:shard1  x:collection1_shard1_replica_t0] o.a.s.u.CommitTracker Hard AutoCommit: if uncommited for 15000ms;
   [junit4]   2> 365326 INFO  (qtp20670542-3982) [n:127.0.0.1:55728_ c:collection1 s:shard1  x:collection1_shard1_replica_t0] o.a.s.u.CommitTracker Soft AutoCommit: disabled
   [junit4]   2> 365327 INFO  (qtp20670542-3982) [n:127.0.0.1:55728_ c:collection1 s:shard1  x:collection1_shard1_replica_t0] o.a.s.u.RandomMergePolicy RandomMergePolicy wrapping class org.apache.lucene.index.TieredMergePolicy: [TieredMergePolicy: maxMergeAtOnce=2, maxMergeAtOnceExplicit=2, maxMergedSegmentMB=33.4736328125, floorSegmentMB=0.5771484375, forceMergeDeletesPctAllowed=5.747476825549848, segmentsPerTier=11.0, maxCFSSegmentSizeMB=8.796093022207999E12, noCFSRatio=0.11652470293535266
   [junit4]   2> 365327 INFO  (qtp20670542-3982) [n:127.0.0.1:55728_ c:collection1 s:shard1  x:collection1_shard1_replica_t0] o.a.s.s.SolrIndexSearcher Opening [Searcher@13f4dbc[collection1_shard1_replica_t0] main]
   [junit4]   2> 365328 INFO  (qtp20670542-3982) [n:127.0.0.1:55728_ c:collection1 s:shard1  x:collection1_shard1_replica_t0] o.a.s.r.ManagedResourceStorage Configured ZooKeeperStorageIO with znodeBase: /configs/conf1
   [junit4]   2> 365329 INFO  (qtp20670542-3982) [n:127.0.0.1:55728_ c:collection1 s:shard1  x:collection1_shard1_replica_t0] o.a.s.r.ManagedResourceStorage Loaded null at path _rest_managed.json using ZooKeeperStorageIO:path=/configs/conf1
   [junit4]   2> 365329 INFO  (qtp20670542-3982) [n:127.0.0.1:55728_ c:collection1 s:shard1  x:collection1_shard1_replica_t0] o.a.s.h.ReplicationHandler Commits will be reserved for  10000
   [junit4]   2> 365329 INFO  (qtp20670542-3982) [n:127.0.0.1:55728_ c:collection1 s:shard1  x:collection1_shard1_replica_t0] o.a.s.u.UpdateLog Could not find max version in index or recent updates, using new clock 1573114048593002496
   [junit4]   2> 365336 INFO  (qtp20670542-3982) [n:127.0.0.1:55728_ c:collection1 s:shard1  x:collection1_shard1_replica_t0] o.a.s.c.ShardLeaderElectionContext Enough replicas found to continue.
   [junit4]   2> 365336 INFO  (qtp20670542-3982) [n:127.0.0.1:55728_ c:collection1 s:shard1  x:collection1_shard1_replica_t0] o.a.s.c.ShardLeaderElectionContext I may be the new leader - try and sync
   [junit4]   2> 365336 INFO  (qtp20670542-3982) [n:127.0.0.1:55728_ c:collection1 s:shard1  x:collection1_shard1_replica_t0] o.a.s.c.SyncStrategy Sync replicas to http://127.0.0.1:55728/collection1_shard1_replica_t0/
   [junit4]   2> 365336 INFO  (qtp20670542-3982) [n:127.0.0.1:55728_ c:collection1 s:shard1  x:collection1_shard1_replica_t0] o.a.s.c.SyncStrategy Sync Success - now sync replicas to me
   [junit4]   2> 365336 INFO  (qtp20670542-3982) [n:127.0.0.1:55728_ c:collection1 s:shard1  x:collection1_shard1_replica_t0] o.a.s.c.SyncStrategy http://127.0.0.1:55728/collection1_shard1_replica_t0/ has no replicas
   [junit4]   2> 365336 INFO  (qtp20670542-3982) [n:127.0.0.1:55728_ c:collection1 s:shard1  x:collection1_shard1_replica_t0] o.a.s.c.ShardLeaderElectionContext Found all replicas participating in election, clear LIR
   [junit4]   2> 365337 INFO  (qtp20670542-3982) [n:127.0.0.1:55728_ c:collection1 s:shard1  x:collection1_shard1_replica_t0] o.a.s.c.ZkController collection1_shard1_replica_t0 stopping background replication from leader
   [junit4]   2> 365341 INFO  (qtp20670542-3982) [n:127.0.0.1:55728_ c:collection1 s:shard1  x:collection1_shard1_replica_t0] o.a.s.c.ShardLeaderElectionContext I am the new leader: http://127.0.0.1:55728/collection1_shard1_replica_t0/ shard1
   [junit4]   2> 365379 INFO  (searcherExecutor-1223-thread-1-processing-n:127.0.0.1:55728_ x:collection1_shard1_replica_t0 s:shard1 c:collection1) [n:127.0.0.1:55728_ c:collection1 s:shard1  x:collection1_shard1_replica_t0] o.a.s.c.SolrCore [collection1_shard1_replica_t0] Registered new searcher Searcher@13f4dbc[collection1_shard1_replica_t0] main{ExitableDirectoryReader(UninvertingDirectoryReader())}
   [junit4]   2> 365509 INFO  (qtp20670542-3982) [n:127.0.0.1:55728_ c:collection1 s:shard1  x:collection1_shard1_replica_t0] o.a.s.c.ZkController I am the leader, no recovery necessary
   [junit4]   2> 365512 INFO  (qtp20670542-3982) [n:127.0.0.1:55728_ c:collection1 s:shard1  x:collection1_shard1_replica_t0] o.a.s.s.HttpSolrCall [admin] webapp=null path=/admin/cores params={qt=/admin/cores&collection.configName=conf1&name=collection1_shard1_replica_t0&action=CREATE&collection=collection1&shard=shard1&wt=javabin&version=2&replicaType=TLOG} status=0 QTime=1469
   [junit4]   2> 365513 INFO  (qtp20670542-3980) [n:127.0.0.1:55728_    ] o.a.s.s.HttpSolrCall [admin] webapp=null path=/admin/collections params={node=127.0.0.1:55728_&action=ADDREPLICA&collection=collection1&shard=shard1&type=TLOG&wt=javabin&version=2} status=0 QTime=1485
   [junit4]   2> 366021 INFO  (TEST-ChaosMonkeyNothingIsSafeTest.test-seed#[1F4C7C087F1CC38B]) [    ] o.a.s.c.AbstractFullDistribZkTestBase create jetty 2 in directory C:\Users\jenkins\workspace\Lucene-Solr-7.x-Windows\solr\build\solr-core\test\J0\temp\solr.cloud.ChaosMonkeyNothingIsSafeTest_1F4C7C087F1CC38B-001\shard-2-001 of type TLOG
   [junit4]   2> 366022 INFO  (TEST-ChaosMonkeyNothingIsSafeTest.test-seed#[1F4C7C087F1CC38B]) [    ] o.e.j.s.Server jetty-9.3.14.v20161028
   [junit4]   2> 366023 INFO  (TEST-ChaosMonkeyNothingIsSafeTest.test-seed#[1F4C7C087F1CC38B]) [    ] o.e.j.s.h.ContextHandler Started o.e.j.s.ServletContextHandler@10ea03d{/,null,AVAILABLE}
   [junit4]   2> 366024 INFO  (TEST-ChaosMonkeyNothingIsSafeTest.test-seed#[1F4C7C087F1CC38B]) [    ] o.e.j.s.AbstractConnector Started ServerConnector@1cf2182{HTTP/1.1,[http/1.1]}{127.0.0.1:55748}
   [junit4]   2> 366024 INFO  (TEST-ChaosMonkeyNothingIsSafeTest.test-seed#[1F4C7C087F1CC38B]) [    ] o.e.j.s.Server Started @370055ms
   [junit4]   2> 366024 INFO  (TEST-ChaosMonkeyNothingIsSafeTest.test-seed#[1F4C7C087F1CC38B]) [    ] o.a.s.c.s.e.JettySolrRunner Jetty properties: {solr.data.dir=C:\Users\jenkins\workspace\Lucene-Solr-7.x-Windows\solr\build\solr-core\test\J0\temp\solr.cloud.ChaosMonkeyNothingIsSafeTest_1F4C7C087F1CC38B-001\tempDir-001/jetty2, replicaType=TLOG, solrconfig=solrconfig.xml, hostContext=/, hostPort=55748, coreRootDirectory=C:\Users\jenkins\workspace\Lucene-Solr-7.x-Windows\solr\build\solr-core\test\J0\..\..\..\..\..\..\..\..\..\Users\jenkins\workspace\Lucene-Solr-7.x-Windows\solr\build\solr-core\test\J0\temp\solr.cloud.ChaosMonkeyNothingIsSafeTest_1F4C7C087F1CC38B-001\shard-2-001\cores}
   [junit4]   2> 366024 ERROR (TEST-ChaosMonkeyNothingIsSafeTest.test-seed#[1F4C7C087F1CC38B]) [    ] o.a.s.s.StartupLoggingUtils Missing Java Option solr.log.dir. Logging may be missing or incomplete.
   [junit4]   2> 366025 INFO  (TEST-ChaosMonkeyNothingIsSafeTest.test-seed#[1F4C7C087F1CC38B]) [    ] o.a.s.s.SolrDispatchFilter  ___      _       Welcome to Apache Solr™ version 7.1.0
   [junit4]   2> 366025 INFO  (TEST-ChaosMonkeyNothingIsSafeTest.test-seed#[1F4C7C087F1CC38B]) [    ] o.a.s.s.SolrDispatchFilter / __| ___| |_ _   Starting in cloud mode on port null
   [junit4]   2> 366025 INFO  (TEST-ChaosMonkeyNothingIsSafeTest.test-seed#[1F4C7C087F1CC38B]) [    ] o.a.s.s.SolrDispatchFilter \__ \/ _ \ | '_|  Install dir: null, Default config dir: null
   [junit4]   2> 366025 INFO  (TEST-ChaosMonkeyNothingIsSafeTest.test-seed#[1F4C7C087F1CC38B]) [    ] o.a.s.s.SolrDispatchFilter |___/\___/_|_|    Start time: 2017-07-16T20:54:25.617Z
   [junit4]   2> 366029 INFO  (TEST-ChaosMonkeyNothingIsSafeTest.test-seed#[1F4C7C087F1CC38B]) [    ] o.a.s.s.SolrDispatchFilter Loading solr.xml from SolrHome (not found in ZooKeeper)
   [junit4]   2> 366029 INFO  (TEST-ChaosMonkeyNothingIsSafeTest.test-seed#[1F4C7C087F1CC38B]) [    ] o.a.s.c.SolrXmlConfig Loading container configuration from C:\Users\jenkins\workspace\Lucene-Solr-7.x-Windows\solr\build\solr-core\test\J0\temp\solr.cloud.ChaosMonkeyNothingIsSafeTest_1F4C7C087F1CC38B-001\shard-2-001\solr.xml
   [junit4]   2> 366053 INFO  (OverseerCollectionConfigSetProcessor-98319627644829700-127.0.0.1:55679_-n_0000000000) [n:127.0.0.1:55679_    ] o.a.s.c.OverseerTaskQueue Response ZK path: /overseer/collection-queue-work/qnr-0000000004 doesn't exist.  Requestor may have disconnected from ZooKeeper
   [junit4]   2> 366053 INFO  (TEST-ChaosMonkeyNothingIsSafeTest.test-seed#[1F4C7C087F1CC38B]) [    ] o.a.s.c.SolrXmlConfig MBean server found: com.sun.jmx.mbeanserver.JmxMBeanServer@1f17132, but no JMX reporters were configured - adding default JMX reporter.
   [junit4]   2> 366058 INFO  (TEST-ChaosMonkeyNothingIsSafeTest.test-seed#[1F4C7C087F1CC38B]) [    ] o.a.s.c.ZkContainer Zookeeper client=127.0.0.1:55672/solr
   [junit4]   2> 366062 WARN  (NIOServerCxn.Factory:0.0.0.0/0.0.0.0:0) [    ] o.a.z.s.NIOServerCnxn caught end of stream exception
   [junit4]   2> EndOfStreamException: Unable to read additional data from client sessionid 0x15d4d2e3038000b, likely client has closed socket
   [junit4]   2> at org.apache.zookeeper.server.NIOServerCnxn.doIO(NIOServerCnxn.java:239)
   [junit4]   2> at org.apache.zookeeper.server.NIOServerCnxnFactory.run(NIOServerCnxnFactory.java:203)
   [junit4]   2> at java.lang.Thread.run(Thread.java:748)
   [junit4]   2> 366071 INFO  (TEST-ChaosMonkeyNothingIsSafeTest.test-seed#[1F4C7C087F1CC38B]) [n:127.0.0.1:55748_    ] o.a.s.c.c.ZkStateReader Updated live nodes from ZooKeeper... (0) -> (2)
   [junit4]   2> 366074 INFO  (TEST-ChaosMonkeyNothingIsSafeTest.test-seed#[1F4C7C087F1CC38B]) [n:127.0.0.1:55748_    ] o.a.s.c.Overseer Overseer (id=null) closing
   [junit4]   2> 366076 INFO  (TEST-ChaosMonkeyNothingIsSafeTest.test-seed#[1F4C7C087F1CC38B]) [n:127.0.0.1:55748_    ] o.a.s.c.ZkController Register node as live in ZooKeeper:/live_nodes/127.0.0.1:55748_
   [junit4]   2> 366077 INFO  (zkCallback-1318-thread-1-processing-n:127.0.0.1:55679_) [n:127.0.0.1:55679_    ] o.a.s.c.c.ZkStateReader Updated live nodes from ZooKeeper... (2) -> (3)
   [junit4]   2> 366078 INFO  (zkCallback-1336-thread-1-processing-n:127.0.0.1:55748_) [n:127.0.0.1:55748_    ] o.a.s.c.c.ZkStateReader Updated live nodes from ZooKeeper... (2) -> (3)
   [junit4]   2> 366079 INFO  (zkCallback-1330-thread-1-processing-n:127.0.0.1:55728_) [n:127.0.0.1:55728_    ] o.a.s.c.c.ZkStateReader Updated live nodes from ZooKeeper... (2) -> (3)
   [junit4]   2> 366079 INFO  (zkCallback-1325-thread-1) [    ] o.a.s.c.c.ZkStateReader Updated live nodes from ZooKeeper... (2) -> (3)
   [junit4]   2> 366204 INFO  (TEST-ChaosMonkeyNothingIsSafeTest.test-seed#[1F4C7C087F1CC38B]) [n:127.0.0.1:55748_    ] o.a.s.m.r.SolrJmxReporter JMX monitoring for 'solr.node' (registry 'solr.node') enabled at server: com.sun.jmx.mbeanserver.JmxMBeanServer@1f17132
   [junit4]   2> 366207 INFO  (TEST-ChaosMonkeyNothingIsSafeTest.test-seed#[1F4C7C087F1CC38B]) [n:127.0.0.1:55748_    ] o.a.s.m.r.SolrJmxReporter JMX monitoring for 'solr.jvm' (registry 'solr.jvm') enabled at server: com.sun.jmx.mbeanserver.JmxMBeanServer@1f17132
   [junit4]   2> 366207 INFO  (TEST-ChaosMonkeyNothingIsSafeTest.test-seed#[1F4C7C087F1CC38B]) [n:127.0.0.1:55748_    ] o.a.s.m.r.SolrJmxReporter JMX monitoring for 'solr.jetty' (registry 'solr.jetty') enabled at server: com.sun.jmx.mbeanserver.JmxMBeanServer@1f17132
   [junit4]   2> 366210 INFO  (TEST-ChaosMonkeyNothingIsSafeTest.test-seed#[1F4C7C087F1CC38B]) [n:127.0.0.1:55748_    ] o.a.s.c.CorePropertiesLocator Found 0 core definitions underneath C:\Users\jenkins\workspace\Lucene-Solr-7.x-Windows\solr\build\solr-core\test\J0\..\..\..\..\..\..\..\..\..\Users\jenkins\workspace\Lucene-Solr-7.x-Windows\solr\build\solr-core\test\J0\temp\solr.cloud.ChaosMonkeyNothingIsSafeTest_1F4C7C087F1CC38B-001\shard-2-001\cores
   [junit4]   2> 366234 INFO  (qtp20670542-3983) [n:127.0.0.1:55728_    ] o.a.s.h.a.CollectionsHandler Invoked Collection Action :addreplica with params node=127.0.0.1:55748_&action=ADDREPLICA&collection=collection1&shard=shard1&type=TLOG&wt=javabin&version=2 and sendToOCPQueue=true
   [junit4]   2> 366237 INFO  (OverseerThreadFactory-1209-thread-4-processing-n:127.0.0.1:55679_) [n:127.0.0.1:55679_    ] o.a.s.c.AddReplicaCmd Node Identified 127.0.0.1:55748_ for creating new replica
   [junit4]   2> 366239 INFO  (qtp28501984-4009) [n:127.0.0.1:55748_    ] o.a.s.h.a.CoreAdminOperation core create command qt=/admin/cores&collection.configName=conf1&name=collection1_shard1_replica_t1&action=CREATE&collection=collection1&shard=shard1&wt=javabin&version=2&replicaType=TLOG
   [junit4]   2> 366240 INFO  (qtp28501984-4009) [n:127.0.0.1:55748_    ] o.a.s.c.TransientSolrCoreCacheDefault Allocating transient cache for 4 transient cores
   [junit4]   2> 367260 INFO  (qtp28501984-4009) [n:127.0.0.1:55748_ c:collection1 s:shard1  x:collection1_shard1_replica_t1] o.a.s.c.SolrConfig Using Lucene MatchVersion: 7.1.0
   [junit4]   2> 367282 INFO  (qtp28501984-4009) [n:127.0.0.1:55748_ c:collection1 s:shard1  x:collection1_shard1_replica_t1] o.a.s.s.IndexSchema [collection1_shard1_replica_t1] Schema name=test
   [junit4]   2> 367347 INFO  (qtp28501984-4009) [n:127.0.0.1:55748_ c:collection1 s:shard1  x:collection1_shard1_replica_t1] o.a.s.s.IndexSchema Loaded schema test/1.6 with uniqueid field id
   [junit4]   2> 367362 INFO  (qtp28501984-4009) [n:127.0.0.1:55748_ c:collection1 s:shard1  x:collection1_shard1_replica_t1] o.a.s.c.CoreContainer Creating SolrCore 'collection1_shard1_replica_t1' using configuration from collection collection1, trusted=true
   [junit4]   2> 367362 INFO  (qtp28501984-4009) [n:127.0.0.1:55748_ c:collection1 s:shard1  x:collection1_shard1_replica_t1] o.a.s.m.r.SolrJmxReporter JMX monitoring for 'solr.core.collection1.shard1.replica_t1' (registry 'solr.core.collection1.shard1.replica_t1') enabled at server: com.sun.jmx.mbeanserver.JmxMBeanServer@1f17132
   [junit4]   2> 367363 INFO  (qtp28501984-4009) [n:127.0.0.1:55748_ c:collection1 s:shard1  x:collection1_shard1_replica_t1] o.a.s.c.SolrCore solr.RecoveryStrategy.Builder
   [junit4]   2> 367363 INFO  (qtp28501984-4009) [n:127.0.0.1:55748_ c:collection1 s:shard1  x:collection1_shard1_replica_t1] o.a.s.c.SolrCore [[collection1_shard1_replica_t1] ] Opening new SolrCore at [C:\Users\jenkins\workspace\Lucene-Solr-7.x-Windows\solr\build\solr-core\test\J0\temp\solr.cloud.ChaosMonkeyNothingIsSafeTest_1F4C7C087F1CC38B-001\shard-2-001\cores\collection1_shard1_replica_t1], dataDir=[C:\Users\jenkins\workspace\Lucene-Solr-7.x-Windows\solr\build\solr-core\test\J0\..\..\..\..\..\..\..\..\..\Users\jenkins\workspace\Lucene-Solr-7.x-Windows\solr\build\solr-core\test\J0\temp\solr.cloud.ChaosMonkeyNothingIsSafeTest_1F4C7C087F1CC38B-001\shard-2-001\cores\collection1_shard1_replica_t1\data\]
   [junit4]   2> 367370 INFO  (qtp28501984-4009) [n:127.0.0.1:55748_ c:collection1 s:shard1  x:collection1_shard1_replica_t1] o.a.s.u.RandomMergePolicy RandomMergePolicy wrapping class org.apache.lucene.index.LogByteSizeMergePolicy: [LogByteSizeMergePolicy: minMergeSize=1677721, mergeFactor=14, maxMergeSize=2147483648, maxMergeSizeForForcedMerge=9223372036854775807, calibrateSizeByDeletes=false, maxMergeDocs=2147483647, maxCFSSegmentSizeMB=8.796093022207999E12, noCFSRatio=0.8285116883486613]
   [junit4]   2> 367374 WARN  (qtp28501984-4009) [n:127.0.0.1:55748_ c:collection1 s:shard1  x:collection1_shard1_replica_t1] o.a.s.c.RequestHandlers INVALID paramSet a in requestHandler {type = requestHandler,name = /dump,class = DumpRequestHandler,attributes = {initParams=a, name=/dump, class=DumpRequestHandler},args = {defaults={a=A,b=B}}}
   [junit4]   2> 367448 INFO  (qtp28501984-4009) [n:127.0.0.1:55748_ c:collection1 s:shard1  x:collection1_shard1_replica_t1] o.a.s.u.UpdateHandler Using UpdateLog implementation: org.apache.solr.update.UpdateLog
   [junit4]   2> 367448 INFO  (qtp28501984-4009) [n:127.0.0.1:55748_ c:collection1 s:shard1  x:collection1_shard1_replica_t1] o.a.s.u.UpdateLog Initializing UpdateLog: dataDir= defaultSyncLevel=FLUSH numRecordsToKeep=100 maxNumLogsToKeep=10 numVersionBuckets=65536
   [junit4]   2> 367449 INFO  (qtp28501984-4009) [n:127.0.0.1:55748_ c:collection1 s:shard1  x:collection1_shard1_replica_t1] o.a.s.u.CommitTracker Hard AutoCommit: if uncommited for 15000ms;
   [junit4]   2> 367449 INFO  (qtp28501984-4009) [n:127.0.0.1:55748_ c:collection1 s:shard1  x:collection1_shard1_replica_t1] o.a.s.u.CommitTracker Soft AutoCommit: disabled
   [junit4]   2> 367450 INFO  (qtp28501984-4009) [n:127.0.0.1:55748_ c:collection1 s:shard1  x:collection1_shard1_replica_t1] o.a.s.u.RandomMergePolicy RandomMergePolicy wrapping class org.apache.lucene.index.TieredMergePolicy: [TieredMergePolicy: maxMergeAtOnce=2, maxMergeAtOnceExplicit=2, maxMergedSegmentMB=33.4736328125, floorSegmentMB=0.5771484375, forceMergeDeletesPctAllowed=5.747476825549848, segmentsPerTier=11.0, maxCFSSegmentSizeMB=8.796093022207999E12, noCFSRatio=0.11652470293535266
   [junit4]   2> 367450 INFO  (qtp28501984-4009) [n:127.0.0.1:55748_ c:collection1 s:shard1  x:collection1_shard1_replica_t1] o.a.s.s.SolrIndexSearcher Opening [Searcher@d5f219[collection1_shard1_replica_t1] main]
   [junit4]   2> 367452 INFO  (qtp28501984-4009) [n:127.0.0.1:55748_ c:collection1 s:shard1  x:collection1_shard1_replica_t1] o.a.s.r.ManagedResourceStorage Configured ZooKeeperStorageIO with znodeBase: /configs/conf1
   [junit4]   2> 367452 INFO  (qtp28501984-4009) [n:127.0.0.1:55748_ c:collection1 s:shard1  x:collection1_shard1_replica_t1] o.a.s.r.ManagedResourceStorage Loaded null at path _rest_managed.json using ZooKeeperStorageIO:path=/configs/conf1
   [junit4]   2> 367452 INFO  (qtp28501984-4009) [n:127.0.0.1:55748_ c:collection1 s:shard1  x:collection1_shard1_replica_t1] o.a.s.h.ReplicationHandler Commits will be reserved for  10000
   [junit4]   2> 367454 INFO  (searcherExecutor-1234-thread-1-processing-n:127.0.0.1:55748_ x:collection1_shard1_replica_t1 s:shard1 c:collection1) [n:127.0.0.1:55748_ c:collection1 s:shard1  x:collection1_shard1_replica_t1] o.a.s.c.SolrCore [collection1_shard1_replica_t1] Registered new searcher Searcher@d5f219[collection1_shard1_replica_t1] main{ExitableDirectoryReader(UninvertingDirectoryReader())}
   [junit4]   2> 367454 INFO  (qtp28501984-4009) [n:127.0.0.1:55748_ c:collection1 s:shard1  x:collection1_shard1_replica_t1] o.a.s.u.UpdateLog Could not find max version in index or recent updates, using new clock 1573114050821226496
   [junit4]   2> 367460 INFO  (qtp28501984-4009) [n:127.0.0.1:55748_ c:collection1 s:shard1  x:collection1_shard1_replica_t1] o.a.s.c.ZkController Core needs to recover:collection1_shard1_replica_t1
   [junit4]   2> 367460 INFO  (updateExecutor-1333-thread-1-processing-n:127.0.0.1:55748_ x:collection1_shard1_replica_t1 s:shard1 c:collection1) [n:127.0.0.1:55748_ c:collection1 s:shard1 r:core_node2 x:collection1_shard1_replica_t1] o.a.s.u.DefaultSolrCoreState Running recovery
   [junit4]   2> 367461 INFO  (recoveryExecutor-1334-thread-1-processing-n:127.0.0.1:55748_ x:collection1_shard1_replica_t1 s:shard1 c:collection1 r:core_node2) [n:127.0.0.1:55748_ c:collection1 s:shard1 r:core_node2 x:collection1_shard1_replica_t1] o.a.s.c.RecoveryStrategy Starting recovery process. recoveringAfterStartup=true
   [junit4]   2> 367461 INFO  (recoveryExecutor-1334-thread-1-processing-n:127.0.0.1:55748_ x:collection1_shard1_replica_t1 s:shard1 c:collection1 r:core_node2) [n:127.0.0.1:55748_ c:collection1 s:shard1 r:core_node2 x:collection1_shard1_replica_t1] o.a.s.c.RecoveryStrategy ###### startupVersions=[[]]
   [junit4]   2> 367461 INFO  (recoveryExecutor-1334-thread-1-processing-n:127.0.0.1:55748_ x:collection1_shard1_replica_t1 s:shard1 c:collection1 r:core_node2) [n:127.0.0.1:55748_ c:collection1 s:shard1 r:core_node2 x:collection1_shard1_replica_t1] o.a.s.c.ZkController collection1_shard1_replica_t1 stopping background replication from leader
   [junit4]   2> 367461 INFO  (recoveryExecutor-1334-thread-1-processing-n:127.0.0.1:55748_ x:collection1_shard1_replica_t1 s:shard1 c:collection1 r:core_node2) [n:127.0.0.1:55748_ c:collection1 s:shard1 r:core_node2 x:collection1_shard1_replica_t1] o.a.s.c.RecoveryStrategy Begin buffering updates. core=[collection1_shard1_replica_t1]
   [junit4]   2> 367461 INFO  (recoveryExecutor-1334-thread-1-processing-n:127.0.0.1:55748_ x:collection1_shard1_replica_t1 s:shard1 c:collection1 r:core_node2) [n:127.0.0.1:55748_ c:collection1 s:shard1 r:core_node2 x:collection1_shard1_replica_t1] o.a.s.u.UpdateLog Starting to buffer updates. FSUpdateLog{state=ACTIVE, tlog=null}
   [junit4]   2> 367461 INFO  (recoveryExecutor-1334-thread-1-processing-n:127.0.0.1:55748_ x:collection1_shard1_replica_t1 s:shard1 c:collection1 r:core_node2) [n:127.0.0.1:55748_ c:collection1 s:shard1 r:core_node2 x:collection1_shard1_replica_t1] o.a.s.c.RecoveryStrategy Publishing state of core [collection1_shard1_replica_t1] as recovering, leader is [http://127.0.0.1:55728/collection1_shard1_replica_t0/] and I am [http://127.0.0.1:55748/collection1_shard1_replica_t1/]
   [junit4]   2> 367463 INFO  (qtp28501984-4009) [n:127.0.0.1:55748_ c:collection1 s:shard1  x:collection1_shard1_replica_t1] o.a.s.s.HttpSolrCall [admin] webapp=null path=/admin/cores params={qt=/admin/cores&collection.configName=conf1&name=collection1_shard1_replica_t1&action=CREATE&collection=collection1&shard=shard1&

[...truncated too long message...]

Native Method)
   [junit4]    >         at java.util.concurrent.locks.LockSupport.parkNanos(LockSupport.java:215)
   [junit4]    >         at java.util.concurrent.SynchronousQueue$TransferStack.awaitFulfill(SynchronousQueue.java:460)
   [junit4]    >         at java.util.concurrent.SynchronousQueue$TransferStack.transfer(SynchronousQueue.java:362)
   [junit4]    >         at java.util.concurrent.SynchronousQueue.poll(SynchronousQueue.java:941)
   [junit4]    >         at java.util.concurrent.ThreadPoolExecutor.getTask(ThreadPoolExecutor.java:1066)
   [junit4]    >         at java.util.concurrent.ThreadPoolExecutor.runWorker(ThreadPoolExecutor.java:1127)
   [junit4]    >         at java.util.concurrent.ThreadPoolExecutor$Worker.run(ThreadPoolExecutor.java:617)
   [junit4]    >         at java.lang.Thread.run(Thread.java:748)
   [junit4]    >    8) Thread[id=3974, name=TEST-ChaosMonkeyNothingIsSafeTest.test-seed#[1F4C7C087F1CC38B]-SendThread(127.0.0.1:55672), state=RUNNABLE, group=TGRP-ChaosMonkeyNothingIsSafeTest]
   [junit4]    >         at sun.nio.ch.WindowsSelectorImpl$SubSelector.poll0(Native Method)
   [junit4]    >         at sun.nio.ch.WindowsSelectorImpl$SubSelector.poll(WindowsSelectorImpl.java:296)
   [junit4]    >         at sun.nio.ch.WindowsSelectorImpl$SubSelector.access$400(WindowsSelectorImpl.java:278)
   [junit4]    >         at sun.nio.ch.WindowsSelectorImpl.doSelect(WindowsSelectorImpl.java:159)
   [junit4]    >         at sun.nio.ch.SelectorImpl.lockAndDoSelect(SelectorImpl.java:86)
   [junit4]    >         at sun.nio.ch.SelectorImpl.select(SelectorImpl.java:97)
   [junit4]    >         at org.apache.zookeeper.ClientCnxnSocketNIO.doTransport(ClientCnxnSocketNIO.java:349)
   [junit4]    >         at org.apache.zookeeper.ClientCnxn$SendThread.run(ClientCnxn.java:1141)
   [junit4]    >    9) Thread[id=4104, name=zkCallback-1325-thread-4, state=TIMED_WAITING, group=TGRP-ChaosMonkeyNothingIsSafeTest]
   [junit4]    >         at sun.misc.Unsafe.park(Native Method)
   [junit4]    >         at java.util.concurrent.locks.LockSupport.parkNanos(LockSupport.java:215)
   [junit4]    >         at java.util.concurrent.SynchronousQueue$TransferStack.awaitFulfill(SynchronousQueue.java:460)
   [junit4]    >         at java.util.concurrent.SynchronousQueue$TransferStack.transfer(SynchronousQueue.java:362)
   [junit4]    >         at java.util.concurrent.SynchronousQueue.poll(SynchronousQueue.java:941)
   [junit4]    >         at java.util.concurrent.ThreadPoolExecutor.getTask(ThreadPoolExecutor.java:1066)
   [junit4]    >         at java.util.concurrent.ThreadPoolExecutor.runWorker(ThreadPoolExecutor.java:1127)
   [junit4]    >         at java.util.concurrent.ThreadPoolExecutor$Worker.run(ThreadPoolExecutor.java:617)
   [junit4]    >         at java.lang.Thread.run(Thread.java:748)
   [junit4]    > at __randomizedtesting.SeedInfo.seed([1F4C7C087F1CC38B]:0)Throwable #2: com.carrotsearch.randomizedtesting.ThreadLeakError: There are still zombie threads that couldn't be terminated:
   [junit4]    >    1) Thread[id=4106, name=zkCallback-1325-thread-6, state=TIMED_WAITING, group=TGRP-ChaosMonkeyNothingIsSafeTest]
   [junit4]    >         at sun.misc.Unsafe.park(Native Method)
   [junit4]    >         at java.util.concurrent.locks.LockSupport.parkNanos(LockSupport.java:215)
   [junit4]    >         at java.util.concurrent.SynchronousQueue$TransferStack.awaitFulfill(SynchronousQueue.java:460)
   [junit4]    >         at java.util.concurrent.SynchronousQueue$TransferStack.transfer(SynchronousQueue.java:362)
   [junit4]    >         at java.util.concurrent.SynchronousQueue.poll(SynchronousQueue.java:941)
   [junit4]    >         at java.util.concurrent.ThreadPoolExecutor.getTask(ThreadPoolExecutor.java:1066)
   [junit4]    >         at java.util.concurrent.ThreadPoolExecutor.runWorker(ThreadPoolExecutor.java:1127)
   [junit4]    >         at java.util.concurrent.ThreadPoolExecutor$Worker.run(ThreadPoolExecutor.java:617)
   [junit4]    >         at java.lang.Thread.run(Thread.java:748)
   [junit4]    >    2) Thread[id=3976, name=zkCallback-1325-thread-1, state=TIMED_WAITING, group=TGRP-ChaosMonkeyNothingIsSafeTest]
   [junit4]    >         at sun.misc.Unsafe.park(Native Method)
   [junit4]    >         at java.util.concurrent.locks.LockSupport.parkNanos(LockSupport.java:215)
   [junit4]    >         at java.util.concurrent.SynchronousQueue$TransferStack.awaitFulfill(SynchronousQueue.java:460)
   [junit4]    >         at java.util.concurrent.SynchronousQueue$TransferStack.transfer(SynchronousQueue.java:362)
   [junit4]    >         at java.util.concurrent.SynchronousQueue.poll(SynchronousQueue.java:941)
   [junit4]    >         at java.util.concurrent.ThreadPoolExecutor.getTask(ThreadPoolExecutor.java:1066)
   [junit4]    >         at java.util.concurrent.ThreadPoolExecutor.runWorker(ThreadPoolExecutor.java:1127)
   [junit4]    >         at java.util.concurrent.ThreadPoolExecutor$Worker.run(ThreadPoolExecutor.java:617)
   [junit4]    >         at java.lang.Thread.run(Thread.java:748)
   [junit4]    >    3) Thread[id=4105, name=zkCallback-1325-thread-5, state=TIMED_WAITING, group=TGRP-ChaosMonkeyNothingIsSafeTest]
   [junit4]    >         at sun.misc.Unsafe.park(Native Method)
   [junit4]    >         at java.util.concurrent.locks.LockSupport.parkNanos(LockSupport.java:215)
   [junit4]    >         at java.util.concurrent.SynchronousQueue$TransferStack.awaitFulfill(SynchronousQueue.java:460)
   [junit4]    >         at java.util.concurrent.SynchronousQueue$TransferStack.transfer(SynchronousQueue.java:362)
   [junit4]    >         at java.util.concurrent.SynchronousQueue.poll(SynchronousQueue.java:941)
   [junit4]    >         at java.util.concurrent.ThreadPoolExecutor.getTask(ThreadPoolExecutor.java:1066)
   [junit4]    >         at java.util.concurrent.ThreadPoolExecutor.runWorker(ThreadPoolExecutor.java:1127)
   [junit4]    >         at java.util.concurrent.ThreadPoolExecutor$Worker.run(ThreadPoolExecutor.java:617)
   [junit4]    >         at java.lang.Thread.run(Thread.java:748)
   [junit4]    >    4) Thread[id=4102, name=zkCallback-1325-thread-2, state=TIMED_WAITING, group=TGRP-ChaosMonkeyNothingIsSafeTest]
   [junit4]    >         at sun.misc.Unsafe.park(Native Method)
   [junit4]    >         at java.util.concurrent.locks.LockSupport.parkNanos(LockSupport.java:215)
   [junit4]    >         at java.util.concurrent.SynchronousQueue$TransferStack.awaitFulfill(SynchronousQueue.java:460)
   [junit4]    >         at java.util.concurrent.SynchronousQueue$TransferStack.transfer(SynchronousQueue.java:362)
   [junit4]    >         at java.util.concurrent.SynchronousQueue.poll(SynchronousQueue.java:941)
   [junit4]    >         at java.util.concurrent.ThreadPoolExecutor.getTask(ThreadPoolExecutor.java:1066)
   [junit4]    >         at java.util.concurrent.ThreadPoolExecutor.runWorker(ThreadPoolExecutor.java:1127)
   [junit4]    >         at java.util.concurrent.ThreadPoolExecutor$Worker.run(ThreadPoolExecutor.java:617)
   [junit4]    >         at java.lang.Thread.run(Thread.java:748)
   [junit4]    >    5) Thread[id=4103, name=zkCallback-1325-thread-3, state=TIMED_WAITING, group=TGRP-ChaosMonkeyNothingIsSafeTest]
   [junit4]    >         at sun.misc.Unsafe.park(Native Method)
   [junit4]    >         at java.util.concurrent.locks.LockSupport.parkNanos(LockSupport.java:215)
   [junit4]    >         at java.util.concurrent.SynchronousQueue$TransferStack.awaitFulfill(SynchronousQueue.java:460)
   [junit4]    >         at java.util.concurrent.SynchronousQueue$TransferStack.transfer(SynchronousQueue.java:362)
   [junit4]    >         at java.util.concurrent.SynchronousQueue.poll(SynchronousQueue.java:941)
   [junit4]    >         at java.util.concurrent.ThreadPoolExecutor.getTask(ThreadPoolExecutor.java:1066)
   [junit4]    >         at java.util.concurrent.ThreadPoolExecutor.runWorker(ThreadPoolExecutor.java:1127)
   [junit4]    >         at java.util.concurrent.ThreadPoolExecutor$Worker.run(ThreadPoolExecutor.java:617)
   [junit4]    >         at java.lang.Thread.run(Thread.java:748)
   [junit4]    >    6) Thread[id=3974, name=TEST-ChaosMonkeyNothingIsSafeTest.test-seed#[1F4C7C087F1CC38B]-SendThread(127.0.0.1:55672), state=TIMED_WAITING, group=TGRP-ChaosMonkeyNothingIsSafeTest]
   [junit4]    >         at java.lang.Thread.sleep(Native Method)
   [junit4]    >         at org.apache.zookeeper.client.StaticHostProvider.next(StaticHostProvider.java:101)
   [junit4]    >         at org.apache.zookeeper.ClientCnxn$SendThread.startConnect(ClientCnxn.java:997)
   [junit4]    >         at org.apache.zookeeper.ClientCnxn$SendThread.run(ClientCnxn.java:1060)
   [junit4]    >    7) Thread[id=4104, name=zkCallback-1325-thread-4, state=TIMED_WAITING, group=TGRP-ChaosMonkeyNothingIsSafeTest]
   [junit4]    >         at sun.misc.Unsafe.park(Native Method)
   [junit4]    >         at java.util.concurrent.locks.LockSupport.parkNanos(LockSupport.java:215)
   [junit4]    >         at java.util.concurrent.SynchronousQueue$TransferStack.awaitFulfill(SynchronousQueue.java:460)
   [junit4]    >         at java.util.concurrent.SynchronousQueue$TransferStack.transfer(SynchronousQueue.java:362)
   [junit4]    >         at java.util.concurrent.SynchronousQueue.poll(SynchronousQueue.java:941)
   [junit4]    >         at java.util.concurrent.ThreadPoolExecutor.getTask(ThreadPoolExecutor.java:1066)
   [junit4]    >         at java.util.concurrent.ThreadPoolExecutor.runWorker(ThreadPoolExecutor.java:1127)
   [junit4]    >         at java.util.concurrent.ThreadPoolExecutor$Worker.run(ThreadPoolExecutor.java:617)
   [junit4]    >         at java.lang.Thread.run(Thread.java:748)
   [junit4]    > at __randomizedtesting.SeedInfo.seed([1F4C7C087F1CC38B]:0)
   [junit4] Completed [101/728 (1!)] on J0 in 68.93s, 1 test, 3 errors <<< FAILURES!

[...truncated 41391 lines...]


---------------------------------------------------------------------
To unsubscribe, e-mail: [hidden email]
For additional commands, e-mail: [hidden email]
Loading...