[JENKINS] Lucene-Solr-7.x-Windows (32bit/jdk1.8.0_172) - Build # 683 - Unstable!

classic Classic list List threaded Threaded
1 message Options
Reply | Threaded
Open this post in threaded view
|

[JENKINS] Lucene-Solr-7.x-Windows (32bit/jdk1.8.0_172) - Build # 683 - Unstable!

Policeman Jenkins Server-2
Build: https://jenkins.thetaphi.de/job/Lucene-Solr-7.x-Windows/683/
Java: 32bit/jdk1.8.0_172 -client -XX:+UseParallelGC

1 tests failed.
FAILED:  org.apache.solr.cloud.OverseerTaskQueueTest.testPeekElements

Error Message:


Stack Trace:
java.lang.AssertionError
        at __randomizedtesting.SeedInfo.seed([A5FB8759C2377519:58D53D78120E2104]:0)
        at org.junit.Assert.fail(Assert.java:92)
        at org.junit.Assert.assertTrue(Assert.java:43)
        at org.junit.Assert.assertTrue(Assert.java:54)
        at org.apache.solr.cloud.DistributedQueueTest.testPeekElements(DistributedQueueTest.java:265)
        at sun.reflect.NativeMethodAccessorImpl.invoke0(Native Method)
        at sun.reflect.NativeMethodAccessorImpl.invoke(NativeMethodAccessorImpl.java:62)
        at sun.reflect.DelegatingMethodAccessorImpl.invoke(DelegatingMethodAccessorImpl.java:43)
        at java.lang.reflect.Method.invoke(Method.java:498)
        at com.carrotsearch.randomizedtesting.RandomizedRunner.invoke(RandomizedRunner.java:1737)
        at com.carrotsearch.randomizedtesting.RandomizedRunner$8.evaluate(RandomizedRunner.java:934)
        at com.carrotsearch.randomizedtesting.RandomizedRunner$9.evaluate(RandomizedRunner.java:970)
        at com.carrotsearch.randomizedtesting.RandomizedRunner$10.evaluate(RandomizedRunner.java:984)
        at com.carrotsearch.randomizedtesting.rules.SystemPropertiesRestoreRule$1.evaluate(SystemPropertiesRestoreRule.java:57)
        at org.apache.lucene.util.TestRuleSetupTeardownChained$1.evaluate(TestRuleSetupTeardownChained.java:49)
        at org.apache.lucene.util.AbstractBeforeAfterRule$1.evaluate(AbstractBeforeAfterRule.java:45)
        at org.apache.lucene.util.TestRuleThreadAndTestName$1.evaluate(TestRuleThreadAndTestName.java:48)
        at org.apache.lucene.util.TestRuleIgnoreAfterMaxFailures$1.evaluate(TestRuleIgnoreAfterMaxFailures.java:64)
        at org.apache.lucene.util.TestRuleMarkFailure$1.evaluate(TestRuleMarkFailure.java:47)
        at com.carrotsearch.randomizedtesting.rules.StatementAdapter.evaluate(StatementAdapter.java:36)
        at com.carrotsearch.randomizedtesting.ThreadLeakControl$StatementRunner.run(ThreadLeakControl.java:368)
        at com.carrotsearch.randomizedtesting.ThreadLeakControl.forkTimeoutingTask(ThreadLeakControl.java:817)
        at com.carrotsearch.randomizedtesting.ThreadLeakControl$3.evaluate(ThreadLeakControl.java:468)
        at com.carrotsearch.randomizedtesting.RandomizedRunner.runSingleTest(RandomizedRunner.java:943)
        at com.carrotsearch.randomizedtesting.RandomizedRunner$5.evaluate(RandomizedRunner.java:829)
        at com.carrotsearch.randomizedtesting.RandomizedRunner$6.evaluate(RandomizedRunner.java:879)
        at com.carrotsearch.randomizedtesting.RandomizedRunner$7.evaluate(RandomizedRunner.java:890)
        at com.carrotsearch.randomizedtesting.rules.StatementAdapter.evaluate(StatementAdapter.java:36)
        at com.carrotsearch.randomizedtesting.rules.SystemPropertiesRestoreRule$1.evaluate(SystemPropertiesRestoreRule.java:57)
        at org.apache.lucene.util.AbstractBeforeAfterRule$1.evaluate(AbstractBeforeAfterRule.java:45)
        at com.carrotsearch.randomizedtesting.rules.StatementAdapter.evaluate(StatementAdapter.java:36)
        at org.apache.lucene.util.TestRuleStoreClassName$1.evaluate(TestRuleStoreClassName.java:41)
        at com.carrotsearch.randomizedtesting.rules.NoShadowingOrOverridesOnMethodsRule$1.evaluate(NoShadowingOrOverridesOnMethodsRule.java:40)
        at com.carrotsearch.randomizedtesting.rules.NoShadowingOrOverridesOnMethodsRule$1.evaluate(NoShadowingOrOverridesOnMethodsRule.java:40)
        at com.carrotsearch.randomizedtesting.rules.StatementAdapter.evaluate(StatementAdapter.java:36)
        at com.carrotsearch.randomizedtesting.rules.StatementAdapter.evaluate(StatementAdapter.java:36)
        at com.carrotsearch.randomizedtesting.rules.StatementAdapter.evaluate(StatementAdapter.java:36)
        at org.apache.lucene.util.TestRuleAssertionsRequired$1.evaluate(TestRuleAssertionsRequired.java:53)
        at org.apache.lucene.util.TestRuleMarkFailure$1.evaluate(TestRuleMarkFailure.java:47)
        at org.apache.lucene.util.TestRuleIgnoreAfterMaxFailures$1.evaluate(TestRuleIgnoreAfterMaxFailures.java:64)
        at org.apache.lucene.util.TestRuleIgnoreTestSuites$1.evaluate(TestRuleIgnoreTestSuites.java:54)
        at com.carrotsearch.randomizedtesting.rules.StatementAdapter.evaluate(StatementAdapter.java:36)
        at com.carrotsearch.randomizedtesting.ThreadLeakControl$StatementRunner.run(ThreadLeakControl.java:368)
        at java.lang.Thread.run(Thread.java:748)




Build Log:
[...truncated 13894 lines...]
   [junit4] Suite: org.apache.solr.cloud.OverseerTaskQueueTest
   [junit4]   2> 2981801 INFO  (SUITE-OverseerTaskQueueTest-seed#[A5FB8759C2377519]-worker) [    ] o.a.s.SolrTestCaseJ4 SecureRandom sanity checks: test.solr.allowed.securerandom=null & java.security.egd=file:/dev/./urandom
   [junit4]   2> Creating dataDir: C:\Users\jenkins\workspace\Lucene-Solr-7.x-Windows\solr\build\solr-core\test\J0\temp\solr.cloud.OverseerTaskQueueTest_A5FB8759C2377519-001\init-core-data-001
   [junit4]   2> 2981803 WARN  (SUITE-OverseerTaskQueueTest-seed#[A5FB8759C2377519]-worker) [    ] o.a.s.SolrTestCaseJ4 startTrackingSearchers: numOpens=6 numCloses=6
   [junit4]   2> 2981803 INFO  (SUITE-OverseerTaskQueueTest-seed#[A5FB8759C2377519]-worker) [    ] o.a.s.SolrTestCaseJ4 Using PointFields (NUMERIC_POINTS_SYSPROP=true) w/NUMERIC_DOCVALUES_SYSPROP=false
   [junit4]   2> 2981807 INFO  (SUITE-OverseerTaskQueueTest-seed#[A5FB8759C2377519]-worker) [    ] o.a.s.SolrTestCaseJ4 Randomized ssl (true) and clientAuth (false) via: @org.apache.solr.util.RandomizeSSL(reason=, value=NaN, ssl=NaN, clientAuth=NaN)
   [junit4]   2> 2981809 INFO  (TEST-OverseerTaskQueueTest.testLocallyOffer-seed#[A5FB8759C2377519]) [    ] o.a.s.SolrTestCaseJ4 ###Starting testLocallyOffer
   [junit4]   2> 2981810 INFO  (TEST-OverseerTaskQueueTest.testLocallyOffer-seed#[A5FB8759C2377519]) [    ] o.a.s.c.ZkTestServer STARTING ZK TEST SERVER
   [junit4]   2> 2981810 INFO  (Thread-4528) [    ] o.a.s.c.ZkTestServer client port:0.0.0.0/0.0.0.0:0
   [junit4]   2> 2981810 INFO  (Thread-4528) [    ] o.a.s.c.ZkTestServer Starting server
   [junit4]   2> 2981813 ERROR (Thread-4528) [    ] o.a.z.s.ZooKeeperServer ZKShutdownHandler is not registered, so ZooKeeper server won't take any action on ERROR or SHUTDOWN server state changes
   [junit4]   2> 2981911 INFO  (TEST-OverseerTaskQueueTest.testLocallyOffer-seed#[A5FB8759C2377519]) [    ] o.a.s.c.ZkTestServer start zk server on port:57682
   [junit4]   2> 2981920 INFO  (zkConnectionManagerCallback-6283-thread-1) [    ] o.a.s.c.c.ConnectionManager zkClient has connected
   [junit4]   2> 2982321 INFO  (TEST-OverseerTaskQueueTest.testLocallyOffer-seed#[A5FB8759C2377519]) [    ] o.a.s.SolrTestCaseJ4 ###Ending testLocallyOffer
   [junit4]   2> 2982321 ERROR (TEST-OverseerTaskQueueTest.testLocallyOffer-seed#[A5FB8759C2377519]) [    ] o.a.z.s.ZooKeeperServer ZKShutdownHandler is not registered, so ZooKeeper server won't take any action on ERROR or SHUTDOWN server state changes
   [junit4]   2> 2982322 INFO  (TEST-OverseerTaskQueueTest.testLocallyOffer-seed#[A5FB8759C2377519]) [    ] o.a.s.c.ZkTestServer connecting to 127.0.0.1:57682 57682
   [junit4]   2> 2982323 INFO  (Thread-4528) [    ] o.a.s.c.ZkTestServer connecting to 127.0.0.1:57682 57682
   [junit4]   2> 2982326 INFO  (TEST-OverseerTaskQueueTest.testDistributedQueue-seed#[A5FB8759C2377519]) [    ] o.a.s.SolrTestCaseJ4 ###Starting testDistributedQueue
   [junit4]   2> 2982327 INFO  (TEST-OverseerTaskQueueTest.testDistributedQueue-seed#[A5FB8759C2377519]) [    ] o.a.s.c.ZkTestServer STARTING ZK TEST SERVER
   [junit4]   2> 2982327 INFO  (Thread-4529) [    ] o.a.s.c.ZkTestServer client port:0.0.0.0/0.0.0.0:0
   [junit4]   2> 2982329 INFO  (Thread-4529) [    ] o.a.s.c.ZkTestServer Starting server
   [junit4]   2> 2982331 ERROR (Thread-4529) [    ] o.a.z.s.ZooKeeperServer ZKShutdownHandler is not registered, so ZooKeeper server won't take any action on ERROR or SHUTDOWN server state changes
   [junit4]   2> 2982428 INFO  (TEST-OverseerTaskQueueTest.testDistributedQueue-seed#[A5FB8759C2377519]) [    ] o.a.s.c.ZkTestServer start zk server on port:57688
   [junit4]   2> 2982433 INFO  (zkConnectionManagerCallback-6286-thread-1) [    ] o.a.s.c.c.ConnectionManager zkClient has connected
   [junit4]   2> 2984623 INFO  (TEST-OverseerTaskQueueTest.testDistributedQueue-seed#[A5FB8759C2377519]) [    ] o.a.s.SolrTestCaseJ4 ###Ending testDistributedQueue
   [junit4]   2> 2984624 ERROR (TEST-OverseerTaskQueueTest.testDistributedQueue-seed#[A5FB8759C2377519]) [    ] o.a.z.s.ZooKeeperServer ZKShutdownHandler is not registered, so ZooKeeper server won't take any action on ERROR or SHUTDOWN server state changes
   [junit4]   2> 2984624 INFO  (TEST-OverseerTaskQueueTest.testDistributedQueue-seed#[A5FB8759C2377519]) [    ] o.a.s.c.ZkTestServer connecting to 127.0.0.1:57688 57688
   [junit4]   2> 2984625 INFO  (Thread-4529) [    ] o.a.s.c.ZkTestServer connecting to 127.0.0.1:57688 57688
   [junit4]   2> 2984628 INFO  (TEST-OverseerTaskQueueTest.testContainsTaskWithRequestId-seed#[A5FB8759C2377519]) [    ] o.a.s.SolrTestCaseJ4 ###Starting testContainsTaskWithRequestId
   [junit4]   2> 2984629 INFO  (TEST-OverseerTaskQueueTest.testContainsTaskWithRequestId-seed#[A5FB8759C2377519]) [    ] o.a.s.c.ZkTestServer STARTING ZK TEST SERVER
   [junit4]   2> 2984818 INFO  (Thread-4532) [    ] o.a.s.c.ZkTestServer client port:0.0.0.0/0.0.0.0:0
   [junit4]   2> 2984818 INFO  (Thread-4532) [    ] o.a.s.c.ZkTestServer Starting server
   [junit4]   2> 2984820 ERROR (Thread-4532) [    ] o.a.z.s.ZooKeeperServer ZKShutdownHandler is not registered, so ZooKeeper server won't take any action on ERROR or SHUTDOWN server state changes
   [junit4]   2> 2985004 INFO  (TEST-OverseerTaskQueueTest.testContainsTaskWithRequestId-seed#[A5FB8759C2377519]) [    ] o.a.s.c.ZkTestServer start zk server on port:57718
   [junit4]   2> 2985182 INFO  (zkConnectionManagerCallback-6289-thread-1) [    ] o.a.s.c.c.ConnectionManager zkClient has connected
   [junit4]   2> 2985191 INFO  (TEST-OverseerTaskQueueTest.testContainsTaskWithRequestId-seed#[A5FB8759C2377519]) [    ] o.a.s.SolrTestCaseJ4 ###Ending testContainsTaskWithRequestId
   [junit4]   2> 2985192 ERROR (TEST-OverseerTaskQueueTest.testContainsTaskWithRequestId-seed#[A5FB8759C2377519]) [    ] o.a.z.s.ZooKeeperServer ZKShutdownHandler is not registered, so ZooKeeper server won't take any action on ERROR or SHUTDOWN server state changes
   [junit4]   2> 2985192 INFO  (TEST-OverseerTaskQueueTest.testContainsTaskWithRequestId-seed#[A5FB8759C2377519]) [    ] o.a.s.c.ZkTestServer connecting to 127.0.0.1:57718 57718
   [junit4]   2> 2985193 INFO  (Thread-4532) [    ] o.a.s.c.ZkTestServer connecting to 127.0.0.1:57718 57718
   [junit4]   2> 2985197 INFO  (TEST-OverseerTaskQueueTest.testDistributedQueueBlocking-seed#[A5FB8759C2377519]) [    ] o.a.s.SolrTestCaseJ4 ###Starting testDistributedQueueBlocking
   [junit4]   2> 2985198 INFO  (TEST-OverseerTaskQueueTest.testDistributedQueueBlocking-seed#[A5FB8759C2377519]) [    ] o.a.s.c.ZkTestServer STARTING ZK TEST SERVER
   [junit4]   2> 2985199 INFO  (Thread-4533) [    ] o.a.s.c.ZkTestServer client port:0.0.0.0/0.0.0.0:0
   [junit4]   2> 2985199 INFO  (Thread-4533) [    ] o.a.s.c.ZkTestServer Starting server
   [junit4]   2> 2985204 ERROR (Thread-4533) [    ] o.a.z.s.ZooKeeperServer ZKShutdownHandler is not registered, so ZooKeeper server won't take any action on ERROR or SHUTDOWN server state changes
   [junit4]   2> 2985348 INFO  (TEST-OverseerTaskQueueTest.testDistributedQueueBlocking-seed#[A5FB8759C2377519]) [    ] o.a.s.c.ZkTestServer start zk server on port:57730
   [junit4]   2> 2985374 INFO  (zkConnectionManagerCallback-6292-thread-1) [    ] o.a.s.c.c.ConnectionManager zkClient has connected
   [junit4]   2> 2986586 WARN  (zkConnectionManagerCallback-6292-thread-1) [    ] o.a.s.c.c.ConnectionManager Watcher org.apache.solr.common.cloud.ConnectionManager@1a69515 name: ZooKeeperConnection Watcher:127.0.0.1:57730/solr got event WatchedEvent state:Disconnected type:None path:null path: null type: None
   [junit4]   2> 2986586 WARN  (zkConnectionManagerCallback-6292-thread-1) [    ] o.a.s.c.c.ConnectionManager zkClient has disconnected
   [junit4]   2> 2988402 WARN  (TEST-OverseerTaskQueueTest.testDistributedQueueBlocking-seed#[A5FB8759C2377519]-SendThread(127.0.0.1:57730)) [    ] o.a.z.ClientCnxn Unable to reconnect to ZooKeeper service, session 0x1000232152b0000 has expired
   [junit4]   2> 2988402 WARN  (zkConnectionManagerCallback-6292-thread-1) [    ] o.a.s.c.c.ConnectionManager Watcher org.apache.solr.common.cloud.ConnectionManager@1a69515 name: ZooKeeperConnection Watcher:127.0.0.1:57730/solr got event WatchedEvent state:Expired type:None path:null path: null type: None
   [junit4]   2> 2988402 WARN  (zkConnectionManagerCallback-6292-thread-1) [    ] o.a.s.c.c.ConnectionManager Our previous ZooKeeper session was expired. Attempting to reconnect to recover relationship with ZooKeeper...
   [junit4]   2> 2988402 WARN  (zkConnectionManagerCallback-6292-thread-1) [    ] o.a.s.c.c.DefaultConnectionStrategy Connection expired - starting a new one...
   [junit4]   2> 2988403 INFO  (zkConnectionManagerCallback-6292-thread-1-EventThread) [    ] o.a.s.c.c.ConnectionManager zkClient has connected
   [junit4]   2> 2988403 INFO  (zkConnectionManagerCallback-6292-thread-1) [    ] o.a.s.c.c.ConnectionManager Connection with ZooKeeper reestablished.
   [junit4]   2> 2988404 INFO  (zkConnectionManagerCallback-6292-thread-1) [    ] o.a.s.c.c.DefaultConnectionStrategy Reconnected to ZooKeeper
   [junit4]   2> 2988404 INFO  (zkConnectionManagerCallback-6292-thread-1) [    ] o.a.s.c.c.ConnectionManager zkClient Connected:true
   [junit4]   2> 2989558 INFO  (TEST-OverseerTaskQueueTest.testDistributedQueueBlocking-seed#[A5FB8759C2377519]) [    ] o.a.s.SolrTestCaseJ4 ###Ending testDistributedQueueBlocking
   [junit4]   2> 2989559 ERROR (TEST-OverseerTaskQueueTest.testDistributedQueueBlocking-seed#[A5FB8759C2377519]) [    ] o.a.z.s.ZooKeeperServer ZKShutdownHandler is not registered, so ZooKeeper server won't take any action on ERROR or SHUTDOWN server state changes
   [junit4]   2> 2989559 INFO  (TEST-OverseerTaskQueueTest.testDistributedQueueBlocking-seed#[A5FB8759C2377519]) [    ] o.a.s.c.ZkTestServer connecting to 127.0.0.1:57730 57730
   [junit4]   2> 2989560 INFO  (Thread-4533) [    ] o.a.s.c.ZkTestServer connecting to 127.0.0.1:57730 57730
   [junit4]   2> 2989561 WARN  (Thread-4533) [    ] o.a.s.c.ZkTestServer Watch limit violations:
   [junit4]   2> Maximum concurrent children watches above limit:
   [junit4]   2>
   [junit4]   2> 2 /solr/distqueue/test
   [junit4]   2>
   [junit4]   2> 2989564 INFO  (TEST-OverseerTaskQueueTest.testPeekElements-seed#[A5FB8759C2377519]) [    ] o.a.s.SolrTestCaseJ4 ###Starting testPeekElements
   [junit4]   2> 2989565 INFO  (TEST-OverseerTaskQueueTest.testPeekElements-seed#[A5FB8759C2377519]) [    ] o.a.s.c.ZkTestServer STARTING ZK TEST SERVER
   [junit4]   2> 2989565 INFO  (Thread-4534) [    ] o.a.s.c.ZkTestServer client port:0.0.0.0/0.0.0.0:0
   [junit4]   2> 2989565 INFO  (Thread-4534) [    ] o.a.s.c.ZkTestServer Starting server
   [junit4]   2> 2989568 ERROR (Thread-4534) [    ] o.a.z.s.ZooKeeperServer ZKShutdownHandler is not registered, so ZooKeeper server won't take any action on ERROR or SHUTDOWN server state changes
   [junit4]   2> 2989666 INFO  (TEST-OverseerTaskQueueTest.testPeekElements-seed#[A5FB8759C2377519]) [    ] o.a.s.c.ZkTestServer start zk server on port:57774
   [junit4]   2> 2989670 INFO  (zkConnectionManagerCallback-6295-thread-1) [    ] o.a.s.c.c.ConnectionManager zkClient has connected
   [junit4]   2> 2991996 INFO  (TEST-OverseerTaskQueueTest.testPeekElements-seed#[A5FB8759C2377519]) [    ] o.a.s.SolrTestCaseJ4 ###Ending testPeekElements
   [junit4]   2> 2991997 ERROR (TEST-OverseerTaskQueueTest.testPeekElements-seed#[A5FB8759C2377519]) [    ] o.a.z.s.ZooKeeperServer ZKShutdownHandler is not registered, so ZooKeeper server won't take any action on ERROR or SHUTDOWN server state changes
   [junit4]   2> 2991999 INFO  (TEST-OverseerTaskQueueTest.testPeekElements-seed#[A5FB8759C2377519]) [    ] o.a.s.c.ZkTestServer connecting to 127.0.0.1:57774 57774
   [junit4]   2> 2992001 INFO  (Thread-4534) [    ] o.a.s.c.ZkTestServer connecting to 127.0.0.1:57774 57774
   [junit4]   2> NOTE: reproduce with: ant test  -Dtestcase=OverseerTaskQueueTest -Dtests.method=testPeekElements -Dtests.seed=A5FB8759C2377519 -Dtests.slow=true -Dtests.locale=id -Dtests.timezone=Asia/Kuala_Lumpur -Dtests.asserts=true -Dtests.file.encoding=ISO-8859-1
   [junit4] FAILURE 2.45s J0 | OverseerTaskQueueTest.testPeekElements <<<
   [junit4]    > Throwable #1: java.lang.AssertionError
   [junit4]    > at __randomizedtesting.SeedInfo.seed([A5FB8759C2377519:58D53D78120E2104]:0)
   [junit4]    > at org.apache.solr.cloud.DistributedQueueTest.testPeekElements(DistributedQueueTest.java:265)
   [junit4]    > at java.lang.Thread.run(Thread.java:748)
   [junit4]   2> 2992011 INFO  (TEST-OverseerTaskQueueTest.testLeakChildWatcher-seed#[A5FB8759C2377519]) [    ] o.a.s.SolrTestCaseJ4 ###Starting testLeakChildWatcher
   [junit4]   2> 2992013 INFO  (TEST-OverseerTaskQueueTest.testLeakChildWatcher-seed#[A5FB8759C2377519]) [    ] o.a.s.c.ZkTestServer STARTING ZK TEST SERVER
   [junit4]   2> 2992021 INFO  (Thread-4535) [    ] o.a.s.c.ZkTestServer client port:0.0.0.0/0.0.0.0:0
   [junit4]   2> 2992022 INFO  (Thread-4535) [    ] o.a.s.c.ZkTestServer Starting server
   [junit4]   2> 2992049 ERROR (Thread-4535) [    ] o.a.z.s.ZooKeeperServer ZKShutdownHandler is not registered, so ZooKeeper server won't take any action on ERROR or SHUTDOWN server state changes
   [junit4]   2> 2992114 INFO  (TEST-OverseerTaskQueueTest.testLeakChildWatcher-seed#[A5FB8759C2377519]) [    ] o.a.s.c.ZkTestServer start zk server on port:57846
   [junit4]   2> 2992268 INFO  (zkConnectionManagerCallback-6298-thread-1) [    ] o.a.s.c.c.ConnectionManager zkClient has connected
   [junit4]   2> 2992398 INFO  (TEST-OverseerTaskQueueTest.testLeakChildWatcher-seed#[A5FB8759C2377519]) [    ] o.a.s.SolrTestCaseJ4 ###Ending testLeakChildWatcher
   [junit4]   2> 2992399 ERROR (TEST-OverseerTaskQueueTest.testLeakChildWatcher-seed#[A5FB8759C2377519]) [    ] o.a.z.s.ZooKeeperServer ZKShutdownHandler is not registered, so ZooKeeper server won't take any action on ERROR or SHUTDOWN server state changes
   [junit4]   2> 2992399 INFO  (TEST-OverseerTaskQueueTest.testLeakChildWatcher-seed#[A5FB8759C2377519]) [    ] o.a.s.c.ZkTestServer connecting to 127.0.0.1:57846 57846
   [junit4]   2> 2992400 INFO  (Thread-4535) [    ] o.a.s.c.ZkTestServer connecting to 127.0.0.1:57846 57846
   [junit4]   2> 2992403 INFO  (TEST-OverseerTaskQueueTest.testDistributedQueueCache-seed#[A5FB8759C2377519]) [    ] o.a.s.SolrTestCaseJ4 ###Starting testDistributedQueueCache
   [junit4]   2> 2992405 INFO  (TEST-OverseerTaskQueueTest.testDistributedQueueCache-seed#[A5FB8759C2377519]) [    ] o.a.s.c.ZkTestServer STARTING ZK TEST SERVER
   [junit4]   2> 2992406 INFO  (Thread-4536) [    ] o.a.s.c.ZkTestServer client port:0.0.0.0/0.0.0.0:0
   [junit4]   2> 2992406 INFO  (Thread-4536) [    ] o.a.s.c.ZkTestServer Starting server
   [junit4]   2> 2992408 ERROR (Thread-4536) [    ] o.a.z.s.ZooKeeperServer ZKShutdownHandler is not registered, so ZooKeeper server won't take any action on ERROR or SHUTDOWN server state changes
   [junit4]   2> 2992506 INFO  (TEST-OverseerTaskQueueTest.testDistributedQueueCache-seed#[A5FB8759C2377519]) [    ] o.a.s.c.ZkTestServer start zk server on port:57864
   [junit4]   2> 2992509 INFO  (zkConnectionManagerCallback-6301-thread-1) [    ] o.a.s.c.c.ConnectionManager zkClient has connected
   [junit4]   2> 2992520 INFO  (TEST-OverseerTaskQueueTest.testDistributedQueueCache-seed#[A5FB8759C2377519]) [    ] o.a.s.SolrTestCaseJ4 ###Ending testDistributedQueueCache
   [junit4]   2> 2992521 ERROR (TEST-OverseerTaskQueueTest.testDistributedQueueCache-seed#[A5FB8759C2377519]) [    ] o.a.z.s.ZooKeeperServer ZKShutdownHandler is not registered, so ZooKeeper server won't take any action on ERROR or SHUTDOWN server state changes
   [junit4]   2> 2992521 INFO  (TEST-OverseerTaskQueueTest.testDistributedQueueCache-seed#[A5FB8759C2377519]) [    ] o.a.s.c.ZkTestServer connecting to 127.0.0.1:57864 57864
   [junit4]   2> 2992522 INFO  (Thread-4536) [    ] o.a.s.c.ZkTestServer connecting to 127.0.0.1:57864 57864
   [junit4]   2> NOTE: leaving temporary files on disk at: C:\Users\jenkins\workspace\Lucene-Solr-7.x-Windows\solr\build\solr-core\test\J0\temp\solr.cloud.OverseerTaskQueueTest_A5FB8759C2377519-001
   [junit4]   2> Jul 11, 2018 7:21:49 AM com.carrotsearch.randomizedtesting.ThreadLeakControl checkThreadLeaks
   [junit4]   2> WARNING: Will linger awaiting termination of 4 leaked thread(s).
   [junit4]   2> NOTE: test params are: codec=Lucene70, sim=RandomSimilarity(queryNorm=true): {}, locale=id, timezone=Asia/Kuala_Lumpur
   [junit4]   2> NOTE: Windows 10 10.0 x86/Oracle Corporation 1.8.0_172 (32-bit)/cpus=3,threads=1,free=148056456,total=493092864
   [junit4]   2> NOTE: All tests run in this JVM: [DateRangeFieldTest, BasicAuthIntegrationTest, TestLuceneIndexBackCompat, TestSegmentSorting, CdcrReplicationHandlerTest, RestoreTriggerStateTest, TestReloadAndDeleteDocs, TestZkChroot, MoveReplicaTest, CdcrVersionReplicationTest, TestLegacyFieldReuse, PreAnalyzedFieldManagedSchemaCloudTest, ConcurrentDeleteAndCreateCollectionTest, TestPhraseSuggestions, TestSolrQueryParser, TestSolrDeletionPolicy1, TestLFUCache, TestSchemalessBufferedUpdates, MergeStrategyTest, DocValuesNotIndexedTest, TestPushWriter, IndexSizeTriggerTest, ClassificationUpdateProcessorIntegrationTest, CollectionsAPIAsyncDistributedZkTest, TestCustomDocTransformer, TestComputePlanAction, UninvertDocValuesMergePolicyTest, TestRawTransformer, HdfsTlogReplayBufferedWhileIndexingTest, RequestLoggingTest, TestClusterStateMutator, TestFieldCacheSort, TestHdfsUpdateLog, TermsComponentTest, TestXmlQParserPlugin, TestNumericTokenStream, SyncSliceTest, TestCloudPseudoReturnFields, TestCloudInspectUtil, TestNodeLostTrigger, TestFieldSortValues, TestManagedStopFilterFactory, LeaderElectionIntegrationTest, PKIAuthenticationIntegrationTest, XmlInterpolationTest, TestDocSet, HdfsSyncSliceTest, TestRecoveryHdfs, NotRequiredUniqueKeyTest, FieldAnalysisRequestHandlerTest, SolrInfoBeanTest, TestNamedUpdateProcessors, SolrIndexConfigTest, MBeansHandlerTest, DistributedFacetPivotLongTailTest, TestManagedSchema, ChaosMonkeyNothingIsSafeTest, CoreMergeIndexesAdminHandlerTest, ConnectionManagerTest, RegexBytesRefFilterTest, TestOrdValues, UtilsToolTest, TestReplicationHandler, DocValuesMultiTest, TestSimDistributedQueue, TestMissingGroups, TestNumericTerms64, SolrJmxReporterCloudTest, TestClassicSimilarityFactory, DistributedFacetPivotSmallTest, TestBinaryResponseWriter, LIRRollingUpdatesTest, HdfsDirectoryTest, CheckHdfsIndexTest, HdfsWriteToMultipleCollectionsTest, VMParamsZkACLAndCredentialsProvidersTest, TestBulkSchemaConcurrent, TestManagedSynonymGraphFilterFactory, TestUnInvertedFieldException, TestDistributedGrouping, DistributedTermsComponentTest, TestJmxIntegration, TestDeleteCollectionOnDownNodes, SolrCloudExampleTest, TestSmileRequest, PeerSyncWithBufferUpdatesTest, RandomizedTaggerTest, TestNonDefinedSimilarityFactory, BasicDistributedZkTest, AliasIntegrationTest, DistributedFacetExistsSmallTest, TestExtendedDismaxParser, TestFuzzyAnalyzedSuggestions, TestPerFieldSimilarityWithDefaultOverride, BlockDirectoryTest, TestObjectReleaseTracker, TestJsonRequest, TestFieldTypeCollectionResource, StatelessScriptUpdateProcessorFactoryTest, TestImpersonationWithHadoopAuth, TestMacroExpander, TestRemoteStreaming, ShardRoutingTest, TestJavabinTupleStreamParser, LeaderFailoverAfterPartitionTest, DirectoryFactoryTest, TestSizeLimitedDistributedMap, TestWordDelimiterFilterFactory, HttpPartitionTest, TaggerTest, TestReloadDeadlock, TermVectorComponentDistributedTest, TestComponentsName, TestSchemaSimilarityResource, XsltUpdateRequestHandlerTest, OrderedExecutorTest, TestMiniSolrCloudClusterSSL, TestCSVLoader, CoreAdminOperationTest, TestDistribIDF, TestSubQueryTransformerDistrib, TestCollectionsAPIViaSolrCloudCluster, TestRandomCollapseQParserPlugin, BaseCdcrDistributedZkTest, TestJettySolrRunner, URLClassifyProcessorTest, TestExecutePlanAction, TestCorePropertiesReload, TestExpandComponent, TestSolrCoreProperties, SearchRateTriggerIntegrationTest, TestTrie, TestCloudSearcherWarming, TestUnifiedSolrHighlighter, TestCloudJSONFacetSKG, JSONWriterTest, ReplicationFactorTest, ComputePlanActionTest, ConfigureRecoveryStrategyTest, ConvertedLegacyTest, TimeRoutedAliasUpdateProcessorTest, TestComplexPhraseLeadingWildcard, TestSolrCloudWithSecureImpersonation, AutoAddReplicasPlanActionTest, TestDFRSimilarityFactory, DistanceFunctionTest, MetricsHistoryHandlerTest, SimpleMLTQParserTest, TestMergePolicyConfig, SuggestComponentContextFilterQueryTest, TestSchemaNameResource, AsyncCallRequestStatusResponseTest, PluginInfoTest, TestCollationFieldDocValues, TestJsonFacetsWithNestedObjects, SynonymTokenizerTest, UUIDFieldTest, TestQueryUtils, ChaosMonkeySafeLeaderTest, DocExpirationUpdateProcessorFactoryTest, TestBackupRepositoryFactory, MoveReplicaHDFSFailoverTest, SignatureUpdateProcessorFactoryTest, TestValueSourceCache, DistributedQueueTest, TestDistributedMap, DistributedMLTComponentTest, RecoveryZkTest, ZkSolrClientTest, TestInPlaceUpdatesStandalone, SubstringBytesRefFilterTest, ZkControllerTest, TestSolrIndexConfig, DisMaxRequestHandlerTest, SolrIndexSplitterTest, DeleteStatusTest, SolrGangliaReporterTest, LegacyCloudClusterPropTest, TestStandardQParsers, BitVectorTest, TestCloudSchemaless, RegexBoostProcessorTest, CollectionStateFormat2Test, DistributedSpellCheckComponentTest, RangeFacetCloudTest, TestLargeCluster, SolrRequestParserTest, SpellCheckComponentTest, TestLMDirichletSimilarityFactory, OverseerCollectionConfigSetProcessorTest, DistribDocExpirationUpdateProcessorTest, TestPointFields, TestPrepRecovery, SaslZkACLProviderTest, TestFileDictionaryLookup, SimplePostToolTest, SliceStateTest, EchoParamsTest, ParsingFieldUpdateProcessorsTest, AnalysisAfterCoreReloadTest, MinimalSchemaTest, OutputWriterTest, SampleTest, SolrTestCaseJ4Test, TestCrossCoreJoin, TestDistributedMissingSort, TestDistributedSearch, TestGroupingSearch, TestJoin, TestRandomDVFaceting, TestRandomFaceting, ProtectedTermFilterFactoryTest, TestCharFilters, TestLuceneMatchVersion, TokenizerChainTest, TestEmbeddedSolrServerConstructors, TestEmbeddedSolrServerSchemaAPI, ConnectionReuseTest, ActionThrottleTest, AssignBackwardCompatibilityTest, BasicDistributedZk2Test, CloudExitableDirectoryReaderTest, ClusterStateTest, ClusterStateUpdateTest, CollectionsAPISolrJTest, DeleteLastCustomShardedReplicaTest, DeleteReplicaTest, LIROnShardRestartTest, LeaderElectionContextKeyTest, LeaderTragicEventTest, LeaderVoteWaitTimeoutTest, MoveReplicaHDFSTest, MultiThreadedOCPTest, OutOfBoxZkACLAndCredentialsProvidersTest, OverriddenZkACLAndCredentialsProvidersTest, OverseerModifyCollectionTest, OverseerTaskQueueTest]
   [junit4] Completed [467/823 (1!)] on J0 in 11.00s, 7 tests, 1 failure <<< FAILURES!

[...truncated 45633 lines...]
[repro] Jenkins log URL: https://jenkins.thetaphi.de/job/Lucene-Solr-7.x-Windows/683/consoleText

[repro] Revision: f3e8180bd71cdc3e51a72e9e529a8e69251bdda5

[repro] Ant options: "-Dargs=-client -XX:+UseParallelGC"

[repro] ant clean

[...truncated 6 lines...]
[repro] Test suites by module:
[repro]    solr\core
[repro]       OverseerTaskQueueTest
[repro] ant compile-test

[...truncated 3339 lines...]
[repro] ant test-nocompile -Dtests.dups=5 -Dtests.maxfailures=5 -Dtests.class="*.OverseerTaskQueueTest" -Dtests.showOutput=onerror "-Dargs=-client -XX:+UseParallelGC" -Dtests.seed=A5FB8759C2377519 -Dtests.slow=true -Dtests.locale=id -Dtests.timezone=Asia/Kuala_Lumpur -Dtests.asserts=true -Dtests.file.encoding=ISO-8859-1

[...truncated 99 lines...]
[repro] Failures:
[repro]   0/5 failed: org.apache.solr.cloud.OverseerTaskQueueTest
[repro] Exiting with code 0

[...truncated 75 lines...]


---------------------------------------------------------------------
To unsubscribe, e-mail: [hidden email]
For additional commands, e-mail: [hidden email]