[JENKINS] Lucene-Solr-7.x-Windows (64bit/jdk-10.0.1) - Build # 990 - Unstable!

classic Classic list List threaded Threaded
2 messages Options
Reply | Threaded
Open this post in threaded view
|

[JENKINS] Lucene-Solr-7.x-Windows (64bit/jdk-10.0.1) - Build # 990 - Unstable!

Policeman Jenkins Server-2
Build: https://jenkins.thetaphi.de/job/Lucene-Solr-7.x-Windows/990/
Java: 64bit/jdk-10.0.1 -XX:-UseCompressedOops -XX:+UseG1GC

6 tests failed.
FAILED:  org.apache.solr.cloud.MissingSegmentRecoveryTest.testLeaderRecovery

Error Message:
Expected a collection with one shard and two replicas Timeout waiting to see state for collection=MissingSegmentRecoveryTest :DocCollection(MissingSegmentRecoveryTest//collections/MissingSegmentRecoveryTest/state.json/8)={   "pullReplicas":"0",   "replicationFactor":"2",   "shards":{"shard1":{       "range":"80000000-7fffffff",       "state":"active",       "replicas":{         "core_node3":{           "core":"MissingSegmentRecoveryTest_shard1_replica_n1",           "base_url":"http://127.0.0.1:62095/solr",           "node_name":"127.0.0.1:62095_solr",           "state":"down",           "type":"NRT",           "force_set_state":"false"},         "core_node4":{           "core":"MissingSegmentRecoveryTest_shard1_replica_n2",           "base_url":"http://127.0.0.1:62098/solr",           "node_name":"127.0.0.1:62098_solr",           "state":"active",           "type":"NRT",           "force_set_state":"false",           "leader":"true"}}}},   "router":{"name":"compositeId"},   "maxShardsPerNode":"1",   "autoAddReplicas":"false",   "nrtReplicas":"2",   "tlogReplicas":"0"} Live Nodes: [127.0.0.1:62095_solr, 127.0.0.1:62098_solr] Last available state: DocCollection(MissingSegmentRecoveryTest//collections/MissingSegmentRecoveryTest/state.json/8)={   "pullReplicas":"0",   "replicationFactor":"2",   "shards":{"shard1":{       "range":"80000000-7fffffff",       "state":"active",       "replicas":{         "core_node3":{           "core":"MissingSegmentRecoveryTest_shard1_replica_n1",           "base_url":"http://127.0.0.1:62095/solr",           "node_name":"127.0.0.1:62095_solr",           "state":"down",           "type":"NRT",           "force_set_state":"false"},         "core_node4":{           "core":"MissingSegmentRecoveryTest_shard1_replica_n2",           "base_url":"http://127.0.0.1:62098/solr",           "node_name":"127.0.0.1:62098_solr",           "state":"active",           "type":"NRT",           "force_set_state":"false",           "leader":"true"}}}},   "router":{"name":"compositeId"},   "maxShardsPerNode":"1",   "autoAddReplicas":"false",   "nrtReplicas":"2",   "tlogReplicas":"0"}

Stack Trace:
java.lang.AssertionError: Expected a collection with one shard and two replicas
Timeout waiting to see state for collection=MissingSegmentRecoveryTest :DocCollection(MissingSegmentRecoveryTest//collections/MissingSegmentRecoveryTest/state.json/8)={
  "pullReplicas":"0",
  "replicationFactor":"2",
  "shards":{"shard1":{
      "range":"80000000-7fffffff",
      "state":"active",
      "replicas":{
        "core_node3":{
          "core":"MissingSegmentRecoveryTest_shard1_replica_n1",
          "base_url":"http://127.0.0.1:62095/solr",
          "node_name":"127.0.0.1:62095_solr",
          "state":"down",
          "type":"NRT",
          "force_set_state":"false"},
        "core_node4":{
          "core":"MissingSegmentRecoveryTest_shard1_replica_n2",
          "base_url":"http://127.0.0.1:62098/solr",
          "node_name":"127.0.0.1:62098_solr",
          "state":"active",
          "type":"NRT",
          "force_set_state":"false",
          "leader":"true"}}}},
  "router":{"name":"compositeId"},
  "maxShardsPerNode":"1",
  "autoAddReplicas":"false",
  "nrtReplicas":"2",
  "tlogReplicas":"0"}
Live Nodes: [127.0.0.1:62095_solr, 127.0.0.1:62098_solr]
Last available state: DocCollection(MissingSegmentRecoveryTest//collections/MissingSegmentRecoveryTest/state.json/8)={
  "pullReplicas":"0",
  "replicationFactor":"2",
  "shards":{"shard1":{
      "range":"80000000-7fffffff",
      "state":"active",
      "replicas":{
        "core_node3":{
          "core":"MissingSegmentRecoveryTest_shard1_replica_n1",
          "base_url":"http://127.0.0.1:62095/solr",
          "node_name":"127.0.0.1:62095_solr",
          "state":"down",
          "type":"NRT",
          "force_set_state":"false"},
        "core_node4":{
          "core":"MissingSegmentRecoveryTest_shard1_replica_n2",
          "base_url":"http://127.0.0.1:62098/solr",
          "node_name":"127.0.0.1:62098_solr",
          "state":"active",
          "type":"NRT",
          "force_set_state":"false",
          "leader":"true"}}}},
  "router":{"name":"compositeId"},
  "maxShardsPerNode":"1",
  "autoAddReplicas":"false",
  "nrtReplicas":"2",
  "tlogReplicas":"0"}
        at __randomizedtesting.SeedInfo.seed([7D1D9A70F8DA5FFB:2D480273A1FBE9E6]:0)
        at org.junit.Assert.fail(Assert.java:88)
        at org.apache.solr.cloud.SolrCloudTestCase.waitForState(SolrCloudTestCase.java:289)
        at org.apache.solr.cloud.SolrCloudTestCase.waitForState(SolrCloudTestCase.java:267)
        at org.apache.solr.cloud.MissingSegmentRecoveryTest.testLeaderRecovery(MissingSegmentRecoveryTest.java:106)
        at java.base/jdk.internal.reflect.NativeMethodAccessorImpl.invoke0(Native Method)
        at java.base/jdk.internal.reflect.NativeMethodAccessorImpl.invoke(NativeMethodAccessorImpl.java:62)
        at java.base/jdk.internal.reflect.DelegatingMethodAccessorImpl.invoke(DelegatingMethodAccessorImpl.java:43)
        at java.base/java.lang.reflect.Method.invoke(Method.java:564)
        at com.carrotsearch.randomizedtesting.RandomizedRunner.invoke(RandomizedRunner.java:1750)
        at com.carrotsearch.randomizedtesting.RandomizedRunner$8.evaluate(RandomizedRunner.java:938)
        at com.carrotsearch.randomizedtesting.RandomizedRunner$9.evaluate(RandomizedRunner.java:974)
        at com.carrotsearch.randomizedtesting.RandomizedRunner$10.evaluate(RandomizedRunner.java:988)
        at com.carrotsearch.randomizedtesting.rules.SystemPropertiesRestoreRule$1.evaluate(SystemPropertiesRestoreRule.java:57)
        at org.apache.lucene.util.TestRuleSetupTeardownChained$1.evaluate(TestRuleSetupTeardownChained.java:49)
        at org.apache.lucene.util.AbstractBeforeAfterRule$1.evaluate(AbstractBeforeAfterRule.java:45)
        at org.apache.lucene.util.TestRuleThreadAndTestName$1.evaluate(TestRuleThreadAndTestName.java:48)
        at org.apache.lucene.util.TestRuleIgnoreAfterMaxFailures$1.evaluate(TestRuleIgnoreAfterMaxFailures.java:64)
        at org.apache.lucene.util.TestRuleMarkFailure$1.evaluate(TestRuleMarkFailure.java:47)
        at com.carrotsearch.randomizedtesting.rules.StatementAdapter.evaluate(StatementAdapter.java:36)
        at com.carrotsearch.randomizedtesting.ThreadLeakControl$StatementRunner.run(ThreadLeakControl.java:368)
        at com.carrotsearch.randomizedtesting.ThreadLeakControl.forkTimeoutingTask(ThreadLeakControl.java:817)
        at com.carrotsearch.randomizedtesting.ThreadLeakControl$3.evaluate(ThreadLeakControl.java:468)
        at com.carrotsearch.randomizedtesting.RandomizedRunner.runSingleTest(RandomizedRunner.java:947)
        at com.carrotsearch.randomizedtesting.RandomizedRunner$5.evaluate(RandomizedRunner.java:832)
        at com.carrotsearch.randomizedtesting.RandomizedRunner$6.evaluate(RandomizedRunner.java:883)
        at com.carrotsearch.randomizedtesting.RandomizedRunner$7.evaluate(RandomizedRunner.java:894)
        at com.carrotsearch.randomizedtesting.rules.StatementAdapter.evaluate(StatementAdapter.java:36)
        at com.carrotsearch.randomizedtesting.rules.SystemPropertiesRestoreRule$1.evaluate(SystemPropertiesRestoreRule.java:57)
        at org.apache.lucene.util.AbstractBeforeAfterRule$1.evaluate(AbstractBeforeAfterRule.java:45)
        at com.carrotsearch.randomizedtesting.rules.StatementAdapter.evaluate(StatementAdapter.java:36)
        at org.apache.lucene.util.TestRuleStoreClassName$1.evaluate(TestRuleStoreClassName.java:41)
        at com.carrotsearch.randomizedtesting.rules.NoShadowingOrOverridesOnMethodsRule$1.evaluate(NoShadowingOrOverridesOnMethodsRule.java:40)
        at com.carrotsearch.randomizedtesting.rules.NoShadowingOrOverridesOnMethodsRule$1.evaluate(NoShadowingOrOverridesOnMethodsRule.java:40)
        at com.carrotsearch.randomizedtesting.rules.StatementAdapter.evaluate(StatementAdapter.java:36)
        at com.carrotsearch.randomizedtesting.rules.StatementAdapter.evaluate(StatementAdapter.java:36)
        at org.apache.lucene.util.TestRuleAssertionsRequired$1.evaluate(TestRuleAssertionsRequired.java:53)
        at org.apache.lucene.util.TestRuleMarkFailure$1.evaluate(TestRuleMarkFailure.java:47)
        at org.apache.lucene.util.TestRuleIgnoreAfterMaxFailures$1.evaluate(TestRuleIgnoreAfterMaxFailures.java:64)
        at org.apache.lucene.util.TestRuleIgnoreTestSuites$1.evaluate(TestRuleIgnoreTestSuites.java:54)
        at com.carrotsearch.randomizedtesting.rules.StatementAdapter.evaluate(StatementAdapter.java:36)
        at com.carrotsearch.randomizedtesting.ThreadLeakControl$StatementRunner.run(ThreadLeakControl.java:368)
        at java.base/java.lang.Thread.run(Thread.java:844)


FAILED:  org.apache.solr.handler.TestSQLHandler.doTest

Error Message:
--> http://127.0.0.1:57350/collection1_shard2_replica_n2:Failed to execute sqlQuery 'select id, field_i, str_s, field_i_p, field_f_p, field_d_p, field_l_p from collection1 where (text='(XXXX)' OR text='XXXX') AND text='XXXX' order by field_i desc' against JDBC connection 'jdbc:calcitesolr:'. Error while executing SQL "select id, field_i, str_s, field_i_p, field_f_p, field_d_p, field_l_p from collection1 where (text='(XXXX)' OR text='XXXX') AND text='XXXX' order by field_i desc": java.io.IOException: java.util.concurrent.ExecutionException: java.io.IOException: --> http://127.0.0.1:57350/collection1_shard2_replica_n2/:can not sort on a field w/o docValues unless it is indexed=true uninvertible=true and the type supports Uninversion: field_i

Stack Trace:
java.io.IOException: --> http://127.0.0.1:57350/collection1_shard2_replica_n2:Failed to execute sqlQuery 'select id, field_i, str_s, field_i_p, field_f_p, field_d_p, field_l_p from collection1 where (text='(XXXX)' OR text='XXXX') AND text='XXXX' order by field_i desc' against JDBC connection 'jdbc:calcitesolr:'.
Error while executing SQL "select id, field_i, str_s, field_i_p, field_f_p, field_d_p, field_l_p from collection1 where (text='(XXXX)' OR text='XXXX') AND text='XXXX' order by field_i desc": java.io.IOException: java.util.concurrent.ExecutionException: java.io.IOException: --> http://127.0.0.1:57350/collection1_shard2_replica_n2/:can not sort on a field w/o docValues unless it is indexed=true uninvertible=true and the type supports Uninversion: field_i
        at __randomizedtesting.SeedInfo.seed([7D1D9A70F8DA5FFB:DA5922D495614C42]:0)
        at org.apache.solr.client.solrj.io.stream.SolrStream.read(SolrStream.java:215)
        at org.apache.solr.handler.TestSQLHandler.getTuples(TestSQLHandler.java:2617)
        at org.apache.solr.handler.TestSQLHandler.testBasicSelect(TestSQLHandler.java:145)
        at org.apache.solr.handler.TestSQLHandler.doTest(TestSQLHandler.java:93)
        at java.base/jdk.internal.reflect.NativeMethodAccessorImpl.invoke0(Native Method)
        at java.base/jdk.internal.reflect.NativeMethodAccessorImpl.invoke(NativeMethodAccessorImpl.java:62)
        at java.base/jdk.internal.reflect.DelegatingMethodAccessorImpl.invoke(DelegatingMethodAccessorImpl.java:43)
        at java.base/java.lang.reflect.Method.invoke(Method.java:564)
        at com.carrotsearch.randomizedtesting.RandomizedRunner.invoke(RandomizedRunner.java:1750)
        at com.carrotsearch.randomizedtesting.RandomizedRunner$8.evaluate(RandomizedRunner.java:938)
        at com.carrotsearch.randomizedtesting.RandomizedRunner$9.evaluate(RandomizedRunner.java:974)
        at com.carrotsearch.randomizedtesting.RandomizedRunner$10.evaluate(RandomizedRunner.java:988)
        at org.apache.solr.BaseDistributedSearchTestCase$ShardsRepeatRule$ShardsFixedStatement.callStatement(BaseDistributedSearchTestCase.java:1075)
        at org.apache.solr.BaseDistributedSearchTestCase$ShardsRepeatRule$ShardsStatement.evaluate(BaseDistributedSearchTestCase.java:1047)
        at com.carrotsearch.randomizedtesting.rules.SystemPropertiesRestoreRule$1.evaluate(SystemPropertiesRestoreRule.java:57)
        at org.apache.lucene.util.TestRuleSetupTeardownChained$1.evaluate(TestRuleSetupTeardownChained.java:49)
        at org.apache.lucene.util.AbstractBeforeAfterRule$1.evaluate(AbstractBeforeAfterRule.java:45)
        at org.apache.lucene.util.TestRuleThreadAndTestName$1.evaluate(TestRuleThreadAndTestName.java:48)
        at org.apache.lucene.util.TestRuleIgnoreAfterMaxFailures$1.evaluate(TestRuleIgnoreAfterMaxFailures.java:64)
        at org.apache.lucene.util.TestRuleMarkFailure$1.evaluate(TestRuleMarkFailure.java:47)
        at com.carrotsearch.randomizedtesting.rules.StatementAdapter.evaluate(StatementAdapter.java:36)
        at com.carrotsearch.randomizedtesting.ThreadLeakControl$StatementRunner.run(ThreadLeakControl.java:368)
        at com.carrotsearch.randomizedtesting.ThreadLeakControl.forkTimeoutingTask(ThreadLeakControl.java:817)
        at com.carrotsearch.randomizedtesting.ThreadLeakControl$3.evaluate(ThreadLeakControl.java:468)
        at com.carrotsearch.randomizedtesting.RandomizedRunner.runSingleTest(RandomizedRunner.java:947)
        at com.carrotsearch.randomizedtesting.RandomizedRunner$5.evaluate(RandomizedRunner.java:832)
        at com.carrotsearch.randomizedtesting.RandomizedRunner$6.evaluate(RandomizedRunner.java:883)
        at com.carrotsearch.randomizedtesting.RandomizedRunner$7.evaluate(RandomizedRunner.java:894)
        at com.carrotsearch.randomizedtesting.rules.StatementAdapter.evaluate(StatementAdapter.java:36)
        at com.carrotsearch.randomizedtesting.rules.SystemPropertiesRestoreRule$1.evaluate(SystemPropertiesRestoreRule.java:57)
        at org.apache.lucene.util.AbstractBeforeAfterRule$1.evaluate(AbstractBeforeAfterRule.java:45)
        at com.carrotsearch.randomizedtesting.rules.StatementAdapter.evaluate(StatementAdapter.java:36)
        at org.apache.lucene.util.TestRuleStoreClassName$1.evaluate(TestRuleStoreClassName.java:41)
        at com.carrotsearch.randomizedtesting.rules.NoShadowingOrOverridesOnMethodsRule$1.evaluate(NoShadowingOrOverridesOnMethodsRule.java:40)
        at com.carrotsearch.randomizedtesting.rules.NoShadowingOrOverridesOnMethodsRule$1.evaluate(NoShadowingOrOverridesOnMethodsRule.java:40)
        at com.carrotsearch.randomizedtesting.rules.StatementAdapter.evaluate(StatementAdapter.java:36)
        at com.carrotsearch.randomizedtesting.rules.StatementAdapter.evaluate(StatementAdapter.java:36)
        at org.apache.lucene.util.TestRuleAssertionsRequired$1.evaluate(TestRuleAssertionsRequired.java:53)
        at org.apache.lucene.util.TestRuleMarkFailure$1.evaluate(TestRuleMarkFailure.java:47)
        at org.apache.lucene.util.TestRuleIgnoreAfterMaxFailures$1.evaluate(TestRuleIgnoreAfterMaxFailures.java:64)
        at org.apache.lucene.util.TestRuleIgnoreTestSuites$1.evaluate(TestRuleIgnoreTestSuites.java:54)
        at com.carrotsearch.randomizedtesting.rules.StatementAdapter.evaluate(StatementAdapter.java:36)
        at com.carrotsearch.randomizedtesting.ThreadLeakControl$StatementRunner.run(ThreadLeakControl.java:368)
        at java.base/java.lang.Thread.run(Thread.java:844)


FAILED:  org.apache.solr.handler.TestSQLHandler.doTest

Error Message:
--> http://127.0.0.1:57572/collection1_shard2_replica_n1:Failed to execute sqlQuery 'select id, field_i, str_s, field_i_p, field_f_p, field_d_p, field_l_p from collection1 where (text='(XXXX)' OR text='XXXX') AND text='XXXX' order by field_i desc' against JDBC connection 'jdbc:calcitesolr:'. Error while executing SQL "select id, field_i, str_s, field_i_p, field_f_p, field_d_p, field_l_p from collection1 where (text='(XXXX)' OR text='XXXX') AND text='XXXX' order by field_i desc": java.io.IOException: java.util.concurrent.ExecutionException: java.io.IOException: --> http://127.0.0.1:57572/collection1_shard2_replica_n1/:can not sort on a field w/o docValues unless it is indexed=true uninvertible=true and the type supports Uninversion: field_i

Stack Trace:
java.io.IOException: --> http://127.0.0.1:57572/collection1_shard2_replica_n1:Failed to execute sqlQuery 'select id, field_i, str_s, field_i_p, field_f_p, field_d_p, field_l_p from collection1 where (text='(XXXX)' OR text='XXXX') AND text='XXXX' order by field_i desc' against JDBC connection 'jdbc:calcitesolr:'.
Error while executing SQL "select id, field_i, str_s, field_i_p, field_f_p, field_d_p, field_l_p from collection1 where (text='(XXXX)' OR text='XXXX') AND text='XXXX' order by field_i desc": java.io.IOException: java.util.concurrent.ExecutionException: java.io.IOException: --> http://127.0.0.1:57572/collection1_shard2_replica_n1/:can not sort on a field w/o docValues unless it is indexed=true uninvertible=true and the type supports Uninversion: field_i
        at __randomizedtesting.SeedInfo.seed([7D1D9A70F8DA5FFB:DA5922D495614C42]:0)
        at org.apache.solr.client.solrj.io.stream.SolrStream.read(SolrStream.java:215)
        at org.apache.solr.handler.TestSQLHandler.getTuples(TestSQLHandler.java:2617)
        at org.apache.solr.handler.TestSQLHandler.testBasicSelect(TestSQLHandler.java:145)
        at org.apache.solr.handler.TestSQLHandler.doTest(TestSQLHandler.java:93)
        at java.base/jdk.internal.reflect.NativeMethodAccessorImpl.invoke0(Native Method)
        at java.base/jdk.internal.reflect.NativeMethodAccessorImpl.invoke(NativeMethodAccessorImpl.java:62)
        at java.base/jdk.internal.reflect.DelegatingMethodAccessorImpl.invoke(DelegatingMethodAccessorImpl.java:43)
        at java.base/java.lang.reflect.Method.invoke(Method.java:564)
        at com.carrotsearch.randomizedtesting.RandomizedRunner.invoke(RandomizedRunner.java:1750)
        at com.carrotsearch.randomizedtesting.RandomizedRunner$8.evaluate(RandomizedRunner.java:938)
        at com.carrotsearch.randomizedtesting.RandomizedRunner$9.evaluate(RandomizedRunner.java:974)
        at com.carrotsearch.randomizedtesting.RandomizedRunner$10.evaluate(RandomizedRunner.java:988)
        at org.apache.solr.BaseDistributedSearchTestCase$ShardsRepeatRule$ShardsFixedStatement.callStatement(BaseDistributedSearchTestCase.java:1075)
        at org.apache.solr.BaseDistributedSearchTestCase$ShardsRepeatRule$ShardsStatement.evaluate(BaseDistributedSearchTestCase.java:1047)
        at com.carrotsearch.randomizedtesting.rules.SystemPropertiesRestoreRule$1.evaluate(SystemPropertiesRestoreRule.java:57)
        at org.apache.lucene.util.TestRuleSetupTeardownChained$1.evaluate(TestRuleSetupTeardownChained.java:49)
        at org.apache.lucene.util.AbstractBeforeAfterRule$1.evaluate(AbstractBeforeAfterRule.java:45)
        at org.apache.lucene.util.TestRuleThreadAndTestName$1.evaluate(TestRuleThreadAndTestName.java:48)
        at org.apache.lucene.util.TestRuleIgnoreAfterMaxFailures$1.evaluate(TestRuleIgnoreAfterMaxFailures.java:64)
        at org.apache.lucene.util.TestRuleMarkFailure$1.evaluate(TestRuleMarkFailure.java:47)
        at com.carrotsearch.randomizedtesting.rules.StatementAdapter.evaluate(StatementAdapter.java:36)
        at com.carrotsearch.randomizedtesting.ThreadLeakControl$StatementRunner.run(ThreadLeakControl.java:368)
        at com.carrotsearch.randomizedtesting.ThreadLeakControl.forkTimeoutingTask(ThreadLeakControl.java:817)
        at com.carrotsearch.randomizedtesting.ThreadLeakControl$3.evaluate(ThreadLeakControl.java:468)
        at com.carrotsearch.randomizedtesting.RandomizedRunner.runSingleTest(RandomizedRunner.java:947)
        at com.carrotsearch.randomizedtesting.RandomizedRunner$5.evaluate(RandomizedRunner.java:832)
        at com.carrotsearch.randomizedtesting.RandomizedRunner$6.evaluate(RandomizedRunner.java:883)
        at com.carrotsearch.randomizedtesting.RandomizedRunner$7.evaluate(RandomizedRunner.java:894)
        at com.carrotsearch.randomizedtesting.rules.StatementAdapter.evaluate(StatementAdapter.java:36)
        at com.carrotsearch.randomizedtesting.rules.SystemPropertiesRestoreRule$1.evaluate(SystemPropertiesRestoreRule.java:57)
        at org.apache.lucene.util.AbstractBeforeAfterRule$1.evaluate(AbstractBeforeAfterRule.java:45)
        at com.carrotsearch.randomizedtesting.rules.StatementAdapter.evaluate(StatementAdapter.java:36)
        at org.apache.lucene.util.TestRuleStoreClassName$1.evaluate(TestRuleStoreClassName.java:41)
        at com.carrotsearch.randomizedtesting.rules.NoShadowingOrOverridesOnMethodsRule$1.evaluate(NoShadowingOrOverridesOnMethodsRule.java:40)
        at com.carrotsearch.randomizedtesting.rules.NoShadowingOrOverridesOnMethodsRule$1.evaluate(NoShadowingOrOverridesOnMethodsRule.java:40)
        at com.carrotsearch.randomizedtesting.rules.StatementAdapter.evaluate(StatementAdapter.java:36)
        at com.carrotsearch.randomizedtesting.rules.StatementAdapter.evaluate(StatementAdapter.java:36)
        at org.apache.lucene.util.TestRuleAssertionsRequired$1.evaluate(TestRuleAssertionsRequired.java:53)
        at org.apache.lucene.util.TestRuleMarkFailure$1.evaluate(TestRuleMarkFailure.java:47)
        at org.apache.lucene.util.TestRuleIgnoreAfterMaxFailures$1.evaluate(TestRuleIgnoreAfterMaxFailures.java:64)
        at org.apache.lucene.util.TestRuleIgnoreTestSuites$1.evaluate(TestRuleIgnoreTestSuites.java:54)
        at com.carrotsearch.randomizedtesting.rules.StatementAdapter.evaluate(StatementAdapter.java:36)
        at com.carrotsearch.randomizedtesting.ThreadLeakControl$StatementRunner.run(ThreadLeakControl.java:368)
        at java.base/java.lang.Thread.run(Thread.java:844)


FAILED:  org.apache.solr.handler.TestSQLHandler.doTest

Error Message:
--> http://127.0.0.1:57921/collection1_shard2_replica_n1:Failed to execute sqlQuery 'select id, field_i, str_s, field_i_p, field_f_p, field_d_p, field_l_p from collection1 where (text='(XXXX)' OR text='XXXX') AND text='XXXX' order by field_i desc' against JDBC connection 'jdbc:calcitesolr:'. Error while executing SQL "select id, field_i, str_s, field_i_p, field_f_p, field_d_p, field_l_p from collection1 where (text='(XXXX)' OR text='XXXX') AND text='XXXX' order by field_i desc": java.io.IOException: java.util.concurrent.ExecutionException: java.io.IOException: --> http://127.0.0.1:57952/collection1_shard2_replica_n5/:can not sort on a field w/o docValues unless it is indexed=true uninvertible=true and the type supports Uninversion: field_i

Stack Trace:
java.io.IOException: --> http://127.0.0.1:57921/collection1_shard2_replica_n1:Failed to execute sqlQuery 'select id, field_i, str_s, field_i_p, field_f_p, field_d_p, field_l_p from collection1 where (text='(XXXX)' OR text='XXXX') AND text='XXXX' order by field_i desc' against JDBC connection 'jdbc:calcitesolr:'.
Error while executing SQL "select id, field_i, str_s, field_i_p, field_f_p, field_d_p, field_l_p from collection1 where (text='(XXXX)' OR text='XXXX') AND text='XXXX' order by field_i desc": java.io.IOException: java.util.concurrent.ExecutionException: java.io.IOException: --> http://127.0.0.1:57952/collection1_shard2_replica_n5/:can not sort on a field w/o docValues unless it is indexed=true uninvertible=true and the type supports Uninversion: field_i
        at __randomizedtesting.SeedInfo.seed([7D1D9A70F8DA5FFB:DA5922D495614C42]:0)
        at org.apache.solr.client.solrj.io.stream.SolrStream.read(SolrStream.java:215)
        at org.apache.solr.handler.TestSQLHandler.getTuples(TestSQLHandler.java:2617)
        at org.apache.solr.handler.TestSQLHandler.testBasicSelect(TestSQLHandler.java:145)
        at org.apache.solr.handler.TestSQLHandler.doTest(TestSQLHandler.java:93)
        at java.base/jdk.internal.reflect.NativeMethodAccessorImpl.invoke0(Native Method)
        at java.base/jdk.internal.reflect.NativeMethodAccessorImpl.invoke(NativeMethodAccessorImpl.java:62)
        at java.base/jdk.internal.reflect.DelegatingMethodAccessorImpl.invoke(DelegatingMethodAccessorImpl.java:43)
        at java.base/java.lang.reflect.Method.invoke(Method.java:564)
        at com.carrotsearch.randomizedtesting.RandomizedRunner.invoke(RandomizedRunner.java:1750)
        at com.carrotsearch.randomizedtesting.RandomizedRunner$8.evaluate(RandomizedRunner.java:938)
        at com.carrotsearch.randomizedtesting.RandomizedRunner$9.evaluate(RandomizedRunner.java:974)
        at com.carrotsearch.randomizedtesting.RandomizedRunner$10.evaluate(RandomizedRunner.java:988)
        at org.apache.solr.BaseDistributedSearchTestCase$ShardsRepeatRule$ShardsFixedStatement.callStatement(BaseDistributedSearchTestCase.java:1075)
        at org.apache.solr.BaseDistributedSearchTestCase$ShardsRepeatRule$ShardsStatement.evaluate(BaseDistributedSearchTestCase.java:1047)
        at com.carrotsearch.randomizedtesting.rules.SystemPropertiesRestoreRule$1.evaluate(SystemPropertiesRestoreRule.java:57)
        at org.apache.lucene.util.TestRuleSetupTeardownChained$1.evaluate(TestRuleSetupTeardownChained.java:49)
        at org.apache.lucene.util.AbstractBeforeAfterRule$1.evaluate(AbstractBeforeAfterRule.java:45)
        at org.apache.lucene.util.TestRuleThreadAndTestName$1.evaluate(TestRuleThreadAndTestName.java:48)
        at org.apache.lucene.util.TestRuleIgnoreAfterMaxFailures$1.evaluate(TestRuleIgnoreAfterMaxFailures.java:64)
        at org.apache.lucene.util.TestRuleMarkFailure$1.evaluate(TestRuleMarkFailure.java:47)
        at com.carrotsearch.randomizedtesting.rules.StatementAdapter.evaluate(StatementAdapter.java:36)
        at com.carrotsearch.randomizedtesting.ThreadLeakControl$StatementRunner.run(ThreadLeakControl.java:368)
        at com.carrotsearch.randomizedtesting.ThreadLeakControl.forkTimeoutingTask(ThreadLeakControl.java:817)
        at com.carrotsearch.randomizedtesting.ThreadLeakControl$3.evaluate(ThreadLeakControl.java:468)
        at com.carrotsearch.randomizedtesting.RandomizedRunner.runSingleTest(RandomizedRunner.java:947)
        at com.carrotsearch.randomizedtesting.RandomizedRunner$5.evaluate(RandomizedRunner.java:832)
        at com.carrotsearch.randomizedtesting.RandomizedRunner$6.evaluate(RandomizedRunner.java:883)
        at com.carrotsearch.randomizedtesting.RandomizedRunner$7.evaluate(RandomizedRunner.java:894)
        at com.carrotsearch.randomizedtesting.rules.StatementAdapter.evaluate(StatementAdapter.java:36)
        at com.carrotsearch.randomizedtesting.rules.SystemPropertiesRestoreRule$1.evaluate(SystemPropertiesRestoreRule.java:57)
        at org.apache.lucene.util.AbstractBeforeAfterRule$1.evaluate(AbstractBeforeAfterRule.java:45)
        at com.carrotsearch.randomizedtesting.rules.StatementAdapter.evaluate(StatementAdapter.java:36)
        at org.apache.lucene.util.TestRuleStoreClassName$1.evaluate(TestRuleStoreClassName.java:41)
        at com.carrotsearch.randomizedtesting.rules.NoShadowingOrOverridesOnMethodsRule$1.evaluate(NoShadowingOrOverridesOnMethodsRule.java:40)
        at com.carrotsearch.randomizedtesting.rules.NoShadowingOrOverridesOnMethodsRule$1.evaluate(NoShadowingOrOverridesOnMethodsRule.java:40)
        at com.carrotsearch.randomizedtesting.rules.StatementAdapter.evaluate(StatementAdapter.java:36)
        at com.carrotsearch.randomizedtesting.rules.StatementAdapter.evaluate(StatementAdapter.java:36)
        at org.apache.lucene.util.TestRuleAssertionsRequired$1.evaluate(TestRuleAssertionsRequired.java:53)
        at org.apache.lucene.util.TestRuleMarkFailure$1.evaluate(TestRuleMarkFailure.java:47)
        at org.apache.lucene.util.TestRuleIgnoreAfterMaxFailures$1.evaluate(TestRuleIgnoreAfterMaxFailures.java:64)
        at org.apache.lucene.util.TestRuleIgnoreTestSuites$1.evaluate(TestRuleIgnoreTestSuites.java:54)
        at com.carrotsearch.randomizedtesting.rules.StatementAdapter.evaluate(StatementAdapter.java:36)
        at com.carrotsearch.randomizedtesting.ThreadLeakControl$StatementRunner.run(ThreadLeakControl.java:368)
        at java.base/java.lang.Thread.run(Thread.java:844)


FAILED:  org.apache.solr.handler.TestSQLHandler.doTest

Error Message:


Stack Trace:
java.lang.AssertionError
        at __randomizedtesting.SeedInfo.seed([7D1D9A70F8DA5FFB:DA5922D495614C42]:0)
        at org.apache.solr.handler.TestSQLHandler.testBasicSelect(TestSQLHandler.java:236)
        at org.apache.solr.handler.TestSQLHandler.doTest(TestSQLHandler.java:93)
        at java.base/jdk.internal.reflect.NativeMethodAccessorImpl.invoke0(Native Method)
        at java.base/jdk.internal.reflect.NativeMethodAccessorImpl.invoke(NativeMethodAccessorImpl.java:62)
        at java.base/jdk.internal.reflect.DelegatingMethodAccessorImpl.invoke(DelegatingMethodAccessorImpl.java:43)
        at java.base/java.lang.reflect.Method.invoke(Method.java:564)
        at com.carrotsearch.randomizedtesting.RandomizedRunner.invoke(RandomizedRunner.java:1750)
        at com.carrotsearch.randomizedtesting.RandomizedRunner$8.evaluate(RandomizedRunner.java:938)
        at com.carrotsearch.randomizedtesting.RandomizedRunner$9.evaluate(RandomizedRunner.java:974)
        at com.carrotsearch.randomizedtesting.RandomizedRunner$10.evaluate(RandomizedRunner.java:988)
        at org.apache.solr.BaseDistributedSearchTestCase$ShardsRepeatRule$ShardsFixedStatement.callStatement(BaseDistributedSearchTestCase.java:1075)
        at org.apache.solr.BaseDistributedSearchTestCase$ShardsRepeatRule$ShardsStatement.evaluate(BaseDistributedSearchTestCase.java:1047)
        at com.carrotsearch.randomizedtesting.rules.SystemPropertiesRestoreRule$1.evaluate(SystemPropertiesRestoreRule.java:57)
        at org.apache.lucene.util.TestRuleSetupTeardownChained$1.evaluate(TestRuleSetupTeardownChained.java:49)
        at org.apache.lucene.util.AbstractBeforeAfterRule$1.evaluate(AbstractBeforeAfterRule.java:45)
        at org.apache.lucene.util.TestRuleThreadAndTestName$1.evaluate(TestRuleThreadAndTestName.java:48)
        at org.apache.lucene.util.TestRuleIgnoreAfterMaxFailures$1.evaluate(TestRuleIgnoreAfterMaxFailures.java:64)
        at org.apache.lucene.util.TestRuleMarkFailure$1.evaluate(TestRuleMarkFailure.java:47)
        at com.carrotsearch.randomizedtesting.rules.StatementAdapter.evaluate(StatementAdapter.java:36)
        at com.carrotsearch.randomizedtesting.ThreadLeakControl$StatementRunner.run(ThreadLeakControl.java:368)
        at com.carrotsearch.randomizedtesting.ThreadLeakControl.forkTimeoutingTask(ThreadLeakControl.java:817)
        at com.carrotsearch.randomizedtesting.ThreadLeakControl$3.evaluate(ThreadLeakControl.java:468)
        at com.carrotsearch.randomizedtesting.RandomizedRunner.runSingleTest(RandomizedRunner.java:947)
        at com.carrotsearch.randomizedtesting.RandomizedRunner$5.evaluate(RandomizedRunner.java:832)
        at com.carrotsearch.randomizedtesting.RandomizedRunner$6.evaluate(RandomizedRunner.java:883)
        at com.carrotsearch.randomizedtesting.RandomizedRunner$7.evaluate(RandomizedRunner.java:894)
        at com.carrotsearch.randomizedtesting.rules.StatementAdapter.evaluate(StatementAdapter.java:36)
        at com.carrotsearch.randomizedtesting.rules.SystemPropertiesRestoreRule$1.evaluate(SystemPropertiesRestoreRule.java:57)
        at org.apache.lucene.util.AbstractBeforeAfterRule$1.evaluate(AbstractBeforeAfterRule.java:45)
        at com.carrotsearch.randomizedtesting.rules.StatementAdapter.evaluate(StatementAdapter.java:36)
        at org.apache.lucene.util.TestRuleStoreClassName$1.evaluate(TestRuleStoreClassName.java:41)
        at com.carrotsearch.randomizedtesting.rules.NoShadowingOrOverridesOnMethodsRule$1.evaluate(NoShadowingOrOverridesOnMethodsRule.java:40)
        at com.carrotsearch.randomizedtesting.rules.NoShadowingOrOverridesOnMethodsRule$1.evaluate(NoShadowingOrOverridesOnMethodsRule.java:40)
        at com.carrotsearch.randomizedtesting.rules.StatementAdapter.evaluate(StatementAdapter.java:36)
        at com.carrotsearch.randomizedtesting.rules.StatementAdapter.evaluate(StatementAdapter.java:36)
        at org.apache.lucene.util.TestRuleAssertionsRequired$1.evaluate(TestRuleAssertionsRequired.java:53)
        at org.apache.lucene.util.TestRuleMarkFailure$1.evaluate(TestRuleMarkFailure.java:47)
        at org.apache.lucene.util.TestRuleIgnoreAfterMaxFailures$1.evaluate(TestRuleIgnoreAfterMaxFailures.java:64)
        at org.apache.lucene.util.TestRuleIgnoreTestSuites$1.evaluate(TestRuleIgnoreTestSuites.java:54)
        at com.carrotsearch.randomizedtesting.rules.StatementAdapter.evaluate(StatementAdapter.java:36)
        at com.carrotsearch.randomizedtesting.ThreadLeakControl$StatementRunner.run(ThreadLeakControl.java:368)
        at java.base/java.lang.Thread.run(Thread.java:844)


FAILED:  junit.framework.TestSuite.org.apache.solr.client.solrj.impl.CloudSolrClientTest

Error Message:
ObjectTracker found 3 object(s) that were not released!!! [MockDirectoryWrapper, SolrCore, MockDirectoryWrapper] org.apache.solr.common.util.ObjectReleaseTracker$ObjectTrackerException: org.apache.lucene.store.MockDirectoryWrapper  at org.apache.solr.common.util.ObjectReleaseTracker.track(ObjectReleaseTracker.java:42)  at org.apache.solr.core.CachingDirectoryFactory.get(CachingDirectoryFactory.java:348)  at org.apache.solr.handler.IndexFetcher.fetchLatestIndex(IndexFetcher.java:503)  at org.apache.solr.handler.IndexFetcher.fetchLatestIndex(IndexFetcher.java:346)  at org.apache.solr.handler.ReplicationHandler.doFetch(ReplicationHandler.java:425)  at org.apache.solr.handler.ReplicationHandler.lambda$setupPolling$13(ReplicationHandler.java:1171)  at java.base/java.util.concurrent.Executors$RunnableAdapter.call(Executors.java:514)  at java.base/java.util.concurrent.FutureTask.runAndReset(FutureTask.java:305)  at java.base/java.util.concurrent.ScheduledThreadPoolExecutor$ScheduledFutureTask.run(ScheduledThreadPoolExecutor.java:305)  at java.base/java.util.concurrent.ThreadPoolExecutor.runWorker(ThreadPoolExecutor.java:1135)  at java.base/java.util.concurrent.ThreadPoolExecutor$Worker.run(ThreadPoolExecutor.java:635)  at java.base/java.lang.Thread.run(Thread.java:844)  org.apache.solr.common.util.ObjectReleaseTracker$ObjectTrackerException: org.apache.solr.core.SolrCore  at org.apache.solr.common.util.ObjectReleaseTracker.track(ObjectReleaseTracker.java:42)  at org.apache.solr.core.SolrCore.<init>(SolrCore.java:1054)  at org.apache.solr.core.SolrCore.<init>(SolrCore.java:874)  at org.apache.solr.core.CoreContainer.createFromDescriptor(CoreContainer.java:1178)  at org.apache.solr.core.CoreContainer.create(CoreContainer.java:1088)  at org.apache.solr.handler.admin.CoreAdminOperation.lambda$static$0(CoreAdminOperation.java:92)  at org.apache.solr.handler.admin.CoreAdminOperation.execute(CoreAdminOperation.java:360)  at org.apache.solr.handler.admin.CoreAdminHandler$CallInfo.call(CoreAdminHandler.java:395)  at org.apache.solr.handler.admin.CoreAdminHandler.lambda$handleRequestBody$0(CoreAdminHandler.java:188)  at com.codahale.metrics.InstrumentedExecutorService$InstrumentedRunnable.run(InstrumentedExecutorService.java:176)  at org.apache.solr.common.util.ExecutorUtil$MDCAwareThreadPoolExecutor.lambda$execute$0(ExecutorUtil.java:209)  at java.base/java.util.concurrent.ThreadPoolExecutor.runWorker(ThreadPoolExecutor.java:1135)  at java.base/java.util.concurrent.ThreadPoolExecutor$Worker.run(ThreadPoolExecutor.java:635)  at java.base/java.lang.Thread.run(Thread.java:844)  org.apache.solr.common.util.ObjectReleaseTracker$ObjectTrackerException: org.apache.lucene.store.MockDirectoryWrapper  at org.apache.solr.common.util.ObjectReleaseTracker.track(ObjectReleaseTracker.java:42)  at org.apache.solr.core.CachingDirectoryFactory.get(CachingDirectoryFactory.java:348)  at org.apache.solr.update.SolrIndexWriter.create(SolrIndexWriter.java:95)  at org.apache.solr.core.SolrCore.initIndex(SolrCore.java:770)  at org.apache.solr.core.SolrCore.<init>(SolrCore.java:967)  at org.apache.solr.core.SolrCore.<init>(SolrCore.java:874)  at org.apache.solr.core.CoreContainer.createFromDescriptor(CoreContainer.java:1178)  at org.apache.solr.core.CoreContainer.create(CoreContainer.java:1088)  at org.apache.solr.handler.admin.CoreAdminOperation.lambda$static$0(CoreAdminOperation.java:92)  at org.apache.solr.handler.admin.CoreAdminOperation.execute(CoreAdminOperation.java:360)  at org.apache.solr.handler.admin.CoreAdminHandler$CallInfo.call(CoreAdminHandler.java:395)  at org.apache.solr.handler.admin.CoreAdminHandler.lambda$handleRequestBody$0(CoreAdminHandler.java:188)  at com.codahale.metrics.InstrumentedExecutorService$InstrumentedRunnable.run(InstrumentedExecutorService.java:176)  at org.apache.solr.common.util.ExecutorUtil$MDCAwareThreadPoolExecutor.lambda$execute$0(ExecutorUtil.java:209)  at java.base/java.util.concurrent.ThreadPoolExecutor.runWorker(ThreadPoolExecutor.java:1135)  at java.base/java.util.concurrent.ThreadPoolExecutor$Worker.run(ThreadPoolExecutor.java:635)  at java.base/java.lang.Thread.run(Thread.java:844)   expected null, but was:<ObjectTracker found 3 object(s) that were not released!!! [MockDirectoryWrapper, SolrCore, MockDirectoryWrapper] org.apache.solr.common.util.ObjectReleaseTracker$ObjectTrackerException: org.apache.lucene.store.MockDirectoryWrapper  at org.apache.solr.common.util.ObjectReleaseTracker.track(ObjectReleaseTracker.java:42)  at org.apache.solr.core.CachingDirectoryFactory.get(CachingDirectoryFactory.java:348)  at org.apache.solr.handler.IndexFetcher.fetchLatestIndex(IndexFetcher.java:503)  at org.apache.solr.handler.IndexFetcher.fetchLatestIndex(IndexFetcher.java:346)  at org.apache.solr.handler.ReplicationHandler.doFetch(ReplicationHandler.java:425)  at org.apache.solr.handler.ReplicationHandler.lambda$setupPolling$13(ReplicationHandler.java:1171)  at java.base/java.util.concurrent.Executors$RunnableAdapter.call(Executors.java:514)  at java.base/java.util.concurrent.FutureTask.runAndReset(FutureTask.java:305)  at java.base/java.util.concurrent.ScheduledThreadPoolExecutor$ScheduledFutureTask.run(ScheduledThreadPoolExecutor.java:305)  at java.base/java.util.concurrent.ThreadPoolExecutor.runWorker(ThreadPoolExecutor.java:1135)  at java.base/java.util.concurrent.ThreadPoolExecutor$Worker.run(ThreadPoolExecutor.java:635)  at java.base/java.lang.Thread.run(Thread.java:844)  org.apache.solr.common.util.ObjectReleaseTracker$ObjectTrackerException: org.apache.solr.core.SolrCore  at org.apache.solr.common.util.ObjectReleaseTracker.track(ObjectReleaseTracker.java:42)  at org.apache.solr.core.SolrCore.<init>(SolrCore.java:1054)  at org.apache.solr.core.SolrCore.<init>(SolrCore.java:874)  at org.apache.solr.core.CoreContainer.createFromDescriptor(CoreContainer.java:1178)  at org.apache.solr.core.CoreContainer.create(CoreContainer.java:1088)  at org.apache.solr.handler.admin.CoreAdminOperation.lambda$static$0(CoreAdminOperation.java:92)  at org.apache.solr.handler.admin.CoreAdminOperation.execute(CoreAdminOperation.java:360)  at org.apache.solr.handler.admin.CoreAdminHandler$CallInfo.call(CoreAdminHandler.java:395)  at org.apache.solr.handler.admin.CoreAdminHandler.lambda$handleRequestBody$0(CoreAdminHandler.java:188)  at com.codahale.metrics.InstrumentedExecutorService$InstrumentedRunnable.run(InstrumentedExecutorService.java:176)  at org.apache.solr.common.util.ExecutorUtil$MDCAwareThreadPoolExecutor.lambda$execute$0(ExecutorUtil.java:209)  at java.base/java.util.concurrent.ThreadPoolExecutor.runWorker(ThreadPoolExecutor.java:1135)  at java.base/java.util.concurrent.ThreadPoolExecutor$Worker.run(ThreadPoolExecutor.java:635)  at java.base/java.lang.Thread.run(Thread.java:844)  org.apache.solr.common.util.ObjectReleaseTracker$ObjectTrackerException: org.apache.lucene.store.MockDirectoryWrapper  at org.apache.solr.common.util.ObjectReleaseTracker.track(ObjectReleaseTracker.java:42)  at org.apache.solr.core.CachingDirectoryFactory.get(CachingDirectoryFactory.java:348)  at org.apache.solr.update.SolrIndexWriter.create(SolrIndexWriter.java:95)  at org.apache.solr.core.SolrCore.initIndex(SolrCore.java:770)  at org.apache.solr.core.SolrCore.<init>(SolrCore.java:967)  at org.apache.solr.core.SolrCore.<init>(SolrCore.java:874)  at org.apache.solr.core.CoreContainer.createFromDescriptor(CoreContainer.java:1178)  at org.apache.solr.core.CoreContainer.create(CoreContainer.java:1088)  at org.apache.solr.handler.admin.CoreAdminOperation.lambda$static$0(CoreAdminOperation.java:92)  at org.apache.solr.handler.admin.CoreAdminOperation.execute(CoreAdminOperation.java:360)  at org.apache.solr.handler.admin.CoreAdminHandler$CallInfo.call(CoreAdminHandler.java:395)  at org.apache.solr.handler.admin.CoreAdminHandler.lambda$handleRequestBody$0(CoreAdminHandler.java:188)  at com.codahale.metrics.InstrumentedExecutorService$InstrumentedRunnable.run(InstrumentedExecutorService.java:176)  at org.apache.solr.common.util.ExecutorUtil$MDCAwareThreadPoolExecutor.lambda$execute$0(ExecutorUtil.java:209)  at java.base/java.util.concurrent.ThreadPoolExecutor.runWorker(ThreadPoolExecutor.java:1135)  at java.base/java.util.concurrent.ThreadPoolExecutor$Worker.run(ThreadPoolExecutor.java:635)  at java.base/java.lang.Thread.run(Thread.java:844)  >

Stack Trace:
java.lang.AssertionError: ObjectTracker found 3 object(s) that were not released!!! [MockDirectoryWrapper, SolrCore, MockDirectoryWrapper]
org.apache.solr.common.util.ObjectReleaseTracker$ObjectTrackerException: org.apache.lucene.store.MockDirectoryWrapper
        at org.apache.solr.common.util.ObjectReleaseTracker.track(ObjectReleaseTracker.java:42)
        at org.apache.solr.core.CachingDirectoryFactory.get(CachingDirectoryFactory.java:348)
        at org.apache.solr.handler.IndexFetcher.fetchLatestIndex(IndexFetcher.java:503)
        at org.apache.solr.handler.IndexFetcher.fetchLatestIndex(IndexFetcher.java:346)
        at org.apache.solr.handler.ReplicationHandler.doFetch(ReplicationHandler.java:425)
        at org.apache.solr.handler.ReplicationHandler.lambda$setupPolling$13(ReplicationHandler.java:1171)
        at java.base/java.util.concurrent.Executors$RunnableAdapter.call(Executors.java:514)
        at java.base/java.util.concurrent.FutureTask.runAndReset(FutureTask.java:305)
        at java.base/java.util.concurrent.ScheduledThreadPoolExecutor$ScheduledFutureTask.run(ScheduledThreadPoolExecutor.java:305)
        at java.base/java.util.concurrent.ThreadPoolExecutor.runWorker(ThreadPoolExecutor.java:1135)
        at java.base/java.util.concurrent.ThreadPoolExecutor$Worker.run(ThreadPoolExecutor.java:635)
        at java.base/java.lang.Thread.run(Thread.java:844)

org.apache.solr.common.util.ObjectReleaseTracker$ObjectTrackerException: org.apache.solr.core.SolrCore
        at org.apache.solr.common.util.ObjectReleaseTracker.track(ObjectReleaseTracker.java:42)
        at org.apache.solr.core.SolrCore.<init>(SolrCore.java:1054)
        at org.apache.solr.core.SolrCore.<init>(SolrCore.java:874)
        at org.apache.solr.core.CoreContainer.createFromDescriptor(CoreContainer.java:1178)
        at org.apache.solr.core.CoreContainer.create(CoreContainer.java:1088)
        at org.apache.solr.handler.admin.CoreAdminOperation.lambda$static$0(CoreAdminOperation.java:92)
        at org.apache.solr.handler.admin.CoreAdminOperation.execute(CoreAdminOperation.java:360)
        at org.apache.solr.handler.admin.CoreAdminHandler$CallInfo.call(CoreAdminHandler.java:395)
        at org.apache.solr.handler.admin.CoreAdminHandler.lambda$handleRequestBody$0(CoreAdminHandler.java:188)
        at com.codahale.metrics.InstrumentedExecutorService$InstrumentedRunnable.run(InstrumentedExecutorService.java:176)
        at org.apache.solr.common.util.ExecutorUtil$MDCAwareThreadPoolExecutor.lambda$execute$0(ExecutorUtil.java:209)
        at java.base/java.util.concurrent.ThreadPoolExecutor.runWorker(ThreadPoolExecutor.java:1135)
        at java.base/java.util.concurrent.ThreadPoolExecutor$Worker.run(ThreadPoolExecutor.java:635)
        at java.base/java.lang.Thread.run(Thread.java:844)

org.apache.solr.common.util.ObjectReleaseTracker$ObjectTrackerException: org.apache.lucene.store.MockDirectoryWrapper
        at org.apache.solr.common.util.ObjectReleaseTracker.track(ObjectReleaseTracker.java:42)
        at org.apache.solr.core.CachingDirectoryFactory.get(CachingDirectoryFactory.java:348)
        at org.apache.solr.update.SolrIndexWriter.create(SolrIndexWriter.java:95)
        at org.apache.solr.core.SolrCore.initIndex(SolrCore.java:770)
        at org.apache.solr.core.SolrCore.<init>(SolrCore.java:967)
        at org.apache.solr.core.SolrCore.<init>(SolrCore.java:874)
        at org.apache.solr.core.CoreContainer.createFromDescriptor(CoreContainer.java:1178)
        at org.apache.solr.core.CoreContainer.create(CoreContainer.java:1088)
        at org.apache.solr.handler.admin.CoreAdminOperation.lambda$static$0(CoreAdminOperation.java:92)
        at org.apache.solr.handler.admin.CoreAdminOperation.execute(CoreAdminOperation.java:360)
        at org.apache.solr.handler.admin.CoreAdminHandler$CallInfo.call(CoreAdminHandler.java:395)
        at org.apache.solr.handler.admin.CoreAdminHandler.lambda$handleRequestBody$0(CoreAdminHandler.java:188)
        at com.codahale.metrics.InstrumentedExecutorService$InstrumentedRunnable.run(InstrumentedExecutorService.java:176)
        at org.apache.solr.common.util.ExecutorUtil$MDCAwareThreadPoolExecutor.lambda$execute$0(ExecutorUtil.java:209)
        at java.base/java.util.concurrent.ThreadPoolExecutor.runWorker(ThreadPoolExecutor.java:1135)
        at java.base/java.util.concurrent.ThreadPoolExecutor$Worker.run(ThreadPoolExecutor.java:635)
        at java.base/java.lang.Thread.run(Thread.java:844)

 expected null, but was:<ObjectTracker found 3 object(s) that were not released!!! [MockDirectoryWrapper, SolrCore, MockDirectoryWrapper]
org.apache.solr.common.util.ObjectReleaseTracker$ObjectTrackerException: org.apache.lucene.store.MockDirectoryWrapper
        at org.apache.solr.common.util.ObjectReleaseTracker.track(ObjectReleaseTracker.java:42)
        at org.apache.solr.core.CachingDirectoryFactory.get(CachingDirectoryFactory.java:348)
        at org.apache.solr.handler.IndexFetcher.fetchLatestIndex(IndexFetcher.java:503)
        at org.apache.solr.handler.IndexFetcher.fetchLatestIndex(IndexFetcher.java:346)
        at org.apache.solr.handler.ReplicationHandler.doFetch(ReplicationHandler.java:425)
        at org.apache.solr.handler.ReplicationHandler.lambda$setupPolling$13(ReplicationHandler.java:1171)
        at java.base/java.util.concurrent.Executors$RunnableAdapter.call(Executors.java:514)
        at java.base/java.util.concurrent.FutureTask.runAndReset(FutureTask.java:305)
        at java.base/java.util.concurrent.ScheduledThreadPoolExecutor$ScheduledFutureTask.run(ScheduledThreadPoolExecutor.java:305)
        at java.base/java.util.concurrent.ThreadPoolExecutor.runWorker(ThreadPoolExecutor.java:1135)
        at java.base/java.util.concurrent.ThreadPoolExecutor$Worker.run(ThreadPoolExecutor.java:635)
        at java.base/java.lang.Thread.run(Thread.java:844)

org.apache.solr.common.util.ObjectReleaseTracker$ObjectTrackerException: org.apache.solr.core.SolrCore
        at org.apache.solr.common.util.ObjectReleaseTracker.track(ObjectReleaseTracker.java:42)
        at org.apache.solr.core.SolrCore.<init>(SolrCore.java:1054)
        at org.apache.solr.core.SolrCore.<init>(SolrCore.java:874)
        at org.apache.solr.core.CoreContainer.createFromDescriptor(CoreContainer.java:1178)
        at org.apache.solr.core.CoreContainer.create(CoreContainer.java:1088)
        at org.apache.solr.handler.admin.CoreAdminOperation.lambda$static$0(CoreAdminOperation.java:92)
        at org.apache.solr.handler.admin.CoreAdminOperation.execute(CoreAdminOperation.java:360)
        at org.apache.solr.handler.admin.CoreAdminHandler$CallInfo.call(CoreAdminHandler.java:395)
        at org.apache.solr.handler.admin.CoreAdminHandler.lambda$handleRequestBody$0(CoreAdminHandler.java:188)
        at com.codahale.metrics.InstrumentedExecutorService$InstrumentedRunnable.run(InstrumentedExecutorService.java:176)
        at org.apache.solr.common.util.ExecutorUtil$MDCAwareThreadPoolExecutor.lambda$execute$0(ExecutorUtil.java:209)
        at java.base/java.util.concurrent.ThreadPoolExecutor.runWorker(ThreadPoolExecutor.java:1135)
        at java.base/java.util.concurrent.ThreadPoolExecutor$Worker.run(ThreadPoolExecutor.java:635)
        at java.base/java.lang.Thread.run(Thread.java:844)

org.apache.solr.common.util.ObjectReleaseTracker$ObjectTrackerException: org.apache.lucene.store.MockDirectoryWrapper
        at org.apache.solr.common.util.ObjectReleaseTracker.track(ObjectReleaseTracker.java:42)
        at org.apache.solr.core.CachingDirectoryFactory.get(CachingDirectoryFactory.java:348)
        at org.apache.solr.update.SolrIndexWriter.create(SolrIndexWriter.java:95)
        at org.apache.solr.core.SolrCore.initIndex(SolrCore.java:770)
        at org.apache.solr.core.SolrCore.<init>(SolrCore.java:967)
        at org.apache.solr.core.SolrCore.<init>(SolrCore.java:874)
        at org.apache.solr.core.CoreContainer.createFromDescriptor(CoreContainer.java:1178)
        at org.apache.solr.core.CoreContainer.create(CoreContainer.java:1088)
        at org.apache.solr.handler.admin.CoreAdminOperation.lambda$static$0(CoreAdminOperation.java:92)
        at org.apache.solr.handler.admin.CoreAdminOperation.execute(CoreAdminOperation.java:360)
        at org.apache.solr.handler.admin.CoreAdminHandler$CallInfo.call(CoreAdminHandler.java:395)
        at org.apache.solr.handler.admin.CoreAdminHandler.lambda$handleRequestBody$0(CoreAdminHandler.java:188)
        at com.codahale.metrics.InstrumentedExecutorService$InstrumentedRunnable.run(InstrumentedExecutorService.java:176)
        at org.apache.solr.common.util.ExecutorUtil$MDCAwareThreadPoolExecutor.lambda$execute$0(ExecutorUtil.java:209)
        at java.base/java.util.concurrent.ThreadPoolExecutor.runWorker(ThreadPoolExecutor.java:1135)
        at java.base/java.util.concurrent.ThreadPoolExecutor$Worker.run(ThreadPoolExecutor.java:635)
        at java.base/java.lang.Thread.run(Thread.java:844)

>
        at __randomizedtesting.SeedInfo.seed([F24789AC86BB9926]:0)
        at org.junit.Assert.fail(Assert.java:88)
        at org.junit.Assert.failNotNull(Assert.java:755)
        at org.junit.Assert.assertNull(Assert.java:737)
        at org.apache.solr.SolrTestCaseJ4.teardownTestCases(SolrTestCaseJ4.java:320)
        at java.base/jdk.internal.reflect.NativeMethodAccessorImpl.invoke0(Native Method)
        at java.base/jdk.internal.reflect.NativeMethodAccessorImpl.invoke(NativeMethodAccessorImpl.java:62)
        at java.base/jdk.internal.reflect.DelegatingMethodAccessorImpl.invoke(DelegatingMethodAccessorImpl.java:43)
        at java.base/java.lang.reflect.Method.invoke(Method.java:564)
        at com.carrotsearch.randomizedtesting.RandomizedRunner.invoke(RandomizedRunner.java:1750)
        at com.carrotsearch.randomizedtesting.RandomizedRunner$7.evaluate(RandomizedRunner.java:901)
        at com.carrotsearch.randomizedtesting.rules.StatementAdapter.evaluate(StatementAdapter.java:36)
        at com.carrotsearch.randomizedtesting.rules.SystemPropertiesRestoreRule$1.evaluate(SystemPropertiesRestoreRule.java:57)
        at org.apache.lucene.util.AbstractBeforeAfterRule$1.evaluate(AbstractBeforeAfterRule.java:45)
        at com.carrotsearch.randomizedtesting.rules.StatementAdapter.evaluate(StatementAdapter.java:36)
        at org.apache.lucene.util.TestRuleStoreClassName$1.evaluate(TestRuleStoreClassName.java:41)
        at com.carrotsearch.randomizedtesting.rules.NoShadowingOrOverridesOnMethodsRule$1.evaluate(NoShadowingOrOverridesOnMethodsRule.java:40)
        at com.carrotsearch.randomizedtesting.rules.NoShadowingOrOverridesOnMethodsRule$1.evaluate(NoShadowingOrOverridesOnMethodsRule.java:40)
        at com.carrotsearch.randomizedtesting.rules.StatementAdapter.evaluate(StatementAdapter.java:36)
        at com.carrotsearch.randomizedtesting.rules.StatementAdapter.evaluate(StatementAdapter.java:36)
        at org.apache.lucene.util.TestRuleAssertionsRequired$1.evaluate(TestRuleAssertionsRequired.java:53)
        at org.apache.lucene.util.TestRuleMarkFailure$1.evaluate(TestRuleMarkFailure.java:47)
        at org.apache.lucene.util.TestRuleIgnoreAfterMaxFailures$1.evaluate(TestRuleIgnoreAfterMaxFailures.java:64)
        at org.apache.lucene.util.TestRuleIgnoreTestSuites$1.evaluate(TestRuleIgnoreTestSuites.java:54)
        at com.carrotsearch.randomizedtesting.rules.StatementAdapter.evaluate(StatementAdapter.java:36)
        at com.carrotsearch.randomizedtesting.ThreadLeakControl$StatementRunner.run(ThreadLeakControl.java:368)
        at java.base/java.lang.Thread.run(Thread.java:844)




Build Log:
[...truncated 14306 lines...]
   [junit4] Suite: org.apache.solr.cloud.MissingSegmentRecoveryTest
   [junit4]   2> 2087834 INFO  (SUITE-MissingSegmentRecoveryTest-seed#[7D1D9A70F8DA5FFB]-worker) [    ] o.a.s.SolrTestCaseJ4 SecureRandom sanity checks: test.solr.allowed.securerandom=null & java.security.egd=file:/dev/./urandom
   [junit4]   2> Creating dataDir: C:\Users\jenkins\workspace\Lucene-Solr-7.x-Windows\solr\build\solr-core\test\J0\temp\solr.cloud.MissingSegmentRecoveryTest_7D1D9A70F8DA5FFB-001\init-core-data-001
   [junit4]   2> 2087839 WARN  (SUITE-MissingSegmentRecoveryTest-seed#[7D1D9A70F8DA5FFB]-worker) [    ] o.a.s.SolrTestCaseJ4 startTrackingSearchers: numOpens=25 numCloses=25
   [junit4]   2> 2087839 INFO  (SUITE-MissingSegmentRecoveryTest-seed#[7D1D9A70F8DA5FFB]-worker) [    ] o.a.s.SolrTestCaseJ4 Using PointFields (NUMERIC_POINTS_SYSPROP=true) w/NUMERIC_DOCVALUES_SYSPROP=false
   [junit4]   2> 2087841 INFO  (SUITE-MissingSegmentRecoveryTest-seed#[7D1D9A70F8DA5FFB]-worker) [    ] o.a.s.SolrTestCaseJ4 Randomized ssl (false) and clientAuth (false) via: @org.apache.solr.util.RandomizeSSL(reason="", value=0.0/0.0, ssl=0.0/0.0, clientAuth=0.0/0.0)
   [junit4]   2> 2087841 INFO  (SUITE-MissingSegmentRecoveryTest-seed#[7D1D9A70F8DA5FFB]-worker) [    ] o.a.s.c.MiniSolrCloudCluster Starting cluster of 2 servers in C:\Users\jenkins\workspace\Lucene-Solr-7.x-Windows\solr\build\solr-core\test\J0\temp\solr.cloud.MissingSegmentRecoveryTest_7D1D9A70F8DA5FFB-001\tempDir-001
   [junit4]   2> 2087842 INFO  (SUITE-MissingSegmentRecoveryTest-seed#[7D1D9A70F8DA5FFB]-worker) [    ] o.a.s.c.ZkTestServer STARTING ZK TEST SERVER
   [junit4]   2> 2087845 INFO  (ZkTestServer Run Thread) [    ] o.a.s.c.ZkTestServer client port:0.0.0.0/0.0.0.0:0
   [junit4]   2> 2087845 INFO  (ZkTestServer Run Thread) [    ] o.a.s.c.ZkTestServer Starting server
   [junit4]   2> 2087938 INFO  (SUITE-MissingSegmentRecoveryTest-seed#[7D1D9A70F8DA5FFB]-worker) [    ] o.a.s.c.ZkTestServer start zk server on port:62084
   [junit4]   2> 2087938 INFO  (SUITE-MissingSegmentRecoveryTest-seed#[7D1D9A70F8DA5FFB]-worker) [    ] o.a.s.c.ZkTestServer parse host and port list: 127.0.0.1:62084
   [junit4]   2> 2087938 INFO  (SUITE-MissingSegmentRecoveryTest-seed#[7D1D9A70F8DA5FFB]-worker) [    ] o.a.s.c.ZkTestServer connecting to 127.0.0.1 62084
   [junit4]   2> 2087980 INFO  (zkConnectionManagerCallback-10083-thread-1) [    ] o.a.s.c.c.ConnectionManager zkClient has connected
   [junit4]   2> 2088012 INFO  (zkConnectionManagerCallback-10085-thread-1) [    ] o.a.s.c.c.ConnectionManager zkClient has connected
   [junit4]   2> 2088017 INFO  (zkConnectionManagerCallback-10087-thread-1) [    ] o.a.s.c.c.ConnectionManager zkClient has connected
   [junit4]   2> 2088022 WARN  (NIOServerCxn.Factory:0.0.0.0/0.0.0.0:0) [    ] o.a.z.s.NIOServerCnxn Unable to read additional data from client sessionid 0x100a9df4e6c0002, likely client has closed socket
   [junit4]   2> 2088026 WARN  (jetty-launcher-10088-thread-1) [    ] o.e.j.s.AbstractConnector Ignoring deprecated socket close linger time
   [junit4]   2> 2088026 INFO  (jetty-launcher-10088-thread-1) [    ] o.a.s.c.s.e.JettySolrRunner Start Jetty (original configured port=0)
   [junit4]   2> 2088026 INFO  (jetty-launcher-10088-thread-1) [    ] o.a.s.c.s.e.JettySolrRunner Trying to start Jetty on port 0 try number 1 ...
   [junit4]   2> 2088026 INFO  (jetty-launcher-10088-thread-1) [    ] o.e.j.s.Server jetty-9.4.14.v20181114; built: 2018-11-14T21:20:31.478Z; git: c4550056e785fb5665914545889f21dc136ad9e6; jvm 10.0.1+10
   [junit4]   2> 2088026 INFO  (jetty-launcher-10088-thread-1) [    ] o.e.j.s.session DefaultSessionIdManager workerName=node0
   [junit4]   2> 2088026 INFO  (jetty-launcher-10088-thread-1) [    ] o.e.j.s.session No SessionScavenger set, using defaults
   [junit4]   2> 2088026 INFO  (jetty-launcher-10088-thread-1) [    ] o.e.j.s.session node0 Scavenging every 600000ms
   [junit4]   2> 2088026 INFO  (jetty-launcher-10088-thread-1) [    ] o.e.j.s.h.ContextHandler Started o.e.j.s.ServletContextHandler@51d4bc9b{/solr,null,AVAILABLE}
   [junit4]   2> 2088026 WARN  (jetty-launcher-10088-thread-2) [    ] o.e.j.s.AbstractConnector Ignoring deprecated socket close linger time
   [junit4]   2> 2088026 INFO  (jetty-launcher-10088-thread-2) [    ] o.a.s.c.s.e.JettySolrRunner Start Jetty (original configured port=0)
   [junit4]   2> 2088026 INFO  (jetty-launcher-10088-thread-2) [    ] o.a.s.c.s.e.JettySolrRunner Trying to start Jetty on port 0 try number 1 ...
   [junit4]   2> 2088026 INFO  (jetty-launcher-10088-thread-2) [    ] o.e.j.s.Server jetty-9.4.14.v20181114; built: 2018-11-14T21:20:31.478Z; git: c4550056e785fb5665914545889f21dc136ad9e6; jvm 10.0.1+10
   [junit4]   2> 2088032 INFO  (jetty-launcher-10088-thread-2) [    ] o.e.j.s.session DefaultSessionIdManager workerName=node0
   [junit4]   2> 2088032 INFO  (jetty-launcher-10088-thread-2) [    ] o.e.j.s.session No SessionScavenger set, using defaults
   [junit4]   2> 2088032 INFO  (jetty-launcher-10088-thread-2) [    ] o.e.j.s.session node0 Scavenging every 600000ms
   [junit4]   2> 2088032 INFO  (jetty-launcher-10088-thread-2) [    ] o.e.j.s.h.ContextHandler Started o.e.j.s.ServletContextHandler@255c58c3{/solr,null,AVAILABLE}
   [junit4]   2> 2088032 INFO  (jetty-launcher-10088-thread-1) [    ] o.e.j.s.AbstractConnector Started ServerConnector@4df64002{HTTP/1.1,[http/1.1]}{127.0.0.1:62095}
   [junit4]   2> 2088032 INFO  (jetty-launcher-10088-thread-1) [    ] o.e.j.s.Server Started @2066448ms
   [junit4]   2> 2088032 INFO  (jetty-launcher-10088-thread-1) [    ] o.a.s.c.s.e.JettySolrRunner Jetty properties: {hostContext=/solr, hostPort=62095}
   [junit4]   2> 2088032 ERROR (jetty-launcher-10088-thread-1) [    ] o.a.s.u.StartupLoggingUtils Missing Java Option solr.log.dir. Logging may be missing or incomplete.
   [junit4]   2> 2088032 INFO  (jetty-launcher-10088-thread-1) [    ] o.a.s.s.SolrDispatchFilter Using logger factory org.apache.logging.slf4j.Log4jLoggerFactory
   [junit4]   2> 2088032 INFO  (jetty-launcher-10088-thread-1) [    ] o.a.s.s.SolrDispatchFilter  ___      _       Welcome to Apache Solr™ version 7.8.0
   [junit4]   2> 2088032 INFO  (jetty-launcher-10088-thread-1) [    ] o.a.s.s.SolrDispatchFilter / __| ___| |_ _   Starting in cloud mode on port null
   [junit4]   2> 2088032 INFO  (jetty-launcher-10088-thread-1) [    ] o.a.s.s.SolrDispatchFilter \__ \/ _ \ | '_|  Install dir: null
   [junit4]   2> 2088032 INFO  (jetty-launcher-10088-thread-1) [    ] o.a.s.s.SolrDispatchFilter |___/\___/_|_|    Start time: 2019-02-12T08:01:52.303557100Z
   [junit4]   2> 2088032 INFO  (jetty-launcher-10088-thread-2) [    ] o.e.j.s.AbstractConnector Started ServerConnector@287ecfbe{HTTP/1.1,[http/1.1]}{127.0.0.1:62098}
   [junit4]   2> 2088032 INFO  (jetty-launcher-10088-thread-2) [    ] o.e.j.s.Server Started @2066449ms
   [junit4]   2> 2088032 INFO  (jetty-launcher-10088-thread-2) [    ] o.a.s.c.s.e.JettySolrRunner Jetty properties: {hostContext=/solr, hostPort=62098}
   [junit4]   2> 2088032 ERROR (jetty-launcher-10088-thread-2) [    ] o.a.s.u.StartupLoggingUtils Missing Java Option solr.log.dir. Logging may be missing or incomplete.
   [junit4]   2> 2088032 INFO  (jetty-launcher-10088-thread-2) [    ] o.a.s.s.SolrDispatchFilter Using logger factory org.apache.logging.slf4j.Log4jLoggerFactory
   [junit4]   2> 2088032 INFO  (jetty-launcher-10088-thread-2) [    ] o.a.s.s.SolrDispatchFilter  ___      _       Welcome to Apache Solr™ version 7.8.0
   [junit4]   2> 2088032 INFO  (jetty-launcher-10088-thread-2) [    ] o.a.s.s.SolrDispatchFilter / __| ___| |_ _   Starting in cloud mode on port null
   [junit4]   2> 2088032 INFO  (jetty-launcher-10088-thread-2) [    ] o.a.s.s.SolrDispatchFilter \__ \/ _ \ | '_|  Install dir: null
   [junit4]   2> 2088032 INFO  (jetty-launcher-10088-thread-2) [    ] o.a.s.s.SolrDispatchFilter |___/\___/_|_|    Start time: 2019-02-12T08:01:52.303557100Z
   [junit4]   2> 2088055 INFO  (zkConnectionManagerCallback-10090-thread-1) [    ] o.a.s.c.c.ConnectionManager zkClient has connected
   [junit4]   2> 2088066 INFO  (jetty-launcher-10088-thread-1) [    ] o.a.s.s.SolrDispatchFilter solr.xml found in ZooKeeper. Loading...
   [junit4]   2> 2088066 INFO  (zkConnectionManagerCallback-10092-thread-1) [    ] o.a.s.c.c.ConnectionManager zkClient has connected
   [junit4]   2> 2088070 INFO  (jetty-launcher-10088-thread-2) [    ] o.a.s.s.SolrDispatchFilter solr.xml found in ZooKeeper. Loading...
   [junit4]   2> 2088081 WARN  (NIOServerCxn.Factory:0.0.0.0/0.0.0.0:0) [    ] o.a.z.s.NIOServerCnxn Unable to read additional data from client sessionid 0x100a9df4e6c0003, likely client has closed socket
   [junit4]   2> 2088082 WARN  (NIOServerCxn.Factory:0.0.0.0/0.0.0.0:0) [    ] o.a.z.s.NIOServerCnxn Unable to read additional data from client sessionid 0x100a9df4e6c0004, likely client has closed socket
   [junit4]   2> 2088303 INFO  (jetty-launcher-10088-thread-1) [    ] o.a.s.h.c.HttpShardHandlerFactory Host whitelist initialized: WhitelistHostChecker [whitelistHosts=null, whitelistHostCheckingEnabled=true]
   [junit4]   2> 2088310 INFO  (jetty-launcher-10088-thread-1) [    ] o.a.s.c.ZkContainer Zookeeper client=127.0.0.1:62084/solr
   [junit4]   2> 2088317 INFO  (zkConnectionManagerCallback-10096-thread-1) [    ] o.a.s.c.c.ConnectionManager zkClient has connected
   [junit4]   2> 2088320 WARN  (NIOServerCxn.Factory:0.0.0.0/0.0.0.0:0) [    ] o.a.z.s.NIOServerCnxn Unable to read additional data from client sessionid 0x100a9df4e6c0005, likely client has closed socket
   [junit4]   2> 2088325 INFO  (zkConnectionManagerCallback-10098-thread-1) [    ] o.a.s.c.c.ConnectionManager zkClient has connected
   [junit4]   2> 2088504 INFO  (jetty-launcher-10088-thread-2) [    ] o.a.s.h.c.HttpShardHandlerFactory Host whitelist initialized: WhitelistHostChecker [whitelistHosts=null, whitelistHostCheckingEnabled=true]
   [junit4]   2> 2088513 INFO  (jetty-launcher-10088-thread-2) [    ] o.a.s.c.ZkContainer Zookeeper client=127.0.0.1:62084/solr
   [junit4]   2> 2088534 INFO  (zkConnectionManagerCallback-10104-thread-1) [    ] o.a.s.c.c.ConnectionManager zkClient has connected
   [junit4]   2> 2088545 WARN  (NIOServerCxn.Factory:0.0.0.0/0.0.0.0:0) [    ] o.a.z.s.NIOServerCnxn Unable to read additional data from client sessionid 0x100a9df4e6c0007, likely client has closed socket
   [junit4]   2> 2088549 INFO  (zkConnectionManagerCallback-10106-thread-1) [    ] o.a.s.c.c.ConnectionManager zkClient has connected
   [junit4]   2> 2088573 INFO  (jetty-launcher-10088-thread-2) [n:127.0.0.1:62098_solr    ] o.a.s.c.OverseerElectionContext I am going to be the leader 127.0.0.1:62098_solr
   [junit4]   2> 2088573 INFO  (jetty-launcher-10088-thread-2) [n:127.0.0.1:62098_solr    ] o.a.s.c.Overseer Overseer (id=72244370596429832-127.0.0.1:62098_solr-n_0000000000) starting
   [junit4]   2> 2088686 INFO  (zkConnectionManagerCallback-10113-thread-1) [    ] o.a.s.c.c.ConnectionManager zkClient has connected
   [junit4]   2> 2088697 INFO  (jetty-launcher-10088-thread-2) [n:127.0.0.1:62098_solr    ] o.a.s.c.s.i.ZkClientClusterStateProvider Cluster at 127.0.0.1:62084/solr ready
   [junit4]   2> 2088698 INFO  (jetty-launcher-10088-thread-2) [n:127.0.0.1:62098_solr    ] o.a.s.c.ZkController Register node as live in ZooKeeper:/live_nodes/127.0.0.1:62098_solr
   [junit4]   2> 2088705 DEBUG (OverseerAutoScalingTriggerThread-72244370596429832-127.0.0.1:62098_solr-n_0000000000) [    ] o.a.s.c.a.OverseerTriggerThread Adding .auto_add_replicas and .scheduled_maintenance triggers
   [junit4]   2> 2088705 INFO  (zkCallback-10112-thread-1) [    ] o.a.s.c.c.ZkStateReader Updated live nodes from ZooKeeper... (0) -> (1)
   [junit4]   2> 2088705 DEBUG (OverseerAutoScalingTriggerThread-72244370596429832-127.0.0.1:62098_solr-n_0000000000) [    ] o.a.s.c.a.OverseerTriggerThread Refreshing /autoscaling.json with znode version 1
   [junit4]   2> 2088705 DEBUG (OverseerAutoScalingTriggerThread-72244370596429832-127.0.0.1:62098_solr-n_0000000000) [    ] o.a.s.c.a.OverseerTriggerThread Current znodeVersion 1, lastZnodeVersion 0
   [junit4]   2> 2088705 DEBUG (OverseerAutoScalingTriggerThread-72244370596429832-127.0.0.1:62098_solr-n_0000000000) [    ] o.a.s.c.a.OverseerTriggerThread Processed trigger updates upto znodeVersion 1
   [junit4]   2> 2088705 INFO  (zkCallback-10105-thread-1) [    ] o.a.s.c.c.ZkStateReader Updated live nodes from ZooKeeper... (0) -> (1)
   [junit4]   2> 2088705 DEBUG (OverseerAutoScalingTriggerThread-72244370596429832-127.0.0.1:62098_solr-n_0000000000) [    ] o.a.s.c.a.NodeLostTrigger NodeLostTrigger .auto_add_replicas - Initial livenodes: [127.0.0.1:62098_solr]
   [junit4]   2> 2088705 DEBUG (OverseerAutoScalingTriggerThread-72244370596429832-127.0.0.1:62098_solr-n_0000000000) [    ] o.a.s.c.a.OverseerTriggerThread -- cleaning old nodeLost / nodeAdded markers
   [junit4]   2> 2088705 DEBUG (OverseerAutoScalingTriggerThread-72244370596429832-127.0.0.1:62098_solr-n_0000000000) [    ] o.a.s.c.a.OverseerTriggerThread Current znodeVersion 1, lastZnodeVersion 1
   [junit4]   2> 2088705 INFO  (OverseerStateUpdate-72244370596429832-127.0.0.1:62098_solr-n_0000000000) [n:127.0.0.1:62098_solr    ] o.a.s.c.Overseer Starting to work on the main queue : 127.0.0.1:62098_solr
   [junit4]   2> 2088721 DEBUG (ScheduledTrigger-10474-thread-2) [    ] o.a.s.c.a.NodeLostTrigger Running NodeLostTrigger: .auto_add_replicas with currently live nodes: 1 and last live nodes: 1
   [junit4]   2> 2088748 INFO  (jetty-launcher-10088-thread-2) [n:127.0.0.1:62098_solr    ] o.a.s.h.a.MetricsHistoryHandler No .system collection, keeping metrics history in memory.
   [junit4]   2> 2088798 INFO  (jetty-launcher-10088-thread-2) [n:127.0.0.1:62098_solr    ] o.a.s.m.r.SolrJmxReporter JMX monitoring for 'solr_62098.solr.node' (registry 'solr.node') enabled at server: com.sun.jmx.mbeanserver.JmxMBeanServer@7688cac7
   [junit4]   2> 2088812 INFO  (jetty-launcher-10088-thread-2) [n:127.0.0.1:62098_solr    ] o.a.s.m.r.SolrJmxReporter JMX monitoring for 'solr_62098.solr.jvm' (registry 'solr.jvm') enabled at server: com.sun.jmx.mbeanserver.JmxMBeanServer@7688cac7
   [junit4]   2> 2088812 INFO  (jetty-launcher-10088-thread-2) [n:127.0.0.1:62098_solr    ] o.a.s.m.r.SolrJmxReporter JMX monitoring for 'solr_62098.solr.jetty' (registry 'solr.jetty') enabled at server: com.sun.jmx.mbeanserver.JmxMBeanServer@7688cac7
   [junit4]   2> 2088814 INFO  (jetty-launcher-10088-thread-2) [n:127.0.0.1:62098_solr    ] o.a.s.c.CorePropertiesLocator Found 0 core definitions underneath C:\Users\jenkins\workspace\Lucene-Solr-7.x-Windows\solr\build\solr-core\test\J0\temp\solr.cloud.MissingSegmentRecoveryTest_7D1D9A70F8DA5FFB-001\tempDir-001\node2\.
   [junit4]   2> 2089061 INFO  (jetty-launcher-10088-thread-1) [n:127.0.0.1:62095_solr    ] o.a.s.c.c.ZkStateReader Updated live nodes from ZooKeeper... (0) -> (1)
   [junit4]   2> 2089067 INFO  (jetty-launcher-10088-thread-1) [n:127.0.0.1:62095_solr    ] o.a.s.c.ZkController Publish node=127.0.0.1:62095_solr as DOWN
   [junit4]   2> 2089068 INFO  (jetty-launcher-10088-thread-1) [n:127.0.0.1:62095_solr    ] o.a.s.c.TransientSolrCoreCacheDefault Allocating transient cache for 2147483647 transient cores
   [junit4]   2> 2089068 INFO  (jetty-launcher-10088-thread-1) [n:127.0.0.1:62095_solr    ] o.a.s.c.ZkController Register node as live in ZooKeeper:/live_nodes/127.0.0.1:62095_solr
   [junit4]   2> 2089073 INFO  (zkCallback-10112-thread-1) [    ] o.a.s.c.c.ZkStateReader Updated live nodes from ZooKeeper... (1) -> (2)
   [junit4]   2> 2089075 DEBUG (OverseerStateUpdate-72244370596429832-127.0.0.1:62098_solr-n_0000000000) [n:127.0.0.1:62098_solr    ] o.a.s.c.Overseer processMessage: queueSize: 1, message = {
   [junit4]   2>   "operation":"downnode",
   [junit4]   2>   "node_name":"127.0.0.1:62095_solr"} current state version: 0
   [junit4]   2> 2089075 INFO  (zkCallback-10105-thread-1) [    ] o.a.s.c.c.ZkStateReader Updated live nodes from ZooKeeper... (1) -> (2)
   [junit4]   2> 2089076 INFO  (zkCallback-10097-thread-1) [    ] o.a.s.c.c.ZkStateReader Updated live nodes from ZooKeeper... (1) -> (2)
   [junit4]   2> 2089218 INFO  (zkConnectionManagerCallback-10119-thread-1) [    ] o.a.s.c.c.ConnectionManager zkClient has connected
   [junit4]   2> 2089220 INFO  (jetty-launcher-10088-thread-1) [n:127.0.0.1:62095_solr    ] o.a.s.c.c.ZkStateReader Updated live nodes from ZooKeeper... (0) -> (2)
   [junit4]   2> 2089222 INFO  (jetty-launcher-10088-thread-1) [n:127.0.0.1:62095_solr    ] o.a.s.c.s.i.ZkClientClusterStateProvider Cluster at 127.0.0.1:62084/solr ready
   [junit4]   2> 2089222 INFO  (jetty-launcher-10088-thread-1) [n:127.0.0.1:62095_solr    ] o.a.s.h.a.MetricsHistoryHandler No .system collection, keeping metrics history in memory.
   [junit4]   2> 2089288 INFO  (jetty-launcher-10088-thread-1) [n:127.0.0.1:62095_solr    ] o.a.s.m.r.SolrJmxReporter JMX monitoring for 'solr_62095.solr.node' (registry 'solr.node') enabled at server: com.sun.jmx.mbeanserver.JmxMBeanServer@7688cac7
   [junit4]   2> 2089300 INFO  (jetty-launcher-10088-thread-1) [n:127.0.0.1:62095_solr    ] o.a.s.m.r.SolrJmxReporter JMX monitoring for 'solr_62095.solr.jvm' (registry 'solr.jvm') enabled at server: com.sun.jmx.mbeanserver.JmxMBeanServer@7688cac7
   [junit4]   2> 2089300 INFO  (jetty-launcher-10088-thread-1) [n:127.0.0.1:62095_solr    ] o.a.s.m.r.SolrJmxReporter JMX monitoring for 'solr_62095.solr.jetty' (registry 'solr.jetty') enabled at server: com.sun.jmx.mbeanserver.JmxMBeanServer@7688cac7
   [junit4]   2> 2089302 INFO  (jetty-launcher-10088-thread-1) [n:127.0.0.1:62095_solr    ] o.a.s.c.CorePropertiesLocator Found 0 core definitions underneath C:\Users\jenkins\workspace\Lucene-Solr-7.x-Windows\solr\build\solr-core\test\J0\temp\solr.cloud.MissingSegmentRecoveryTest_7D1D9A70F8DA5FFB-001\tempDir-001\node1\.
   [junit4]   2> 2089432 INFO  (zkConnectionManagerCallback-10125-thread-1) [    ] o.a.s.c.c.ConnectionManager zkClient has connected
   [junit4]   2> 2089450 INFO  (SUITE-MissingSegmentRecoveryTest-seed#[7D1D9A70F8DA5FFB]-worker) [    ] o.a.s.c.c.ZkStateReader Updated live nodes from ZooKeeper... (0) -> (2)
   [junit4]   2> 2089459 INFO  (SUITE-MissingSegmentRecoveryTest-seed#[7D1D9A70F8DA5FFB]-worker) [    ] o.a.s.c.s.i.ZkClientClusterStateProvider Cluster at 127.0.0.1:62084/solr ready
   [junit4]   2> 2089500 INFO  (TEST-MissingSegmentRecoveryTest.testLeaderRecovery-seed#[7D1D9A70F8DA5FFB]) [    ] o.a.s.SolrTestCaseJ4 ###Starting testLeaderRecovery
   [junit4]   2> 2089503 INFO  (qtp872377123-33307) [n:127.0.0.1:62098_solr    ] o.a.s.h.a.CollectionsHandler Invoked Collection Action :create with params collection.configName=conf&maxShardsPerNode=1&name=MissingSegmentRecoveryTest&nrtReplicas=2&action=CREATE&numShards=1&wt=javabin&version=2 and sendToOCPQueue=true
   [junit4]   2> 2089508 INFO  (OverseerThreadFactory-10476-thread-1-processing-n:127.0.0.1:62098_solr) [n:127.0.0.1:62098_solr    ] o.a.s.c.a.c.CreateCollectionCmd Create collection MissingSegmentRecoveryTest
   [junit4]   2> 2089517 DEBUG (OverseerStateUpdate-72244370596429832-127.0.0.1:62098_solr-n_0000000000) [n:127.0.0.1:62098_solr    ] o.a.s.c.Overseer processMessage: queueSize: 1, message = {
   [junit4]   2>   "name":"MissingSegmentRecoveryTest",
   [junit4]   2>   "fromApi":"true",
   [junit4]   2>   "collection.configName":"conf",
   [junit4]   2>   "numShards":"1",
   [junit4]   2>   "maxShardsPerNode":"1",
   [junit4]   2>   "nrtReplicas":"2",
   [junit4]   2>   "stateFormat":"2",
   [junit4]   2>   "replicationFactor":"2",
   [junit4]   2>   "operation":"create"} current state version: 0
   [junit4]   2> 2089619 INFO  (qtp872377123-33309) [n:127.0.0.1:62098_solr    ] o.a.s.s.HttpSolrCall [admin] webapp=null path=/admin/metrics params={prefix=CONTAINER.fs.usableSpace,CONTAINER.fs.totalSpace,CORE.coreName&wt=javabin&version=2&group=solr.node,solr.core} status=0 QTime=4
   [junit4]   2> 2089625 INFO  (qtp872377123-33310) [n:127.0.0.1:62098_solr    ] o.a.s.s.HttpSolrCall [admin] webapp=null path=/admin/metrics params={prefix=CONTAINER.fs.usableSpace,CONTAINER.fs.totalSpace,CORE.coreName&wt=javabin&version=2&group=solr.node,solr.core} status=0 QTime=4
   [junit4]   2> 2089630 INFO  (qtp872377123-33311) [n:127.0.0.1:62098_solr    ] o.a.s.s.HttpSolrCall [admin] webapp=null path=/admin/metrics params={prefix=CONTAINER.fs.usableSpace,CONTAINER.fs.totalSpace,CORE.coreName&wt=javabin&version=2&group=solr.node,solr.core} status=0 QTime=4
   [junit4]   2> 2089631 INFO  (qtp872377123-33306) [n:127.0.0.1:62098_solr    ] o.a.s.s.HttpSolrCall [admin] webapp=null path=/admin/metrics params={prefix=CONTAINER.fs.usableSpace,CONTAINER.fs.totalSpace,CORE.coreName&wt=javabin&version=2&group=solr.node,solr.core} status=0 QTime=4
   [junit4]   2> 2089631 INFO  (qtp872377123-33306) [n:127.0.0.1:62098_solr    ] o.a.s.s.HttpSolrCall [admin] webapp=null path=/admin/metrics params={prefix=CONTAINER.fs.usableSpace,CONTAINER.fs.totalSpace,CORE.coreName&wt=javabin&version=2&group=solr.node,solr.core} status=0 QTime=4
   [junit4]   2> 2089649 INFO  (qtp1498209292-33297) [n:127.0.0.1:62095_solr    ] o.a.s.s.HttpSolrCall [admin] webapp=null path=/admin/metrics params={prefix=CONTAINER.fs.usableSpace,CONTAINER.fs.totalSpace,CORE.coreName&wt=javabin&version=2&group=solr.node,solr.core} status=0 QTime=8
   [junit4]   2> 2089654 INFO  (qtp1498209292-33299) [n:127.0.0.1:62095_solr    ] o.a.s.s.HttpSolrCall [admin] webapp=null path=/admin/metrics params={prefix=CONTAINER.fs.usableSpace,CONTAINER.fs.totalSpace,CORE.coreName&wt=javabin&version=2&group=solr.node,solr.core} status=0 QTime=4
   [junit4]   2> 2089656 INFO  (qtp1498209292-33300) [n:127.0.0.1:62095_solr    ] o.a.s.s.HttpSolrCall [admin] webapp=null path=/admin/metrics params={prefix=CONTAINER.fs.usableSpace,CONTAINER.fs.totalSpace,CORE.coreName&wt=javabin&version=2&group=solr.node,solr.core} status=0 QTime=3
   [junit4]   2> 2089664 INFO  (qtp1498209292-33301) [n:127.0.0.1:62095_solr    ] o.a.s.s.HttpSolrCall [admin] webapp=null path=/admin/metrics params={prefix=CONTAINER.fs.usableSpace,CONTAINER.fs.totalSpace,CORE.coreName&wt=javabin&version=2&group=solr.node,solr.core} status=0 QTime=4
   [junit4]   2> 2089667 INFO  (qtp1498209292-33302) [n:127.0.0.1:62095_solr    ] o.a.s.s.HttpSolrCall [admin] webapp=null path=/admin/metrics params={prefix=CONTAINER.fs.usableSpace,CONTAINER.fs.totalSpace,CORE.coreName&wt=javabin&version=2&group=solr.node,solr.core} status=0 QTime=3
   [junit4]   2> 2089674 DEBUG (OverseerStateUpdate-72244370596429832-127.0.0.1:62098_solr-n_0000000000) [n:127.0.0.1:62098_solr    ] o.a.s.c.Overseer processMessage: queueSize: 1, message = {
   [junit4]   2>   "operation":"ADDREPLICA",
   [junit4]   2>   "collection":"MissingSegmentRecoveryTest",
   [junit4]   2>   "shard":"shard1",
   [junit4]   2>   "core":"MissingSegmentRecoveryTest_shard1_replica_n1",
   [junit4]   2>   "state":"down",
   [junit4]   2>   "base_url":"http://127.0.0.1:62095/solr",
   [junit4]   2>   "type":"NRT",
   [junit4]   2>   "waitForFinalState":"false"} current state version: 0
   [junit4]   2> 2089674 INFO  (OverseerStateUpdate-72244370596429832-127.0.0.1:62098_solr-n_0000000000) [n:127.0.0.1:62098_solr    ] o.a.s.c.o.SliceMutator createReplica() {
   [junit4]   2>   "operation":"ADDREPLICA",
   [junit4]   2>   "collection":"MissingSegmentRecoveryTest",
   [junit4]   2>   "shard":"shard1",
   [junit4]   2>   "core":"MissingSegmentRecoveryTest_shard1_replica_n1",
   [junit4]   2>   "state":"down",
   [junit4]   2>   "base_url":"http://127.0.0.1:62095/solr",
   [junit4]   2>   "type":"NRT",
   [junit4]   2>   "waitForFinalState":"false"}
   [junit4]   2> 2089692 DEBUG (OverseerStateUpdate-72244370596429832-127.0.0.1:62098_solr-n_0000000000) [n:127.0.0.1:62098_solr    ] o.a.s.c.Overseer processMessage: queueSize: 2, message = {
   [junit4]   2>   "operation":"ADDREPLICA",
   [junit4]   2>   "collection":"MissingSegmentRecoveryTest",
   [junit4]   2>   "shard":"shard1",
   [junit4]   2>   "core":"MissingSegmentRecoveryTest_shard1_replica_n2",
   [junit4]   2>   "state":"down",
   [junit4]   2>   "base_url":"http://127.0.0.1:62098/solr",
   [junit4]   2>   "type":"NRT",
   [junit4]   2>   "waitForFinalState":"false"} current state version: 0
   [junit4]   2> 2089692 INFO  (OverseerStateUpdate-72244370596429832-127.0.0.1:62098_solr-n_0000000000) [n:127.0.0.1:62098_solr    ] o.a.s.c.o.SliceMutator createReplica() {
   [junit4]   2>   "operation":"ADDREPLICA",
   [junit4]   2>   "collection":"MissingSegmentRecoveryTest",
   [junit4]   2>   "shard":"shard1",
   [junit4]   2>   "core":"MissingSegmentRecoveryTest_shard1_replica_n2",
   [junit4]   2>   "state":"down",
   [junit4]   2>   "base_url":"http://127.0.0.1:62098/solr",
   [junit4]   2>   "type":"NRT",
   [junit4]   2>   "waitForFinalState":"false"}
   [junit4]   2> 2089695 DEBUG (ScheduledTrigger-10474-thread-2) [    ] o.a.s.c.a.NodeLostTrigger Running NodeLostTrigger: .auto_add_replicas with currently live nodes: 2 and last live nodes: 1
   [junit4]   2> 2089880 INFO  (qtp872377123-33308) [n:127.0.0.1:62098_solr    x:MissingSegmentRecoveryTest_shard1_replica_n2] o.a.s.h.a.CoreAdminOperation core create command qt=/admin/cores&coreNodeName=core_node4&collection.configName=conf&newCollection=true&name=MissingSegmentRecoveryTest_shard1_replica_n2&action=CREATE&numShards=1&collection=MissingSegmentRecoveryTest&shard=shard1&wt=javabin&version=2&replicaType=NRT
   [junit4]   2> 2089880 INFO  (qtp1498209292-33298) [n:127.0.0.1:62095_solr    x:MissingSegmentRecoveryTest_shard1_replica_n1] o.a.s.h.a.CoreAdminOperation core create command qt=/admin/cores&coreNodeName=core_node3&collection.configName=conf&newCollection=true&name=MissingSegmentRecoveryTest_shard1_replica_n1&action=CREATE&numShards=1&collection=MissingSegmentRecoveryTest&shard=shard1&wt=javabin&version=2&replicaType=NRT
   [junit4]   2> 2089880 INFO  (qtp872377123-33308) [n:127.0.0.1:62098_solr    x:MissingSegmentRecoveryTest_shard1_replica_n2] o.a.s.c.TransientSolrCoreCacheDefault Allocating transient cache for 2147483647 transient cores
   [junit4]   2> 2089885 DEBUG (OverseerStateUpdate-72244370596429832-127.0.0.1:62098_solr-n_0000000000) [n:127.0.0.1:62098_solr    ] o.a.s.c.Overseer processMessage: queueSize: 2, message = {
   [junit4]   2>   "core":"MissingSegmentRecoveryTest_shard1_replica_n1",
   [junit4]   2>   "core_node_name":"core_node3",
   [junit4]   2>   "roles":null,
   [junit4]   2>   "base_url":"http://127.0.0.1:62095/solr",
   [junit4]   2>   "node_name":"127.0.0.1:62095_solr",
   [junit4]   2>   "numShards":"1",
   [junit4]   2>   "state":"down",
   [junit4]   2>   "shard":"shard1",
   [junit4]   2>   "collection":"MissingSegmentRecoveryTest",
   [junit4]   2>   "type":"NRT",
   [junit4]   2>   "force_set_state":"false",
   [junit4]   2>   "operation":"state"} current state version: 0
   [junit4]   2> 2089885 DEBUG (OverseerStateUpdate-72244370596429832-127.0.0.1:62098_solr-n_0000000000) [n:127.0.0.1:62098_solr    ] o.a.s.c.Overseer processMessage: queueSize: 2, message = {
   [junit4]   2>   "core":"MissingSegmentRecoveryTest_shard1_replica_n2",
   [junit4]   2>   "core_node_name":"core_node4",
   [junit4]   2>   "roles":null,
   [junit4]   2>   "base_url":"http://127.0.0.1:62098/solr",
   [junit4]   2>   "node_name":"127.0.0.1:62098_solr",
   [junit4]   2>   "numShards":"1",
   [junit4]   2>   "state":"down",
   [junit4]   2>   "shard":"shard1",
   [junit4]   2>   "collection":"MissingSegmentRecoveryTest",
   [junit4]   2>   "type":"NRT",
   [junit4]   2>   "force_set_state":"false",
   [junit4]   2>   "operation":"state"} current state version: 0
   [junit4]   2> 2090664 DEBUG (ScheduledTrigger-10474-thread-4) [    ] o.a.s.c.a.NodeLostTrigger Running NodeLostTrigger: .auto_add_replicas with currently live nodes: 2 and last live nodes: 2
   [junit4]   2> 2090856 INFO  (qtp1498209292-33298) [n:127.0.0.1:62095_solr c:MissingSegmentRecoveryTest s:shard1 r:core_node3 x:MissingSegmentRecoveryTest_shard1_replica_n1] o.a.s.c.SolrConfig Using Lucene MatchVersion: 7.8.0
   [junit4]   2> 2090858 INFO  (qtp872377123-33308) [n:127.0.0.1:62098_solr c:MissingSegmentRecoveryTest s:shard1 r:core_node4 x:MissingSegmentRecoveryTest_shard1_replica_n2] o.a.s.c.SolrConfig Using Lucene MatchVersion: 7.8.0
   [junit4]   2> 2090864 INFO  (qtp1498209292-33298) [n:127.0.0.1:62095_solr c:MissingSegmentRecoveryTest s:shard1 r:core_node3 x:MissingSegmentRecoveryTest_shard1_replica_n1] o.a.s.s.IndexSchema [MissingSegmentRecoveryTest_shard1_replica_n1] Schema name=minimal
   [junit4]   2> 2090865 INFO  (qtp872377123-33308) [n:127.0.0.1:62098_solr c:MissingSegmentRecoveryTest s:shard1 r:core_node4 x:MissingSegmentRecoveryTest_shard1_replica_n2] o.a.s.s.IndexSchema [MissingSegmentRecoveryTest_shard1_replica_n2] Schema name=minimal
   [junit4]   2> 2090865 INFO  (qtp1498209292-33298) [n:127.0.0.1:62095_solr c:MissingSegmentRecoveryTest s:shard1 r:core_node3 x:MissingSegmentRecoveryTest_shard1_replica_n1] o.a.s.s.IndexSchema Loaded schema minimal/1.1 with uniqueid field id
   [junit4]   2> 2090865 INFO  (qtp1498209292-33298) [n:127.0.0.1:62095_solr c:MissingSegmentRecoveryTest s:shard1 r:core_node3 x:MissingSegmentRecoveryTest_shard1_replica_n1] o.a.s.c.CoreContainer Creating SolrCore 'MissingSegmentRecoveryTest_shard1_replica_n1' using configuration from collection MissingSegmentRecoveryTest, trusted=true
   [junit4]   2> 2090866 INFO  (qtp1498209292-33298) [n:127.0.0.1:62095_solr c:MissingSegmentRecoveryTest s:shard1 r:core_node3 x:MissingSegmentRecoveryTest_shard1_replica_n1] o.a.s.m.r.SolrJmxReporter JMX monitoring for 'solr_62095.solr.core.MissingSegmentRecoveryTest.shard1.replica_n1' (registry 'solr.core.MissingSegmentRecoveryTest.shard1.replica_n1') enabled at server: com.sun.jmx.mbeanserver.JmxMBeanServer@7688cac7
   [junit4]   2> 2090866 INFO  (qtp1498209292-33298) [n:127.0.0.1:62095_solr c:MissingSegmentRecoveryTest s:shard1 r:core_node3 x:MissingSegmentRecoveryTest_shard1_replica_n1] o.a.s.c.SolrCore [[MissingSegmentRecoveryTest_shard1_replica_n1] ] Opening new SolrCore at [C:\Users\jenkins\workspace\Lucene-Solr-7.x-Windows\solr\build\solr-core\test\J0\temp\solr.cloud.MissingSegmentRecoveryTest_7D1D9A70F8DA5FFB-001\tempDir-001\node1\MissingSegmentRecoveryTest_shard1_replica_n1], dataDir=[C:\Users\jenkins\workspace\Lucene-Solr-7.x-Windows\solr\build\solr-core\test\J0\temp\solr.cloud.MissingSegmentRecoveryTest_7D1D9A70F8DA5FFB-001\tempDir-001\node1\.\MissingSegmentRecoveryTest_shard1_replica_n1\data\]
   [junit4]   2> 2090866 INFO  (qtp872377123-33308) [n:127.0.0.1:62098_solr c:MissingSegmentRecoveryTest s:shard1 r:core_node4 x:MissingSegmentRecoveryTest_shard1_replica_n2] o.a.s.s.IndexSchema Loaded schema minimal/1.1 with uniqueid field id
   [junit4]   2> 2090866 INFO  (qtp872377123-33308) [n:127.0.0.1:62098_solr c:MissingSegmentRecoveryTest s:shard1 r:core_node4 x:MissingSegmentRecoveryTest_shard1_replica_n2] o.a.s.c.CoreContainer Creating SolrCore 'MissingSegmentRecoveryTest_shard1_replica_n2' using configuration from collection MissingSegmentRecoveryTest, trusted=true
   [junit4]   2> 2090867 INFO  (qtp872377123-33308) [n:127.0.0.1:62098_solr c:MissingSegmentRecoveryTest s:shard1 r:core_node4 x:MissingSegmentRecoveryTest_shard1_replica_n2] o.a.s.m.r.SolrJmxReporter JMX monitoring for 'solr_62098.solr.core.MissingSegmentRecoveryTest.shard1.replica_n2' (registry 'solr.core.MissingSegmentRecoveryTest.shard1.replica_n2') enabled at server: com.sun.jmx.mbeanserver.JmxMBeanServer@7688cac7
   [junit4]   2> 2090867 INFO  (qtp872377123-33308) [n:127.0.0.1:62098_solr c:MissingSegmentRecoveryTest s:shard1 r:core_node4 x:MissingSegmentRecoveryTest_shard1_replica_n2] o.a.s.c.SolrCore [[MissingSegmentRecoveryTest_shard1_replica_n2] ] Opening new SolrCore at [C:\Users\jenkins\workspace\Lucene-Solr-7.x-Windows\solr\build\solr-core\test\J0\temp\solr.cloud.MissingSegmentRecoveryTest_7D1D9A70F8DA5FFB-001\tempDir-001\node2\MissingSegmentRecoveryTest_shard1_replica_n2], dataDir=[C:\Users\jenkins\workspace\Lucene-Solr-7.x-Windows\solr\build\solr-core\test\J0\temp\solr.cloud.MissingSegmentRecoveryTest_7D1D9A70F8DA5FFB-001\tempDir-001\node2\.\MissingSegmentRecoveryTest_shard1_replica_n2\data\]
   [junit4]   2> 2090957 INFO  (qtp872377123-33308) [n:127.0.0.1:62098_solr c:MissingSegmentRecoveryTest s:shard1 r:core_node4 x:MissingSegmentRecoveryTest_shard1_replica_n2] o.a.s.u.UpdateHandler Using UpdateLog implementation: org.apache.solr.update.UpdateLog
   [junit4]   2> 2090957 INFO  (qtp872377123-33308) [n:127.0.0.1:62098_solr c:MissingSegmentRecoveryTest s:shard1 r:core_node4 x:MissingSegmentRecoveryTest_shard1_replica_n2] o.a.s.u.UpdateLog Initializing UpdateLog: dataDir=null defaultSyncLevel=FLUSH numRecordsToKeep=100 maxNumLogsToKeep=10 numVersionBuckets=65536
   [junit4]   2> 2090961 INFO  (qtp872377123-33308) [n:127.0.0.1:62098_solr c:MissingSegmentRecoveryTest s:shard1 r:core_node4 x:MissingSegmentRecoveryTest_shard1_replica_n2] o.a.s.u.CommitTracker Hard AutoCommit: disabled
   [junit4]   2> 2090961 INFO  (qtp872377123-33308) [n:127.0.0.1:62098_solr c:MissingSegmentRecoveryTest s:shard1 r:core_node4 x:MissingSegmentRecoveryTest_shard1_replica_n2] o.a.s.u.CommitTracker Soft AutoCommit: disabled
   [junit4]   2> 2090972 INFO  (qtp1498209292-33298) [n:127.0.0.1:62095_solr c:MissingSegmentRecoveryTest s:shard1 r:core_node3 x:MissingSegmentRecoveryTest_shard1_replica_n1] o.a.s.u.UpdateHandler Using UpdateLog implementation: org.apache.solr.update.UpdateLog
   [junit4]   2> 2090972 INFO  (qtp1498209292-33298) [n:127.0.0.1:62095_solr c:MissingSegmentRecoveryTest s:shard1 r:core_node3 x:MissingSegmentRecoveryTest_shard1_replica_n1] o.a.s.u.UpdateLog Initializing UpdateLog: dataDir=null defaultSyncLevel=FLUSH numRecordsToKeep=100 maxNumLogsToKeep=10 numVersionBuckets=65536
   [junit4]   2> 2090975 INFO  (qtp1498209292-33298) [n:127.0.0.1:62095_solr c:MissingSegmentRecoveryTest s:shard1 r:core_node3 x:MissingSegmentRecoveryTest_shard1_replica_n1] o.a.s.u.CommitTracker Hard AutoCommit: disabled
   [junit4]   2> 2090975 INFO  (qtp1498209292-33298) [n:127.0.0.1:62095_solr c:MissingSegmentRecoveryTest s:shard1 r:core_node3 x:MissingSegmentRecoveryTest_shard1_replica_n1] o.a.s.u.CommitTracker Soft AutoCommit: disabled
   [junit4]   2> 2090980 INFO  (qtp872377123-33308) [n:127.0.0.1:62098_solr c:MissingSegmentRecoveryTest s:shard1 r:core_node4 x:MissingSegmentRecoveryTest_shard1_replica_n2] o.a.s.s.SolrIndexSearcher Opening [Searcher@7a7d7514[MissingSegmentRecoveryTest_shard1_replica_n2] main]
   [junit4]   2> 2090981 INFO  (qtp872377123-33308) [n:127.0.0.1:62098_solr c:MissingSegmentRecoveryTest s:shard1 r:core_node4 x:MissingSegmentRecoveryTest_shard1_replica_n2] o.a.s.r.ManagedResourceStorage Configured ZooKeeperStorageIO with znodeBase: /configs/conf
   [junit4]   2> 2090982 INFO  (qtp872377123-33308) [n:127.0.0.1:62098_solr c:MissingSegmentRecoveryTest s:shard1 r:core_node4 x:MissingSegmentRecoveryTest_shard1_replica_n2] o.a.s.r.ManagedResourceStorage Loaded null at path _rest_managed.json using ZooKeeperStorageIO:path=/configs/conf
   [junit4]   2> 2090982 INFO  (qtp872377123-33308) [n:127.0.0.1:62098_solr c:MissingSegmentRecoveryTest s:shard1 r:core_node4 x:MissingSegmentRecoveryTest_shard1_replica_n2] o.a.s.h.ReplicationHandler Commits will be reserved for 10000ms.
   [junit4]   2> 2090982 INFO  (qtp872377123-33308) [n:127.0.0.1:62098_solr c:MissingSegmentRecoveryTest s:shard1 r:core_node4 x:MissingSegmentRecoveryTest_shard1_replica_n2] o.a.s.u.UpdateLog Could not find max version in index or recent updates, using new clock 1625249300089929728
   [junit4]   2> 2090989 INFO  (qtp872377123-33308) [n:127.0.0.1:62098_solr c:MissingSegmentRecoveryTest s:shard1 r:core_node4 x:MissingSegmentRecoveryTest_shard1_replica_n2] o.a.s.c.ZkShardTerms Successful update of terms at /collections/MissingSegmentRecoveryTest/terms/shard1 to Terms{values={core_node4=0}, version=0}
   [junit4]   2> 2090989 INFO  (qtp872377123-33308) [n:127.0.0.1:62098_solr c:MissingSegmentRecoveryTest s:shard1 r:core_node4 x:MissingSegmentRecoveryTest_shard1_replica_n2] o.a.s.c.ShardLeaderElectionContextBase make sure parent is created /collections/MissingSegmentRecoveryTest/leaders/shard1
   [junit4]   2> 2090993 DEBUG (OverseerStateUpdate-72244370596429832-127.0.0.1:62098_solr-n_0000000000) [n:127.0.0.1:62098_solr    ] o.a.s.c.Overseer processMessage: queueSize: 1, message = {
   [junit4]   2>   "operation":"leader",
   [junit4]   2>   "shard":"shard1",
   [junit4]   2>   "collection":"MissingSegmentRecoveryTest"} current state version: 0
   [junit4]   2> 2090993 INFO  (qtp872377123-33308) [n:127.0.0.1:62098_solr c:MissingSegmentRecoveryTest s:shard1 r:core_node4 x:MissingSegmentRecoveryTest_shard1_replica_n2] o.a.s.c.ShardLeaderElectionContext Waiting until we see more replicas up for shard shard1: total=2 found=1 timeoutin=9999ms
   [junit4]   2> 2090993 INFO  (qtp1498209292-33298) [n:127.0.0.1:62095_solr c:MissingSegmentRecoveryTest s:shard1 r:core_node3 x:MissingSegmentRecoveryTest_shard1_replica_n1] o.a.s.s.SolrIndexSearcher Opening [Searcher@517e1b5d[MissingSegmentRecoveryTest_shard1_replica_n1] main]
   [junit4]   2> 2090995 INFO  (qtp1498209292-33298) [n:127.0.0.1:62095_solr c:MissingSegmentRecoveryTest s:shard1 r:core_node3 x:MissingSegmentRecoveryTest_shard1_replica_n1] o.a.s.r.ManagedResourceStorage Configured ZooKeeperStorageIO with znodeBase: /configs/conf
   [junit4]   2> 2090995 INFO  (qtp1498209292-33298) [n:127.0.0.1:62095_solr c:MissingSegmentRecoveryTest s:shard1 r:core_node3 x:MissingSegmentRecoveryTest_shard1_replica_n1] o.a.s.r.ManagedResourceStorage Loaded null at path _rest_managed.json using ZooKeeperStorageIO:path=/configs/conf
   [junit4]   2> 2090997 INFO  (qtp1498209292-33298) [n:127.0.0.1:62095_solr c:MissingSegmentRecoveryTest s:shard1 r:core_node3 x:MissingSegmentRecoveryTest_shard1_replica_n1] o.a.s.h.ReplicationHandler Commits will be reserved for 10000ms.
   [junit4]   2> 2090997 INFO  (qtp1498209292-33298) [n:127.0.0.1:62095_solr c:MissingSegmentRecoveryTest s:shard1 r:core_node3 x:MissingSegmentRecoveryTest_shard1_replica_n1] o.a.s.u.UpdateLog Could not find max version in index or recent updates, using new clock 1625249300105658368
   [junit4]   2> 2091003 INFO  (qtp1498209292-33298) [n:127.0.0.1:62095_solr c:MissingSegmentRecoveryTest s:shard1 r:core_node3 x:MissingSegmentRecoveryTest_shard1_replica_n1] o.a.s.c.ZkShardTerms Successful update of terms at /collections/MissingSegmentRecoveryTest/terms/shard1 to Terms{values={core_node3=0, core_node4=0}, version=1}
   [junit4]   2> 2091003 INFO  (qtp1498209292-33298) [n:127.0.0.1:62095_solr c:MissingSegmentRecoveryTest s:shard1 r:core_node3 x:MissingSegmentRecoveryTest_shard1_replica_n1] o.a.s.c.ShardLeaderElectionContextBase make sure parent is created /collections/MissingSegmentRecoveryTest/leaders/shard1
   [junit4]   2> 2091005 INFO  (searcherExecutor-10486-thread-1-processing-n:127.0.0.1:62098_solr x:MissingSegmentRecoveryTest_shard1_replica_n2 c:MissingSegmentRecoveryTest s:shard1 r:core_node4) [n:127.0.0.1:62098_solr c:MissingSegmentRecoveryTest s:shard1 r:core

[...truncated too long message...]

Test
   [junit4] OK      4.42s J0 | CloudSolrClientTest.testVersionsAreReturned
   [junit4] OK      5.24s J0 | CloudSolrClientTest.testOverwriteOption
   [junit4] OK      7.30s J0 | CloudSolrClientTest.preferReplicaTypesTest
   [junit4] OK      6.15s J0 | CloudSolrClientTest.testNonRetryableRequests
   [junit4] Completed [1/5] on J0 in 105.30s, 16 tests
   [junit4]
   [junit4] Suite: org.apache.solr.client.solrj.impl.CloudSolrClientTest
   [junit4] OK      17.0s J1 | CloudSolrClientTest.checkCollectionParameters
   [junit4] OK      8.68s J1 | CloudSolrClientTest.testAliasHandling
   [junit4] OK      4.97s J1 | CloudSolrClientTest.testRouting
   [junit4] OK      4.36s J1 | CloudSolrClientTest.testInitializationWithSolrUrls
   [junit4] OK      2.42s J1 | CloudSolrClientTest.testCollectionDoesntExist
   [junit4] OK      2.91s J1 | CloudSolrClientTest.customHttpClientTest
   [junit4] OK      3.62s J1 | CloudSolrClientTest.testParallelUpdateQTime
   [junit4] OK      3.66s J1 | CloudSolrClientTest.stateVersionParamTest
   [junit4] OK      2.85s J1 | CloudSolrClientTest.testShutdown
   [junit4] OK      7.83s J1 | CloudSolrClientTest.testRetryUpdatesWhenClusterStateIsStale
   [junit4] OK      7.85s J1 | CloudSolrClientTest.preferLocalShardsTest
   [junit4] OK      2.22s J1 | CloudSolrClientTest.testWrongZkChrootTest
   [junit4] OK      4.69s J1 | CloudSolrClientTest.testVersionsAreReturned
   [junit4] OK      6.46s J1 | CloudSolrClientTest.testOverwriteOption
   [junit4] OK      7.45s J1 | CloudSolrClientTest.preferReplicaTypesTest
   [junit4] OK      6.13s J1 | CloudSolrClientTest.testNonRetryableRequests
   [junit4] Completed [2/5] on J1 in 105.58s, 16 tests
   [junit4]
   [junit4] Suite: org.apache.solr.client.solrj.impl.CloudSolrClientTest
   [junit4] OK      6.94s J0 | CloudSolrClientTest.checkCollectionParameters
   [junit4] OK      7.11s J0 | CloudSolrClientTest.testAliasHandling
   [junit4] OK      4.63s J0 | CloudSolrClientTest.testRouting
   [junit4] OK      4.36s J0 | CloudSolrClientTest.testInitializationWithSolrUrls
   [junit4] OK      2.39s J0 | CloudSolrClientTest.testCollectionDoesntExist
   [junit4] OK      2.20s J0 | CloudSolrClientTest.customHttpClientTest
   [junit4] OK      4.33s J0 | CloudSolrClientTest.testParallelUpdateQTime
   [junit4] OK      4.36s J0 | CloudSolrClientTest.stateVersionParamTest
   [junit4] OK      3.72s J0 | CloudSolrClientTest.testShutdown
   [junit4] OK      7.43s J0 | CloudSolrClientTest.testRetryUpdatesWhenClusterStateIsStale
   [junit4] OK      6.95s J0 | CloudSolrClientTest.preferLocalShardsTest
   [junit4] OK      1.38s J0 | CloudSolrClientTest.testWrongZkChrootTest
   [junit4] OK      3.44s J0 | CloudSolrClientTest.testVersionsAreReturned
   [junit4] OK      4.73s J0 | CloudSolrClientTest.testOverwriteOption
   [junit4] OK      7.54s J0 | CloudSolrClientTest.preferReplicaTypesTest
   [junit4] OK      6.59s J0 | CloudSolrClientTest.testNonRetryableRequests
   [junit4] Completed [3/5] on J0 in 78.43s, 16 tests
   [junit4]
   [junit4] Suite: org.apache.solr.client.solrj.impl.CloudSolrClientTest
   [junit4] OK      6.01s J1 | CloudSolrClientTest.checkCollectionParameters
   [junit4] OK      7.07s J1 | CloudSolrClientTest.testAliasHandling
   [junit4] OK      4.65s J1 | CloudSolrClientTest.testRouting
   [junit4] OK      4.36s J1 | CloudSolrClientTest.testInitializationWithSolrUrls
   [junit4] OK      3.26s J1 | CloudSolrClientTest.testCollectionDoesntExist
   [junit4] OK      2.00s J1 | CloudSolrClientTest.customHttpClientTest
   [junit4] OK      4.35s J1 | CloudSolrClientTest.testParallelUpdateQTime
   [junit4] OK      4.14s J1 | CloudSolrClientTest.stateVersionParamTest
   [junit4] OK      3.87s J1 | CloudSolrClientTest.testShutdown
   [junit4] OK      7.58s J1 | CloudSolrClientTest.testRetryUpdatesWhenClusterStateIsStale
   [junit4] OK      6.93s J1 | CloudSolrClientTest.preferLocalShardsTest
   [junit4] OK      1.69s J1 | CloudSolrClientTest.testWrongZkChrootTest
   [junit4] OK      3.47s J1 | CloudSolrClientTest.testVersionsAreReturned
   [junit4] OK      4.96s J1 | CloudSolrClientTest.testOverwriteOption
   [junit4] OK      9.09s J1 | CloudSolrClientTest.preferReplicaTypesTest
   [junit4] OK      6.43s J1 | CloudSolrClientTest.testNonRetryableRequests
   [junit4] Completed [4/5] on J1 in 80.15s, 16 tests
   [junit4]
   [junit4] Suite: org.apache.solr.client.solrj.impl.CloudSolrClientTest
   [junit4] OK      5.49s J0 | CloudSolrClientTest.checkCollectionParameters
   [junit4] OK      7.20s J0 | CloudSolrClientTest.testAliasHandling
   [junit4] OK      3.82s J0 | CloudSolrClientTest.testRouting
   [junit4] OK      4.25s J0 | CloudSolrClientTest.testInitializationWithSolrUrls
   [junit4] OK      1.82s J0 | CloudSolrClientTest.testCollectionDoesntExist
   [junit4] OK      2.19s J0 | CloudSolrClientTest.customHttpClientTest
   [junit4] OK      4.18s J0 | CloudSolrClientTest.testParallelUpdateQTime
   [junit4] OK      3.53s J0 | CloudSolrClientTest.stateVersionParamTest
   [junit4] OK      2.75s J0 | CloudSolrClientTest.testShutdown
   [junit4] OK      7.11s J0 | CloudSolrClientTest.testRetryUpdatesWhenClusterStateIsStale
   [junit4] OK      6.90s J0 | CloudSolrClientTest.preferLocalShardsTest
   [junit4] OK      1.69s J0 | CloudSolrClientTest.testWrongZkChrootTest
   [junit4] OK      4.48s J0 | CloudSolrClientTest.testVersionsAreReturned
   [junit4] OK      5.60s J0 | CloudSolrClientTest.testOverwriteOption
   [junit4] OK      6.81s J0 | CloudSolrClientTest.preferReplicaTypesTest
   [junit4] OK      6.28s J0 | CloudSolrClientTest.testNonRetryableRequests
   [junit4] Completed [5/5] on J0 in 74.50s, 16 tests
   [junit4]
   [junit4] JVM J0:     1.69 ..   260.73 =   259.03s
   [junit4] JVM J1:     1.70 ..   188.63 =   186.93s
   [junit4] Execution time total: 4 minutes 20 seconds
   [junit4] Tests summary: 5 suites, 80 tests
   [junit4] Could not remove temporary path: C:\Users\jenkins\workspace\Lucene-Solr-7.x-Windows\solr\build\solr-solrj\test\J1 (java.nio.file.DirectoryNotEmptyException: Remaining files: [C:\Users\jenkins\workspace\Lucene-Solr-7.x-Windows\solr\build\solr-solrj\test\J1\temp])
   [junit4] Could not remove temporary path: C:\Users\jenkins\workspace\Lucene-Solr-7.x-Windows\solr\build\solr-solrj\test\J0 (java.nio.file.DirectoryNotEmptyException: Remaining files: [C:\Users\jenkins\workspace\Lucene-Solr-7.x-Windows\solr\build\solr-solrj\test\J0\temp])
     [echo] 5 slowest tests:
[junit4:tophints] 102.58s | org.apache.solr.client.solrj.impl.CloudSolrClientTest
[junit4:tophints]  58.80s | org.apache.solr.client.solrj.io.stream.StreamDecoratorTest
[junit4:tophints]  41.46s | org.apache.solr.common.cloud.TestCollectionStateWatchers
[junit4:tophints]  39.61s | org.apache.solr.common.cloud.TestCloudCollectionsListeners
[junit4:tophints]  30.49s | org.apache.solr.client.solrj.request.SchemaTest

-check-totals:
WARNING: An illegal reflective access operation has occurred
WARNING: Illegal reflective access by org.codehaus.groovy.reflection.CachedClass (file:/C:/Users/jenkins/.ivy2/cache/org.codehaus.groovy/groovy-all/jars/groovy-all-2.4.15.jar) to method java.lang.Object.finalize()
WARNING: Please consider reporting this to the maintainers of org.codehaus.groovy.reflection.CachedClass
WARNING: Use --illegal-access=warn to enable warnings of further illegal reflective access operations
WARNING: All illegal access operations will be denied in a future release

test-nocompile:

BUILD SUCCESSFUL
Total time: 4 minutes 23 seconds
[repro] Failures:
[repro]   0/5 failed: org.apache.solr.client.solrj.impl.CloudSolrClientTest
[repro]   0/5 failed: org.apache.solr.cloud.MissingSegmentRecoveryTest
[repro]   3/5 failed: org.apache.solr.handler.TestSQLHandler
[repro] Exiting with code 1

C:\Users\jenkins\workspace\Lucene-Solr-7.x-Windows>IF EXIST lucene\build move /y lucene\build lucene\build.repro
        1 dir(s) moved.

C:\Users\jenkins\workspace\Lucene-Solr-7.x-Windows>IF EXIST solr\build move /y solr\build solr\build.repro
        1 dir(s) moved.

C:\Users\jenkins\workspace\Lucene-Solr-7.x-Windows>IF EXIST lucene\build.orig move /y lucene\build.orig lucene\build
        1 dir(s) moved.

C:\Users\jenkins\workspace\Lucene-Solr-7.x-Windows>IF EXIST solr\build.orig move /y solr\build.orig solr\build
        1 dir(s) moved.

C:\Users\jenkins\workspace\Lucene-Solr-7.x-Windows>exit 0
Archiving artifacts
Setting ANT_1_8_2_HOME=C:\Users\jenkins\tools\hudson.tasks.Ant_AntInstallation\ANT_1.8.2
[WARNINGS] Parsing warnings in console log with parser Java Compiler (javac)
Setting ANT_1_8_2_HOME=C:\Users\jenkins\tools\hudson.tasks.Ant_AntInstallation\ANT_1.8.2
No credentials specified
Setting ANT_1_8_2_HOME=C:\Users\jenkins\tools\hudson.tasks.Ant_AntInstallation\ANT_1.8.2
<Git Blamer> Using GitBlamer to create author and commit information for all warnings.
<Git Blamer> GIT_COMMIT=4a1f4380ae25ef38dac071e972f4c056a4e03ac8, workspace=C:\Users\jenkins\workspace\Lucene-Solr-7.x-Windows
[WARNINGS] Computing warning deltas based on reference build #989
Recording test results
Setting ANT_1_8_2_HOME=C:\Users\jenkins\tools\hudson.tasks.Ant_AntInstallation\ANT_1.8.2
Build step 'Publish JUnit test result report' changed build result to UNSTABLE
Email was triggered for: Unstable (Test Failures)
Sending email for trigger: Unstable (Test Failures)
Setting ANT_1_8_2_HOME=C:\Users\jenkins\tools\hudson.tasks.Ant_AntInstallation\ANT_1.8.2
Setting ANT_1_8_2_HOME=C:\Users\jenkins\tools\hudson.tasks.Ant_AntInstallation\ANT_1.8.2
Setting ANT_1_8_2_HOME=C:\Users\jenkins\tools\hudson.tasks.Ant_AntInstallation\ANT_1.8.2
Setting ANT_1_8_2_HOME=C:\Users\jenkins\tools\hudson.tasks.Ant_AntInstallation\ANT_1.8.2
Setting ANT_1_8_2_HOME=C:\Users\jenkins\tools\hudson.tasks.Ant_AntInstallation\ANT_1.8.2
Setting ANT_1_8_2_HOME=C:\Users\jenkins\tools\hudson.tasks.Ant_AntInstallation\ANT_1.8.2


---------------------------------------------------------------------
To unsubscribe, e-mail: [hidden email]
For additional commands, e-mail: [hidden email]
Reply | Threaded
Open this post in threaded view
|

[JENKINS] Lucene-Solr-7.x-Windows (64bit/jdk-10.0.1) - Build # 991 - Failure!

Policeman Jenkins Server-2
Build: https://jenkins.thetaphi.de/job/Lucene-Solr-7.x-Windows/991/
Java: 64bit/jdk-10.0.1 -XX:+UseCompressedOops -XX:+UseParallelGC

All tests passed

Build Log:
[...truncated 15169 lines...]
   [junit4] JVM J0: stdout was not empty, see: C:\Users\jenkins\workspace\Lucene-Solr-7.x-Windows\solr\build\solr-core\test\temp\junit4-J0-20190215_001319_39810030664512006041447.sysout
   [junit4] >>> JVM J0 emitted unexpected output (verbatim) ----
   [junit4] #
   [junit4] # A fatal error has been detected by the Java Runtime Environment:
   [junit4] #
   [junit4] #  EXCEPTION_ACCESS_VIOLATION (0xc0000005) at pc=0x0000000070c1bbff, pid=3740, tid=7804
   [junit4] #
   [junit4] # JRE version: OpenJDK Runtime Environment (10.0.1+10) (build 10.0.1+10)
   [junit4] # Java VM: OpenJDK 64-Bit Server VM (10.0.1+10, mixed mode, tiered, compressed oops, parallel gc, windows-amd64)
   [junit4] # Problematic frame:
   [junit4] # V  [jvm.dll+0x46bbff]
   [junit4] #
   [junit4] # No core dump will be written. Minidumps are not enabled by default on client versions of Windows
   [junit4] #
   [junit4] # An error report file with more information is saved as:
   [junit4] # C:\Users\jenkins\workspace\Lucene-Solr-7.x-Windows\solr\build\solr-core\test\J0\hs_err_pid3740.log
   [junit4] #
   [junit4] # Compiler replay data is saved as:
   [junit4] # C:\Users\jenkins\workspace\Lucene-Solr-7.x-Windows\solr\build\solr-core\test\J0\replay_pid3740.log
   [junit4] #
   [junit4] # If you would like to submit a bug report, please visit:
   [junit4] #   http://bugreport.java.com/bugreport/crash.jsp
   [junit4] #
   [junit4] <<< JVM J0: EOF ----

[...truncated 463 lines...]
   [junit4] ERROR: JVM J0 ended with an exception, command line: C:\Users\jenkins\tools\java\64bit\jdk-10.0.1\bin\java.exe -XX:+UseCompressedOops -XX:+UseParallelGC -XX:+HeapDumpOnOutOfMemoryError -XX:HeapDumpPath=C:\Users\jenkins\workspace\Lucene-Solr-7.x-Windows\heapdumps -ea -esa --illegal-access=deny -Dtests.prefix=tests -Dtests.seed=B4D866EE6D62A5B0 -Xmx512M -Dtests.iters= -Dtests.verbose=false -Dtests.infostream=false -Dtests.codec=random -Dtests.postingsformat=random -Dtests.docvaluesformat=random -Dtests.locale=random -Dtests.timezone=random -Dtests.directory=random -Dtests.linedocsfile=europarl.lines.txt.gz -Dtests.luceneMatchVersion=7.8.0 -Dtests.cleanthreads=perClass -Djava.util.logging.config.file=C:\Users\jenkins\workspace\Lucene-Solr-7.x-Windows\lucene\tools\junit4\logging.properties -Dtests.nightly=false -Dtests.weekly=false -Dtests.monster=false -Dtests.slow=true -Dtests.asserts=true -Dtests.multiplier=1 -DtempDir=./temp -Djava.io.tmpdir=./temp -Dcommon.dir=C:\Users\jenkins\workspace\Lucene-Solr-7.x-Windows\lucene -Dclover.db.dir=C:\Users\jenkins\workspace\Lucene-Solr-7.x-Windows\lucene\build\clover\db -Djava.security.policy=C:\Users\jenkins\workspace\Lucene-Solr-7.x-Windows\lucene\tools\junit4\solr-tests.policy -Dtests.LUCENE_VERSION=7.8.0 -Djetty.testMode=1 -Djetty.insecurerandom=1 -Dsolr.directoryFactory=org.apache.solr.core.MockDirectoryFactory -Djava.awt.headless=true -Djdk.map.althashing.threshold=0 -Dtests.src.home=C:\Users\jenkins\workspace\Lucene-Solr-7.x-Windows -Djava.security.egd=file:/dev/./urandom -Djunit4.childvm.cwd=C:\Users\jenkins\workspace\Lucene-Solr-7.x-Windows\solr\build\solr-core\test\J0 -Djunit4.tempDir=C:\Users\jenkins\workspace\Lucene-Solr-7.x-Windows\solr\build\solr-core\test\temp -Djunit4.childvm.id=0 -Djunit4.childvm.count=2 -Dfile.encoding=ISO-8859-1 -Dtests.disableHdfs=true -Djava.security.manager=org.apache.lucene.util.TestSecurityManager -Dtests.filterstacks=true -Dtests.leaveTemporary=false -Dtests.badapples=false -classpath C:\Users\jenkins\workspace\Lucene-Solr-7.x-Windows\solr\build\solr-core\classes\test;C:\Users\jenkins\workspace\Lucene-Solr-7.x-Windows\solr\build\solr-test-framework\classes\java;C:\Users\jenkins\workspace\Lucene-Solr-7.x-Windows\solr\test-framework\lib\hamcrest-core-1.3.jar;C:\Users\jenkins\workspace\Lucene-Solr-7.x-Windows\solr\test-framework\lib\junit4-ant-2.7.2.jar;C:\Users\jenkins\workspace\Lucene-Solr-7.x-Windows\solr\core\src\test-files;C:\Users\jenkins\workspace\Lucene-Solr-7.x-Windows\lucene\build\test-framework\classes\java;C:\Users\jenkins\workspace\Lucene-Solr-7.x-Windows\lucene\build\codecs\classes\java;C:\Users\jenkins\workspace\Lucene-Solr-7.x-Windows\solr\build\solr-solrj\classes\java;C:\Users\jenkins\workspace\Lucene-Solr-7.x-Windows\solr\build\solr-core\classes\java;C:\Users\jenkins\workspace\Lucene-Solr-7.x-Windows\lucene\build\analysis\common\lucene-analyzers-common-7.8.0-SNAPSHOT.jar;C:\Users\jenkins\workspace\Lucene-Solr-7.x-Windows\lucene\build\analysis\kuromoji\lucene-analyzers-kuromoji-7.8.0-SNAPSHOT.jar;C:\Users\jenkins\workspace\Lucene-Solr-7.x-Windows\lucene\build\analysis\nori\lucene-analyzers-nori-7.8.0-SNAPSHOT.jar;C:\Users\jenkins\workspace\Lucene-Solr-7.x-Windows\lucene\build\analysis\phonetic\lucene-analyzers-phonetic-7.8.0-SNAPSHOT.jar;C:\Users\jenkins\workspace\Lucene-Solr-7.x-Windows\lucene\build\codecs\lucene-codecs-7.8.0-SNAPSHOT.jar;C:\Users\jenkins\workspace\Lucene-Solr-7.x-Windows\lucene\build\backward-codecs\lucene-backward-codecs-7.8.0-SNAPSHOT.jar;C:\Users\jenkins\workspace\Lucene-Solr-7.x-Windows\lucene\build\highlighter\lucene-highlighter-7.8.0-SNAPSHOT.jar;C:\Users\jenkins\workspace\Lucene-Solr-7.x-Windows\lucene\build\memory\lucene-memory-7.8.0-SNAPSHOT.jar;C:\Users\jenkins\workspace\Lucene-Solr-7.x-Windows\lucene\build\misc\lucene-misc-7.8.0-SNAPSHOT.jar;C:\Users\jenkins\workspace\Lucene-Solr-7.x-Windows\lucene\build\spatial-extras\lucene-spatial-extras-7.8.0-SNAPSHOT.jar;C:\Users\jenkins\workspace\Lucene-Solr-7.x-Windows\lucene\build\spatial3d\lucene-spatial3d-7.8.0-SNAPSHOT.jar;C:\Users\jenkins\workspace\Lucene-Solr-7.x-Windows\lucene\build\expressions\lucene-expressions-7.8.0-SNAPSHOT.jar;C:\Users\jenkins\workspace\Lucene-Solr-7.x-Windows\lucene\build\suggest\lucene-suggest-7.8.0-SNAPSHOT.jar;C:\Users\jenkins\workspace\Lucene-Solr-7.x-Windows\lucene\build\grouping\lucene-grouping-7.8.0-SNAPSHOT.jar;C:\Users\jenkins\workspace\Lucene-Solr-7.x-Windows\lucene\build\queries\lucene-queries-7.8.0-SNAPSHOT.jar;C:\Users\jenkins\workspace\Lucene-Solr-7.x-Windows\lucene\build\queryparser\lucene-queryparser-7.8.0-SNAPSHOT.jar;C:\Users\jenkins\workspace\Lucene-Solr-7.x-Windows\lucene\build\join\lucene-join-7.8.0-SNAPSHOT.jar;C:\Users\jenkins\workspace\Lucene-Solr-7.x-Windows\lucene\build\sandbox\lucene-sandbox-7.8.0-SNAPSHOT.jar;C:\Users\jenkins\workspace\Lucene-Solr-7.x-Windows\lucene\build\classification\lucene-classification-7.8.0-SNAPSHOT.jar;C:\Users\jenkins\workspace\Lucene-Solr-7.x-Windows\solr\core\lib\antlr4-runtime-4.5.1-1.jar;C:\Users\jenkins\workspace\Lucene-Solr-7.x-Windows\solr\core\lib\asm-5.1.jar;C:\Users\jenkins\workspace\Lucene-Solr-7.x-Windows\solr\core\lib\asm-commons-5.1.jar;C:\Users\jenkins\workspace\Lucene-Solr-7.x-Windows\solr\core\lib\avatica-core-1.10.0.jar;C:\Users\jenkins\workspace\Lucene-Solr-7.x-Windows\solr\core\lib\caffeine-2.4.0.jar;C:\Users\jenkins\workspace\Lucene-Solr-7.x-Windows\solr\core\lib\calcite-core-1.13.0.jar;C:\Users\jenkins\workspace\Lucene-Solr-7.x-Windows\solr\core\lib\calcite-linq4j-1.13.0.jar;C:\Users\jenkins\workspace\Lucene-Solr-7.x-Windows\solr\core\lib\commons-cli-1.2.jar;C:\Users\jenkins\workspace\Lucene-Solr-7.x-Windows\solr\core\lib\commons-codec-1.11.jar;C:\Users\jenkins\workspace\Lucene-Solr-7.x-Windows\solr\core\lib\commons-collections-3.2.2.jar;C:\Users\jenkins\workspace\Lucene-Solr-7.x-Windows\solr\core\lib\commons-compiler-2.7.6.jar;C:\Users\jenkins\workspace\Lucene-Solr-7.x-Windows\solr\core\lib\commons-configuration-1.6.jar;C:\Users\jenkins\workspace\Lucene-Solr-7.x-Windows\solr\core\lib\commons-exec-1.3.jar;C:\Users\jenkins\workspace\Lucene-Solr-7.x-Windows\solr\core\lib\commons-fileupload-1.3.3.jar;C:\Users\jenkins\workspace\Lucene-Solr-7.x-Windows\solr\core\lib\commons-io-2.5.jar;C:\Users\jenkins\workspace\Lucene-Solr-7.x-Windows\solr\core\lib\commons-lang-2.6.jar;C:\Users\jenkins\workspace\Lucene-Solr-7.x-Windows\solr\core\lib\commons-lang3-3.6.jar;C:\Users\jenkins\workspace\Lucene-Solr-7.x-Windows\solr\core\lib\commons-math3-3.6.1.jar;C:\Users\jenkins\workspace\Lucene-Solr-7.x-Windows\solr\core\lib\curator-client-2.8.0.jar;C:\Users\jenkins\workspace\Lucene-Solr-7.x-Windows\solr\core\lib\curator-framework-2.8.0.jar;C:\Users\jenkins\workspace\Lucene-Solr-7.x-Windows\solr\core\lib\curator-recipes-2.8.0.jar;C:\Users\jenkins\workspace\Lucene-Solr-7.x-Windows\solr\core\lib\disruptor-3.4.0.jar;C:\Users\jenkins\workspace\Lucene-Solr-7.x-Windows\solr\core\lib\dom4j-1.6.1.jar;C:\Users\jenkins\workspace\Lucene-Solr-7.x-Windows\solr\core\lib\eigenbase-properties-1.1.5.jar;C:\Users\jenkins\workspace\Lucene-Solr-7.x-Windows\solr\core\lib\guava-14.0.1.jar;C:\Users\jenkins\workspace\Lucene-Solr-7.x-Windows\solr\core\lib\hadoop-annotations-2.7.4.jar;C:\Users\jenkins\workspace\Lucene-Solr-7.x-Windows\solr\core\lib\hadoop-auth-2.7.4.jar;C:\Users\jenkins\workspace\Lucene-Solr-7.x-Windows\solr\core\lib\hadoop-common-2.7.4.jar;C:\Users\jenkins\workspace\Lucene-Solr-7.x-Windows\solr\core\lib\hadoop-hdfs-2.7.4.jar;C:\Users\jenkins\workspace\Lucene-Solr-7.x-Windows\solr\core\lib\hppc-0.8.1.jar;C:\Users\jenkins\workspace\Lucene-Solr-7.x-Windows\solr\core\lib\htrace-core-3.2.0-incubating.jar;C:\Users\jenkins\workspace\Lucene-Solr-7.x-Windows\solr\core\lib\jackson-annotations-2.9.6.jar;C:\Users\jenkins\workspace\Lucene-Solr-7.x-Windows\solr\core\lib\jackson-core-2.9.6.jar;C:\Users\jenkins\workspace\Lucene-Solr-7.x-Windows\solr\core\lib\jackson-core-asl-1.9.13.jar;C:\Users\jenkins\workspace\Lucene-Solr-7.x-Windows\solr\core\lib\jackson-databind-2.9.6.jar;C:\Users\jenkins\workspace\Lucene-Solr-7.x-Windows\solr\core\lib\jackson-dataformat-smile-2.9.6.jar;C:\Users\jenkins\workspace\Lucene-Solr-7.x-Windows\solr\core\lib\jackson-mapper-asl-1.9.13.jar;C:\Users\jenkins\workspace\Lucene-Solr-7.x-Windows\solr\core\lib\janino-2.7.6.jar;C:\Users\jenkins\workspace\Lucene-Solr-7.x-Windows\solr\core\lib\jcl-over-slf4j-1.7.24.jar;C:\Users\jenkins\workspace\Lucene-Solr-7.x-Windows\solr\core\lib\joda-time-2.2.jar;C:\Users\jenkins\workspace\Lucene-Solr-7.x-Windows\solr\core\lib\log4j-1.2-api-2.11.0.jar;C:\Users\jenkins\workspace\Lucene-Solr-7.x-Windows\solr\core\lib\log4j-api-2.11.0.jar;C:\Users\jenkins\workspace\Lucene-Solr-7.x-Windows\solr\core\lib\log4j-core-2.11.0.jar;C:\Users\jenkins\workspace\Lucene-Solr-7.x-Windows\solr\core\lib\log4j-slf4j-impl-2.11.0.jar;C:\Users\jenkins\workspace\Lucene-Solr-7.x-Windows\solr\core\lib\org.restlet-2.3.0.jar;C:\Users\jenkins\workspace\Lucene-Solr-7.x-Windows\solr\core\lib\org.restlet.ext.servlet-2.3.0.jar;C:\Users\jenkins\workspace\Lucene-Solr-7.x-Windows\solr\core\lib\protobuf-java-3.1.0.jar;C:\Users\jenkins\workspace\Lucene-Solr-7.x-Windows\solr\core\lib\rrd4j-3.2.jar;C:\Users\jenkins\workspace\Lucene-Solr-7.x-Windows\solr\core\lib\spatial4j-0.7.jar;C:\Users\jenkins\workspace\Lucene-Solr-7.x-Windows\solr\core\lib\t-digest-3.1.jar;C:\Users\jenkins\workspace\Lucene-Solr-7.x-Windows\solr\solrj\lib\commons-io-2.5.jar;C:\Users\jenkins\workspace\Lucene-Solr-7.x-Windows\solr\solrj\lib\commons-math3-3.6.1.jar;C:\Users\jenkins\workspace\Lucene-Solr-7.x-Windows\solr\solrj\lib\httpclient-4.5.6.jar;C:\Users\jenkins\workspace\Lucene-Solr-7.x-Windows\solr\solrj\lib\httpcore-4.4.10.jar;C:\Users\jenkins\workspace\Lucene-Solr-7.x-Windows\solr\solrj\lib\httpmime-4.5.6.jar;C:\Users\jenkins\workspace\Lucene-Solr-7.x-Windows\solr\solrj\lib\jcl-over-slf4j-1.7.24.jar;C:\Users\jenkins\workspace\Lucene-Solr-7.x-Windows\solr\solrj\lib\noggit-0.8.jar;C:\Users\jenkins\workspace\Lucene-Solr-7.x-Windows\solr\solrj\lib\slf4j-api-1.7.24.jar;C:\Users\jenkins\workspace\Lucene-Solr-7.x-Windows\solr\solrj\lib\stax2-api-3.1.4.jar;C:\Users\jenkins\workspace\Lucene-Solr-7.x-Windows\solr\solrj\lib\woodstox-core-asl-4.4.1.jar;C:\Users\jenkins\workspace\Lucene-Solr-7.x-Windows\solr\solrj\lib\zookeeper-3.4.13.jar;C:\Users\jenkins\workspace\Lucene-Solr-7.x-Windows\solr\server\lib\gmetric4j-1.0.7.jar;C:\Users\jenkins\workspace\Lucene-Solr-7.x-Windows\solr\server\lib\javax.servlet-api-3.1.0.jar;C:\Users\jenkins\workspace\Lucene-Solr-7.x-Windows\solr\server\lib\jetty-continuation-9.4.14.v20181114.jar;C:\Users\jenkins\workspace\Lucene-Solr-7.x-Windows\solr\server\lib\jetty-deploy-9.4.14.v20181114.jar;C:\Users\jenkins\workspace\Lucene-Solr-7.x-Windows\solr\server\lib\jetty-http-9.4.14.v20181114.jar;C:\Users\jenkins\workspace\Lucene-Solr-7.x-Windows\solr\server\lib\jetty-io-9.4.14.v20181114.jar;C:\Users\jenkins\workspace\Lucene-Solr-7.x-Windows\solr\server\lib\jetty-jmx-9.4.14.v20181114.jar;C:\Users\jenkins\workspace\Lucene-Solr-7.x-Windows\solr\server\lib\jetty-rewrite-9.4.14.v20181114.jar;C:\Users\jenkins\workspace\Lucene-Solr-7.x-Windows\solr\server\lib\jetty-security-9.4.14.v20181114.jar;C:\Users\jenkins\workspace\Lucene-Solr-7.x-Windows\solr\server\lib\jetty-server-9.4.14.v20181114.jar;C:\Users\jenkins\workspace\Lucene-Solr-7.x-Windows\solr\server\lib\jetty-servlet-9.4.14.v20181114.jar;C:\Users\jenkins\workspace\Lucene-Solr-7.x-Windows\solr\server\lib\jetty-servlets-9.4.14.v20181114.jar;C:\Users\jenkins\workspace\Lucene-Solr-7.x-Windows\solr\server\lib\jetty-util-9.4.14.v20181114.jar;C:\Users\jenkins\workspace\Lucene-Solr-7.x-Windows\solr\server\lib\jetty-webapp-9.4.14.v20181114.jar;C:\Users\jenkins\workspace\Lucene-Solr-7.x-Windows\solr\server\lib\jetty-xml-9.4.14.v20181114.jar;C:\Users\jenkins\workspace\Lucene-Solr-7.x-Windows\solr\server\lib\metrics-core-3.2.6.jar;C:\Users\jenkins\workspace\Lucene-Solr-7.x-Windows\solr\server\lib\metrics-ganglia-3.2.6.jar;C:\Users\jenkins\workspace\Lucene-Solr-7.x-Windows\solr\server\lib\metrics-graphite-3.2.6.jar;C:\Users\jenkins\workspace\Lucene-Solr-7.x-Windows\solr\server\lib\metrics-jetty9-3.2.6.jar;C:\Users\jenkins\workspace\Lucene-Solr-7.x-Windows\solr\server\lib\metrics-jvm-3.2.6.jar;C:\Users\jenkins\workspace\Lucene-Solr-7.x-Windows\solr\example\example-DIH\solr\db\lib\derby-10.9.1.0.jar;C:\Users\jenkins\workspace\Lucene-Solr-7.x-Windows\solr\example\example-DIH\solr\db\lib\hsqldb-2.4.0.jar;C:\Users\jenkins\workspace\Lucene-Solr-7.x-Windows\lucene\build\core\classes\java;C:\Users\jenkins\workspace\Lucene-Solr-7.x-Windows\lucene\test-framework\lib\hamcrest-core-1.3.jar;C:\Users\jenkins\workspace\Lucene-Solr-7.x-Windows\lucene\test-framework\lib\junit-4.12.jar;C:\Users\jenkins\workspace\Lucene-Solr-7.x-Windows\lucene\test-framework\lib\randomizedtesting-runner-2.7.2.jar;C:\Users\jenkins\workspace\Lucene-Solr-7.x-Windows\solr\core\test-lib\antlr-2.7.7.jar;C:\Users\jenkins\workspace\Lucene-Solr-7.x-Windows\solr\core\test-lib\antlr4-runtime-4.5.1-1.jar;C:\Users\jenkins\workspace\Lucene-Solr-7.x-Windows\solr\core\test-lib\apacheds-core-2.0.0-M15.jar;C:\Users\jenkins\workspace\Lucene-Solr-7.x-Windows\solr\core\test-lib\apacheds-core-api-2.0.0-M15.jar;C:\Users\jenkins\workspace\Lucene-Solr-7.x-Windows\solr\core\test-lib\apacheds-core-avl-2.0.0-M15.jar;C:\Users\jenkins\workspace\Lucene-Solr-7.x-Windows\solr\core\test-lib\apacheds-core-shared-2.0.0-M15.jar;C:\Users\jenkins\workspace\Lucene-Solr-7.x-Windows\solr\core\test-lib\apacheds-i18n-2.0.0-M15.jar;C:\Users\jenkins\workspace\Lucene-Solr-7.x-Windows\solr\core\test-lib\apacheds-interceptor-kerberos-2.0.0-M15.jar;C:\Users\jenkins\workspace\Lucene-Solr-7.x-Windows\solr\core\test-lib\apacheds-interceptors-admin-2.0.0-M15.jar;C:\Users\jenkins\workspace\Lucene-Solr-7.x-Windows\solr\core\test-lib\apacheds-interceptors-authn-2.0.0-M15.jar;C:\Users\jenkins\workspace\Lucene-Solr-7.x-Windows\solr\core\test-lib\apacheds-interceptors-authz-2.0.0-M15.jar;C:\Users\jenkins\workspace\Lucene-Solr-7.x-Windows\solr\core\test-lib\apacheds-interceptors-changelog-2.0.0-M15.jar;C:\Users\jenkins\workspace\Lucene-Solr-7.x-Windows\solr\core\test-lib\apacheds-interceptors-collective-2.0.0-M15.jar;C:\Users\jenkins\workspace\Lucene-Solr-7.x-Windows\solr\core\test-lib\apacheds-interceptors-event-2.0.0-M15.jar;C:\Users\jenkins\workspace\Lucene-Solr-7.x-Windows\solr\core\test-lib\apacheds-interceptors-exception-2.0.0-M15.jar;C:\Users\jenkins\workspace\Lucene-Solr-7.x-Windows\solr\core\test-lib\apacheds-interceptors-journal-2.0.0-M15.jar;C:\Users\jenkins\workspace\Lucene-Solr-7.x-Windows\solr\core\test-lib\apacheds-interceptors-normalization-2.0.0-M15.jar;C:\Users\jenkins\workspace\Lucene-Solr-7.x-Windows\solr\core\test-lib\apacheds-interceptors-operational-2.0.0-M15.jar;C:\Users\jenkins\workspace\Lucene-Solr-7.x-Windows\solr\core\test-lib\apacheds-interceptors-referral-2.0.0-M15.jar;C:\Users\jenkins\workspace\Lucene-Solr-7.x-Windows\solr\core\test-lib\apacheds-interceptors-schema-2.0.0-M15.jar;C:\Users\jenkins\workspace\Lucene-Solr-7.x-Windows\solr\core\test-lib\apacheds-interceptors-subtree-2.0.0-M15.jar;C:\Users\jenkins\workspace\Lucene-Solr-7.x-Windows\solr\core\test-lib\apacheds-interceptors-trigger-2.0.0-M15.jar;C:\Users\jenkins\workspace\Lucene-Solr-7.x-Windows\solr\core\test-lib\apacheds-jdbm-partition-2.0.0-M15.jar;C:\Users\jenkins\workspace\Lucene-Solr-7.x-Windows\solr\core\test-lib\apacheds-jdbm1-2.0.0-M2.jar;C:\Users\jenkins\workspace\Lucene-Solr-7.x-Windows\solr\core\test-lib\apacheds-kerberos-codec-2.0.0-M15.jar;C:\Users\jenkins\workspace\Lucene-Solr-7.x-Windows\solr\core\test-lib\apacheds-ldif-partition-2.0.0-M15.jar;C:\Users\jenkins\workspace\Lucene-Solr-7.x-Windows\solr\core\test-lib\apacheds-mavibot-partition-2.0.0-M15.jar;C:\Users\jenkins\workspace\Lucene-Solr-7.x-Windows\solr\core\test-lib\apacheds-protocol-kerberos-2.0.0-M15.jar;C:\Users\jenkins\workspace\Lucene-Solr-7.x-Windows\solr\core\test-lib\apacheds-protocol-ldap-2.0.0-M15.jar;C:\Users\jenkins\workspace\Lucene-Solr-7.x-Windows\solr\core\test-lib\apacheds-protocol-shared-2.0.0-M15.jar;C:\Users\jenkins\workspace\Lucene-Solr-7.x-Windows\solr\core\test-lib\apacheds-xdbm-partition-2.0.0-M15.jar;C:\Users\jenkins\workspace\Lucene-Solr-7.x-Windows\solr\core\test-lib\api-all-1.0.0-M20.jar;C:\Users\jenkins\workspace\Lucene-Solr-7.x-Windows\solr\core\test-lib\bcprov-jdk15on-1.60.jar;C:\Users\jenkins\workspace\Lucene-Solr-7.x-Windows\solr\core\test-lib\byte-buddy-1.9.3.jar;C:\Users\jenkins\workspace\Lucene-Solr-7.x-Windows\solr\core\test-lib\commons-collections-3.2.2.jar;C:\Users\jenkins\workspace\Lucene-Solr-7.x-Windows\solr\core\test-lib\ehcache-core-2.4.4.jar;C:\Users\jenkins\workspace\Lucene-Solr-7.x-Windows\solr\core\test-lib\hadoop-common-2.7.4-tests.jar;C:\Users\jenkins\workspace\Lucene-Solr-7.x-Windows\solr\core\test-lib\hadoop-hdfs-2.7.4-tests.jar;C:\Users\jenkins\workspace\Lucene-Solr-7.x-Windows\solr\core\test-lib\hadoop-minikdc-2.7.4.jar;C:\Users\jenkins\workspace\Lucene-Solr-7.x-Windows\solr\core\test-lib\htrace-core-3.2.0-incubating.jar;C:\Users\jenkins\workspace\Lucene-Solr-7.x-Windows\solr\core\test-lib\jersey-core-1.9.jar;C:\Users\jenkins\workspace\Lucene-Solr-7.x-Windows\solr\core\test-lib\jersey-server-1.9.jar;C:\Users\jenkins\workspace\Lucene-Solr-7.x-Windows\solr\core\test-lib\jetty-6.1.26.jar;C:\Users\jenkins\workspace\Lucene-Solr-7.x-Windows\solr\core\test-lib\jetty-sslengine-6.1.26.jar;C:\Users\jenkins\workspace\Lucene-Solr-7.x-Windows\solr\core\test-lib\jetty-util-6.1.26.jar;C:\Users\jenkins\workspace\Lucene-Solr-7.x-Windows\solr\core\test-lib\mina-core-2.0.0-M5.jar;C:\Users\jenkins\workspace\Lucene-Solr-7.x-Windows\solr\core\test-lib\mockito-core-2.23.4.jar;C:\Users\jenkins\workspace\Lucene-Solr-7.x-Windows\solr\core\test-lib\netty-all-4.0.36.Final.jar;C:\Users\jenkins\workspace\Lucene-Solr-7.x-Windows\solr\core\test-lib\objenesis-2.6.jar;C:\Users\jenkins\workspace\Lucene-Solr-7.x-Windows\lucene\build\analysis\icu\lucene-analyzers-icu-7.8.0-SNAPSHOT.jar;C:\Users\jenkins\workspace\Lucene-Solr-7.x-Windows\solr\build\contrib\solr-analysis-extras\classes\java;C:\Users\jenkins\workspace\Lucene-Solr-7.x-Windows\lucene\build\queryparser\classes\test;C:\Users\jenkins\workspace\Lucene-Solr-7.x-Windows\lucene\build\backward-codecs\classes\test;C:\Users\jenkins\workspace\Lucene-Solr-7.x-Windows\solr\contrib\analysis-extras\lib\icu4j-62.1.jar;C:\Users\jenkins\tools\hudson.tasks.Ant_AntInstallation\ANT_1.8.2\lib\ant-launcher.jar;C:\Users\jenkins\.ant\lib\ivy-2.4.0.jar;C:\Users\jenkins\tools\hudson.tasks.Ant_AntInstallation\ANT_1.8.2\lib\ant-antlr.jar;C:\Users\jenkins\tools\hudson.tasks.Ant_AntInstallation\ANT_1.8.2\lib\ant-apache-bcel.jar;C:\Users\jenkins\tools\hudson.tasks.Ant_AntInstallation\ANT_1.8.2\lib\ant-apache-bsf.jar;C:\Users\jenkins\tools\hudson.tasks.Ant_AntInstallation\ANT_1.8.2\lib\ant-apache-log4j.jar;C:\Users\jenkins\tools\hudson.tasks.Ant_AntInstallation\ANT_1.8.2\lib\ant-apache-oro.jar;C:\Users\jenkins\tools\hudson.tasks.Ant_AntInstallation\ANT_1.8.2\lib\ant-apache-regexp.jar;C:\Users\jenkins\tools\hudson.tasks.Ant_AntInstallation\ANT_1.8.2\lib\ant-apache-resolver.jar;C:\Users\jenkins\tools\hudson.tasks.Ant_AntInstallation\ANT_1.8.2\lib\ant-apache-xalan2.jar;C:\Users\jenkins\tools\hudson.tasks.Ant_AntInstallation\ANT_1.8.2\lib\ant-commons-logging.jar;C:\Users\jenkins\tools\hudson.tasks.Ant_AntInstallation\ANT_1.8.2\lib\ant-commons-net.jar;C:\Users\jenkins\tools\hudson.tasks.Ant_AntInstallation\ANT_1.8.2\lib\ant-jai.jar;C:\Users\jenkins\tools\hudson.tasks.Ant_AntInstallation\ANT_1.8.2\lib\ant-javamail.jar;C:\Users\jenkins\tools\hudson.tasks.Ant_AntInstallation\ANT_1.8.2\lib\ant-jdepend.jar;C:\Users\jenkins\tools\hudson.tasks.Ant_AntInstallation\ANT_1.8.2\lib\ant-jmf.jar;C:\Users\jenkins\tools\hudson.tasks.Ant_AntInstallation\ANT_1.8.2\lib\ant-jsch.jar;C:\Users\jenkins\tools\hudson.tasks.Ant_AntInstallation\ANT_1.8.2\lib\ant-junit.jar;C:\Users\jenkins\tools\hudson.tasks.Ant_AntInstallation\ANT_1.8.2\lib\ant-junit4.jar;C:\Users\jenkins\tools\hudson.tasks.Ant_AntInstallation\ANT_1.8.2\lib\ant-netrexx.jar;C:\Users\jenkins\tools\hudson.tasks.Ant_AntInstallation\ANT_1.8.2\lib\ant-swing.jar;C:\Users\jenkins\tools\hudson.tasks.Ant_AntInstallation\ANT_1.8.2\lib\ant-testutil.jar;C:\Users\jenkins\tools\hudson.tasks.Ant_AntInstallation\ANT_1.8.2\lib\ant.jar;C:\Users\jenkins\.ivy2\cache\com.carrotsearch.randomizedtesting\junit4-ant\jars\junit4-ant-2.7.2.jar com.carrotsearch.ant.tasks.junit4.slave.SlaveMainSafe -eventsfile C:\Users\jenkins\workspace\Lucene-Solr-7.x-Windows\solr\build\solr-core\test\temp\junit4-J0-20190215_001319_3984959866790598530985.events @C:\Users\jenkins\workspace\Lucene-Solr-7.x-Windows\solr\build\solr-core\test\temp\junit4-J0-20190215_001319_3985103803535989243177.suites -stdin
   [junit4] ERROR: JVM J0 ended with an exception: Forked process returned with error code: 1. Very likely a JVM crash.  See process stdout at: C:\Users\jenkins\workspace\Lucene-Solr-7.x-Windows\solr\build\solr-core\test\temp\junit4-J0-20190215_001319_39810030664512006041447.sysout
   [junit4] at com.carrotsearch.ant.tasks.junit4.JUnit4.executeSlave(JUnit4.java:1542)
   [junit4] at com.carrotsearch.ant.tasks.junit4.JUnit4.access$000(JUnit4.java:123)
   [junit4] at com.carrotsearch.ant.tasks.junit4.JUnit4$2.call(JUnit4.java:997)
   [junit4] at com.carrotsearch.ant.tasks.junit4.JUnit4$2.call(JUnit4.java:994)
   [junit4] at java.base/java.util.concurrent.FutureTask.run(FutureTask.java:264)
   [junit4] at java.base/java.util.concurrent.ThreadPoolExecutor.runWorker(ThreadPoolExecutor.java:1135)
   [junit4] at java.base/java.util.concurrent.ThreadPoolExecutor$Worker.run(ThreadPoolExecutor.java:635)
   [junit4] at java.base/java.lang.Thread.run(Thread.java:844)

BUILD FAILED
C:\Users\jenkins\workspace\Lucene-Solr-7.x-Windows\build.xml:633: The following error occurred while executing this line:
C:\Users\jenkins\workspace\Lucene-Solr-7.x-Windows\build.xml:577: The following error occurred while executing this line:
C:\Users\jenkins\workspace\Lucene-Solr-7.x-Windows\build.xml:59: The following error occurred while executing this line:
C:\Users\jenkins\workspace\Lucene-Solr-7.x-Windows\solr\build.xml:267: The following error occurred while executing this line:
C:\Users\jenkins\workspace\Lucene-Solr-7.x-Windows\solr\common-build.xml:558: The following error occurred while executing this line:
C:\Users\jenkins\workspace\Lucene-Solr-7.x-Windows\lucene\common-build.xml:1572: The following error occurred while executing this line:
C:\Users\jenkins\workspace\Lucene-Solr-7.x-Windows\lucene\common-build.xml:1099: At least one slave process threw an exception, first: Forked process returned with error code: 1. Very likely a JVM crash.  See process stdout at: C:\Users\jenkins\workspace\Lucene-Solr-7.x-Windows\solr\build\solr-core\test\temp\junit4-J0-20190215_001319_39810030664512006041447.sysout

Total time: 77 minutes 51 seconds
Build step 'Invoke Ant' marked build as failure
Archiving artifacts
Setting ANT_1_8_2_HOME=C:\Users\jenkins\tools\hudson.tasks.Ant_AntInstallation\ANT_1.8.2
[WARNINGS] Skipping publisher since build result is FAILURE
Recording test results
Setting ANT_1_8_2_HOME=C:\Users\jenkins\tools\hudson.tasks.Ant_AntInstallation\ANT_1.8.2
Email was triggered for: Failure - Any
Sending email for trigger: Failure - Any
Setting ANT_1_8_2_HOME=C:\Users\jenkins\tools\hudson.tasks.Ant_AntInstallation\ANT_1.8.2
Setting ANT_1_8_2_HOME=C:\Users\jenkins\tools\hudson.tasks.Ant_AntInstallation\ANT_1.8.2
Setting ANT_1_8_2_HOME=C:\Users\jenkins\tools\hudson.tasks.Ant_AntInstallation\ANT_1.8.2
Setting ANT_1_8_2_HOME=C:\Users\jenkins\tools\hudson.tasks.Ant_AntInstallation\ANT_1.8.2
Setting ANT_1_8_2_HOME=C:\Users\jenkins\tools\hudson.tasks.Ant_AntInstallation\ANT_1.8.2
Setting ANT_1_8_2_HOME=C:\Users\jenkins\tools\hudson.tasks.Ant_AntInstallation\ANT_1.8.2


---------------------------------------------------------------------
To unsubscribe, e-mail: [hidden email]
For additional commands, e-mail: [hidden email]