[JENKINS] Lucene-Solr-8.x-Linux (64bit/jdk-12) - Build # 412 - Unstable!

classic Classic list List threaded Threaded
1 message Options
Reply | Threaded
Open this post in threaded view
|

[JENKINS] Lucene-Solr-8.x-Linux (64bit/jdk-12) - Build # 412 - Unstable!

Policeman Jenkins Server-2
Build: https://jenkins.thetaphi.de/job/Lucene-Solr-8.x-Linux/412/
Java: 64bit/jdk-12 -XX:-UseCompressedOops -XX:+UseConcMarkSweepGC

2 tests failed.
FAILED:  org.apache.solr.client.solrj.io.stream.MathExpressionTest.testGammaDistribution

Error Message:
0.8700499347432092 0.8796210753435566

Stack Trace:
java.lang.AssertionError: 0.8700499347432092 0.8796210753435566
        at __randomizedtesting.SeedInfo.seed([A509BC20D62CA5C7:9873978EF5540FD0]:0)
        at org.junit.Assert.fail(Assert.java:88)
        at org.junit.Assert.assertTrue(Assert.java:41)
        at org.apache.solr.client.solrj.io.stream.MathExpressionTest.testGammaDistribution(MathExpressionTest.java:4590)
        at java.base/jdk.internal.reflect.NativeMethodAccessorImpl.invoke0(Native Method)
        at java.base/jdk.internal.reflect.NativeMethodAccessorImpl.invoke(NativeMethodAccessorImpl.java:62)
        at java.base/jdk.internal.reflect.DelegatingMethodAccessorImpl.invoke(DelegatingMethodAccessorImpl.java:43)
        at java.base/java.lang.reflect.Method.invoke(Method.java:567)
        at com.carrotsearch.randomizedtesting.RandomizedRunner.invoke(RandomizedRunner.java:1750)
        at com.carrotsearch.randomizedtesting.RandomizedRunner$8.evaluate(RandomizedRunner.java:938)
        at com.carrotsearch.randomizedtesting.RandomizedRunner$9.evaluate(RandomizedRunner.java:974)
        at com.carrotsearch.randomizedtesting.RandomizedRunner$10.evaluate(RandomizedRunner.java:988)
        at com.carrotsearch.randomizedtesting.rules.SystemPropertiesRestoreRule$1.evaluate(SystemPropertiesRestoreRule.java:57)
        at org.apache.lucene.util.TestRuleSetupTeardownChained$1.evaluate(TestRuleSetupTeardownChained.java:49)
        at org.apache.lucene.util.AbstractBeforeAfterRule$1.evaluate(AbstractBeforeAfterRule.java:45)
        at org.apache.lucene.util.TestRuleThreadAndTestName$1.evaluate(TestRuleThreadAndTestName.java:48)
        at org.apache.lucene.util.TestRuleIgnoreAfterMaxFailures$1.evaluate(TestRuleIgnoreAfterMaxFailures.java:64)
        at org.apache.lucene.util.TestRuleMarkFailure$1.evaluate(TestRuleMarkFailure.java:47)
        at com.carrotsearch.randomizedtesting.rules.StatementAdapter.evaluate(StatementAdapter.java:36)
        at com.carrotsearch.randomizedtesting.ThreadLeakControl$StatementRunner.run(ThreadLeakControl.java:368)
        at com.carrotsearch.randomizedtesting.ThreadLeakControl.forkTimeoutingTask(ThreadLeakControl.java:817)
        at com.carrotsearch.randomizedtesting.ThreadLeakControl$3.evaluate(ThreadLeakControl.java:468)
        at com.carrotsearch.randomizedtesting.RandomizedRunner.runSingleTest(RandomizedRunner.java:947)
        at com.carrotsearch.randomizedtesting.RandomizedRunner$5.evaluate(RandomizedRunner.java:832)
        at com.carrotsearch.randomizedtesting.RandomizedRunner$6.evaluate(RandomizedRunner.java:883)
        at com.carrotsearch.randomizedtesting.RandomizedRunner$7.evaluate(RandomizedRunner.java:894)
        at com.carrotsearch.randomizedtesting.rules.StatementAdapter.evaluate(StatementAdapter.java:36)
        at com.carrotsearch.randomizedtesting.rules.SystemPropertiesRestoreRule$1.evaluate(SystemPropertiesRestoreRule.java:57)
        at org.apache.lucene.util.AbstractBeforeAfterRule$1.evaluate(AbstractBeforeAfterRule.java:45)
        at com.carrotsearch.randomizedtesting.rules.StatementAdapter.evaluate(StatementAdapter.java:36)
        at org.apache.lucene.util.TestRuleStoreClassName$1.evaluate(TestRuleStoreClassName.java:41)
        at com.carrotsearch.randomizedtesting.rules.NoShadowingOrOverridesOnMethodsRule$1.evaluate(NoShadowingOrOverridesOnMethodsRule.java:40)
        at com.carrotsearch.randomizedtesting.rules.NoShadowingOrOverridesOnMethodsRule$1.evaluate(NoShadowingOrOverridesOnMethodsRule.java:40)
        at com.carrotsearch.randomizedtesting.rules.StatementAdapter.evaluate(StatementAdapter.java:36)
        at com.carrotsearch.randomizedtesting.rules.StatementAdapter.evaluate(StatementAdapter.java:36)
        at org.apache.lucene.util.TestRuleAssertionsRequired$1.evaluate(TestRuleAssertionsRequired.java:53)
        at org.apache.lucene.util.TestRuleMarkFailure$1.evaluate(TestRuleMarkFailure.java:47)
        at org.apache.lucene.util.TestRuleIgnoreAfterMaxFailures$1.evaluate(TestRuleIgnoreAfterMaxFailures.java:64)
        at org.apache.lucene.util.TestRuleIgnoreTestSuites$1.evaluate(TestRuleIgnoreTestSuites.java:54)
        at com.carrotsearch.randomizedtesting.rules.StatementAdapter.evaluate(StatementAdapter.java:36)
        at com.carrotsearch.randomizedtesting.ThreadLeakControl$StatementRunner.run(ThreadLeakControl.java:368)
        at java.base/java.lang.Thread.run(Thread.java:835)


FAILED:  org.apache.solr.client.solrj.io.stream.StreamDecoratorTest.testParallelTerminatingDaemonUpdateStream

Error Message:
Failed while waiting for active collection Timeout waiting to see state for collection=parallelDestinationCollection1 :null Live Nodes: [127.0.0.1:35027_solr, 127.0.0.1:39337_solr, 127.0.0.1:42103_solr, 127.0.0.1:44467_solr] Last available state: null

Stack Trace:
java.lang.RuntimeException: Failed while waiting for active collection
Timeout waiting to see state for collection=parallelDestinationCollection1 :null
Live Nodes: [127.0.0.1:35027_solr, 127.0.0.1:39337_solr, 127.0.0.1:42103_solr, 127.0.0.1:44467_solr]
Last available state: null
        at __randomizedtesting.SeedInfo.seed([A509BC20D62CA5C7:546D644882466AD9]:0)
        at org.apache.solr.cloud.MiniSolrCloudCluster.waitForActiveCollection(MiniSolrCloudCluster.java:758)
        at org.apache.solr.cloud.MiniSolrCloudCluster.waitForActiveCollection(MiniSolrCloudCluster.java:764)
        at org.apache.solr.client.solrj.io.stream.StreamDecoratorTest.testParallelTerminatingDaemonUpdateStream(StreamDecoratorTest.java:3049)
        at java.base/jdk.internal.reflect.NativeMethodAccessorImpl.invoke0(Native Method)
        at java.base/jdk.internal.reflect.NativeMethodAccessorImpl.invoke(NativeMethodAccessorImpl.java:62)
        at java.base/jdk.internal.reflect.DelegatingMethodAccessorImpl.invoke(DelegatingMethodAccessorImpl.java:43)
        at java.base/java.lang.reflect.Method.invoke(Method.java:567)
        at com.carrotsearch.randomizedtesting.RandomizedRunner.invoke(RandomizedRunner.java:1750)
        at com.carrotsearch.randomizedtesting.RandomizedRunner$8.evaluate(RandomizedRunner.java:938)
        at com.carrotsearch.randomizedtesting.RandomizedRunner$9.evaluate(RandomizedRunner.java:974)
        at com.carrotsearch.randomizedtesting.RandomizedRunner$10.evaluate(RandomizedRunner.java:988)
        at com.carrotsearch.randomizedtesting.rules.SystemPropertiesRestoreRule$1.evaluate(SystemPropertiesRestoreRule.java:57)
        at org.apache.lucene.util.TestRuleSetupTeardownChained$1.evaluate(TestRuleSetupTeardownChained.java:49)
        at org.apache.lucene.util.AbstractBeforeAfterRule$1.evaluate(AbstractBeforeAfterRule.java:45)
        at org.apache.lucene.util.TestRuleThreadAndTestName$1.evaluate(TestRuleThreadAndTestName.java:48)
        at org.apache.lucene.util.TestRuleIgnoreAfterMaxFailures$1.evaluate(TestRuleIgnoreAfterMaxFailures.java:64)
        at org.apache.lucene.util.TestRuleMarkFailure$1.evaluate(TestRuleMarkFailure.java:47)
        at com.carrotsearch.randomizedtesting.rules.StatementAdapter.evaluate(StatementAdapter.java:36)
        at com.carrotsearch.randomizedtesting.ThreadLeakControl$StatementRunner.run(ThreadLeakControl.java:368)
        at com.carrotsearch.randomizedtesting.ThreadLeakControl.forkTimeoutingTask(ThreadLeakControl.java:817)
        at com.carrotsearch.randomizedtesting.ThreadLeakControl$3.evaluate(ThreadLeakControl.java:468)
        at com.carrotsearch.randomizedtesting.RandomizedRunner.runSingleTest(RandomizedRunner.java:947)
        at com.carrotsearch.randomizedtesting.RandomizedRunner$5.evaluate(RandomizedRunner.java:832)
        at com.carrotsearch.randomizedtesting.RandomizedRunner$6.evaluate(RandomizedRunner.java:883)
        at com.carrotsearch.randomizedtesting.RandomizedRunner$7.evaluate(RandomizedRunner.java:894)
        at com.carrotsearch.randomizedtesting.rules.StatementAdapter.evaluate(StatementAdapter.java:36)
        at com.carrotsearch.randomizedtesting.rules.SystemPropertiesRestoreRule$1.evaluate(SystemPropertiesRestoreRule.java:57)
        at org.apache.lucene.util.AbstractBeforeAfterRule$1.evaluate(AbstractBeforeAfterRule.java:45)
        at com.carrotsearch.randomizedtesting.rules.StatementAdapter.evaluate(StatementAdapter.java:36)
        at org.apache.lucene.util.TestRuleStoreClassName$1.evaluate(TestRuleStoreClassName.java:41)
        at com.carrotsearch.randomizedtesting.rules.NoShadowingOrOverridesOnMethodsRule$1.evaluate(NoShadowingOrOverridesOnMethodsRule.java:40)
        at com.carrotsearch.randomizedtesting.rules.NoShadowingOrOverridesOnMethodsRule$1.evaluate(NoShadowingOrOverridesOnMethodsRule.java:40)
        at com.carrotsearch.randomizedtesting.rules.StatementAdapter.evaluate(StatementAdapter.java:36)
        at com.carrotsearch.randomizedtesting.rules.StatementAdapter.evaluate(StatementAdapter.java:36)
        at org.apache.lucene.util.TestRuleAssertionsRequired$1.evaluate(TestRuleAssertionsRequired.java:53)
        at org.apache.lucene.util.TestRuleMarkFailure$1.evaluate(TestRuleMarkFailure.java:47)
        at org.apache.lucene.util.TestRuleIgnoreAfterMaxFailures$1.evaluate(TestRuleIgnoreAfterMaxFailures.java:64)
        at org.apache.lucene.util.TestRuleIgnoreTestSuites$1.evaluate(TestRuleIgnoreTestSuites.java:54)
        at com.carrotsearch.randomizedtesting.rules.StatementAdapter.evaluate(StatementAdapter.java:36)
        at com.carrotsearch.randomizedtesting.ThreadLeakControl$StatementRunner.run(ThreadLeakControl.java:368)
        at java.base/java.lang.Thread.run(Thread.java:835)




Build Log:
[...truncated 2078 lines...]
   [junit4] JVM J2: stderr was not empty, see: /home/jenkins/workspace/Lucene-Solr-8.x-Linux/lucene/build/core/test/temp/junit4-J2-20190416_185420_7129700394936436421864.syserr
   [junit4] >>> JVM J2 emitted unexpected output (verbatim) ----
   [junit4] OpenJDK 64-Bit Server VM warning: Option UseConcMarkSweepGC was deprecated in version 9.0 and will likely be removed in a future release.
   [junit4] <<< JVM J2: EOF ----

[...truncated 5 lines...]
   [junit4] JVM J0: stderr was not empty, see: /home/jenkins/workspace/Lucene-Solr-8.x-Linux/lucene/build/core/test/temp/junit4-J0-20190416_185420_71511564207324577026920.syserr
   [junit4] >>> JVM J0 emitted unexpected output (verbatim) ----
   [junit4] OpenJDK 64-Bit Server VM warning: Option UseConcMarkSweepGC was deprecated in version 9.0 and will likely be removed in a future release.
   [junit4] <<< JVM J0: EOF ----

[...truncated 5 lines...]
   [junit4] JVM J1: stderr was not empty, see: /home/jenkins/workspace/Lucene-Solr-8.x-Linux/lucene/build/core/test/temp/junit4-J1-20190416_185420_71315888043012012519901.syserr
   [junit4] >>> JVM J1 emitted unexpected output (verbatim) ----
   [junit4] OpenJDK 64-Bit Server VM warning: Option UseConcMarkSweepGC was deprecated in version 9.0 and will likely be removed in a future release.
   [junit4] <<< JVM J1: EOF ----

[...truncated 304 lines...]
   [junit4] JVM J1: stderr was not empty, see: /home/jenkins/workspace/Lucene-Solr-8.x-Linux/lucene/build/test-framework/test/temp/junit4-J1-20190416_190440_4171507231384897351920.syserr
   [junit4] >>> JVM J1 emitted unexpected output (verbatim) ----
   [junit4] OpenJDK 64-Bit Server VM warning: Option UseConcMarkSweepGC was deprecated in version 9.0 and will likely be removed in a future release.
   [junit4] <<< JVM J1: EOF ----

[...truncated 3 lines...]
   [junit4] JVM J0: stderr was not empty, see: /home/jenkins/workspace/Lucene-Solr-8.x-Linux/lucene/build/test-framework/test/temp/junit4-J0-20190416_190440_4174915900414690545525.syserr
   [junit4] >>> JVM J0 emitted unexpected output (verbatim) ----
   [junit4] OpenJDK 64-Bit Server VM warning: Option UseConcMarkSweepGC was deprecated in version 9.0 and will likely be removed in a future release.
   [junit4] <<< JVM J0: EOF ----

[...truncated 3 lines...]
   [junit4] JVM J2: stderr was not empty, see: /home/jenkins/workspace/Lucene-Solr-8.x-Linux/lucene/build/test-framework/test/temp/junit4-J2-20190416_190440_4177024608751408013025.syserr
   [junit4] >>> JVM J2 emitted unexpected output (verbatim) ----
   [junit4] OpenJDK 64-Bit Server VM warning: Option UseConcMarkSweepGC was deprecated in version 9.0 and will likely be removed in a future release.
   [junit4] <<< JVM J2: EOF ----

[...truncated 1080 lines...]
   [junit4] JVM J1: stderr was not empty, see: /home/jenkins/workspace/Lucene-Solr-8.x-Linux/lucene/build/analysis/common/test/temp/junit4-J1-20190416_190628_63414562973196791119113.syserr
   [junit4] >>> JVM J1 emitted unexpected output (verbatim) ----
   [junit4] OpenJDK 64-Bit Server VM warning: Option UseConcMarkSweepGC was deprecated in version 9.0 and will likely be removed in a future release.
   [junit4] <<< JVM J1: EOF ----

[...truncated 3 lines...]
   [junit4] JVM J0: stderr was not empty, see: /home/jenkins/workspace/Lucene-Solr-8.x-Linux/lucene/build/analysis/common/test/temp/junit4-J0-20190416_190628_62910935061129190383962.syserr
   [junit4] >>> JVM J0 emitted unexpected output (verbatim) ----
   [junit4] OpenJDK 64-Bit Server VM warning: Option UseConcMarkSweepGC was deprecated in version 9.0 and will likely be removed in a future release.
   [junit4] <<< JVM J0: EOF ----

[...truncated 3 lines...]
   [junit4] JVM J2: stderr was not empty, see: /home/jenkins/workspace/Lucene-Solr-8.x-Linux/lucene/build/analysis/common/test/temp/junit4-J2-20190416_190628_63416498238046834631327.syserr
   [junit4] >>> JVM J2 emitted unexpected output (verbatim) ----
   [junit4] OpenJDK 64-Bit Server VM warning: Option UseConcMarkSweepGC was deprecated in version 9.0 and will likely be removed in a future release.
   [junit4] <<< JVM J2: EOF ----

[...truncated 258 lines...]
   [junit4] JVM J1: stderr was not empty, see: /home/jenkins/workspace/Lucene-Solr-8.x-Linux/lucene/build/analysis/icu/test/temp/junit4-J1-20190416_190831_9716733951794881383388.syserr
   [junit4] >>> JVM J1 emitted unexpected output (verbatim) ----
   [junit4] OpenJDK 64-Bit Server VM warning: Option UseConcMarkSweepGC was deprecated in version 9.0 and will likely be removed in a future release.
   [junit4] <<< JVM J1: EOF ----

   [junit4] JVM J0: stderr was not empty, see: /home/jenkins/workspace/Lucene-Solr-8.x-Linux/lucene/build/analysis/icu/test/temp/junit4-J0-20190416_190831_9718634221164181731177.syserr
   [junit4] >>> JVM J0 emitted unexpected output (verbatim) ----
   [junit4] OpenJDK 64-Bit Server VM warning: Option UseConcMarkSweepGC was deprecated in version 9.0 and will likely be removed in a future release.
   [junit4] <<< JVM J0: EOF ----

[...truncated 3 lines...]
   [junit4] JVM J2: stderr was not empty, see: /home/jenkins/workspace/Lucene-Solr-8.x-Linux/lucene/build/analysis/icu/test/temp/junit4-J2-20190416_190831_97114872274915299330739.syserr
   [junit4] >>> JVM J2 emitted unexpected output (verbatim) ----
   [junit4] OpenJDK 64-Bit Server VM warning: Option UseConcMarkSweepGC was deprecated in version 9.0 and will likely be removed in a future release.
   [junit4] <<< JVM J2: EOF ----

[...truncated 248 lines...]
   [junit4] JVM J0: stderr was not empty, see: /home/jenkins/workspace/Lucene-Solr-8.x-Linux/lucene/build/analysis/kuromoji/test/temp/junit4-J0-20190416_190845_59115484027510602474987.syserr
   [junit4] >>> JVM J0 emitted unexpected output (verbatim) ----
   [junit4] OpenJDK 64-Bit Server VM warning: Option UseConcMarkSweepGC was deprecated in version 9.0 and will likely be removed in a future release.
   [junit4] <<< JVM J0: EOF ----

[...truncated 6 lines...]
   [junit4] JVM J2: stderr was not empty, see: /home/jenkins/workspace/Lucene-Solr-8.x-Linux/lucene/build/analysis/kuromoji/test/temp/junit4-J2-20190416_190845_59213772576330161175752.syserr
   [junit4] >>> JVM J2 emitted unexpected output (verbatim) ----
   [junit4] OpenJDK 64-Bit Server VM warning: Option UseConcMarkSweepGC was deprecated in version 9.0 and will likely be removed in a future release.
   [junit4] <<< JVM J2: EOF ----

[...truncated 5 lines...]
   [junit4] JVM J1: stderr was not empty, see: /home/jenkins/workspace/Lucene-Solr-8.x-Linux/lucene/build/analysis/kuromoji/test/temp/junit4-J1-20190416_190845_59118087479647398347206.syserr
   [junit4] >>> JVM J1 emitted unexpected output (verbatim) ----
   [junit4] OpenJDK 64-Bit Server VM warning: Option UseConcMarkSweepGC was deprecated in version 9.0 and will likely be removed in a future release.
   [junit4] <<< JVM J1: EOF ----

[...truncated 162 lines...]
   [junit4] JVM J1: stderr was not empty, see: /home/jenkins/workspace/Lucene-Solr-8.x-Linux/lucene/build/analysis/morfologik/test/temp/junit4-J1-20190416_190910_34913955389954416233157.syserr
   [junit4] >>> JVM J1 emitted unexpected output (verbatim) ----
   [junit4] OpenJDK 64-Bit Server VM warning: Option UseConcMarkSweepGC was deprecated in version 9.0 and will likely be removed in a future release.
   [junit4] <<< JVM J1: EOF ----

[...truncated 3 lines...]
   [junit4] JVM J0: stderr was not empty, see: /home/jenkins/workspace/Lucene-Solr-8.x-Linux/lucene/build/analysis/morfologik/test/temp/junit4-J0-20190416_190910_34914229425945721245374.syserr
   [junit4] >>> JVM J0 emitted unexpected output (verbatim) ----
   [junit4] OpenJDK 64-Bit Server VM warning: Option UseConcMarkSweepGC was deprecated in version 9.0 and will likely be removed in a future release.
   [junit4] <<< JVM J0: EOF ----

[...truncated 3 lines...]
   [junit4] JVM J2: stderr was not empty, see: /home/jenkins/workspace/Lucene-Solr-8.x-Linux/lucene/build/analysis/morfologik/test/temp/junit4-J2-20190416_190910_34911716987668799463241.syserr
   [junit4] >>> JVM J2 emitted unexpected output (verbatim) ----
   [junit4] OpenJDK 64-Bit Server VM warning: Option UseConcMarkSweepGC was deprecated in version 9.0 and will likely be removed in a future release.
   [junit4] <<< JVM J2: EOF ----

[...truncated 204 lines...]
   [junit4] JVM J2: stderr was not empty, see: /home/jenkins/workspace/Lucene-Solr-8.x-Linux/lucene/build/analysis/nori/test/temp/junit4-J2-20190416_190915_11214482728892583974681.syserr
   [junit4] >>> JVM J2 emitted unexpected output (verbatim) ----
   [junit4] OpenJDK 64-Bit Server VM warning: Option UseConcMarkSweepGC was deprecated in version 9.0 and will likely be removed in a future release.
   [junit4] <<< JVM J2: EOF ----

[...truncated 6 lines...]
   [junit4] JVM J0: stderr was not empty, see: /home/jenkins/workspace/Lucene-Solr-8.x-Linux/lucene/build/analysis/nori/test/temp/junit4-J0-20190416_190915_1124894340406159837380.syserr
   [junit4] >>> JVM J0 emitted unexpected output (verbatim) ----
   [junit4] OpenJDK 64-Bit Server VM warning: Option UseConcMarkSweepGC was deprecated in version 9.0 and will likely be removed in a future release.
   [junit4] <<< JVM J0: EOF ----

[...truncated 3 lines...]
   [junit4] JVM J1: stderr was not empty, see: /home/jenkins/workspace/Lucene-Solr-8.x-Linux/lucene/build/analysis/nori/test/temp/junit4-J1-20190416_190915_11211391869168299586067.syserr
   [junit4] >>> JVM J1 emitted unexpected output (verbatim) ----
   [junit4] OpenJDK 64-Bit Server VM warning: Option UseConcMarkSweepGC was deprecated in version 9.0 and will likely be removed in a future release.
   [junit4] <<< JVM J1: EOF ----

[...truncated 168 lines...]
   [junit4] JVM J1: stderr was not empty, see: /home/jenkins/workspace/Lucene-Solr-8.x-Linux/lucene/build/analysis/opennlp/test/temp/junit4-J1-20190416_190925_99516530542213271334441.syserr
   [junit4] >>> JVM J1 emitted unexpected output (verbatim) ----
   [junit4] OpenJDK 64-Bit Server VM warning: Option UseConcMarkSweepGC was deprecated in version 9.0 and will likely be removed in a future release.
   [junit4] <<< JVM J1: EOF ----

[...truncated 6 lines...]
   [junit4] JVM J2: stderr was not empty, see: /home/jenkins/workspace/Lucene-Solr-8.x-Linux/lucene/build/analysis/opennlp/test/temp/junit4-J2-20190416_190925_995694702300153221693.syserr
   [junit4] >>> JVM J2 emitted unexpected output (verbatim) ----
   [junit4] OpenJDK 64-Bit Server VM warning: Option UseConcMarkSweepGC was deprecated in version 9.0 and will likely be removed in a future release.
   [junit4] <<< JVM J2: EOF ----

   [junit4] JVM J0: stderr was not empty, see: /home/jenkins/workspace/Lucene-Solr-8.x-Linux/lucene/build/analysis/opennlp/test/temp/junit4-J0-20190416_190925_99514032500433207495732.syserr
   [junit4] >>> JVM J0 emitted unexpected output (verbatim) ----
   [junit4] OpenJDK 64-Bit Server VM warning: Option UseConcMarkSweepGC was deprecated in version 9.0 and will likely be removed in a future release.
   [junit4] <<< JVM J0: EOF ----

[...truncated 173 lines...]
   [junit4] JVM J2: stderr was not empty, see: /home/jenkins/workspace/Lucene-Solr-8.x-Linux/lucene/build/analysis/phonetic/test/temp/junit4-J2-20190416_190929_64013105763988155334796.syserr
   [junit4] >>> JVM J2 emitted unexpected output (verbatim) ----
   [junit4] OpenJDK 64-Bit Server VM warning: Option UseConcMarkSweepGC was deprecated in version 9.0 and will likely be removed in a future release.
   [junit4] <<< JVM J2: EOF ----

[...truncated 6 lines...]
   [junit4] JVM J1: stderr was not empty, see: /home/jenkins/workspace/Lucene-Solr-8.x-Linux/lucene/build/analysis/phonetic/test/temp/junit4-J1-20190416_190929_6424810880545354384213.syserr
   [junit4] >>> JVM J1 emitted unexpected output (verbatim) ----
   [junit4] OpenJDK 64-Bit Server VM warning: Option UseConcMarkSweepGC was deprecated in version 9.0 and will likely be removed in a future release.
   [junit4] <<< JVM J1: EOF ----

[...truncated 3 lines...]
   [junit4] JVM J0: stderr was not empty, see: /home/jenkins/workspace/Lucene-Solr-8.x-Linux/lucene/build/analysis/phonetic/test/temp/junit4-J0-20190416_190929_64014318948977636997566.syserr
   [junit4] >>> JVM J0 emitted unexpected output (verbatim) ----
   [junit4] OpenJDK 64-Bit Server VM warning: Option UseConcMarkSweepGC was deprecated in version 9.0 and will likely be removed in a future release.
   [junit4] <<< JVM J0: EOF ----

[...truncated 161 lines...]
   [junit4] JVM J0: stderr was not empty, see: /home/jenkins/workspace/Lucene-Solr-8.x-Linux/lucene/build/analysis/smartcn/test/temp/junit4-J0-20190416_190940_8014237079026321201085.syserr
   [junit4] >>> JVM J0 emitted unexpected output (verbatim) ----
   [junit4] OpenJDK 64-Bit Server VM warning: Option UseConcMarkSweepGC was deprecated in version 9.0 and will likely be removed in a future release.
   [junit4] <<< JVM J0: EOF ----

[...truncated 3 lines...]
   [junit4] JVM J1: stderr was not empty, see: /home/jenkins/workspace/Lucene-Solr-8.x-Linux/lucene/build/analysis/smartcn/test/temp/junit4-J1-20190416_190940_8013123202626071408160.syserr
   [junit4] >>> JVM J1 emitted unexpected output (verbatim) ----
   [junit4] OpenJDK 64-Bit Server VM warning: Option UseConcMarkSweepGC was deprecated in version 9.0 and will likely be removed in a future release.
   [junit4] <<< JVM J1: EOF ----

[...truncated 162 lines...]
   [junit4] JVM J2: stderr was not empty, see: /home/jenkins/workspace/Lucene-Solr-8.x-Linux/lucene/build/analysis/stempel/test/temp/junit4-J2-20190416_190950_5826624346187138841092.syserr
   [junit4] >>> JVM J2 emitted unexpected output (verbatim) ----
   [junit4] OpenJDK 64-Bit Server VM warning: Option UseConcMarkSweepGC was deprecated in version 9.0 and will likely be removed in a future release.
   [junit4] <<< JVM J2: EOF ----

[...truncated 6 lines...]
   [junit4] JVM J0: stderr was not empty, see: /home/jenkins/workspace/Lucene-Solr-8.x-Linux/lucene/build/analysis/stempel/test/temp/junit4-J0-20190416_190950_58210689716274554502617.syserr
   [junit4] >>> JVM J0 emitted unexpected output (verbatim) ----
   [junit4] OpenJDK 64-Bit Server VM warning: Option UseConcMarkSweepGC was deprecated in version 9.0 and will likely be removed in a future release.
   [junit4] <<< JVM J0: EOF ----

   [junit4] JVM J1: stderr was not empty, see: /home/jenkins/workspace/Lucene-Solr-8.x-Linux/lucene/build/analysis/stempel/test/temp/junit4-J1-20190416_190950_5828298376699988969873.syserr
   [junit4] >>> JVM J1 emitted unexpected output (verbatim) ----
   [junit4] OpenJDK 64-Bit Server VM warning: Option UseConcMarkSweepGC was deprecated in version 9.0 and will likely be removed in a future release.
   [junit4] <<< JVM J1: EOF ----

[...truncated 177 lines...]
   [junit4] JVM J2: stderr was not empty, see: /home/jenkins/workspace/Lucene-Solr-8.x-Linux/lucene/build/backward-codecs/test/temp/junit4-J2-20190416_190953_7864547607779617561621.syserr
   [junit4] >>> JVM J2 emitted unexpected output (verbatim) ----
   [junit4] OpenJDK 64-Bit Server VM warning: Option UseConcMarkSweepGC was deprecated in version 9.0 and will likely be removed in a future release.
   [junit4] <<< JVM J2: EOF ----

[...truncated 19 lines...]
   [junit4] JVM J0: stderr was not empty, see: /home/jenkins/workspace/Lucene-Solr-8.x-Linux/lucene/build/backward-codecs/test/temp/junit4-J0-20190416_190953_78611159745978389214585.syserr
   [junit4] >>> JVM J0 emitted unexpected output (verbatim) ----
   [junit4] OpenJDK 64-Bit Server VM warning: Option UseConcMarkSweepGC was deprecated in version 9.0 and will likely be removed in a future release.
   [junit4] <<< JVM J0: EOF ----

[...truncated 10 lines...]
   [junit4] JVM J1: stderr was not empty, see: /home/jenkins/workspace/Lucene-Solr-8.x-Linux/lucene/build/backward-codecs/test/temp/junit4-J1-20190416_190953_7868196186366837885280.syserr
   [junit4] >>> JVM J1 emitted unexpected output (verbatim) ----
   [junit4] OpenJDK 64-Bit Server VM warning: Option UseConcMarkSweepGC was deprecated in version 9.0 and will likely be removed in a future release.
   [junit4] <<< JVM J1: EOF ----

[...truncated 1545 lines...]
   [junit4] JVM J2: stderr was not empty, see: /home/jenkins/workspace/Lucene-Solr-8.x-Linux/lucene/build/benchmark/test/temp/junit4-J2-20190416_191350_82710156751609879977153.syserr
   [junit4] >>> JVM J2 emitted unexpected output (verbatim) ----
   [junit4] OpenJDK 64-Bit Server VM warning: Option UseConcMarkSweepGC was deprecated in version 9.0 and will likely be removed in a future release.
   [junit4] <<< JVM J2: EOF ----

   [junit4] JVM J1: stderr was not empty, see: /home/jenkins/workspace/Lucene-Solr-8.x-Linux/lucene/build/benchmark/test/temp/junit4-J1-20190416_191350_8261086005572947016249.syserr
   [junit4] >>> JVM J1 emitted unexpected output (verbatim) ----
   [junit4] OpenJDK 64-Bit Server VM warning: Option UseConcMarkSweepGC was deprecated in version 9.0 and will likely be removed in a future release.
   [junit4] <<< JVM J1: EOF ----

[...truncated 6 lines...]
   [junit4] JVM J0: stderr was not empty, see: /home/jenkins/workspace/Lucene-Solr-8.x-Linux/lucene/build/benchmark/test/temp/junit4-J0-20190416_191350_82417821747295661788176.syserr
   [junit4] >>> JVM J0 emitted unexpected output (verbatim) ----
   [junit4] OpenJDK 64-Bit Server VM warning: Option UseConcMarkSweepGC was deprecated in version 9.0 and will likely be removed in a future release.
   [junit4] <<< JVM J0: EOF ----

[...truncated 253 lines...]
   [junit4] JVM J1: stderr was not empty, see: /home/jenkins/workspace/Lucene-Solr-8.x-Linux/lucene/build/classification/test/temp/junit4-J1-20190416_191400_4727292090882226283233.syserr
   [junit4] >>> JVM J1 emitted unexpected output (verbatim) ----
   [junit4] OpenJDK 64-Bit Server VM warning: Option UseConcMarkSweepGC was deprecated in version 9.0 and will likely be removed in a future release.
   [junit4] <<< JVM J1: EOF ----

[...truncated 3 lines...]
   [junit4] JVM J2: stderr was not empty, see: /home/jenkins/workspace/Lucene-Solr-8.x-Linux/lucene/build/classification/test/temp/junit4-J2-20190416_191400_4722731579300183942957.syserr
   [junit4] >>> JVM J2 emitted unexpected output (verbatim) ----
   [junit4] OpenJDK 64-Bit Server VM warning: Option UseConcMarkSweepGC was deprecated in version 9.0 and will likely be removed in a future release.
   [junit4] <<< JVM J2: EOF ----

   [junit4] JVM J0: stderr was not empty, see: /home/jenkins/workspace/Lucene-Solr-8.x-Linux/lucene/build/classification/test/temp/junit4-J0-20190416_191400_4728657912782245171193.syserr
   [junit4] >>> JVM J0 emitted unexpected output (verbatim) ----
   [junit4] OpenJDK 64-Bit Server VM warning: Option UseConcMarkSweepGC was deprecated in version 9.0 and will likely be removed in a future release.
   [junit4] <<< JVM J0: EOF ----

[...truncated 257 lines...]
   [junit4] JVM J1: stderr was not empty, see: /home/jenkins/workspace/Lucene-Solr-8.x-Linux/lucene/build/codecs/test/temp/junit4-J1-20190416_191418_8026947447273436150090.syserr
   [junit4] >>> JVM J1 emitted unexpected output (verbatim) ----
   [junit4] OpenJDK 64-Bit Server VM warning: Option UseConcMarkSweepGC was deprecated in version 9.0 and will likely be removed in a future release.
   [junit4] <<< JVM J1: EOF ----

[...truncated 7 lines...]
   [junit4] JVM J2: stderr was not empty, see: /home/jenkins/workspace/Lucene-Solr-8.x-Linux/lucene/build/codecs/test/temp/junit4-J2-20190416_191418_8026244513482847343186.syserr
   [junit4] >>> JVM J2 emitted unexpected output (verbatim) ----
   [junit4] OpenJDK 64-Bit Server VM warning: Option UseConcMarkSweepGC was deprecated in version 9.0 and will likely be removed in a future release.
   [junit4] <<< JVM J2: EOF ----

[...truncated 4 lines...]
   [junit4] JVM J0: stderr was not empty, see: /home/jenkins/workspace/Lucene-Solr-8.x-Linux/lucene/build/codecs/test/temp/junit4-J0-20190416_191418_80212928104432313807445.syserr
   [junit4] >>> JVM J0 emitted unexpected output (verbatim) ----
   [junit4] OpenJDK 64-Bit Server VM warning: Option UseConcMarkSweepGC was deprecated in version 9.0 and will likely be removed in a future release.
   [junit4] <<< JVM J0: EOF ----

[...truncated 233 lines...]
   [junit4] JVM J2: stderr was not empty, see: /home/jenkins/workspace/Lucene-Solr-8.x-Linux/lucene/build/demo/test/temp/junit4-J2-20190416_191817_11913042817511248316805.syserr
   [junit4] >>> JVM J2 emitted unexpected output (verbatim) ----
   [junit4] OpenJDK 64-Bit Server VM warning: Option UseConcMarkSweepGC was deprecated in version 9.0 and will likely be removed in a future release.
   [junit4] <<< JVM J2: EOF ----

[...truncated 3 lines...]
   [junit4] JVM J1: stderr was not empty, see: /home/jenkins/workspace/Lucene-Solr-8.x-Linux/lucene/build/demo/test/temp/junit4-J1-20190416_191817_1199306473019710548549.syserr
   [junit4] >>> JVM J1 emitted unexpected output (verbatim) ----
   [junit4] OpenJDK 64-Bit Server VM warning: Option UseConcMarkSweepGC was deprecated in version 9.0 and will likely be removed in a future release.
   [junit4] <<< JVM J1: EOF ----

   [junit4] JVM J0: stderr was not empty, see: /home/jenkins/workspace/Lucene-Solr-8.x-Linux/lucene/build/demo/test/temp/junit4-J0-20190416_191817_1194907031873589914522.syserr
   [junit4] >>> JVM J0 emitted unexpected output (verbatim) ----
   [junit4] OpenJDK 64-Bit Server VM warning: Option UseConcMarkSweepGC was deprecated in version 9.0 and will likely be removed in a future release.
   [junit4] <<< JVM J0: EOF ----

[...truncated 176 lines...]
   [junit4] JVM J2: stderr was not empty, see: /home/jenkins/workspace/Lucene-Solr-8.x-Linux/lucene/build/expressions/test/temp/junit4-J2-20190416_191820_8045294781187092526576.syserr
   [junit4] >>> JVM J2 emitted unexpected output (verbatim) ----
   [junit4] OpenJDK 64-Bit Server VM warning: Option UseConcMarkSweepGC was deprecated in version 9.0 and will likely be removed in a future release.
   [junit4] <<< JVM J2: EOF ----

   [junit4] JVM J1: stderr was not empty, see: /home/jenkins/workspace/Lucene-Solr-8.x-Linux/lucene/build/expressions/test/temp/junit4-J1-20190416_191820_804385995614040256050.syserr
   [junit4] >>> JVM J1 emitted unexpected output (verbatim) ----
   [junit4] OpenJDK 64-Bit Server VM warning: Option UseConcMarkSweepGC was deprecated in version 9.0 and will likely be removed in a future release.
   [junit4] <<< JVM J1: EOF ----

[...truncated 3 lines...]
   [junit4] JVM J0: stderr was not empty, see: /home/jenkins/workspace/Lucene-Solr-8.x-Linux/lucene/build/expressions/test/temp/junit4-J0-20190416_191820_8041057179092531743949.syserr
   [junit4] >>> JVM J0 emitted unexpected output (verbatim) ----
   [junit4] OpenJDK 64-Bit Server VM warning: Option UseConcMarkSweepGC was deprecated in version 9.0 and will likely be removed in a future release.
   [junit4] <<< JVM J0: EOF ----

[...truncated 234 lines...]
   [junit4] JVM J0: stderr was not empty, see: /home/jenkins/workspace/Lucene-Solr-8.x-Linux/lucene/build/facet/test/temp/junit4-J0-20190416_191829_99713814914421369577813.syserr
   [junit4] >>> JVM J0 emitted unexpected output (verbatim) ----
   [junit4] OpenJDK 64-Bit Server VM warning: Option UseConcMarkSweepGC was deprecated in version 9.0 and will likely be removed in a future release.
   [junit4] <<< JVM J0: EOF ----

[...truncated 3 lines...]
   [junit4] JVM J1: stderr was not empty, see: /home/jenkins/workspace/Lucene-Solr-8.x-Linux/lucene/build/facet/test/temp/junit4-J1-20190416_191829_9973787723642411426473.syserr
   [junit4] >>> JVM J1 emitted unexpected output (verbatim) ----
   [junit4] OpenJDK 64-Bit Server VM warning: Option UseConcMarkSweepGC was deprecated in version 9.0 and will likely be removed in a future release.
   [junit4] <<< JVM J1: EOF ----

[...truncated 3 lines...]
   [junit4] JVM J2: stderr was not empty, see: /home/jenkins/workspace/Lucene-Solr-8.x-Linux/lucene/build/facet/test/temp/junit4-J2-20190416_191829_997909861111782162102.syserr
   [junit4] >>> JVM J2 emitted unexpected output (verbatim) ----
   [junit4] OpenJDK 64-Bit Server VM warning: Option UseConcMarkSweepGC was deprecated in version 9.0 and will likely be removed in a future release.
   [junit4] <<< JVM J2: EOF ----

[...truncated 182 lines...]
   [junit4] JVM J0: stderr was not empty, see: /home/jenkins/workspace/Lucene-Solr-8.x-Linux/lucene/build/grouping/test/temp/junit4-J0-20190416_191902_5971712039523549683311.syserr
   [junit4] >>> JVM J0 emitted unexpected output (verbatim) ----
   [junit4] OpenJDK 64-Bit Server VM warning: Option UseConcMarkSweepGC was deprecated in version 9.0 and will likely be removed in a future release.
   [junit4] <<< JVM J0: EOF ----

[...truncated 3 lines...]
   [junit4] JVM J1: stderr was not empty, see: /home/jenkins/workspace/Lucene-Solr-8.x-Linux/lucene/build/grouping/test/temp/junit4-J1-20190416_191902_59711802934773441538380.syserr
   [junit4] >>> JVM J1 emitted unexpected output (verbatim) ----
   [junit4] OpenJDK 64-Bit Server VM warning: Option UseConcMarkSweepGC was deprecated in version 9.0 and will likely be removed in a future release.
   [junit4] <<< JVM J1: EOF ----

[...truncated 3 lines...]
   [junit4] JVM J2: stderr was not empty, see: /home/jenkins/workspace/Lucene-Solr-8.x-Linux/lucene/build/grouping/test/temp/junit4-J2-20190416_191902_5971817245046537999318.syserr
   [junit4] >>> JVM J2 emitted unexpected output (verbatim) ----
   [junit4] OpenJDK 64-Bit Server VM warning: Option UseConcMarkSweepGC was deprecated in version 9.0 and will likely be removed in a future release.
   [junit4] <<< JVM J2: EOF ----

[...truncated 249 lines...]
   [junit4] JVM J0: stderr was not empty, see: /home/jenkins/workspace/Lucene-Solr-8.x-Linux/lucene/build/highlighter/test/temp/junit4-J0-20190416_191918_92417977349741314781722.syserr
   [junit4] >>> JVM J0 emitted unexpected output (verbatim) ----
   [junit4] OpenJDK 64-Bit Server VM warning: Option UseConcMarkSweepGC was deprecated in version 9.0 and will likely be removed in a future release.
   [junit4] <<< JVM J0: EOF ----

   [junit4] JVM J1: stderr was not empty, see: /home/jenkins/workspace/Lucene-Solr-8.x-Linux/lucene/build/highlighter/test/temp/junit4-J1-20190416_191918_9242360249854345939468.syserr
   [junit4] >>> JVM J1 emitted unexpected output (verbatim) ----
   [junit4] OpenJDK 64-Bit Server VM warning: Option UseConcMarkSweepGC was deprecated in version 9.0 and will likely be removed in a future release.
   [junit4] <<< JVM J1: EOF ----

[...truncated 12 lines...]
   [junit4] JVM J2: stderr was not empty, see: /home/jenkins/workspace/Lucene-Solr-8.x-Linux/lucene/build/highlighter/test/temp/junit4-J2-20190416_191918_92417815872947305485973.syserr
   [junit4] >>> JVM J2 emitted unexpected output (verbatim) ----
   [junit4] OpenJDK 64-Bit Server VM warning: Option UseConcMarkSweepGC was deprecated in version 9.0 and will likely be removed in a future release.
   [junit4] <<< JVM J2: EOF ----

[...truncated 166 lines...]
   [junit4] JVM J1: stderr was not empty, see: /home/jenkins/workspace/Lucene-Solr-8.x-Linux/lucene/build/join/test/temp/junit4-J1-20190416_191944_2769013894905796301243.syserr
   [junit4] >>> JVM J1 emitted unexpected output (verbatim) ----
   [junit4] OpenJDK 64-Bit Server VM warning: Option UseConcMarkSweepGC was deprecated in version 9.0 and will likely be removed in a future release.
   [junit4] <<< JVM J1: EOF ----

[...truncated 6 lines...]
   [junit4] JVM J0: stderr was not empty, see: /home/jenkins/workspace/Lucene-Solr-8.x-Linux/lucene/build/join/test/temp/junit4-J0-20190416_191944_2768805773636430725127.syserr
   [junit4] >>> JVM J0 emitted unexpected output (verbatim) ----
   [junit4] OpenJDK 64-Bit Server VM warning: Option UseConcMarkSweepGC was deprecated in version 9.0 and will likely be removed in a future release.
   [junit4] <<< JVM J0: EOF ----

[...truncated 3 lines...]
   [junit4] JVM J2: stderr was not empty, see: /home/jenkins/workspace/Lucene-Solr-8.x-Linux/lucene/build/join/test/temp/junit4-J2-20190416_191944_27613090407444659184877.syserr
   [junit4] >>> JVM J2 emitted unexpected output (verbatim) ----
   [junit4] OpenJDK 64-Bit Server VM warning: Option UseConcMarkSweepGC was deprecated in version 9.0 and will likely be removed in a future release.
   [junit4] <<< JVM J2: EOF ----

[...truncated 306 lines...]
   [junit4] JVM J2: stderr was not empty, see: /home/jenkins/workspace/Lucene-Solr-8.x-Linux/lucene/build/luke/test/temp/junit4-J2-20190416_192023_3144285708157920972817.syserr
   [junit4] >>> JVM J2 emitted unexpected output (verbatim) ----
   [junit4] OpenJDK 64-Bit Server VM warning: Option UseConcMarkSweepGC was deprecated in version 9.0 and will likely be removed in a future release.
   [junit4] <<< JVM J2: EOF ----

   [junit4] JVM J0: stderr was not empty, see: /home/jenkins/workspace/Lucene-Solr-8.x-Linux/lucene/build/luke/test/temp/junit4-J0-20190416_192023_3143420810906114774608.syserr
   [junit4] >>> JVM J0 emitted unexpected output (verbatim) ----
   [junit4] OpenJDK 64-Bit Server VM warning: Option UseConcMarkSweepGC was deprecated in version 9.0 and will likely be removed in a future release.
   [junit4] <<< JVM J0: EOF ----

   [junit4] JVM J1: stderr was not empty, see: /home/jenkins/workspace/Lucene-Solr-8.x-Linux/lucene/build/luke/test/temp/junit4-J1-20190416_192023_31417019913630242902543.syserr
   [junit4] >>> JVM J1 emitted unexpected output (verbatim) ----
   [junit4] OpenJDK 64-Bit Server VM warning: Option UseConcMarkSweepGC was deprecated in version 9.0 and will likely be removed in a future release.
   [junit4] <<< JVM J1: EOF ----

[...truncated 157 lines...]
   [junit4] JVM J0: stderr was not empty, see: /home/jenkins/workspace/Lucene-Solr-8.x-Linux/lucene/build/memory/test/temp/junit4-J0-20190416_192029_2744070030796497054139.syserr
   [junit4] >>> JVM J0 emitted unexpected output (verbatim) ----
   [junit4] OpenJDK 64-Bit Server VM warning: Option UseConcMarkSweepGC was deprecated in version 9.0 and will likely be removed in a future release.
   [junit4] <<< JVM J0: EOF ----

[...truncated 3 lines...]
   [junit4] JVM J1: stderr was not empty, see: /home/jenkins/workspace/Lucene-Solr-8.x-Linux/lucene/build/memory/test/temp/junit4-J1-20190416_192029_27416187572556345305153.syserr
   [junit4] >>> JVM J1 emitted unexpected output (verbatim) ----
   [junit4] OpenJDK 64-Bit Server VM warning: Option UseConcMarkSweepGC was deprecated in version 9.0 and will likely be removed in a future release.
   [junit4] <<< JVM J1: EOF ----

[...truncated 179 lines...]
   [junit4] JVM J0: stderr was not empty, see: /home/jenkins/workspace/Lucene-Solr-8.x-Linux/lucene/build/misc/test/temp/junit4-J0-20190416_192042_04917541534075150756218.syserr
   [junit4] >>> JVM J0 emitted unexpected output (verbatim) ----
   [junit4] OpenJDK 64-Bit Server VM warning: Option UseConcMarkSweepGC was deprecated in version 9.0 and will likely be removed in a future release.
   [junit4] <<< JVM J0: EOF ----

[...truncated 3 lines...]
   [junit4] JVM J2: stderr was not empty, see: /home/jenkins/workspace/Lucene-Solr-8.x-Linux/lucene/build/misc/test/temp/junit4-J2-20190416_192042_04918401399933099510888.syserr
   [junit4] >>> JVM J2 emitted unexpected output (verbatim) ----
   [junit4] OpenJDK 64-Bit Server VM warning: Option UseConcMarkSweepGC was deprecated in version 9.0 and will likely be removed in a future release.
   [junit4] <<< JVM J2: EOF ----

[...truncated 9 lines...]
   [junit4] JVM J1: stderr was not empty, see: /home/jenkins/workspace/Lucene-Solr-8.x-Linux/lucene/build/misc/test/temp/junit4-J1-20190416_192042_0499450877047573538057.syserr
   [junit4] >>> JVM J1 emitted unexpected output (verbatim) ----
   [junit4] OpenJDK 64-Bit Server VM warning: Option UseConcMarkSweepGC was deprecated in version 9.0 and will likely be removed in a future release.
   [junit4] <<< JVM J1: EOF ----

[...truncated 312 lines...]
   [junit4] JVM J1: stderr was not empty, see: /home/jenkins/workspace/Lucene-Solr-8.x-Linux/lucene/build/queries/test/temp/junit4-J1-20190416_192108_1094532785400035777467.syserr
   [junit4] >>> JVM J1 emitted unexpected output (verbatim) ----
   [junit4] OpenJDK 64-Bit Server VM warning: Option UseConcMarkSweepGC was deprecated in version 9.0 and will likely be removed in a future release.
   [junit4] <<< JVM J1: EOF ----

   [junit4] JVM J2: stderr was not empty, see: /home/jenkins/workspace/Lucene-Solr-8.x-Linux/lucene/build/queries/test/temp/junit4-J2-20190416_192108_11016199661998237471200.syserr
   [junit4] >>> JVM J2 emitted unexpected output (verbatim) ----
   [junit4] OpenJDK 64-Bit Server VM warning: Option UseConcMarkSweepGC was deprecated in version 9.0 and will likely be removed in a future release.
   [junit4] <<< JVM J2: EOF ----

   [junit4] JVM J0: stderr was not empty, see: /home/jenkins/workspace/Lucene-Solr-8.x-Linux/lucene/build/queries/test/temp/junit4-J0-20190416_192108_1099439158374652920509.syserr
   [junit4] >>> JVM J0 emitted unexpected output (verbatim) ----
   [junit4] OpenJDK 64-Bit Server VM warning: Option UseConcMarkSweepGC was deprecated in version 9.0 and will likely be removed in a future release.
   [junit4] <<< JVM J0: EOF ----

[...truncated 231 lines...]
   [junit4] JVM J2: stderr was not empty, see: /home/jenkins/workspace/Lucene-Solr-8.x-Linux/lucene/build/queryparser/test/temp/junit4-J2-20190416_192120_15414189613521117203741.syserr
   [junit4] >>> JVM J2 emitted unexpected output (verbatim) ----
   [junit4] OpenJDK 64-Bit Server VM warning: Option UseConcMarkSweepGC was deprecated in version 9.0 and will likely be removed in a future release.
   [junit4] <<< JVM J2: EOF ----

[...truncated 3 lines...]
   [junit4] JVM J1: stderr was not empty, see: /home/jenkins/workspace/Lucene-Solr-8.x-Linux/lucene/build/queryparser/test/temp/junit4-J1-20190416_192120_1544108678056409900601.syserr
   [junit4] >>> JVM J1 emitted unexpected output (verbatim) ----
   [junit4] OpenJDK 64-Bit Server VM warning: Option UseConcMarkSweepGC was deprecated in version 9.0 and will likely be removed in a future release.
   [junit4] <<< JVM J1: EOF ----

[...truncated 3 lines...]
   [junit4] JVM J0: stderr was not empty, see: /home/jenkins/workspace/Lucene-Solr-8.x-Linux/lucene/build/queryparser/test/temp/junit4-J0-20190416_192120_15417565013424797853937.syserr
   [junit4] >>> JVM J0 emitted unexpected output (verbatim) ----
   [junit4] OpenJDK 64-Bit Server VM warning: Option UseConcMarkSweepGC was deprecated in version 9.0 and will likely be removed in a future release.
   [junit4] <<< JVM J0: EOF ----

[...truncated 219 lines...]
   [junit4] JVM J2: stderr was not empty, see: /home/jenkins/workspace/Lucene-Solr-8.x-Linux/lucene/build/replicator/test/temp/junit4-J2-20190416_192129_9592891926268004613355.syserr
   [junit4] >>> JVM J2 emitted unexpected output (verbatim) ----
   [junit4] OpenJDK 64-Bit Server VM warning: Option UseConcMarkSweepGC was deprecated in version 9.0 and will likely be removed in a future release.
   [junit4] <<< JVM J2: EOF ----

   [junit4] JVM J1: stderr was not empty, see: /home/jenkins/workspace/Lucene-Solr-8.x-Linux/lucene/build/replicator/test/temp/junit4-J1-20190416_192129_9599321737030658331031.syserr
   [junit4] >>> JVM J1 emitted unexpected output (verbatim) ----
   [junit4] OpenJDK 64-Bit Server VM warning: Option UseConcMarkSweepGC was deprecated in version 9.0 and will likely be removed in a future release.
   [junit4] <<< JVM J1: EOF ----

[...truncated 3 lines...]
   [junit4] JVM J0: stderr was not empty, see: /home/jenkins/workspace/Lucene-Solr-8.x-Linux/lucene/build/replicator/test/temp/junit4-J0-20190416_192129_95910820752944146938632.syserr
   [junit4] >>> JVM J0 emitted unexpected output (verbatim) ----
   [junit4] OpenJDK 64-Bit Server VM warning: Option UseConcMarkSweepGC was deprecated in version 9.0 and will likely be removed in a future release.
   [junit4] <<< JVM J0: EOF ----

[...truncated 250 lines...]
   [junit4] JVM J2: stderr was not empty, see: /home/jenkins/workspace/Lucene-Solr-8.x-Linux/lucene/build/sandbox/test/temp/junit4-J2-20190416_192144_1918685632338868735586.syserr
   [junit4] >>> JVM J2 emitted unexpected output (verbatim) ----
   [junit4] OpenJDK 64-Bit Server VM warning: Option UseConcMarkSweepGC was deprecated in version 9.0 and will likely be removed in a future release.
   [junit4] <<< JVM J2: EOF ----

[...truncated 3 lines...]
   [junit4] JVM J1: stderr was not empty, see: /home/jenkins/workspace/Lucene-Solr-8.x-Linux/lucene/build/sandbox/test/temp/junit4-J1-20190416_192144_1916058402688103606380.syserr
   [junit4] >>> JVM J1 emitted unexpected output (verbatim) ----
   [junit4] OpenJDK 64-Bit Server VM warning: Option UseConcMarkSweepGC was deprecated in version 9.0 and will likely be removed in a future release.
   [junit4] <<< JVM J1: EOF ----

[...truncated 3 lines...]
   [junit4] JVM J0: stderr was not empty, see: /home/jenkins/workspace/Lucene-Solr-8.x-Linux/lucene/build/sandbox/test/temp/junit4-J0-20190416_192144_19116720371658453844302.syserr
   [junit4] >>> JVM J0 emitted unexpected output (verbatim) ----
   [junit4] OpenJDK 64-Bit Server VM warning: Option UseConcMarkSweepGC was deprecated in version 9.0 and will likely be removed in a future release.
   [junit4] <<< JVM J0: EOF ----

[...truncated 299 lines...]
   [junit4] JVM J1: stderr was not empty, see: /home/jenkins/workspace/Lucene-Solr-8.x-Linux/lucene/build/spatial-extras/test/temp/junit4-J1-20190416_192241_0316008214073055949129.syserr
   [junit4] >>> JVM J1 emitted unexpected output (verbatim) ----
   [junit4] OpenJDK 64-Bit Server VM warning: Option UseConcMarkSweepGC was deprecated in version 9.0 and will likely be removed in a future release.
   [junit4] <<< JVM J1: EOF ----

[...truncated 3 lines...]
   [junit4] JVM J2: stderr was not empty, see: /home/jenkins/workspace/Lucene-Solr-8.x-Linux/lucene/build/spatial-extras/test/temp/junit4-J2-20190416_192241_03114200556110965954396.syserr
   [junit4] >>> JVM J2 emitted unexpected output (verbatim) ----
   [junit4] OpenJDK 64-Bit Server VM warning: Option UseConcMarkSweepGC was deprecated in version 9.0 and will likely be removed in a future release.
   [junit4] <<< JVM J2: EOF ----

[...truncated 3 lines...]
   [junit4] JVM J0: stderr was not empty, see: /home/jenkins/workspace/Lucene-Solr-8.x-Linux/lucene/build/spatial-extras/test/temp/junit4-J0-20190416_192241_0312475550787757592680.syserr
   [junit4] >>> JVM J0 emitted unexpected output (verbatim) ----
   [junit4] OpenJDK 64-Bit Server VM warning: Option UseConcMarkSweepGC was deprecated in version 9.0 and will likely be removed in a future release.
   [junit4] <<< JVM J0: EOF ----

[...truncated 153 lines...]
   [junit4] JVM J0: stderr was not empty, see: /home/jenkins/workspace/Lucene-Solr-8.x-Linux/lucene/build/spatial/test/temp/junit4-J0-20190416_192311_0353600802686229469120.syserr
   [junit4] >>> JVM J0 emitted unexpected output (verbatim) ----
   [junit4] OpenJDK 64-Bit Server VM warning: Option UseConcMarkSweepGC was deprecated in version 9.0 and will likely be removed in a future release.
   [junit4] <<< JVM J0: EOF ----

[...truncated 187 lines...]
   [junit4] JVM J0: stderr was not empty, see: /home/jenkins/workspace/Lucene-Solr-8.x-Linux/lucene/build/spatial3d/test/temp/junit4-J0-20190416_192313_05417059242230605156454.syserr
   [junit4] >>> JVM J0 emitted unexpected output (verbatim) ----
   [junit4] OpenJDK 64-Bit Server VM warning: Option UseConcMarkSweepGC was deprecated in version 9.0 and will likely be removed in a future release.
   [junit4] <<< JVM J0: EOF ----

   [junit4] JVM J1: stderr was not empty, see: /home/jenkins/workspace/Lucene-Solr-8.x-Linux/lucene/build/spatial3d/test/temp/junit4-J1-20190416_192313_05415040295191344799166.syserr
   [junit4] >>> JVM J1 emitted unexpected output (verbatim) ----
   [junit4] OpenJDK 64-Bit Server VM warning: Option UseConcMarkSweepGC was deprecated in version 9.0 and will likely be removed in a future release.
   [junit4] <<< JVM J1: EOF ----

[...truncated 5 lines...]
   [junit4] JVM J2: stderr was not empty, see: /home/jenkins/workspace/Lucene-Solr-8.x-Linux/lucene/build/spatial3d/test/temp/junit4-J2-20190416_192313_0541826369249781642384.syserr
   [junit4] >>> JVM J2 emitted unexpected output (verbatim) ----
   [junit4] OpenJDK 64-Bit Server VM warning: Option UseConcMarkSweepGC was deprecated in version 9.0 and will likely be removed in a future release.
   [junit4] <<< JVM J2: EOF ----

[...truncated 261 lines...]
   [junit4] JVM J0: stderr was not empty, see: /home/jenkins/workspace/Lucene-Solr-8.x-Linux/lucene/build/suggest/test/temp/junit4-J0-20190416_192436_7199282514647889819629.syserr
   [junit4] >>> JVM J0 emitted unexpected output (verbatim) ----
   [junit4] OpenJDK 64-Bit Server VM warning: Option UseConcMarkSweepGC was deprecated in version 9.0 and will likely be removed in a future release.
   [junit4] <<< JVM J0: EOF ----

[...truncated 3 lines...]
   [junit4] JVM J1: stderr was not empty, see: /home/jenkins/workspace/Lucene-Solr-8.x-Linux/lucene/build/suggest/test/temp/junit4-J1-20190416_192436_71914674027927818098698.syserr
   [junit4] >>> JVM J1 emitted unexpected output (verbatim) ----
   [junit4] OpenJDK 64-Bit Server VM warning: Option UseConcMarkSweepGC was deprecated in version 9.0 and will likely be removed in a future release.
   [junit4] <<< JVM J1: EOF ----

[...truncated 3 lines...]
   [junit4] JVM J2: stderr was not empty, see: /home/jenkins/workspace/Lucene-Solr-8.x-Linux/lucene/build/suggest/test/temp/junit4-J2-20190416_192436_71913697302726631392695.syserr
   [junit4] >>> JVM J2 emitted unexpected output (verbatim) ----
   [junit4] OpenJDK 64-Bit Server VM warning: Option UseConcMarkSweepGC was deprecated in version 9.0 and will likely be removed in a future release.
   [junit4] <<< JVM J2: EOF ----

[...truncated 4644 lines...]
   [junit4] JVM J1: stderr was not empty, see: /home/jenkins/workspace/Lucene-Solr-8.x-Linux/solr/build/solr-core/test/temp/junit4-J1-20190416_192554_39910811898299065060381.syserr
   [junit4] >>> JVM J1 emitted unexpected output (verbatim) ----
   [junit4] OpenJDK 64-Bit Server VM warning: Option UseConcMarkSweepGC was deprecated in version 9.0 and will likely be removed in a future release.
   [junit4] <<< JVM J1: EOF ----

[...truncated 3 lines...]
   [junit4] JVM J0: stderr was not empty, see: /home/jenkins/workspace/Lucene-Solr-8.x-Linux/solr/build/solr-core/test/temp/junit4-J0-20190416_192554_3999222922960810960375.syserr
   [junit4] >>> JVM J0 emitted unexpected output (verbatim) ----
   [junit4] OpenJDK 64-Bit Server VM warning: Option UseConcMarkSweepGC was deprecated in version 9.0 and will likely be removed in a future release.
   [junit4] <<< JVM J0: EOF ----

[...truncated 3 lines...]
   [junit4] JVM J2: stderr was not empty, see: /home/jenkins/workspace/Lucene-Solr-8.x-Linux/solr/build/solr-core/test/temp/junit4-J2-20190416_192554_40016180318014147209302.syserr
   [junit4] >>> JVM J2 emitted unexpected output (verbatim) ----
   [junit4] OpenJDK 64-Bit Server VM warning: Option UseConcMarkSweepGC was deprecated in version 9.0 and will likely be removed in a future release.
   [junit4] <<< JVM J2: EOF ----

[...truncated 655 lines...]
   [junit4] Suite: org.apache.solr.client.solrj.io.stream.MathExpressionTest
   [junit4]   2> 61552 INFO  (SUITE-MathExpressionTest-seed#[A509BC20D62CA5C7]-worker) [    ] o.a.s.SolrTestCaseJ4 SecureRandom sanity checks: test.solr.allowed.securerandom=null & java.security.egd=file:/dev/./urandom
   [junit4]   2> Creating dataDir: /home/jenkins/workspace/Lucene-Solr-8.x-Linux/solr/build/solr-solrj/test/J1/temp/solr.client.solrj.io.stream.MathExpressionTest_A509BC20D62CA5C7-001/init-core-data-001
   [junit4]   2> 61553 WARN  (SUITE-MathExpressionTest-seed#[A509BC20D62CA5C7]-worker) [    ] o.a.s.SolrTestCaseJ4 startTrackingSearchers: numOpens=97 numCloses=97
   [junit4]   2> 61553 INFO  (SUITE-MathExpressionTest-seed#[A509BC20D62CA5C7]-worker) [    ] o.a.s.SolrTestCaseJ4 Using TrieFields (NUMERIC_POINTS_SYSPROP=false) w/NUMERIC_DOCVALUES_SYSPROP=false
   [junit4]   2> 61553 INFO  (SUITE-MathExpressionTest-seed#[A509BC20D62CA5C7]-worker) [    ] o.a.s.SolrTestCaseJ4 Randomized ssl (false) and clientAuth (false) via: @org.apache.solr.util.RandomizeSSL(reason="", value=0.0/0.0, ssl=0.0/0.0, clientAuth=0.0/0.0)
   [junit4]   2> 61554 INFO  (SUITE-MathExpressionTest-seed#[A509BC20D62CA5C7]-worker) [    ] o.a.s.c.MiniSolrCloudCluster Starting cluster of 4 servers in /home/jenkins/workspace/Lucene-Solr-8.x-Linux/solr/build/solr-solrj/test/J1/temp/solr.client.solrj.io.stream.MathExpressionTest_A509BC20D62CA5C7-001/tempDir-001
   [junit4]   2> 61554 INFO  (SUITE-MathExpressionTest-seed#[A509BC20D62CA5C7]-worker) [    ] o.a.s.c.ZkTestServer STARTING ZK TEST SERVER
   [junit4]   2> 61554 INFO  (ZkTestServer Run Thread) [    ] o.a.s.c.ZkTestServer client port:0.0.0.0/0.0.0.0:0
   [junit4]   2> 61554 INFO  (ZkTestServer Run Thread) [    ] o.a.s.c.ZkTestServer Starting server
   [junit4]   2> 61654 INFO  (SUITE-MathExpressionTest-seed#[A509BC20D62CA5C7]-worker) [    ] o.a.s.c.ZkTestServer start zk server on port:35205
   [junit4]   2> 61655 INFO  (SUITE-MathExpressionTest-seed#[A509BC20D62CA5C7]-worker) [    ] o.a.s.c.ZkTestServer parse host and port list: 127.0.0.1:35205
   [junit4]   2> 61655 INFO  (SUITE-MathExpressionTest-seed#[A509BC20D62CA5C7]-worker) [    ] o.a.s.c.ZkTestServer connecting to 127.0.0.1 35205
   [junit4]   2> 61684 INFO  (zkConnectionManagerCallback-658-thread-1) [    ] o.a.s.c.c.ConnectionManager zkClient has connected
   [junit4]   2> 61688 INFO  (zkConnectionManagerCallback-660-thread-1) [    ] o.a.s.c.c.ConnectionManager zkClient has connected
   [junit4]   2> 61689 INFO  (zkConnectionManagerCallback-662-thread-1) [    ] o.a.s.c.c.ConnectionManager zkClient has connected
   [junit4]   2> 61692 WARN  (jetty-launcher-663-thread-1) [    ] o.e.j.s.AbstractConnector Ignoring deprecated socket close linger time
   [junit4]   2> 61692 INFO  (jetty-launcher-663-thread-1) [    ] o.a.s.c.s.e.JettySolrRunner Start Jetty (original configured port=0)
   [junit4]   2> 61692 INFO  (jetty-launcher-663-thread-1) [    ] o.a.s.c.s.e.JettySolrRunner Trying to start Jetty on port 0 try number 1 ...
   [junit4]   2> 61692 INFO  (jetty-launcher-663-thread-1) [    ] o.e.j.s.Server jetty-9.4.14.v20181114; built: 2018-11-14T21:20:31.478Z; git: c4550056e785fb5665914545889f21dc136ad9e6; jvm 12+33
   [junit4]   2> 61693 WARN  (jetty-launcher-663-thread-2) [    ] o.e.j.s.AbstractConnector Ignoring deprecated socket close linger time
   [junit4]   2> 61693 INFO  (jetty-launcher-663-thread-2) [    ] o.a.s.c.s.e.JettySolrRunner Start Jetty (original configured port=0)
   [junit4]   2> 61693 INFO  (jetty-launcher-663-thread-2) [    ] o.a.s.c.s.e.JettySolrRunner Trying to start Jetty on port 0 try number 1 ...
   [junit4]   2> 61694 INFO  (jetty-launcher-663-thread-2) [    ] o.e.j.s.Server jetty-9.4.14.v20181114; built: 2018-11-14T21:20:31.478Z; git: c4550056e785fb5665914545889f21dc136ad9e6; jvm 12+33
   [junit4]   2> 61720 WARN  (jetty-launcher-663-thread-3) [    ] o.e.j.s.AbstractConnector Ignoring deprecated socket close linger time
   [junit4]   2> 61720 INFO  (jetty-launcher-663-thread-3) [    ] o.a.s.c.s.e.JettySolrRunner Start Jetty (original configured port=0)
   [junit4]   2> 61720 INFO  (jetty-launcher-663-thread-3) [    ] o.a.s.c.s.e.JettySolrRunner Trying to start Jetty on port 0 try number 1 ...
   [junit4]   2> 61720 INFO  (jetty-launcher-663-thread-3) [    ] o.e.j.s.Server jetty-9.4.14.v20181114; built: 2018-11-14T21:20:31.478Z; git: c4550056e785fb5665914545889f21dc136ad9e6; jvm 12+33
   [junit4]   2> 61726 WARN  (jetty-launcher-663-thread-4) [    ] o.e.j.s.AbstractConnector Ignoring deprecated socket close linger time
   [junit4]   2> 61727 INFO  (jetty-launcher-663-thread-4) [    ] o.a.s.c.s.e.JettySolrRunner Start Jetty (original configured port=0)
   [junit4]   2> 61727 INFO  (jetty-launcher-663-thread-4) [    ] o.a.s.c.s.e.JettySolrRunner Trying to start Jetty on port 0 try number 1 ...
   [junit4]   2> 61727 INFO  (jetty-launcher-663-thread-4) [    ] o.e.j.s.Server jetty-9.4.14.v20181114; built: 2018-11-14T21:20:31.478Z; git: c4550056e785fb5665914545889f21dc136ad9e6; jvm 12+33
   [junit4]   2> 61772 INFO  (jetty-launcher-663-thread-4) [    ] o.e.j.s.session DefaultSessionIdManager workerName=node0
   [junit4]   2> 61772 INFO  (jetty-launcher-663-thread-4) [    ] o.e.j.s.session No SessionScavenger set, using defaults
   [junit4]   2> 61772 INFO  (jetty-launcher-663-thread-4) [    ] o.e.j.s.session node0 Scavenging every 600000ms
   [junit4]   2> 61772 INFO  (jetty-launcher-663-thread-2) [    ] o.e.j.s.session DefaultSessionIdManager workerName=node0
   [junit4]   2> 61772 INFO  (jetty-launcher-663-thread-2) [    ] o.e.j.s.session No SessionScavenger set, using defaults
   [junit4]   2> 61772 INFO  (jetty-launcher-663-thread-2) [    ] o.e.j.s.session node0 Scavenging every 600000ms
   [junit4]   2> 61776 INFO  (jetty-launcher-663-thread-2) [    ] o.e.j.s.h.ContextHandler Started o.e.j.s.ServletContextHandler@5af77dd9{/solr,null,AVAILABLE}
   [junit4]   2> 61776 INFO  (jetty-launcher-663-thread-4) [    ] o.e.j.s.h.ContextHandler Started o.e.j.s.ServletContextHandler@e04af0{/solr,null,AVAILABLE}
   [junit4]   2> 61778 INFO  (jetty-launcher-663-thread-2) [    ] o.e.j.s.AbstractConnector Started ServerConnector@262c34e{HTTP/1.1,[http/1.1, h2c]}{127.0.0.1:36597}
   [junit4]   2> 61778 INFO  (jetty-launcher-663-thread-2) [    ] o.e.j.s.Server Started @61813ms
   [junit4]   2> 61778 INFO  (jetty-launcher-663-thread-2) [    ] o.a.s.c.s.e.JettySolrRunner Jetty properties: {hostContext=/solr, hostPort=36597}
   [junit4]   2> 61778 INFO  (jetty-launcher-663-thread-4) [    ] o.e.j.s.AbstractConnector Started ServerConnector@78b16ad7{HTTP/1.1,[http/1.1, h2c]}{127.0.0.1:44957}
   [junit4]   2> 61778 INFO  (jetty-launcher-663-thread-4) [    ] o.e.j.s.Server Started @61814ms
   [junit4]   2> 61779 INFO  (jetty-launcher-663-thread-4) [    ] o.a.s.c.s.e.JettySolrRunner Jetty properties: {hostContext=/solr, hostPort=44957}
   [junit4]   2> 61779 ERROR (jetty-launcher-663-thread-2) [    ] o.a.s.u.StartupLoggingUtils Missing Java Option solr.log.dir. Logging may be missing or incomplete.
   [junit4]   2> 61779 INFO  (jetty-launcher-663-thread-2) [    ] o.a.s.s.SolrDispatchFilter Using logger factory org.apache.logging.slf4j.Log4jLoggerFactory
   [junit4]   2> 61779 ERROR (jetty-launcher-663-thread-4) [    ] o.a.s.u.StartupLoggingUtils Missing Java Option solr.log.dir. Logging may be missing or incomplete.
   [junit4]   2> 61779 INFO  (jetty-launcher-663-thread-4) [    ] o.a.s.s.SolrDispatchFilter Using logger factory org.apache.logging.slf4j.Log4jLoggerFactory
   [junit4]   2> 61779 INFO  (jetty-launcher-663-thread-2) [    ] o.a.s.s.SolrDispatchFilter  ___      _       Welcome to Apache Solr? version 8.1.0
   [junit4]   2> 61779 INFO  (jetty-launcher-663-thread-4) [    ] o.a.s.s.SolrDispatchFilter  ___      _       Welcome to Apache Solr? version 8.1.0
   [junit4]   2> 61779 INFO  (jetty-launcher-663-thread-2) [    ] o.a.s.s.SolrDispatchFilter / __| ___| |_ _   Starting in cloud mode on port null
   [junit4]   2> 61779 INFO  (jetty-launcher-663-thread-4) [    ] o.a.s.s.SolrDispatchFilter / __| ___| |_ _   Starting in cloud mode on port null
   [junit4]   2> 61779 INFO  (jetty-launcher-663-thread-2) [    ] o.a.s.s.SolrDispatchFilter \__ \/ _ \ | '_|  Install dir: null
   [junit4]   2> 61779 INFO  (jetty-launcher-663-thread-4) [    ] o.a.s.s.SolrDispatchFilter \__ \/ _ \ | '_|  Install dir: null
   [junit4]   2> 61779 INFO  (jetty-launcher-663-thread-2) [    ] o.a.s.s.SolrDispatchFilter |___/\___/_|_|    Start time: 2019-04-16T20:01:55.634477Z
   [junit4]   2> 61779 INFO  (jetty-launcher-663-thread-4) [    ] o.a.s.s.SolrDispatchFilter |___/\___/_|_|    Start time: 2019-04-16T20:01:55.634497Z
   [junit4]   2> 61811 INFO  (zkConnectionManagerCallback-666-thread-1) [    ] o.a.s.c.c.ConnectionManager zkClient has connected
   [junit4]   2> 61811 INFO  (zkConnectionManagerCallback-667-thread-1) [    ] o.a.s.c.c.ConnectionManager zkClient has connected
   [junit4]   2> 61811 INFO  (jetty-launcher-663-thread-1) [    ] o.e.j.s.session DefaultSessionIdManager workerName=node0
   [junit4]   2> 61811 INFO  (jetty-launcher-663-thread-1) [    ] o.e.j.s.session No SessionScavenger set, using defaults
   [junit4]   2> 61811 INFO  (jetty-launcher-663-thread-2) [    ] o.a.s.s.SolrDispatchFilter solr.xml found in ZooKeeper. Loading...
   [junit4]   2> 61812 INFO  (jetty-launcher-663-thread-1) [    ] o.e.j.s.session node0 Scavenging every 660000ms
   [junit4]   2> 61812 INFO  (jetty-launcher-663-thread-4) [    ] o.a.s.s.SolrDispatchFilter solr.xml found in ZooKeeper. Loading...
   [junit4]   2> 61839 INFO  (jetty-launcher-663-thread-3) [    ] o.e.j.s.session DefaultSessionIdManager workerName=node0
   [junit4]   2> 61839 INFO  (jetty-launcher-663-thread-3) [    ] o.e.j.s.session No SessionScavenger set, using defaults
   [junit4]   2> 61839 INFO  (jetty-launcher-663-thread-3) [    ] o.e.j.s.session node0 Scavenging every 660000ms
   [junit4]   2> 61840 INFO  (jetty-launcher-663-thread-1) [    ] o.e.j.s.h.ContextHandler Started o.e.j.s.ServletContextHandler@5ab6a84e{/solr,null,AVAILABLE}
   [junit4]   2> 61841 INFO  (jetty-launcher-663-thread-1) [    ] o.e.j.s.AbstractConnector Started ServerConnector@1e08e1ec{HTTP/1.1,[http/1.1, h2c]}{127.0.0.1:39085}
   [junit4]   2> 61841 INFO  (jetty-launcher-663-thread-1) [    ] o.e.j.s.Server Started @61876ms
   [junit4]   2> 61841 INFO  (jetty-launcher-663-thread-1) [    ] o.a.s.c.s.e.JettySolrRunner Jetty properties: {hostContext=/solr, hostPort=39085}
   [junit4]   2> 61842 ERROR (jetty-launcher-663-thread-1) [    ] o.a.s.u.StartupLoggingUtils Missing Java Option solr.log.dir. Logging may be missing or incomplete.
   [junit4]   2> 61842 INFO  (jetty-launcher-663-thread-1) [    ] o.a.s.s.SolrDispatchFilter Using logger factory org.apache.logging.slf4j.Log4jLoggerFactory
   [junit4]   2> 61842 INFO  (jetty-launcher-663-thread-1) [    ] o.a.s.s.SolrDispatchFilter  ___      _       Welcome to Apache Solr? version 8.1.0
   [junit4]   2> 61842 INFO  (jetty-launcher-663-thread-1) [    ] o.a.s.s.SolrDispatchFilter / __| ___| |_ _   Starting in cloud mode on port null
   [junit4]   2> 61842 INFO  (jetty-launcher-663-thread-1) [    ] o.a.s.s.SolrDispatchFilter \__ \/ _ \ | '_|  Install dir: null
   [junit4]   2> 61842 INFO  (jetty-launcher-663-thread-1) [    ] o.a.s.s.SolrDispatchFilter |___/\___/_|_|    Start time: 2019-04-16T20:01:55.697375Z
   [junit4]   2> 61848 INFO  (jetty-launcher-663-thread-3) [    ] o.e.j.s.h.ContextHandler Started o.e.j.s.ServletContextHandler@53ec1abf{/solr,null,AVAILABLE}
   [junit4]   2> 61849 INFO  (jetty-launcher-663-thread-3) [    ] o.e.j.s.AbstractConnector Started ServerConnector@74d4263d{HTTP/1.1,[http/1.1, h2c]}{127.0.0.1:34361}
   [junit4]   2> 61849 INFO  (jetty-launcher-663-thread-3) [    ] o.e.j.s.Server Started @61884ms
   [junit4]   2> 61849 INFO  (jetty-launcher-663-thread-3) [    ] o.a.s.c.s.e.JettySolrRunner Jetty properties: {hostContext=/solr, hostPort=34361}
   [junit4]   2> 61850 ERROR (jetty-launcher-663-thread-3) [    ] o.a.s.u.StartupLoggingUtils Missing Java Option solr.log.dir. Logging may be missing or incomplete.
   [junit4]   2> 61850 INFO  (jetty-launcher-663-thread-3) [    ] o.a.s.s.SolrDispatchFilter Using logger factory org.apache.logging.slf4j.Log4jLoggerFactory
   [junit4]   2> 61850 INFO  (jetty-launcher-663-thread-3) [    ] o.a.s.s.SolrDispatchFilter  ___      _       Welcome to Apache Solr? version 8.1.0
   [junit4]   2> 61850 INFO  (jetty-launcher-663-thread-3) [    ] o.a.s.s.SolrDispatchFilter / __| ___| |_ _   Starting in cloud mode on port null
   [junit4]   2> 61850 INFO  (jetty-launcher-663-thread-3) [    ] o.a.s.s.SolrDispatchFilter \__ \/ _ \ | '_|  Install dir: null
   [junit4]   2> 61850 INFO  (jetty-launcher-663-thread-3) [    ] o.a.s.s.SolrDispatchFilter |___/\___/_|_|    Start time: 2019-04-16T20:01:55.705492Z
   [junit4]   2> 61888 INFO  (zkConnectionManagerCallback-671-thread-1) [    ] o.a.s.c.c.ConnectionManager zkClient has connected
   [junit4]   2> 61889 INFO  (jetty-launcher-663-thread-1) [    ] o.a.s.s.SolrDispatchFilter solr.xml found in ZooKeeper. Loading...
   [junit4]   2> 61912 INFO  (zkConnectionManagerCallback-673-thread-1) [    ] o.a.s.c.c.ConnectionManager zkClient has connected
   [junit4]   2> 61916 INFO  (jetty-launcher-663-thread-3) [    ] o.a.s.s.SolrDispatchFilter solr.xml found in ZooKeeper. Loading...
   [junit4]   2> 61937 INFO  (jetty-launcher-663-thread-4) [    ] o.a.s.h.c.HttpShardHandlerFactory Host whitelist initialized: WhitelistHostChecker [whitelistHosts=null, whitelistHostCheckingEnabled=true]
   [junit4]   2> 61938 WARN  (jetty-launcher-663-thread-4) [    ] o.e.j.u.s.S.config No Client EndPointIdentificationAlgorithm configured for SslContextFactory@68f04239[provider=null,keyStore=null,trustStore=null]
   [junit4]   2> 61952 WARN  (jetty-launcher-663-thread-4) [    ] o.e.j.u.s.S.config No Client EndPointIdentificationAlgorithm configured for SslContextFactory@64914c23[provider=null,keyStore=null,trustStore=null]
   [junit4]   2> 61954 INFO  (jetty-launcher-663-thread-4) [    ] o.a.s.c.ZkContainer Zookeeper client=127.0.0.1:35205/solr
   [junit4]   2> 61987 INFO  (zkConnectionManagerCallback-681-thread-1) [    ] o.a.s.c.c.ConnectionManager zkClient has connected
   [junit4]   2> 62012 INFO  (zkConnectionManagerCallback-683-thread-1) [    ] o.a.s.c.c.ConnectionManager zkClient has connected
   [junit4]   2> 62020 WARN  (jetty-launcher-663-thread-4) [n:127.0.0.1:44957_solr    ] o.a.s.c.ZkController The _default configset could not be uploaded. Please provide 'solr.default.confdir' parameter that points to a configset intended to be the default. Current 'solr.default.confdir' value: null
   [junit4]   2> 62024 INFO  (jetty-launcher-663-thread-4) [n:127.0.0.1:44957_solr    ] o.a.s.c.OverseerElectionContext I am going to be the leader 127.0.0.1:44957_solr
   [junit4]   2> 62024 INFO  (jetty-launcher-663-thread-4) [n:127.0.0.1:44957_solr    ] o.a.s.c.Overseer Overseer (id=72092999907278856-127.0.0.1:44957_solr-n_0000000000) starting
   [junit4]   2> 62054 INFO  (jetty-launcher-663-thread-3) [    ] o.a.s.h.c.HttpShardHandlerFactory Host whitelist initialized: WhitelistHostChecker [whitelistHosts=null, whitelistHostCheckingEnabled=true]
   [junit4]   2> 62065 WARN  (jetty-launcher-663-thread-3) [    ] o.e.j.u.s.S.config No Client EndPointIdentificationAlgorithm configured for SslContextFactory@7d6047be[provider=null,keyStore=null,trustStore=null]
   [junit4]   2> 62066 INFO  (zkConnectionManagerCallback-690-thread-1) [    ] o.a.s.c.c.ConnectionManager zkClient has connected
   [junit4]   2> 62067 INFO  (jetty-launcher-663-thread-4) [n:127.0.0.1:44957_solr    ] o.a.s.c.s.i.ZkClientClusterStateProvider Cluster at 127.0.0.1:35205/solr ready
   [junit4]   2> 62081 WARN  (jetty-launcher-663-thread-3) [    ] o.e.j.u.s.S.config No Client EndPointIdentificationAlgorithm configured for SslContextFactory@1f5380b5[provider=null,keyStore=null,trustStore=null]
   [junit4]   2> 62083 INFO  (jetty-launcher-663-thread-3) [    ] o.a.s.c.ZkContainer Zookeeper client=127.0.0.1:35205/solr
   [junit4]   2> 62102 INFO  (OverseerStateUpdate-72092999907278856-127.0.0.1:44957_solr-n_0000000000) [n:127.0.0.1:44957_solr    ] o.a.s.c.Overseer Starting to work on the main queue : 127.0.0.1:44957_solr
   [junit4]   2> 62125 INFO  (jetty-launcher-663-thread-4) [n:127.0.0.1:44957_solr    ] o.a.s.c.ZkController Register node as live in ZooKeeper:/live_nodes/127.0.0.1:44957_solr
   [junit4]   2> 62130 INFO  (jetty-launcher-663-thread-2) [    ] o.a.s.h.c.HttpShardHandlerFactory Host whitelist initialized: WhitelistHostChecker [whitelistHosts=null, whitelistHostCheckingEnabled=true]
   [junit4]   2> 62168 WARN  (jetty-launcher-663-thread-2) [    ] o.e.j.u.s.S.config No Client EndPointIdentificationAlgorithm configured for SslContextFactory@19a3a81a[provider=null,keyStore=null,trustStore=null]
   [junit4]   2> 62169 INFO  (zkCallback-689-thread-1) [    ] o.a.s.c.c.ZkStateReader Updated live nodes from ZooKeeper... (0) -> (1)
   [junit4]   2> 62170 INFO  (zkCallback-682-thread-1) [    ] o.a.s.c.c.ZkStateReader Updated live nodes from ZooKeeper... (0) -> (1)
   [junit4]   2> 62189 INFO  (zkConnectionManagerCallback-696-thread-1) [    ] o.a.s.c.c.ConnectionManager zkClient has connected
   [junit4]   2> 62208 INFO  (jetty-launcher-663-thread-4) [n:127.0.0.1:44957_solr    ] o.a.s.h.a.MetricsHistoryHandler No .system collection, keeping metrics history in memory.
   [junit4]   2> 62225 INFO  (jetty-launcher-663-thread-4) [n:127.0.0.1:44957_solr    ] o.a.s.m.r.SolrJmxReporter JMX monitoring for 'solr_44957.solr.node' (registry 'solr.node') enabled at server: com.sun.jmx.mbeanserver.JmxMBeanServer@286f585
   [junit4]   2> 62229 WARN  (jetty-launcher-663-thread-2) [    ] o.e.j.u.s.S.config No Client EndPointIdentificationAlgorithm configured for SslContextFactory@34b81365[provider=null,keyStore=null,trustStore=null]
   [junit4]   2> 62230 INFO  (jetty-launcher-663-thread-2) [    ] o.a.s.c.ZkContainer Zookeeper client=127.0.0.1:35205/solr
   [junit4]   2> 62235 INFO  (jetty-launcher-663-thread-4) [n:127.0.0.1:44957_solr    ] o.a.s.m.r.SolrJmxReporter JMX monitoring for 'solr_44957.solr.jvm' (registry 'solr.jvm') enabled at server: com.sun.jmx.mbeanserver.JmxMBeanServer@286f585
   [junit4]   2> 62235 INFO  (jetty-launcher-663-thread-4) [n:127.0.0.1:44957_solr    ] o.a.s.m.r.SolrJmxReporter JMX monitoring for 'solr_44957.solr.jetty' (registry 'solr.jetty') enabled at server: com.sun.jmx.mbeanserver.JmxMBeanServer@286f585
   [junit4]   2> 62236 INFO  (jetty-launcher-663-thread-4) [n:127.0.0.1:44957_solr    ] o.a.s.c.CorePropertiesLocator Found 0 core definitions underneath /home/jenkins/workspace/Lucene-Solr-8.x-Linux/solr/build/solr-solrj/test/J1/temp/solr.client.solrj.io.stream.MathExpressionTest_A509BC20D62CA5C7-001/tempDir-001/node4/.
   [junit4]   2> 62236 INFO  (zkConnectionManagerCallback-701-thread-1) [    ] o.a.s.c.c.ConnectionManager zkClient has connected
   [junit4]   2> 62247 WARN  (jetty-launcher-663-thread-3) [n:127.0.0.1:34361_solr    ] o.a.s.c.ZkController The _default configset could not be uploaded. Please provide 'solr.default.confdir' parameter that points to a configset intended to be the default. Current 'solr.default.confdir' value: null
   [junit4]   2> 62248 INFO  (jetty-launcher-663-thread-3) [n:127.0.0.1:34361_solr    ] o.a.s.c.c.ZkStateReader Updated live nodes from ZooKeeper... (0) -> (1)
   [junit4]   2> 62250 INFO  (jetty-launcher-663-thread-3) [n:127.0.0.1:34361_solr    ] o.a.s.c.ZkController Publish node=127.0.0.1:34361_solr as DOWN
   [junit4]   2> 62250 INFO  (jetty-launcher-663-thread-3) [n:127.0.0.1:34361_solr    ] o.a.s.c.TransientSolrCoreCacheDefault Allocating transient cache for 2147483647 transient cores
   [junit4]   2> 62250 INFO  (jetty-launcher-663-thread-3) [n:127.0.0.1:34361_solr    ] o.a.s.c.ZkController Register node as live in ZooKeeper:/live_nodes/127.0.0.1:34361_solr
   [junit4]   2> 62252 INFO  (zkCallback-689-thread-1) [    ] o.a.s.c.c.ZkStateReader Updated live nodes from ZooKeeper... (1) -> (2)
   [junit4]   2> 62252 INFO  (zkCallback-682-thread-1) [    ] o.a.s.c.c.ZkStateReader Updated live nodes from ZooKeeper... (1) -> (2)
   [junit4]   2> 62277 INFO  (jetty-launcher-663-thread-1) [    ] o.a.s.h.c.HttpShardHandlerFactory Host whitelist initialized: WhitelistHostChecker [whitelistHosts=null, whitelistHostCheckingEnabled=true]
   [junit4]   2> 62296 WARN  (jetty-launcher-663-thread-1) [    ] o.e.j.u.s.S.config No Client EndPointIdentificationAlgorithm configured for SslContextFactory@738081ec[provider=null,keyStore=null,trustStore=null]
   [junit4]   2> 62297 INFO  (zkCallback-700-thread-1) [    ] o.a.s.c.c.ZkStateReader Updated live nodes from ZooKeeper... (1) -> (2)
   [junit4]   2> 62316 INFO  (zkConnectionManagerCallback-705-thread-1) [    ] o.a.s.c.c.ConnectionManager zkClient has connected
   [junit4]   2> 62316 INFO  (zkConnectionManagerCallback-713-thread-1) [    ] o.a.s.c.c.ConnectionManager zkClient has connected
   [junit4]   2> 62332 INFO  (jetty-launcher-663-thread-3) [n:127.0.0.1:34361_solr    ] o.a.s.c.c.ZkStateReader Updated live nodes from ZooKeeper... (0) -> (2)
   [junit4]   2> 62339 INFO  (jetty-launcher-663-thread-3) [n:127.0.0.1:34361_solr    ] o.a.s.c.s.i.ZkClientClusterStateProvider Cluster at 127.0.0.1:35205/solr ready
   [junit4]   2> 62341 WARN  (jetty-launcher-663-thread-1) [    ] o.e.j.u.s.S.config No Client EndPointIdentificationAlgorithm configured for SslContextFactory@6a82e665[provider=null,keyStore=null,trustStore=null]
   [junit4]   2> 62342 INFO  (jetty-launcher-663-thread-1) [    ] o.a.s.c.ZkContainer Zookeeper client=127.0.0.1:35205/solr
   [junit4]   2> 62360 INFO  (jetty-launcher-663-thread-3) [n:127.0.0.1:34361_solr    ] o.a.s.h.a.MetricsHistoryHandler No .system collection, keeping metrics history in memory.
   [junit4]   2> 62412 INFO  (jetty-launcher-663-thread-3) [n:127.0.0.1:34361_solr    ] o.a.s.m.r.SolrJmxReporter JMX monitoring for 'solr_34361.solr.node' (registry 'solr.node') enabled at server: com.sun.jmx.mbeanserver.JmxMBeanServer@286f585
   [junit4]   2> 62420 INFO  (jetty-launcher-663-thread-3) [n:127.0.0.1:34361_solr    ] o.a.s.m.r.SolrJmxReporter JMX monitoring for 'solr_34361.solr.jvm' (registry 'solr.jvm') enabled at server: com.sun.jmx.mbeanserver.JmxMBeanServer@286f585
   [junit4]   2> 62420 INFO  (jetty-launcher-663-thread-3) [n:127.0.0.1:34361_solr    ] o.a.s.m.r.SolrJmxReporter JMX monitoring for 'solr_34361.solr.jetty' (registry 'solr.jetty') enabled at server: com.sun.jmx.mbeanserver.JmxMBeanServer@286f585
   [junit4]   2> 62421 INFO  (jetty-launcher-663-thread-3) [n:127.0.0.1:34361_solr    ] o.a.s.c.CorePropertiesLocator Found 0 core definitions underneath /home/jenkins/workspace/Lucene-Solr-8.x-Linux/solr/build/solr-solrj/test/J1/temp/solr.client.solrj.io.stream.MathExpressionTest_A509BC20D62CA5C7-001/tempDir-001/node3/.
   [junit4]   2> 62440 INFO  (zkConnectionManagerCallback-721-thread-1) [    ] o.a.s.c.c.ConnectionManager zkClient has connected
   [junit4]   2> 62449 INFO  (zkConnectionManagerCallback-717-thread-1) [    ] o.a.s.c.c.ConnectionManager zkClient has connected
   [junit4]   2> 62473 WARN  (jetty-launcher-663-thread-2) [n:127.0.0.1:36597_solr    ] o.a.s.c.ZkController The _default configset could not be uploaded. Please provide 'solr.default.confdir' parameter that points to a configset intended to be the default. Current 'solr.default.confdir' value: null
   [junit4]   2> 62475 INFO  (jetty-launcher-663-thread-2) [n:127.0.0.1:36597_solr    ] o.a.s.c.c.ZkStateReader Updated live nodes from ZooKeeper... (0) -> (2)
   [junit4]   2> 62483 INFO  (jetty-launcher-663-thread-2) [n:127.0.0.1:36597_solr    ] o.a.s.c.ZkController Publish node=127.0.0.1:36597_solr as DOWN
   [junit4]   2> 62485 INFO  (jetty-launcher-663-thread-2) [n:127.0.0.1:36597_solr    ] o.a.s.c.TransientSolrCoreCacheDefault Allocating transient cache for 2147483647 transient cores
   [junit4]   2> 62485 INFO  (jetty-launcher-663-thread-2) [n:127.0.0.1:36597_solr    ] o.a.s.c.ZkController Register node as live in ZooKeeper:/live_nodes/127.0.0.1:36597_solr
   [junit4]   2> 62487 INFO  (zkCallback-700-thread-1) [    ] o.a.s.c.c.ZkStateReader Updated live nodes from ZooKeeper... (2) -> (3)
   [junit4]   2> 62487 INFO  (zkCallback-689-thread-1) [    ] o.a.s.c.c.ZkStateReader Updated live nodes from ZooKeeper... (2) -> (3)
   [junit4]   2> 62487 INFO  (zkCallback-682-thread-1) [    ] o.a.s.c.c.ZkStateReader Updated live nodes from ZooKeeper... (2) -> (3)
   [junit4]   2> 62513 INFO  (zkCallback-712-thread-1) [    ] o.a.s.c.c.ZkStateReader Updated live nodes from ZooKeeper... (2) -> (3)
   [junit4]   2> 62540 INFO  (zkCallback-716-thread-1) [    ] o.a.s.c.c.ZkStateReader Updated live nodes from ZooKeeper... (2) -> (3)
   [junit4]   2> 62560 INFO  (zkConnectionManagerCallback-723-thread-1) [    ] o.a.s.c.c.ConnectionManager zkClient has connected
   [junit4]   2> 62563 WARN  (jetty-launcher-663-thread-1) [n:127.0.0.1:39085_solr    ] o.a.s.c.ZkController The _default configset could not be uploaded. Please provide 'solr.default.confdir' parameter that points to a configset intended to be the default. Current 'solr.default.confdir' value: null
   [junit4]   2> 62578 INFO  (jetty-launcher-663-thread-1) [n:127.0.0.1:39085_solr    ] o.a.s.c.c.ZkStateReader Updated live nodes from ZooKeeper... (0) -> (3)
   [junit4]   2> 62580 INFO  (jetty-launcher-663-thread-1) [n:127.0.0.1:39085_solr    ] o.a.s.c.ZkController Publish node=127.0.0.1:39085_solr as DOWN
   [junit4]   2> 62580 INFO  (jetty-launcher-663-thread-1) [n:127.0.0.1:39085_solr    ] o.a.s.c.TransientSolrCoreCacheDefault Allocating transient cache for 2147483647 transient cores
   [junit4]   2> 62580 INFO  (jetty-launcher-663-thread-1) [n:127.0.0.1:39085_solr    ] o.a.s.c.ZkController Register node as live in ZooKeeper:/live_nodes/127.0.0.1:39085_solr
   [junit4]   2> 62581 INFO  (zkCallback-716-thread-1) [    ] o.a.s.c.c.ZkStateReader Updated live nodes from ZooKeeper... (3) -> (4)
   [junit4]   2> 62582 INFO  (zkCallback-700-thread-1) [    ] o.a.s.c.c.ZkStateReader Updated live nodes from ZooKeeper... (3) -> (4)
   [junit4]   2> 62582 INFO  (zkCallback-689-thread-1) [    ] o.a.s.c.c.ZkStateReader Updated live nodes from ZooKeeper... (3) -> (4)
   [junit4]   2> 62585 INFO  (zkCallback-712-thread-1) [    ] o.a.s.c.c.ZkStateReader Updated live nodes from ZooKeeper... (3) -> (4)
   [junit4]   2> 62586 INFO  (zkCallback-682-thread-1) [    ] o.a.s.c.c.ZkStateReader Updated live nodes from ZooKeeper... (3) -> (4)
   [junit4]   2> 62609 INFO  (zkCallback-722-thread-1) [    ] o.a.s.c.c.ZkStateReader Updated live nodes from ZooKeeper... (3) -> (4)
   [junit4]   2> 62636 INFO  (zkConnectionManagerCallback-730-thread-1) [    ] o.a.s.c.c.ConnectionManager zkClient has connected
   [junit4]   2> 62637 INFO  (jetty-launcher-663-thread-2) [n:127.0.0.1:36597_solr    ] o.a.s.c.c.ZkStateReader Updated live nodes from ZooKeeper... (0) -> (4)
   [junit4]   2> 62638 INFO  (jetty-launcher-663-thread-2) [n:127.0.0.1:36597_solr    ] o.a.s.c.s.i.ZkClientClusterStateProvider Cluster at 127.0.0.1:35205/solr ready
   [junit4]   2> 62644 INFO  (zkConnectionManagerCallback-737-thread-1) [    ] o.a.s.c.c.ConnectionManager zkClient has connected
   [junit4]   2> 62647 INFO  (jetty-launcher-663-thread-1) [n:127.0.0.1:39085_solr    ] o.a.s.c.c.ZkStateReader Updated live nodes from ZooKeeper... (0) -> (4)
   [junit4]   2> 62649 INFO  (jetty-launcher-663-thread-1) [n:127.0.0.1:39085_solr    ] o.a.s.c.s.i.ZkClientClusterStateProvider Cluster at 127.0.0.1:35205/solr ready
   [junit4]   2> 62667 INFO  (jetty-launcher-663-thread-2) [n:127.0.0.1:36597_solr    ] o.a.s.h.a.MetricsHistoryHandler No .system collection, keeping metrics history in memory.
   [junit4]   2> 62681 INFO  (jetty-launcher-663-thread-2) [n:127.0.0.1:36597_solr    ] o.a.s.m.r.SolrJmxReporter JMX monitoring for 'solr_36597.solr.node' (registry 'solr.node') enabled at server: com.sun.jmx.mbeanserver.JmxMBeanServer@286f585
   [junit4]   2> 62688 INFO  (jetty-launcher-663-thread-1) [n:127.0.0.1:39085_solr    ] o.a.s.h.a.MetricsHistoryHandler No .system collection, keeping metrics history in memory.
   [junit4]   2> 62702 INFO  (jetty-launcher-663-thread-1) [n:127.0.0.1:39085_solr    ] o.a.s.m.r.SolrJmxReporter JMX monitoring for 'solr_39085.solr.node' (registry 'solr.node') enabled at server: com.sun.jmx.mbeanserver.JmxMBeanServer@286f585
   [junit4]   2> 62708 INFO  (jetty-launcher-663-thread-2) [n:127.0.0.1:36597_solr    ] o.a.s.m.r.SolrJmxReporter JMX monitoring for 'solr_36597.solr.jvm' (registry 'solr.jvm') enabled at server: com.sun.jmx.mbeanserver.JmxMBeanServer@286f585
   [junit4]   2> 62708 INFO  (jetty-launcher-663-thread-2) [n:127.0.0.1:36597_solr    ] o.a.s.m.r.SolrJmxReporter JMX monitoring for 'solr_36597.solr.jetty' (registry 'solr.jetty') enabled at server: com.sun.jmx.mbeanserver.JmxMBeanServer@286f585
   [junit4]   2> 62709 INFO  (jetty-launcher-663-thread-2) [n:127.0.0.1:36597_solr    ] o.a.s.c.CorePropertiesLocator Found 0 core definitions underneath /home/jenkins/workspace/Lucene-Solr-8.x-Linux/solr/build/solr-solrj/test/J1/temp/solr.client.solrj.io.stream.MathExpressionTest_A509BC20D62CA5C7-001/tempDir-001/node2/.
   [junit4]   2> 62713 INFO  (jetty-launcher-663-thread-1) [n:127.0.0.1:39085_solr    ] o.a.s.m.r.SolrJmxReporter JMX monitoring for 'solr_39085.solr.jvm' (registry 'solr.jvm') enabled at server: com.sun.jmx.mbeanserver.JmxMBeanServer@286f585
   [junit4]   2> 62713 INFO  (jetty-launcher-663-thread-1) [n:127.0.0.1:39085_solr    ] o.a.s.m.r.SolrJmxReporter JMX monitoring for 'solr_39085.solr.jetty' (registry 'solr.jetty') enabled at server: com.sun.jmx.mbeanserver.JmxMBeanServer@286f585
   [junit4]   2> 62714 INFO  (jetty-launcher-663-thread-1) [n:127.0.0.1:39085_solr    ] o.a.s.c.CorePropertiesLocator Found 0 core definitions underneath /home/jenkins/workspace/Lucene-Solr-8.x-Linux/solr/build/solr-solrj/test/J1/temp/solr.client.solrj.io.stream.MathExpressionTest_A509BC20D62CA5C7-001/tempDir-001/node1/.
   [junit4]   2> 62794 INFO  (zkConnectionManagerCallback-744-thread-1) [    ] o.a.s.c.c.ConnectionManager zkClient has connected
   [junit4]   2> 62795 INFO  (SUITE-MathExpressionTest-seed#[A509BC20D62CA5C7]-worker) [    ] o.a.s.c.c.ZkStateReader Updated live nodes from ZooKeeper... (0) -> (4)
   [junit4]   2> 62795 INFO  (SUITE-MathExpressionTest-seed#[A509BC20D62CA5C7]-worker) [    ] o.a.s.c.s.i.ZkClientClusterStateProvider Cluster at 127.0.0.1:35205/solr ready
   [junit4]   2> 62816 INFO  (qtp1552778501-1566) [n:127.0.0.1:44957_solr    ] o.a.s.h.a.CollectionsHandler Invoked Collection Action :create with params collection.configName=conf&name=collection1_collection&nrtReplicas=1&action=CREATE&numShards=2&wt=javabin&version=2 and sendToOCPQueue=true
   [junit4]   2> 62823 INFO  (OverseerThreadFactory-343-thread-1-processing-n:127.0.0.1:44957_solr) [n:127.0.0.1:44957_solr    ] o.a.s.c.a.c.CreateCollectionCmd Create collection collection1_collection
   [junit4]   2> 62940 INFO  (OverseerStateUpdate-72092999907278856-127.0.0.1:44957_solr-n_0000000000) [n:127.0.0.1:44957_solr    ] o.a.s.c.o.SliceMutator createReplica() {
   [junit4]   2>   "operation":"ADDREPLICA",
   [junit4]   2>   "collection":"collection1_collection",
   [junit4]   2>   "shard":"shard1",
   [junit4]   2>   "core":"collection1_collection_shard1_replica_n1",
   [junit4]   2>   "state":"down",
   [junit4]   2>   "base_url":"http://127.0.0.1:44957/solr",
   [junit4]   2>   "type":"NRT",
   [junit4]   2>   "waitForFinalState":"false"}
   [junit4]   2> 62944 INFO  (OverseerStateUpdate-72092999907278856-127.0.0.1:44957_solr-n_0000000000) [n:127.0.0.1:44957_solr    ] o.a.s.c.o.SliceMutator createReplica() {
   [junit4]   2>   "operation":"ADDREPLICA",
   [junit4]   2>   "collection":"collection1_collection",
   [junit4]   2>   "shard":"shard2",
   [junit4]   2>   "core":"collection1_collection_shard2_replica_n3",
   [junit4]   2>   "state":"down",
   [junit4]   2>   "base_url":"http://127.0.0.1:36597/solr",
   [junit4]   2>   "type":"NRT",
   [junit4]   2>   "waitForFinalState":"false"}
   [junit4]   2> 63146 INFO  (qtp1758990954-1567) [n:127.0.0.1:36597_solr    x:collection1_collection_shard2_replica_n3] o.a.s.h.a.CoreAdminOperation core create command qt=/admin/cores&coreNodeName=core_node4&collection.configName=conf&newCollection=true&name=collection1_collection_shard2_replica_n3&action=CREATE&numShards=2&collection=collection1_collection&shard=shard2&wt=javabin&version=2&replicaType=NRT
   [junit4]   2> 63146 INFO  (qtp1552778501-1564) [n:127.0.0.1:44957_solr    x:collection1_collection_shard1_replica_n1] o.a.s.h.a.CoreAdminOperation core create command qt=/admin/cores&coreNodeName=core_node2&collection.configName=conf&newCollection=true&name=collection1_collection_shard1_replica_n1&action=CREATE&numShards=2&collection=collection1_collection&shard=shard1&wt=javabin&version=2&replicaType=NRT
   [junit4]   2> 63147 INFO  (qtp1552778501-1564) [n:127.0.0.1:44957_solr    x:collection1_collection_shard1_replica_n1] o.a.s.c.TransientSolrCoreCacheDefault Allocating transient cache for 2147483647 transient cores
   [junit4]   2> 64157 INFO  (qtp1552778501-1564) [n:127.0.0.1:44957_solr c:collection1_collection s:shard1 r:core_node2 x:collection1_collection_shard1_replica_n1] o.a.s.c.SolrConfig Using Lucene MatchVersion: 8.1.0
   [junit4]   2> 64162 INFO  (qtp1758990954-1567) [n:127.0.0.1:36597_solr c:collection1_collection s:shard2 r:core_node4 x:collection1_collection_shard2_replica_n3] o.a.s.c.SolrConfig Using Lucene MatchVersion: 8.1.0
   [junit4]   2> 64169 INFO  (qtp1552778501-1564) [n:127.0.0.1:44957_solr c:collection1_collection s:shard1 r:core_node2 x:collection1_collection_shard1_replica_n1] o.a.s.s.IndexSchema [collection1_collection_shard1_replica_n1] Schema name=test
   [junit4]   2> 64170 INFO  (qtp1758990954-1567) [n:127.0.0.1:36597_solr c:collection1_collection s:shard2 r:core_node4 x:collection1_collection_shard2_replica_n3] o.a.s.s.IndexSchema [collection1_collection_shard2_replica_n3] Schema name=test
   [junit4]   2> 64172 WARN  (qtp1758990954-1567) [n:127.0.0.1:36597_solr c:collection1_collection s:shard2 r:core_node4 x:collection1_collection_shard2_replica_n3] o.a.s.c.SolrResourceLoader Solr loaded a deprecated plugin/analysis class [solr.TrieIntField]. Please consult documentation how to replace it accordingly.
   [junit4]   2> 64172 WARN  (qtp1552778501-1564) [n:127.0.0.1:44957_solr c:collection1_collection s:shard1 r:core_node2 x:collection1_collection_shard1_replica_n1] o.a.s.c.SolrResourceLoader Solr loaded a deprecated plugin/analysis class [solr.TrieIntField]. Please consult documentation how to replace it accordingly.
   [junit4]   2> 64173 WARN  (qtp1758990954-1567) [n:127.0.0.1:36597_solr c:collection1_collection s:shard2 r:core_node4 x:collection1_collection_shard2_replica_n3] o.a.s.c.SolrResourceLoader Solr loaded a deprecated plugin/analysis class [solr.TrieFloatField]. Please consult documentation how to replace it accordingly.
   [junit4]   2> 64173 WARN  (qtp1552778501-1564) [n:127.0.0.1:44957_solr c:collection1_collection s:shard1 r:core_node2 x:collection1_collection_shard1_replica_n1] o.a.s.c.SolrResourceLoader Solr loaded a deprecated plugin/analysis class [solr.TrieFloatField]. Please consult documentation how to replace it accordingly.
   [junit4]   2> 64179 WARN  (qtp1758990954-1567) [n:127.0.0.1:36597_solr c:collection1_collection s:shard2 r:core_node4 x:collection1_collection_shard2_replica_n3] o.a.s.c.SolrResourceLoader Solr loaded a deprecated plugin/analysis class [solr.TrieLongField]. Please consult documentation how to replace it accordingly.
   [junit4]   2> 64179 WARN  (qtp1552778501-1564) [n:127.0.0.1:44957_solr c:collection1_collection s:shard1 r:core_node2 x:collection1_collection_shard1_replica_n1] o.a.s.c.SolrResourceLoader Solr loaded a deprecated plugin/analysis class [solr.TrieLongField]. Please consult documentation how to replace it accordingly.
   [junit4]   2> 64180 WARN  (qtp1758990954-1567) [n:127.0.0.1:36597_solr c:collection1_collection s:shard2 r:core_node4 x:collection1_collection_shard2_replica_n3] o.a.s.c.SolrResourceLoader Solr loaded a deprecated plugin/analysis class [solr.TrieDoubleField]. Please consult documentation how to replace it accordingly.
   [junit4]   2> 64180 WARN  (qtp1552778501-1564) [n:127.0.0.1:44957_solr c:collection1_collection s:shard1 r:core_node2 x:collection1_collection_shard1_replica_n1] o.a.s.c.SolrResourceLoader Solr loaded a deprecated plugin/analysis class [solr.TrieDoubleField]. Please consult documentation how to replace it accordingly.
   [junit4]   2> 64186 WARN  (qtp1758990954-1567) [n:127.0.0.1:36597_solr c:collection1_collection s:shard2 r:core_node4 x:collection1_collection_shard2_replica_n3] o.a.s.c.SolrResourceLoader Solr loaded a deprecated plugin/analysis class [solr.TrieDateField]. Please consult documentation how to replace it accordingly.
   [junit4]   2> 64186 WARN  (qtp1552778501-1564) [n:127.0.0.1:44957_solr c:collection1_collection s:shard1 r:core_node2 x:collection1_collection_shard1_replica_n1] o.a.s.c.SolrResourceLoader Solr loaded a deprecated plugin/analysis class [solr.TrieDate

[...truncated too long message...]

t empty, see: /home/jenkins/workspace/Lucene-Solr-8.x-Linux/solr/build/contrib/solr-dataimporthandler/test/temp/junit4-J0-20190416_200702_2533829507482702759972.syserr
   [junit4] >>> JVM J0 emitted unexpected output (verbatim) ----
   [junit4] OpenJDK 64-Bit Server VM warning: Option UseConcMarkSweepGC was deprecated in version 9.0 and will likely be removed in a future release.
   [junit4] <<< JVM J0: EOF ----

[...truncated 3 lines...]
   [junit4] JVM J2: stderr was not empty, see: /home/jenkins/workspace/Lucene-Solr-8.x-Linux/solr/build/contrib/solr-dataimporthandler/test/temp/junit4-J2-20190416_200702_25416391122184456648174.syserr
   [junit4] >>> JVM J2 emitted unexpected output (verbatim) ----
   [junit4] OpenJDK 64-Bit Server VM warning: Option UseConcMarkSweepGC was deprecated in version 9.0 and will likely be removed in a future release.
   [junit4] <<< JVM J2: EOF ----

[...truncated 573 lines...]
   [junit4] JVM J1: stderr was not empty, see: /home/jenkins/workspace/Lucene-Solr-8.x-Linux/solr/build/contrib/solr-cell/test/temp/junit4-J1-20190416_200730_6492857717184406166419.syserr
   [junit4] >>> JVM J1 emitted unexpected output (verbatim) ----
   [junit4] OpenJDK 64-Bit Server VM warning: Option UseConcMarkSweepGC was deprecated in version 9.0 and will likely be removed in a future release.
   [junit4] <<< JVM J1: EOF ----

[...truncated 3 lines...]
   [junit4] JVM J2: stderr was not empty, see: /home/jenkins/workspace/Lucene-Solr-8.x-Linux/solr/build/contrib/solr-cell/test/temp/junit4-J2-20190416_200730_6495259928917786844340.syserr
   [junit4] >>> JVM J2 emitted unexpected output (verbatim) ----
   [junit4] OpenJDK 64-Bit Server VM warning: Option UseConcMarkSweepGC was deprecated in version 9.0 and will likely be removed in a future release.
   [junit4] <<< JVM J2: EOF ----

[...truncated 3 lines...]
   [junit4] JVM J0: stderr was not empty, see: /home/jenkins/workspace/Lucene-Solr-8.x-Linux/solr/build/contrib/solr-cell/test/temp/junit4-J0-20190416_200730_6498129898733883457243.syserr
   [junit4] >>> JVM J0 emitted unexpected output (verbatim) ----
   [junit4] OpenJDK 64-Bit Server VM warning: Option UseConcMarkSweepGC was deprecated in version 9.0 and will likely be removed in a future release.
   [junit4] <<< JVM J0: EOF ----

[...truncated 584 lines...]
   [junit4] JVM J0: stderr was not empty, see: /home/jenkins/workspace/Lucene-Solr-8.x-Linux/solr/build/contrib/solr-langid/test/temp/junit4-J0-20190416_200744_6755107533899128858121.syserr
   [junit4] >>> JVM J0 emitted unexpected output (verbatim) ----
   [junit4] OpenJDK 64-Bit Server VM warning: Option UseConcMarkSweepGC was deprecated in version 9.0 and will likely be removed in a future release.
   [junit4] <<< JVM J0: EOF ----

[...truncated 3 lines...]
   [junit4] JVM J1: stderr was not empty, see: /home/jenkins/workspace/Lucene-Solr-8.x-Linux/solr/build/contrib/solr-langid/test/temp/junit4-J1-20190416_200744_67515334904219731527791.syserr
   [junit4] >>> JVM J1 emitted unexpected output (verbatim) ----
   [junit4] OpenJDK 64-Bit Server VM warning: Option UseConcMarkSweepGC was deprecated in version 9.0 and will likely be removed in a future release.
   [junit4] <<< JVM J1: EOF ----

   [junit4] JVM J2: stderr was not empty, see: /home/jenkins/workspace/Lucene-Solr-8.x-Linux/solr/build/contrib/solr-langid/test/temp/junit4-J2-20190416_200744_6755122679980932446533.syserr
   [junit4] >>> JVM J2 emitted unexpected output (verbatim) ----
   [junit4] OpenJDK 64-Bit Server VM warning: Option UseConcMarkSweepGC was deprecated in version 9.0 and will likely be removed in a future release.
   [junit4] <<< JVM J2: EOF ----

[...truncated 682 lines...]
   [junit4] JVM J1: stderr was not empty, see: /home/jenkins/workspace/Lucene-Solr-8.x-Linux/solr/build/contrib/solr-ltr/test/temp/junit4-J1-20190416_200756_2721137187224847585246.syserr
   [junit4] >>> JVM J1 emitted unexpected output (verbatim) ----
   [junit4] OpenJDK 64-Bit Server VM warning: Option UseConcMarkSweepGC was deprecated in version 9.0 and will likely be removed in a future release.
   [junit4] <<< JVM J1: EOF ----

[...truncated 3 lines...]
   [junit4] JVM J2: stderr was not empty, see: /home/jenkins/workspace/Lucene-Solr-8.x-Linux/solr/build/contrib/solr-ltr/test/temp/junit4-J2-20190416_200756_27211028156112152128355.syserr
   [junit4] >>> JVM J2 emitted unexpected output (verbatim) ----
   [junit4] OpenJDK 64-Bit Server VM warning: Option UseConcMarkSweepGC was deprecated in version 9.0 and will likely be removed in a future release.
   [junit4] <<< JVM J2: EOF ----

[...truncated 3 lines...]
   [junit4] JVM J0: stderr was not empty, see: /home/jenkins/workspace/Lucene-Solr-8.x-Linux/solr/build/contrib/solr-ltr/test/temp/junit4-J0-20190416_200756_27213393492060204968294.syserr
   [junit4] >>> JVM J0 emitted unexpected output (verbatim) ----
   [junit4] OpenJDK 64-Bit Server VM warning: Option UseConcMarkSweepGC was deprecated in version 9.0 and will likely be removed in a future release.
   [junit4] <<< JVM J0: EOF ----

[...truncated 581 lines...]
   [junit4] JVM J2: stderr was not empty, see: /home/jenkins/workspace/Lucene-Solr-8.x-Linux/solr/build/contrib/solr-prometheus-exporter/test/temp/junit4-J2-20190416_200829_1943569165029803136562.syserr
   [junit4] >>> JVM J2 emitted unexpected output (verbatim) ----
   [junit4] OpenJDK 64-Bit Server VM warning: Option UseConcMarkSweepGC was deprecated in version 9.0 and will likely be removed in a future release.
   [junit4] <<< JVM J2: EOF ----

[...truncated 3 lines...]
   [junit4] JVM J0: stderr was not empty, see: /home/jenkins/workspace/Lucene-Solr-8.x-Linux/solr/build/contrib/solr-prometheus-exporter/test/temp/junit4-J0-20190416_200829_1945072264335109882381.syserr
   [junit4] >>> JVM J0 emitted unexpected output (verbatim) ----
   [junit4] OpenJDK 64-Bit Server VM warning: Option UseConcMarkSweepGC was deprecated in version 9.0 and will likely be removed in a future release.
   [junit4] <<< JVM J0: EOF ----

[...truncated 3 lines...]
   [junit4] JVM J1: stderr was not empty, see: /home/jenkins/workspace/Lucene-Solr-8.x-Linux/solr/build/contrib/solr-prometheus-exporter/test/temp/junit4-J1-20190416_200829_19418168325609855100143.syserr
   [junit4] >>> JVM J1 emitted unexpected output (verbatim) ----
   [junit4] OpenJDK 64-Bit Server VM warning: Option UseConcMarkSweepGC was deprecated in version 9.0 and will likely be removed in a future release.
   [junit4] <<< JVM J1: EOF ----

[...truncated 569 lines...]
   [junit4] JVM J0: stderr was not empty, see: /home/jenkins/workspace/Lucene-Solr-8.x-Linux/solr/build/contrib/solr-velocity/test/temp/junit4-J0-20190416_200850_29514275442979562630032.syserr
   [junit4] >>> JVM J0 emitted unexpected output (verbatim) ----
   [junit4] OpenJDK 64-Bit Server VM warning: Option UseConcMarkSweepGC was deprecated in version 9.0 and will likely be removed in a future release.
   [junit4] <<< JVM J0: EOF ----

[...truncated 34162 lines...]
[repro] Jenkins log URL: https://jenkins.thetaphi.de/job/Lucene-Solr-8.x-Linux/412/consoleText

[repro] Revision: 16243311ba6496ab7b6070d4a1ffd981c17664f8

[repro] Ant options: "-Dargs=-XX:-UseCompressedOops -XX:+UseConcMarkSweepGC"
[repro] Repro line:  ant test  -Dtestcase=MathExpressionTest -Dtests.method=testGammaDistribution -Dtests.seed=A509BC20D62CA5C7 -Dtests.multiplier=3 -Dtests.slow=true -Dtests.locale=sl -Dtests.timezone=America/Halifax -Dtests.asserts=true -Dtests.file.encoding=ISO-8859-1

[repro] Repro line:  ant test  -Dtestcase=StreamDecoratorTest -Dtests.method=testParallelTerminatingDaemonUpdateStream -Dtests.seed=A509BC20D62CA5C7 -Dtests.multiplier=3 -Dtests.slow=true -Dtests.locale=sr-Cyrl-RS -Dtests.timezone=Pacific/Tahiti -Dtests.asserts=true -Dtests.file.encoding=ISO-8859-1

[repro] ant clean

[...truncated 6 lines...]
[repro] Test suites by module:
[repro]    solr/solrj
[repro]       MathExpressionTest
[repro]       StreamDecoratorTest
[repro] ant compile-test

[...truncated 2717 lines...]
[repro] ant test-nocompile -Dtests.dups=5 -Dtests.maxfailures=10 -Dtests.class="*.MathExpressionTest|*.StreamDecoratorTest" -Dtests.showOutput=onerror "-Dargs=-XX:-UseCompressedOops -XX:+UseConcMarkSweepGC" -Dtests.seed=A509BC20D62CA5C7 -Dtests.multiplier=3 -Dtests.slow=true -Dtests.locale=sl -Dtests.timezone=America/Halifax -Dtests.asserts=true -Dtests.file.encoding=ISO-8859-1

[...truncated 798 lines...]
   [junit4] JVM J2: stderr was not empty, see: /home/jenkins/workspace/Lucene-Solr-8.x-Linux/solr/build/solr-solrj/test/temp/junit4-J2-20190416_201141_6334193351395919749465.syserr
   [junit4] >>> JVM J2 emitted unexpected output (verbatim) ----
   [junit4] OpenJDK 64-Bit Server VM warning: Option UseConcMarkSweepGC was deprecated in version 9.0 and will likely be removed in a future release.
   [junit4] <<< JVM J2: EOF ----

[...truncated 104 lines...]
   [junit4] JVM J1: stderr was not empty, see: /home/jenkins/workspace/Lucene-Solr-8.x-Linux/solr/build/solr-solrj/test/temp/junit4-J1-20190416_201141_6336921229595670346684.syserr
   [junit4] >>> JVM J1 emitted unexpected output (verbatim) ----
   [junit4] OpenJDK 64-Bit Server VM warning: Option UseConcMarkSweepGC was deprecated in version 9.0 and will likely be removed in a future release.
   [junit4] <<< JVM J1: EOF ----

   [junit4] JVM J0: stderr was not empty, see: /home/jenkins/workspace/Lucene-Solr-8.x-Linux/solr/build/solr-solrj/test/temp/junit4-J0-20190416_201141_6333775726222628290851.syserr
   [junit4] >>> JVM J0 emitted unexpected output (verbatim) ----
   [junit4] OpenJDK 64-Bit Server VM warning: Option UseConcMarkSweepGC was deprecated in version 9.0 and will likely be removed in a future release.
   [junit4] <<< JVM J0: EOF ----

[...truncated 23 lines...]
[repro] Failures:
[repro]   0/5 failed: org.apache.solr.client.solrj.io.stream.MathExpressionTest
[repro]   0/5 failed: org.apache.solr.client.solrj.io.stream.StreamDecoratorTest
[repro] Exiting with code 0

[...truncated 43 lines...]


---------------------------------------------------------------------
To unsubscribe, e-mail: [hidden email]
For additional commands, e-mail: [hidden email]