[JENKINS] Lucene-Solr-BadApples-Tests-8.x - Build # 39 - Unstable

classic Classic list List threaded Threaded
2 messages Options
Reply | Threaded
Open this post in threaded view
|

[JENKINS] Lucene-Solr-BadApples-Tests-8.x - Build # 39 - Unstable

Apache Jenkins Server-2
Build: https://builds.apache.org/job/Lucene-Solr-BadApples-Tests-8.x/39/

1 tests failed.
FAILED:  org.apache.solr.cloud.ShardRoutingTest.test

Error Message:
expected:<3> but was:<26>

Stack Trace:
java.lang.AssertionError: expected:<3> but was:<26>
        at __randomizedtesting.SeedInfo.seed([41FCD82A9E68FB97:C9A8E7F03094966F]:0)
        at org.junit.Assert.fail(Assert.java:88)
        at org.junit.Assert.failNotEquals(Assert.java:834)
        at org.junit.Assert.assertEquals(Assert.java:645)
        at org.junit.Assert.assertEquals(Assert.java:631)
        at org.apache.solr.cloud.ShardRoutingTest.doTestNumRequests(ShardRoutingTest.java:256)
        at org.apache.solr.cloud.ShardRoutingTest.test(ShardRoutingTest.java:110)
        at sun.reflect.NativeMethodAccessorImpl.invoke0(Native Method)
        at sun.reflect.NativeMethodAccessorImpl.invoke(NativeMethodAccessorImpl.java:62)
        at sun.reflect.DelegatingMethodAccessorImpl.invoke(DelegatingMethodAccessorImpl.java:43)
        at java.lang.reflect.Method.invoke(Method.java:498)
        at com.carrotsearch.randomizedtesting.RandomizedRunner.invoke(RandomizedRunner.java:1750)
        at com.carrotsearch.randomizedtesting.RandomizedRunner$8.evaluate(RandomizedRunner.java:938)
        at com.carrotsearch.randomizedtesting.RandomizedRunner$9.evaluate(RandomizedRunner.java:974)
        at com.carrotsearch.randomizedtesting.RandomizedRunner$10.evaluate(RandomizedRunner.java:988)
        at org.apache.solr.BaseDistributedSearchTestCase$ShardsRepeatRule$ShardsFixedStatement.callStatement(BaseDistributedSearchTestCase.java:1082)
        at org.apache.solr.BaseDistributedSearchTestCase$ShardsRepeatRule$ShardsStatement.evaluate(BaseDistributedSearchTestCase.java:1054)
        at com.carrotsearch.randomizedtesting.rules.SystemPropertiesRestoreRule$1.evaluate(SystemPropertiesRestoreRule.java:57)
        at org.apache.lucene.util.TestRuleSetupTeardownChained$1.evaluate(TestRuleSetupTeardownChained.java:49)
        at org.apache.lucene.util.AbstractBeforeAfterRule$1.evaluate(AbstractBeforeAfterRule.java:45)
        at org.apache.lucene.util.TestRuleThreadAndTestName$1.evaluate(TestRuleThreadAndTestName.java:48)
        at org.apache.lucene.util.TestRuleIgnoreAfterMaxFailures$1.evaluate(TestRuleIgnoreAfterMaxFailures.java:64)
        at org.apache.lucene.util.TestRuleMarkFailure$1.evaluate(TestRuleMarkFailure.java:47)
        at com.carrotsearch.randomizedtesting.rules.StatementAdapter.evaluate(StatementAdapter.java:36)
        at com.carrotsearch.randomizedtesting.ThreadLeakControl$StatementRunner.run(ThreadLeakControl.java:368)
        at com.carrotsearch.randomizedtesting.ThreadLeakControl.forkTimeoutingTask(ThreadLeakControl.java:817)
        at com.carrotsearch.randomizedtesting.ThreadLeakControl$3.evaluate(ThreadLeakControl.java:468)
        at com.carrotsearch.randomizedtesting.RandomizedRunner.runSingleTest(RandomizedRunner.java:947)
        at com.carrotsearch.randomizedtesting.RandomizedRunner$5.evaluate(RandomizedRunner.java:832)
        at com.carrotsearch.randomizedtesting.RandomizedRunner$6.evaluate(RandomizedRunner.java:883)
        at com.carrotsearch.randomizedtesting.RandomizedRunner$7.evaluate(RandomizedRunner.java:894)
        at com.carrotsearch.randomizedtesting.rules.StatementAdapter.evaluate(StatementAdapter.java:36)
        at com.carrotsearch.randomizedtesting.rules.SystemPropertiesRestoreRule$1.evaluate(SystemPropertiesRestoreRule.java:57)
        at org.apache.lucene.util.AbstractBeforeAfterRule$1.evaluate(AbstractBeforeAfterRule.java:45)
        at com.carrotsearch.randomizedtesting.rules.StatementAdapter.evaluate(StatementAdapter.java:36)
        at org.apache.lucene.util.TestRuleStoreClassName$1.evaluate(TestRuleStoreClassName.java:41)
        at com.carrotsearch.randomizedtesting.rules.NoShadowingOrOverridesOnMethodsRule$1.evaluate(NoShadowingOrOverridesOnMethodsRule.java:40)
        at com.carrotsearch.randomizedtesting.rules.NoShadowingOrOverridesOnMethodsRule$1.evaluate(NoShadowingOrOverridesOnMethodsRule.java:40)
        at com.carrotsearch.randomizedtesting.rules.StatementAdapter.evaluate(StatementAdapter.java:36)
        at com.carrotsearch.randomizedtesting.rules.StatementAdapter.evaluate(StatementAdapter.java:36)
        at com.carrotsearch.randomizedtesting.rules.StatementAdapter.evaluate(StatementAdapter.java:36)
        at org.apache.lucene.util.TestRuleAssertionsRequired$1.evaluate(TestRuleAssertionsRequired.java:53)
        at org.apache.lucene.util.TestRuleMarkFailure$1.evaluate(TestRuleMarkFailure.java:47)
        at org.apache.lucene.util.TestRuleIgnoreAfterMaxFailures$1.evaluate(TestRuleIgnoreAfterMaxFailures.java:64)
        at org.apache.lucene.util.TestRuleIgnoreTestSuites$1.evaluate(TestRuleIgnoreTestSuites.java:54)
        at com.carrotsearch.randomizedtesting.rules.StatementAdapter.evaluate(StatementAdapter.java:36)
        at com.carrotsearch.randomizedtesting.ThreadLeakControl$StatementRunner.run(ThreadLeakControl.java:368)
        at java.lang.Thread.run(Thread.java:748)




Build Log:
[...truncated 13150 lines...]
   [junit4] Suite: org.apache.solr.cloud.ShardRoutingTest
   [junit4]   2> Creating dataDir: /home/jenkins/jenkins-slave/workspace/Lucene-Solr-BadApples-Tests-8.x/solr/build/solr-core/test/J0/temp/solr.cloud.ShardRoutingTest_41FCD82A9E68FB97-001/init-core-data-001
   [junit4]   2> 1241148 WARN  (SUITE-ShardRoutingTest-seed#[41FCD82A9E68FB97]-worker) [    ] o.a.s.SolrTestCaseJ4 startTrackingSearchers: numOpens=1 numCloses=1
   [junit4]   2> 1241148 INFO  (SUITE-ShardRoutingTest-seed#[41FCD82A9E68FB97]-worker) [    ] o.a.s.SolrTestCaseJ4 Using TrieFields (NUMERIC_POINTS_SYSPROP=false) w/NUMERIC_DOCVALUES_SYSPROP=true
   [junit4]   2> 1241203 INFO  (SUITE-ShardRoutingTest-seed#[41FCD82A9E68FB97]-worker) [    ] o.a.s.SolrTestCaseJ4 Randomized ssl (true) and clientAuth (false) via: @org.apache.solr.util.RandomizeSSL(reason=, ssl=NaN, value=NaN, clientAuth=NaN)
   [junit4]   2> 1241203 INFO  (SUITE-ShardRoutingTest-seed#[41FCD82A9E68FB97]-worker) [    ] o.a.s.SolrTestCaseJ4 SecureRandom sanity checks: test.solr.allowed.securerandom=null & java.security.egd=file:/dev/./urandom
   [junit4]   2> 1241203 INFO  (SUITE-ShardRoutingTest-seed#[41FCD82A9E68FB97]-worker) [    ] o.a.s.BaseDistributedSearchTestCase Setting hostContext system property: /_/
   [junit4]   2> 1241239 INFO  (TEST-ShardRoutingTest.test-seed#[41FCD82A9E68FB97]) [    ] o.a.s.c.ZkTestServer STARTING ZK TEST SERVER
   [junit4]   2> 1241254 INFO  (ZkTestServer Run Thread) [    ] o.a.s.c.ZkTestServer client port:0.0.0.0/0.0.0.0:0
   [junit4]   2> 1241254 INFO  (ZkTestServer Run Thread) [    ] o.a.s.c.ZkTestServer Starting server
   [junit4]   2> 1241364 INFO  (TEST-ShardRoutingTest.test-seed#[41FCD82A9E68FB97]) [    ] o.a.s.c.ZkTestServer start zk server on port:45860
   [junit4]   2> 1241364 INFO  (TEST-ShardRoutingTest.test-seed#[41FCD82A9E68FB97]) [    ] o.a.s.c.ZkTestServer parse host and port list: 127.0.0.1:45860
   [junit4]   2> 1241364 INFO  (TEST-ShardRoutingTest.test-seed#[41FCD82A9E68FB97]) [    ] o.a.s.c.ZkTestServer connecting to 127.0.0.1 45860
   [junit4]   2> 1241458 INFO  (zkConnectionManagerCallback-2373-thread-1) [    ] o.a.s.c.c.ConnectionManager zkClient has connected
   [junit4]   2> 1241530 INFO  (zkConnectionManagerCallback-2375-thread-1) [    ] o.a.s.c.c.ConnectionManager zkClient has connected
   [junit4]   2> 1241535 INFO  (TEST-ShardRoutingTest.test-seed#[41FCD82A9E68FB97]) [    ] o.a.s.c.ZkTestServer put /home/jenkins/jenkins-slave/workspace/Lucene-Solr-BadApples-Tests-8.x/solr/core/src/test-files/solr/collection1/conf/solrconfig-tlog.xml to /configs/conf1/solrconfig.xml
   [junit4]   2> 1241536 INFO  (TEST-ShardRoutingTest.test-seed#[41FCD82A9E68FB97]) [    ] o.a.s.c.ZkTestServer put /home/jenkins/jenkins-slave/workspace/Lucene-Solr-BadApples-Tests-8.x/solr/core/src/test-files/solr/collection1/conf/schema15.xml to /configs/conf1/schema.xml
   [junit4]   2> 1241537 INFO  (TEST-ShardRoutingTest.test-seed#[41FCD82A9E68FB97]) [    ] o.a.s.c.ZkTestServer put /home/jenkins/jenkins-slave/workspace/Lucene-Solr-BadApples-Tests-8.x/solr/core/src/test-files/solr/collection1/conf/solrconfig.snippet.randomindexconfig.xml to /configs/conf1/solrconfig.snippet.randomindexconfig.xml
   [junit4]   2> 1241537 INFO  (TEST-ShardRoutingTest.test-seed#[41FCD82A9E68FB97]) [    ] o.a.s.c.ZkTestServer put /home/jenkins/jenkins-slave/workspace/Lucene-Solr-BadApples-Tests-8.x/solr/core/src/test-files/solr/collection1/conf/stopwords.txt to /configs/conf1/stopwords.txt
   [junit4]   2> 1241555 INFO  (TEST-ShardRoutingTest.test-seed#[41FCD82A9E68FB97]) [    ] o.a.s.c.ZkTestServer put /home/jenkins/jenkins-slave/workspace/Lucene-Solr-BadApples-Tests-8.x/solr/core/src/test-files/solr/collection1/conf/protwords.txt to /configs/conf1/protwords.txt
   [junit4]   2> 1241555 INFO  (TEST-ShardRoutingTest.test-seed#[41FCD82A9E68FB97]) [    ] o.a.s.c.ZkTestServer put /home/jenkins/jenkins-slave/workspace/Lucene-Solr-BadApples-Tests-8.x/solr/core/src/test-files/solr/collection1/conf/currency.xml to /configs/conf1/currency.xml
   [junit4]   2> 1241556 INFO  (TEST-ShardRoutingTest.test-seed#[41FCD82A9E68FB97]) [    ] o.a.s.c.ZkTestServer put /home/jenkins/jenkins-slave/workspace/Lucene-Solr-BadApples-Tests-8.x/solr/core/src/test-files/solr/collection1/conf/enumsConfig.xml to /configs/conf1/enumsConfig.xml
   [junit4]   2> 1241557 INFO  (TEST-ShardRoutingTest.test-seed#[41FCD82A9E68FB97]) [    ] o.a.s.c.ZkTestServer put /home/jenkins/jenkins-slave/workspace/Lucene-Solr-BadApples-Tests-8.x/solr/core/src/test-files/solr/collection1/conf/open-exchange-rates.json to /configs/conf1/open-exchange-rates.json
   [junit4]   2> 1241557 INFO  (TEST-ShardRoutingTest.test-seed#[41FCD82A9E68FB97]) [    ] o.a.s.c.ZkTestServer put /home/jenkins/jenkins-slave/workspace/Lucene-Solr-BadApples-Tests-8.x/solr/core/src/test-files/solr/collection1/conf/mapping-ISOLatin1Accent.txt to /configs/conf1/mapping-ISOLatin1Accent.txt
   [junit4]   2> 1241558 INFO  (TEST-ShardRoutingTest.test-seed#[41FCD82A9E68FB97]) [    ] o.a.s.c.ZkTestServer put /home/jenkins/jenkins-slave/workspace/Lucene-Solr-BadApples-Tests-8.x/solr/core/src/test-files/solr/collection1/conf/old_synonyms.txt to /configs/conf1/old_synonyms.txt
   [junit4]   2> 1241593 INFO  (TEST-ShardRoutingTest.test-seed#[41FCD82A9E68FB97]) [    ] o.a.s.c.ZkTestServer put /home/jenkins/jenkins-slave/workspace/Lucene-Solr-BadApples-Tests-8.x/solr/core/src/test-files/solr/collection1/conf/synonyms.txt to /configs/conf1/synonyms.txt
   [junit4]   2> 1241648 INFO  (zkConnectionManagerCallback-2379-thread-1) [    ] o.a.s.c.c.ConnectionManager zkClient has connected
   [junit4]   2> 1241665 INFO  (TEST-ShardRoutingTest.test-seed#[41FCD82A9E68FB97]) [    ] o.a.s.c.AbstractFullDistribZkTestBase Will use NRT replicas unless explicitly asked otherwise
   [junit4]   2> 1242462 WARN  (TEST-ShardRoutingTest.test-seed#[41FCD82A9E68FB97]) [    ] o.e.j.s.AbstractConnector Ignoring deprecated socket close linger time
   [junit4]   2> 1242528 INFO  (TEST-ShardRoutingTest.test-seed#[41FCD82A9E68FB97]) [    ] o.a.s.c.s.e.JettySolrRunner Start Jetty (original configured port=0)
   [junit4]   2> 1242528 INFO  (TEST-ShardRoutingTest.test-seed#[41FCD82A9E68FB97]) [    ] o.a.s.c.s.e.JettySolrRunner Trying to start Jetty on port 0 try number 1 ...
   [junit4]   2> 1242528 INFO  (TEST-ShardRoutingTest.test-seed#[41FCD82A9E68FB97]) [    ] o.e.j.s.Server jetty-9.4.14.v20181114; built: 2018-11-14T21:20:31.478Z; git: c4550056e785fb5665914545889f21dc136ad9e6; jvm 1.8.0_191-b12
   [junit4]   2> 1242580 INFO  (TEST-ShardRoutingTest.test-seed#[41FCD82A9E68FB97]) [    ] o.e.j.s.session DefaultSessionIdManager workerName=node0
   [junit4]   2> 1242580 INFO  (TEST-ShardRoutingTest.test-seed#[41FCD82A9E68FB97]) [    ] o.e.j.s.session No SessionScavenger set, using defaults
   [junit4]   2> 1242580 INFO  (TEST-ShardRoutingTest.test-seed#[41FCD82A9E68FB97]) [    ] o.e.j.s.session node0 Scavenging every 600000ms
   [junit4]   2> 1242583 INFO  (TEST-ShardRoutingTest.test-seed#[41FCD82A9E68FB97]) [    ] o.e.j.s.h.ContextHandler Started o.e.j.s.ServletContextHandler@300f478b{/_,null,AVAILABLE}
   [junit4]   2> 1242630 WARN  (TEST-ShardRoutingTest.test-seed#[41FCD82A9E68FB97]) [    ] o.e.j.u.s.S.config No Client EndPointIdentificationAlgorithm configured for SslContextFactory@6e2d5547[provider=null,keyStore=null,trustStore=null]
   [junit4]   2> 1242649 INFO  (TEST-ShardRoutingTest.test-seed#[41FCD82A9E68FB97]) [    ] o.e.j.s.AbstractConnector Started ServerConnector@2ce7eb3d{SSL,[ssl, http/1.1]}{127.0.0.1:40717}
   [junit4]   2> 1242649 INFO  (TEST-ShardRoutingTest.test-seed#[41FCD82A9E68FB97]) [    ] o.e.j.s.Server Started @1242882ms
   [junit4]   2> 1242649 INFO  (TEST-ShardRoutingTest.test-seed#[41FCD82A9E68FB97]) [    ] o.a.s.c.s.e.JettySolrRunner Jetty properties: {solr.data.dir=/home/jenkins/jenkins-slave/workspace/Lucene-Solr-BadApples-Tests-8.x/solr/build/solr-core/test/J0/temp/solr.cloud.ShardRoutingTest_41FCD82A9E68FB97-001/tempDir-001/control/data, replicaType=NRT, hostContext=/_, hostPort=40717, coreRootDirectory=/home/jenkins/jenkins-slave/workspace/Lucene-Solr-BadApples-Tests-8.x/solr/build/solr-core/test/J0/../../../../../../../../../../home/jenkins/jenkins-slave/workspace/Lucene-Solr-BadApples-Tests-8.x/solr/build/solr-core/test/J0/temp/solr.cloud.ShardRoutingTest_41FCD82A9E68FB97-001/control-001/cores}
   [junit4]   2> 1242649 ERROR (TEST-ShardRoutingTest.test-seed#[41FCD82A9E68FB97]) [    ] o.a.s.u.StartupLoggingUtils Missing Java Option solr.log.dir. Logging may be missing or incomplete.
   [junit4]   2> 1242649 INFO  (TEST-ShardRoutingTest.test-seed#[41FCD82A9E68FB97]) [    ] o.a.s.s.SolrDispatchFilter Using logger factory org.apache.logging.slf4j.Log4jLoggerFactory
   [junit4]   2> 1242650 INFO  (TEST-ShardRoutingTest.test-seed#[41FCD82A9E68FB97]) [    ] o.a.s.s.SolrDispatchFilter  ___      _       Welcome to Apache Solr™ version 8.1.0
   [junit4]   2> 1242650 INFO  (TEST-ShardRoutingTest.test-seed#[41FCD82A9E68FB97]) [    ] o.a.s.s.SolrDispatchFilter / __| ___| |_ _   Starting in cloud mode on port null
   [junit4]   2> 1242650 INFO  (TEST-ShardRoutingTest.test-seed#[41FCD82A9E68FB97]) [    ] o.a.s.s.SolrDispatchFilter \__ \/ _ \ | '_|  Install dir: null
   [junit4]   2> 1242650 INFO  (TEST-ShardRoutingTest.test-seed#[41FCD82A9E68FB97]) [    ] o.a.s.s.SolrDispatchFilter |___/\___/_|_|    Start time: 2019-03-06T05:47:05.883Z
   [junit4]   2> 1242721 INFO  (zkConnectionManagerCallback-2381-thread-1) [    ] o.a.s.c.c.ConnectionManager zkClient has connected
   [junit4]   2> 1242758 INFO  (TEST-ShardRoutingTest.test-seed#[41FCD82A9E68FB97]) [    ] o.a.s.s.SolrDispatchFilter Loading solr.xml from SolrHome (not found in ZooKeeper)
   [junit4]   2> 1242758 INFO  (TEST-ShardRoutingTest.test-seed#[41FCD82A9E68FB97]) [    ] o.a.s.c.SolrXmlConfig Loading container configuration from /home/jenkins/jenkins-slave/workspace/Lucene-Solr-BadApples-Tests-8.x/solr/build/solr-core/test/J0/temp/solr.cloud.ShardRoutingTest_41FCD82A9E68FB97-001/control-001/solr.xml
   [junit4]   2> 1242762 INFO  (TEST-ShardRoutingTest.test-seed#[41FCD82A9E68FB97]) [    ] o.a.s.c.SolrXmlConfig Configuration parameter autoReplicaFailoverWorkLoopDelay is ignored
   [junit4]   2> 1242762 INFO  (TEST-ShardRoutingTest.test-seed#[41FCD82A9E68FB97]) [    ] o.a.s.c.SolrXmlConfig Configuration parameter autoReplicaFailoverBadNodeExpiration is ignored
   [junit4]   2> 1242775 INFO  (TEST-ShardRoutingTest.test-seed#[41FCD82A9E68FB97]) [    ] o.a.s.c.SolrXmlConfig MBean server found: com.sun.jmx.mbeanserver.JmxMBeanServer@1bdd8140, but no JMX reporters were configured - adding default JMX reporter.
   [junit4]   2> 1243579 INFO  (TEST-ShardRoutingTest.test-seed#[41FCD82A9E68FB97]) [    ] o.a.s.h.c.HttpShardHandlerFactory Host whitelist initialized: WhitelistHostChecker [whitelistHosts=null, whitelistHostCheckingEnabled=false]
   [junit4]   2> 1243579 WARN  (TEST-ShardRoutingTest.test-seed#[41FCD82A9E68FB97]) [    ] o.a.s.c.s.i.Http2SolrClient Create Http2SolrClient with HTTP/1.1 transport since Java 8 or lower versions does not support SSL + HTTP/2
   [junit4]   2> 1243634 WARN  (TEST-ShardRoutingTest.test-seed#[41FCD82A9E68FB97]) [    ] o.e.j.u.s.S.config No Client EndPointIdentificationAlgorithm configured for SslContextFactory@19f8cc7b[provider=null,keyStore=null,trustStore=null]
   [junit4]   2> 1243658 WARN  (TEST-ShardRoutingTest.test-seed#[41FCD82A9E68FB97]) [    ] o.a.s.c.s.i.Http2SolrClient Create Http2SolrClient with HTTP/1.1 transport since Java 8 or lower versions does not support SSL + HTTP/2
   [junit4]   2> 1243659 WARN  (TEST-ShardRoutingTest.test-seed#[41FCD82A9E68FB97]) [    ] o.e.j.u.s.S.config No Client EndPointIdentificationAlgorithm configured for SslContextFactory@1bd6b6a8[provider=null,keyStore=null,trustStore=null]
   [junit4]   2> 1243659 INFO  (TEST-ShardRoutingTest.test-seed#[41FCD82A9E68FB97]) [    ] o.a.s.c.ZkContainer Zookeeper client=127.0.0.1:45860/solr
   [junit4]   2> 1243694 INFO  (zkConnectionManagerCallback-2387-thread-1) [    ] o.a.s.c.c.ConnectionManager zkClient has connected
   [junit4]   2> 1243742 INFO  (zkConnectionManagerCallback-2389-thread-1) [    ] o.a.s.c.c.ConnectionManager zkClient has connected
   [junit4]   2> 1245058 INFO  (TEST-ShardRoutingTest.test-seed#[41FCD82A9E68FB97]) [n:127.0.0.1:40717__    ] o.a.s.c.OverseerElectionContext I am going to be the leader 127.0.0.1:40717__
   [junit4]   2> 1245058 INFO  (TEST-ShardRoutingTest.test-seed#[41FCD82A9E68FB97]) [n:127.0.0.1:40717__    ] o.a.s.c.Overseer Overseer (id=74298179795091461-127.0.0.1:40717__-n_0000000000) starting
   [junit4]   2> 1245190 INFO  (zkConnectionManagerCallback-2396-thread-1) [    ] o.a.s.c.c.ConnectionManager zkClient has connected
   [junit4]   2> 1245262 INFO  (TEST-ShardRoutingTest.test-seed#[41FCD82A9E68FB97]) [n:127.0.0.1:40717__    ] o.a.s.c.s.i.ZkClientClusterStateProvider Cluster at 127.0.0.1:45860/solr ready
   [junit4]   2> 1245298 INFO  (OverseerStateUpdate-74298179795091461-127.0.0.1:40717__-n_0000000000) [n:127.0.0.1:40717__    ] o.a.s.c.Overseer Starting to work on the main queue : 127.0.0.1:40717__
   [junit4]   2> 1245335 INFO  (TEST-ShardRoutingTest.test-seed#[41FCD82A9E68FB97]) [n:127.0.0.1:40717__    ] o.a.s.c.ZkController Register node as live in ZooKeeper:/live_nodes/127.0.0.1:40717__
   [junit4]   2> 1245395 INFO  (zkCallback-2388-thread-1) [    ] o.a.s.c.c.ZkStateReader Updated live nodes from ZooKeeper... (0) -> (1)
   [junit4]   2> 1245408 INFO  (zkCallback-2395-thread-1) [    ] o.a.s.c.c.ZkStateReader Updated live nodes from ZooKeeper... (0) -> (1)
   [junit4]   2> 1245772 INFO  (TEST-ShardRoutingTest.test-seed#[41FCD82A9E68FB97]) [n:127.0.0.1:40717__    ] o.a.s.h.a.MetricsHistoryHandler No .system collection, keeping metrics history in memory.
   [junit4]   2> 1245905 INFO  (TEST-ShardRoutingTest.test-seed#[41FCD82A9E68FB97]) [n:127.0.0.1:40717__    ] o.a.s.m.r.SolrJmxReporter JMX monitoring for 'solr.node' (registry 'solr.node') enabled at server: com.sun.jmx.mbeanserver.JmxMBeanServer@1bdd8140
   [junit4]   2> 1245962 INFO  (TEST-ShardRoutingTest.test-seed#[41FCD82A9E68FB97]) [n:127.0.0.1:40717__    ] o.a.s.m.r.SolrJmxReporter JMX monitoring for 'solr.jvm' (registry 'solr.jvm') enabled at server: com.sun.jmx.mbeanserver.JmxMBeanServer@1bdd8140
   [junit4]   2> 1245962 INFO  (TEST-ShardRoutingTest.test-seed#[41FCD82A9E68FB97]) [n:127.0.0.1:40717__    ] o.a.s.m.r.SolrJmxReporter JMX monitoring for 'solr.jetty' (registry 'solr.jetty') enabled at server: com.sun.jmx.mbeanserver.JmxMBeanServer@1bdd8140
   [junit4]   2> 1245976 INFO  (TEST-ShardRoutingTest.test-seed#[41FCD82A9E68FB97]) [n:127.0.0.1:40717__    ] o.a.s.c.CorePropertiesLocator Found 0 core definitions underneath /home/jenkins/jenkins-slave/workspace/Lucene-Solr-BadApples-Tests-8.x/solr/build/solr-core/test/J0/../../../../../../../../../../home/jenkins/jenkins-slave/workspace/Lucene-Solr-BadApples-Tests-8.x/solr/build/solr-core/test/J0/temp/solr.cloud.ShardRoutingTest_41FCD82A9E68FB97-001/control-001/cores
   [junit4]   2> 1246214 INFO  (zkConnectionManagerCallback-2402-thread-1) [    ] o.a.s.c.c.ConnectionManager zkClient has connected
   [junit4]   2> 1246226 INFO  (TEST-ShardRoutingTest.test-seed#[41FCD82A9E68FB97]) [    ] o.a.s.c.c.ZkStateReader Updated live nodes from ZooKeeper... (0) -> (1)
   [junit4]   2> 1246227 INFO  (TEST-ShardRoutingTest.test-seed#[41FCD82A9E68FB97]) [    ] o.a.s.c.s.i.ZkClientClusterStateProvider Cluster at 127.0.0.1:45860/solr ready
   [junit4]   2> 1246336 INFO  (qtp280736943-8809) [n:127.0.0.1:40717__    ] o.a.s.h.a.CollectionsHandler Invoked Collection Action :create with params collection.configName=conf1&name=control_collection&nrtReplicas=1&action=CREATE&numShards=1&createNodeSet=127.0.0.1:40717__&wt=javabin&version=2 and sendToOCPQueue=true
   [junit4]   2> 1246445 INFO  (OverseerThreadFactory-2947-thread-1-processing-n:127.0.0.1:40717__) [n:127.0.0.1:40717__    ] o.a.s.c.a.c.CreateCollectionCmd Create collection control_collection
   [junit4]   2> 1246640 INFO  (qtp280736943-8807) [n:127.0.0.1:40717__    x:control_collection_shard1_replica_n1] o.a.s.h.a.CoreAdminOperation core create command qt=/admin/cores&collection.configName=conf1&newCollection=true&name=control_collection_shard1_replica_n1&action=CREATE&numShards=1&collection=control_collection&shard=shard1&wt=javabin&version=2&replicaType=NRT
   [junit4]   2> 1246641 INFO  (qtp280736943-8807) [n:127.0.0.1:40717__    x:control_collection_shard1_replica_n1] o.a.s.c.TransientSolrCoreCacheDefault Allocating transient cache for 4 transient cores
   [junit4]   2> 1247797 INFO  (qtp280736943-8807) [n:127.0.0.1:40717__ c:control_collection s:shard1  x:control_collection_shard1_replica_n1] o.a.s.c.SolrConfig Using Lucene MatchVersion: 8.1.0
   [junit4]   2> 1247841 INFO  (qtp280736943-8807) [n:127.0.0.1:40717__ c:control_collection s:shard1  x:control_collection_shard1_replica_n1] o.a.s.s.IndexSchema [control_collection_shard1_replica_n1] Schema name=test
   [junit4]   2> 1248334 INFO  (qtp280736943-8807) [n:127.0.0.1:40717__ c:control_collection s:shard1  x:control_collection_shard1_replica_n1] o.a.s.s.IndexSchema Loaded schema test/1.6 with uniqueid field id
   [junit4]   2> 1248387 INFO  (qtp280736943-8807) [n:127.0.0.1:40717__ c:control_collection s:shard1  x:control_collection_shard1_replica_n1] o.a.s.c.CoreContainer Creating SolrCore 'control_collection_shard1_replica_n1' using configuration from collection control_collection, trusted=true
   [junit4]   2> 1248387 INFO  (qtp280736943-8807) [n:127.0.0.1:40717__ c:control_collection s:shard1  x:control_collection_shard1_replica_n1] o.a.s.m.r.SolrJmxReporter JMX monitoring for 'solr.core.control_collection.shard1.replica_n1' (registry 'solr.core.control_collection.shard1.replica_n1') enabled at server: com.sun.jmx.mbeanserver.JmxMBeanServer@1bdd8140
   [junit4]   2> 1248387 INFO  (qtp280736943-8807) [n:127.0.0.1:40717__ c:control_collection s:shard1  x:control_collection_shard1_replica_n1] o.a.s.c.SolrCore [[control_collection_shard1_replica_n1] ] Opening new SolrCore at [/home/jenkins/jenkins-slave/workspace/Lucene-Solr-BadApples-Tests-8.x/solr/build/solr-core/test/J0/temp/solr.cloud.ShardRoutingTest_41FCD82A9E68FB97-001/control-001/cores/control_collection_shard1_replica_n1], dataDir=[/home/jenkins/jenkins-slave/workspace/Lucene-Solr-BadApples-Tests-8.x/solr/build/solr-core/test/J0/../../../../../../../../../../home/jenkins/jenkins-slave/workspace/Lucene-Solr-BadApples-Tests-8.x/solr/build/solr-core/test/J0/temp/solr.cloud.ShardRoutingTest_41FCD82A9E68FB97-001/control-001/cores/control_collection_shard1_replica_n1/data/]
   [junit4]   2> 1248404 INFO  (qtp280736943-8807) [n:127.0.0.1:40717__ c:control_collection s:shard1  x:control_collection_shard1_replica_n1] o.a.s.u.RandomMergePolicy RandomMergePolicy wrapping class org.apache.lucene.index.TieredMergePolicy: [TieredMergePolicy: maxMergeAtOnce=15, maxMergeAtOnceExplicit=34, maxMergedSegmentMB=5.34375, floorSegmentMB=1.732421875, forceMergeDeletesPctAllowed=24.1417540618627, segmentsPerTier=17.0, maxCFSSegmentSizeMB=8.796093022207999E12, noCFSRatio=1.0, deletesPctAllowed=31.126574443216782
   [junit4]   2> 1248445 WARN  (qtp280736943-8807) [n:127.0.0.1:40717__ c:control_collection s:shard1  x:control_collection_shard1_replica_n1] o.a.s.c.RequestHandlers INVALID paramSet a in requestHandler {type = requestHandler,name = /dump,class = DumpRequestHandler,attributes = {initParams=a, name=/dump, class=DumpRequestHandler},args = {defaults={a=A,b=B}}}
   [junit4]   2> 1248653 INFO  (qtp280736943-8807) [n:127.0.0.1:40717__ c:control_collection s:shard1  x:control_collection_shard1_replica_n1] o.a.s.u.UpdateHandler Using UpdateLog implementation: org.apache.solr.update.UpdateLog
   [junit4]   2> 1248654 INFO  (qtp280736943-8807) [n:127.0.0.1:40717__ c:control_collection s:shard1  x:control_collection_shard1_replica_n1] o.a.s.u.UpdateLog Initializing UpdateLog: dataDir= defaultSyncLevel=FLUSH numRecordsToKeep=100 maxNumLogsToKeep=10 numVersionBuckets=65536
   [junit4]   2> 1248656 INFO  (qtp280736943-8807) [n:127.0.0.1:40717__ c:control_collection s:shard1  x:control_collection_shard1_replica_n1] o.a.s.u.CommitTracker Hard AutoCommit: disabled
   [junit4]   2> 1248656 INFO  (qtp280736943-8807) [n:127.0.0.1:40717__ c:control_collection s:shard1  x:control_collection_shard1_replica_n1] o.a.s.u.CommitTracker Soft AutoCommit: disabled
   [junit4]   2> 1248670 INFO  (qtp280736943-8807) [n:127.0.0.1:40717__ c:control_collection s:shard1  x:control_collection_shard1_replica_n1] o.a.s.u.RandomMergePolicy RandomMergePolicy wrapping class org.apache.lucene.index.TieredMergePolicy: [TieredMergePolicy: maxMergeAtOnce=48, maxMergeAtOnceExplicit=38, maxMergedSegmentMB=30.10546875, floorSegmentMB=1.6962890625, forceMergeDeletesPctAllowed=7.4653238212176305, segmentsPerTier=47.0, maxCFSSegmentSizeMB=8.796093022207999E12, noCFSRatio=0.4714465786142461, deletesPctAllowed=31.014454464527
   [junit4]   2> 1248671 INFO  (qtp280736943-8807) [n:127.0.0.1:40717__ c:control_collection s:shard1  x:control_collection_shard1_replica_n1] o.a.s.s.SolrIndexSearcher Opening [Searcher@36444cf2[control_collection_shard1_replica_n1] main]
   [junit4]   2> 1248672 INFO  (qtp280736943-8807) [n:127.0.0.1:40717__ c:control_collection s:shard1  x:control_collection_shard1_replica_n1] o.a.s.r.ManagedResourceStorage Configured ZooKeeperStorageIO with znodeBase: /configs/conf1
   [junit4]   2> 1248672 INFO  (qtp280736943-8807) [n:127.0.0.1:40717__ c:control_collection s:shard1  x:control_collection_shard1_replica_n1] o.a.s.r.ManagedResourceStorage Loaded null at path _rest_managed.json using ZooKeeperStorageIO:path=/configs/conf1
   [junit4]   2> 1248673 INFO  (qtp280736943-8807) [n:127.0.0.1:40717__ c:control_collection s:shard1  x:control_collection_shard1_replica_n1] o.a.s.h.ReplicationHandler Commits will be reserved for 10000ms.
   [junit4]   2> 1248685 INFO  (qtp280736943-8807) [n:127.0.0.1:40717__ c:control_collection s:shard1  x:control_collection_shard1_replica_n1] o.a.s.u.UpdateLog Could not find max version in index or recent updates, using new clock 1627233957359648768
   [junit4]   2> 1248698 INFO  (searcherExecutor-2952-thread-1-processing-n:127.0.0.1:40717__ x:control_collection_shard1_replica_n1 c:control_collection s:shard1) [n:127.0.0.1:40717__ c:control_collection s:shard1  x:control_collection_shard1_replica_n1] o.a.s.c.SolrCore [control_collection_shard1_replica_n1] Registered new searcher Searcher@36444cf2[control_collection_shard1_replica_n1] main{ExitableDirectoryReader(UninvertingDirectoryReader())}
   [junit4]   2> 1248708 INFO  (qtp280736943-8807) [n:127.0.0.1:40717__ c:control_collection s:shard1  x:control_collection_shard1_replica_n1] o.a.s.c.ZkShardTerms Successful update of terms at /collections/control_collection/terms/shard1 to Terms{values={core_node2=0}, version=0}
   [junit4]   2> 1248708 INFO  (qtp280736943-8807) [n:127.0.0.1:40717__ c:control_collection s:shard1  x:control_collection_shard1_replica_n1] o.a.s.c.ShardLeaderElectionContextBase make sure parent is created /collections/control_collection/leaders/shard1
   [junit4]   2> 1248710 INFO  (qtp280736943-8807) [n:127.0.0.1:40717__ c:control_collection s:shard1  x:control_collection_shard1_replica_n1] o.a.s.c.ShardLeaderElectionContext Enough replicas found to continue.
   [junit4]   2> 1248710 INFO  (qtp280736943-8807) [n:127.0.0.1:40717__ c:control_collection s:shard1  x:control_collection_shard1_replica_n1] o.a.s.c.ShardLeaderElectionContext I may be the new leader - try and sync
   [junit4]   2> 1248710 INFO  (qtp280736943-8807) [n:127.0.0.1:40717__ c:control_collection s:shard1  x:control_collection_shard1_replica_n1] o.a.s.c.SyncStrategy Sync replicas to https://127.0.0.1:40717/_/control_collection_shard1_replica_n1/
   [junit4]   2> 1248710 INFO  (qtp280736943-8807) [n:127.0.0.1:40717__ c:control_collection s:shard1  x:control_collection_shard1_replica_n1] o.a.s.c.SyncStrategy Sync Success - now sync replicas to me
   [junit4]   2> 1248710 INFO  (qtp280736943-8807) [n:127.0.0.1:40717__ c:control_collection s:shard1  x:control_collection_shard1_replica_n1] o.a.s.c.SyncStrategy https://127.0.0.1:40717/_/control_collection_shard1_replica_n1/ has no replicas
   [junit4]   2> 1248710 INFO  (qtp280736943-8807) [n:127.0.0.1:40717__ c:control_collection s:shard1  x:control_collection_shard1_replica_n1] o.a.s.c.ShardLeaderElectionContextBase Creating leader registration node /collections/control_collection/leaders/shard1/leader after winning as /collections/control_collection/leader_elect/shard1/election/74298179795091461-core_node2-n_0000000000
   [junit4]   2> 1248712 INFO  (qtp280736943-8807) [n:127.0.0.1:40717__ c:control_collection s:shard1  x:control_collection_shard1_replica_n1] o.a.s.c.ShardLeaderElectionContext I am the new leader: https://127.0.0.1:40717/_/control_collection_shard1_replica_n1/ shard1
   [junit4]   2> 1248848 INFO  (zkCallback-2388-thread-1) [    ] o.a.s.c.c.ZkStateReader A cluster state change: [WatchedEvent state:SyncConnected type:NodeDataChanged path:/collections/control_collection/state.json] for collection [control_collection] has occurred - updating... (live nodes size: [1])
   [junit4]   2> 1248848 INFO  (zkCallback-2388-thread-2) [    ] o.a.s.c.c.ZkStateReader A cluster state change: [WatchedEvent state:SyncConnected type:NodeDataChanged path:/collections/control_collection/state.json] for collection [control_collection] has occurred - updating... (live nodes size: [1])
   [junit4]   2> 1248849 INFO  (qtp280736943-8807) [n:127.0.0.1:40717__ c:control_collection s:shard1  x:control_collection_shard1_replica_n1] o.a.s.c.ZkController I am the leader, no recovery necessary
   [junit4]   2> 1248884 ERROR (qtp280736943-8807) [n:127.0.0.1:40717__ c:control_collection s:shard1  x:control_collection_shard1_replica_n1] o.a.s.c.c.ZkStateReader Collection control_collection is not lazy or watched!
   [junit4]   2> 1248891 INFO  (qtp280736943-8807) [n:127.0.0.1:40717__ c:control_collection s:shard1  x:control_collection_shard1_replica_n1] o.a.s.s.HttpSolrCall [admin] webapp=null path=/admin/cores params={qt=/admin/cores&collection.configName=conf1&newCollection=true&name=control_collection_shard1_replica_n1&action=CREATE&numShards=1&collection=control_collection&shard=shard1&wt=javabin&version=2&replicaType=NRT} status=0 QTime=2250
   [junit4]   2> 1248901 INFO  (qtp280736943-8809) [n:127.0.0.1:40717__    ] o.a.s.h.a.CollectionsHandler Wait for new collection to be active for at most 45 seconds. Check all shard replicas
   [junit4]   2> 1248951 INFO  (zkCallback-2388-thread-2) [    ] o.a.s.c.c.ZkStateReader A cluster state change: [WatchedEvent state:SyncConnected type:NodeDataChanged path:/collections/control_collection/state.json] for collection [control_collection] has occurred - updating... (live nodes size: [1])
   [junit4]   2> 1248951 INFO  (zkCallback-2388-thread-3) [    ] o.a.s.c.c.ZkStateReader A cluster state change: [WatchedEvent state:SyncConnected type:NodeDataChanged path:/collections/control_collection/state.json] for collection [control_collection] has occurred - updating... (live nodes size: [1])
   [junit4]   2> 1248951 INFO  (zkCallback-2388-thread-1) [    ] o.a.s.c.c.ZkStateReader A cluster state change: [WatchedEvent state:SyncConnected type:NodeDataChanged path:/collections/control_collection/state.json] for collection [control_collection] has occurred - updating... (live nodes size: [1])
   [junit4]   2> 1248952 INFO  (qtp280736943-8809) [n:127.0.0.1:40717__    ] o.a.s.s.HttpSolrCall [admin] webapp=null path=/admin/collections params={collection.configName=conf1&name=control_collection&nrtReplicas=1&action=CREATE&numShards=1&createNodeSet=127.0.0.1:40717__&wt=javabin&version=2} status=0 QTime=2615
   [junit4]   2> 1248960 INFO  (zkConnectionManagerCallback-2408-thread-1) [    ] o.a.s.c.c.ConnectionManager zkClient has connected
   [junit4]   2> 1248969 INFO  (TEST-ShardRoutingTest.test-seed#[41FCD82A9E68FB97]) [    ] o.a.s.c.c.ZkStateReader Updated live nodes from ZooKeeper... (0) -> (1)
   [junit4]   2> 1248970 INFO  (TEST-ShardRoutingTest.test-seed#[41FCD82A9E68FB97]) [    ] o.a.s.c.s.i.ZkClientClusterStateProvider Cluster at 127.0.0.1:45860/solr ready
   [junit4]   2> 1248970 INFO  (TEST-ShardRoutingTest.test-seed#[41FCD82A9E68FB97]) [    ] o.a.s.c.ChaosMonkey monkey: init - expire sessions:false cause connection loss:false
   [junit4]   2> 1248976 INFO  (qtp280736943-8809) [n:127.0.0.1:40717__    ] o.a.s.h.a.CollectionsHandler Invoked Collection Action :create with params collection.configName=conf1&name=collection1&nrtReplicas=1&action=CREATE&numShards=4&createNodeSet=&stateFormat=1&wt=javabin&version=2 and sendToOCPQueue=true
   [junit4]   2> 1248987 INFO  (OverseerThreadFactory-2947-thread-2-processing-n:127.0.0.1:40717__) [n:127.0.0.1:40717__    ] o.a.s.c.a.c.CreateCollectionCmd Create collection collection1
   [junit4]   2> 1248987 INFO  (OverseerCollectionConfigSetProcessor-74298179795091461-127.0.0.1:40717__-n_0000000000) [n:127.0.0.1:40717__    ] o.a.s.c.OverseerTaskQueue Response ZK path: /overseer/collection-queue-work/qnr-0000000000 doesn't exist.  Requestor may have disconnected from ZooKeeper
   [junit4]   2> 1249224 WARN  (OverseerThreadFactory-2947-thread-2-processing-n:127.0.0.1:40717__) [n:127.0.0.1:40717__    ] o.a.s.c.a.c.CreateCollectionCmd It is unusual to create a collection (collection1) without cores.
   [junit4]   2> 1249226 INFO  (qtp280736943-8809) [n:127.0.0.1:40717__    ] o.a.s.h.a.CollectionsHandler Wait for new collection to be active for at most 45 seconds. Check all shard replicas
   [junit4]   2> 1249241 INFO  (qtp280736943-8809) [n:127.0.0.1:40717__    ] o.a.s.s.HttpSolrCall [admin] webapp=null path=/admin/collections params={collection.configName=conf1&name=collection1&nrtReplicas=1&action=CREATE&numShards=4&createNodeSet=&stateFormat=1&wt=javabin&version=2} status=0 QTime=264
   [junit4]   2> 1249242 INFO  (TEST-ShardRoutingTest.test-seed#[41FCD82A9E68FB97]) [    ] o.a.s.c.AbstractFullDistribZkTestBase Creating jetty instances pullReplicaCount=0 numOtherReplicas=8
   [junit4]   2> 1249994 INFO  (TEST-ShardRoutingTest.test-seed#[41FCD82A9E68FB97]) [    ] o.a.s.c.AbstractFullDistribZkTestBase create jetty 1 in directory /home/jenkins/jenkins-slave/workspace/Lucene-Solr-BadApples-Tests-8.x/solr/build/solr-core/test/J0/temp/solr.cloud.ShardRoutingTest_41FCD82A9E68FB97-001/shard-1-001 of type NRT
   [junit4]   2> 1250000 WARN  (closeThreadPool-2409-thread-1) [    ] o.e.j.s.AbstractConnector Ignoring deprecated socket close linger time
   [junit4]   2> 1250000 INFO  (closeThreadPool-2409-thread-1) [    ] o.a.s.c.s.e.JettySolrRunner Start Jetty (original configured port=0)
   [junit4]   2> 1250000 INFO  (closeThreadPool-2409-thread-1) [    ] o.a.s.c.s.e.JettySolrRunner Trying to start Jetty on port 0 try number 1 ...
   [junit4]   2> 1250000 INFO  (closeThreadPool-2409-thread-1) [    ] o.e.j.s.Server jetty-9.4.14.v20181114; built: 2018-11-14T21:20:31.478Z; git: c4550056e785fb5665914545889f21dc136ad9e6; jvm 1.8.0_191-b12
   [junit4]   2> 1250057 INFO  (closeThreadPool-2409-thread-1) [    ] o.e.j.s.session DefaultSessionIdManager workerName=node0
   [junit4]   2> 1250057 INFO  (closeThreadPool-2409-thread-1) [    ] o.e.j.s.session No SessionScavenger set, using defaults
   [junit4]   2> 1250057 INFO  (closeThreadPool-2409-thread-1) [    ] o.e.j.s.session node0 Scavenging every 660000ms
   [junit4]   2> 1250067 INFO  (closeThreadPool-2409-thread-1) [    ] o.e.j.s.h.ContextHandler Started o.e.j.s.ServletContextHandler@7f2e9176{/_,null,AVAILABLE}
   [junit4]   2> 1250067 WARN  (closeThreadPool-2409-thread-1) [    ] o.e.j.u.s.S.config No Client EndPointIdentificationAlgorithm configured for SslContextFactory@10ca9e28[provider=null,keyStore=null,trustStore=null]
   [junit4]   2> 1250068 INFO  (closeThreadPool-2409-thread-1) [    ] o.e.j.s.AbstractConnector Started ServerConnector@ad12144{SSL,[ssl, http/1.1]}{127.0.0.1:36430}
   [junit4]   2> 1250068 INFO  (closeThreadPool-2409-thread-1) [    ] o.e.j.s.Server Started @1250301ms
   [junit4]   2> 1250068 INFO  (closeThreadPool-2409-thread-1) [    ] o.a.s.c.s.e.JettySolrRunner Jetty properties: {solr.data.dir=/home/jenkins/jenkins-slave/workspace/Lucene-Solr-BadApples-Tests-8.x/solr/build/solr-core/test/J0/temp/solr.cloud.ShardRoutingTest_41FCD82A9E68FB97-001/tempDir-001/jetty1, replicaType=NRT, solrconfig=solrconfig.xml, hostContext=/_, hostPort=36430, coreRootDirectory=/home/jenkins/jenkins-slave/workspace/Lucene-Solr-BadApples-Tests-8.x/solr/build/solr-core/test/J0/../../../../../../../../../../home/jenkins/jenkins-slave/workspace/Lucene-Solr-BadApples-Tests-8.x/solr/build/solr-core/test/J0/temp/solr.cloud.ShardRoutingTest_41FCD82A9E68FB97-001/shard-1-001/cores}
   [junit4]   2> 1250068 ERROR (closeThreadPool-2409-thread-1) [    ] o.a.s.u.StartupLoggingUtils Missing Java Option solr.log.dir. Logging may be missing or incomplete.
   [junit4]   2> 1250068 INFO  (closeThreadPool-2409-thread-1) [    ] o.a.s.s.SolrDispatchFilter Using logger factory org.apache.logging.slf4j.Log4jLoggerFactory
   [junit4]   2> 1250068 INFO  (closeThreadPool-2409-thread-1) [    ] o.a.s.s.SolrDispatchFilter  ___      _       Welcome to Apache Solr™ version 8.1.0
   [junit4]   2> 1250068 INFO  (closeThreadPool-2409-thread-1) [    ] o.a.s.s.SolrDispatchFilter / __| ___| |_ _   Starting in cloud mode on port null
   [junit4]   2> 1250068 INFO  (closeThreadPool-2409-thread-1) [    ] o.a.s.s.SolrDispatchFilter \__ \/ _ \ | '_|  Install dir: null
   [junit4]   2> 1250068 INFO  (closeThreadPool-2409-thread-1) [    ] o.a.s.s.SolrDispatchFilter |___/\___/_|_|    Start time: 2019-03-06T05:47:13.301Z
   [junit4]   2> 1250083 INFO  (zkConnectionManagerCallback-2411-thread-1) [    ] o.a.s.c.c.ConnectionManager zkClient has connected
   [junit4]   2> 1250103 INFO  (closeThreadPool-2409-thread-1) [    ] o.a.s.s.SolrDispatchFilter Loading solr.xml from SolrHome (not found in ZooKeeper)
   [junit4]   2> 1250103 INFO  (closeThreadPool-2409-thread-1) [    ] o.a.s.c.SolrXmlConfig Loading container configuration from /home/jenkins/jenkins-slave/workspace/Lucene-Solr-BadApples-Tests-8.x/solr/build/solr-core/test/J0/temp/solr.cloud.ShardRoutingTest_41FCD82A9E68FB97-001/shard-1-001/solr.xml
   [junit4]   2> 1250107 INFO  (closeThreadPool-2409-thread-1) [    ] o.a.s.c.SolrXmlConfig Configuration parameter autoReplicaFailoverWorkLoopDelay is ignored
   [junit4]   2> 1250107 INFO  (closeThreadPool-2409-thread-1) [    ] o.a.s.c.SolrXmlConfig Configuration parameter autoReplicaFailoverBadNodeExpiration is ignored
   [junit4]   2> 1250120 INFO  (closeThreadPool-2409-thread-1) [    ] o.a.s.c.SolrXmlConfig MBean server found: com.sun.jmx.mbeanserver.JmxMBeanServer@1bdd8140, but no JMX reporters were configured - adding default JMX reporter.
   [junit4]   2> 1250995 INFO  (OverseerCollectionConfigSetProcessor-74298179795091461-127.0.0.1:40717__-n_0000000000) [n:127.0.0.1:40717__    ] o.a.s.c.OverseerTaskQueue Response ZK path: /overseer/collection-queue-work/qnr-0000000002 doesn't exist.  Requestor may have disconnected from ZooKeeper
   [junit4]   2> 1251470 INFO  (closeThreadPool-2409-thread-1) [    ] o.a.s.h.c.HttpShardHandlerFactory Host whitelist initialized: WhitelistHostChecker [whitelistHosts=null, whitelistHostCheckingEnabled=false]
   [junit4]   2> 1251470 WARN  (closeThreadPool-2409-thread-1) [    ] o.a.s.c.s.i.Http2SolrClient Create Http2SolrClient with HTTP/1.1 transport since Java 8 or lower versions does not support SSL + HTTP/2
   [junit4]   2> 1251493 WARN  (closeThreadPool-2409-thread-1) [    ] o.e.j.u.s.S.config No Client EndPointIdentificationAlgorithm configured for SslContextFactory@2740f75a[provider=null,keyStore=null,trustStore=null]
   [junit4]   2> 1251496 WARN  (closeThreadPool-2409-thread-1) [    ] o.a.s.c.s.i.Http2SolrClient Create Http2SolrClient with HTTP/1.1 transport since Java 8 or lower versions does not support SSL + HTTP/2
   [junit4]   2> 1251510 WARN  (closeThreadPool-2409-thread-1) [    ] o.e.j.u.s.S.config No Client EndPointIdentificationAlgorithm configured for SslContextFactory@1f126ea0[provider=null,keyStore=null,trustStore=null]
   [junit4]   2> 1251511 INFO  (closeThreadPool-2409-thread-1) [    ] o.a.s.c.ZkContainer Zookeeper client=127.0.0.1:45860/solr
   [junit4]   2> 1251531 INFO  (zkConnectionManagerCallback-2417-thread-1) [    ] o.a.s.c.c.ConnectionManager zkClient has connected
   [junit4]   2> 1251598 INFO  (zkConnectionManagerCallback-2419-thread-1) [    ] o.a.s.c.c.ConnectionManager zkClient has connected
   [junit4]   2> 1251601 INFO  (closeThreadPool-2409-thread-1) [n:127.0.0.1:36430__    ] o.a.s.c.c.ZkStateReader Updated live nodes from ZooKeeper... (0) -> (1)
   [junit4]   2> 1251640 INFO  (closeThreadPool-2409-thread-1) [n:127.0.0.1:36430__    ] o.a.s.c.ZkController Publish node=127.0.0.1:36430__ as DOWN
   [junit4]   2> 1251655 INFO  (closeThreadPool-2409-thread-1) [n:127.0.0.1:36430__    ] o.a.s.c.TransientSolrCoreCacheDefault Allocating transient cache for 4 transient cores
   [junit4]   2> 1251655 INFO  (closeThreadPool-2409-thread-1) [n:127.0.0.1:36430__    ] o.a.s.c.ZkController Register node as live in ZooKeeper:/live_nodes/127.0.0.1:36430__
   [junit4]   2> 1251656 INFO  (zkCallback-2388-thread-3) [    ] o.a.s.c.c.ZkStateReader Updated live nodes from ZooKeeper... (1) -> (2)
   [junit4]   2> 1251656 INFO  (zkCallback-2407-thread-1) [    ] o.a.s.c.c.ZkStateReader Updated live nodes from ZooKeeper... (1) -> (2)
   [junit4]   2> 1251656 INFO  (zkCallback-2395-thread-1) [    ] o.a.s.c.c.ZkStateReader Updated live nodes from ZooKeeper... (1) -> (2)
   [junit4]   2> 1251675 INFO  (zkCallback-2418-thread-1) [    ] o.a.s.c.c.ZkStateReader Updated live nodes from ZooKeeper... (1) -> (2)
   [junit4]   2> 1251695 INFO  (TEST-ShardRoutingTest.test-seed#[41FCD82A9E68FB97]) [    ] o.a.s.c.AbstractFullDistribZkTestBase create jetty 2 in directory /home/jenkins/jenkins-slave/workspace/Lucene-Solr-BadApples-Tests-8.x/solr/build/solr-core/test/J0/temp/solr.cloud.ShardRoutingTest_41FCD82A9E68FB97-001/shard-2-001 of type NRT
   [junit4]   2> 1251851 WARN  (closeThreadPool-2409-thread-2) [    ] o.e.j.s.AbstractConnector Ignoring deprecated socket close linger time
   [junit4]   2> 1251851 INFO  (closeThreadPool-2409-thread-2) [    ] o.a.s.c.s.e.JettySolrRunner Start Jetty (original configured port=0)
   [junit4]   2> 1251851 INFO  (closeThreadPool-2409-thread-2) [    ] o.a.s.c.s.e.JettySolrRunner Trying to start Jetty on port 0 try number 1 ...
   [junit4]   2> 1251851 INFO  (closeThreadPool-2409-thread-2) [    ] o.e.j.s.Server jetty-9.4.14.v20181114; built: 2018-11-14T21:20:31.478Z; git: c4550056e785fb5665914545889f21dc136ad9e6; jvm 1.8.0_191-b12
   [junit4]   2> 1252068 INFO  (closeThreadPool-2409-thread-2) [    ] o.e.j.s.session DefaultSessionIdManager workerName=node0
   [junit4]   2> 1252068 INFO  (closeThreadPool-2409-thread-2) [    ] o.e.j.s.session No SessionScavenger set, using defaults
   [junit4]   2> 1252068 INFO  (closeThreadPool-2409-thread-2) [    ] o.e.j.s.session node0 Scavenging every 600000ms
   [junit4]   2> 1252072 INFO  (closeThreadPool-2409-thread-2) [    ] o.e.j.s.h.ContextHandler Started o.e.j.s.ServletContextHandler@155cdad9{/_,null,AVAILABLE}
   [junit4]   2> 1252073 WARN  (closeThreadPool-2409-thread-2) [    ] o.e.j.u.s.S.config No Client EndPointIdentificationAlgorithm configured for SslContextFactory@7126de0[provider=null,keyStore=null,trustStore=null]
   [junit4]   2> 1252092 INFO  (closeThreadPool-2409-thread-2) [    ] o.e.j.s.AbstractConnector Started ServerConnector@215df4a5{SSL,[ssl, http/1.1]}{127.0.0.1:35460}
   [junit4]   2> 1252092 INFO  (closeThreadPool-2409-thread-2) [    ] o.e.j.s.Server Started @1252326ms
   [junit4]   2> 1252093 INFO  (closeThreadPool-2409-thread-2) [    ] o.a.s.c.s.e.JettySolrRunner Jetty properties: {solr.data.dir=/home/jenkins/jenkins-slave/workspace/Lucene-Solr-BadApples-Tests-8.x/solr/build/solr-core/test/J0/temp/solr.cloud.ShardRoutingTest_41FCD82A9E68FB97-001/tempDir-001/jetty2, replicaType=NRT, solrconfig=solrconfig.xml, hostContext=/_, hostPort=35460, coreRootDirectory=/home/jenkins/jenkins-slave/workspace/Lucene-Solr-BadApples-Tests-8.x/solr/build/solr-core/test/J0/../../../../../../../../../../home/jenkins/jenkins-slave/workspace/Lucene-Solr-BadApples-Tests-8.x/solr/build/solr-core/test/J0/temp/solr.cloud.ShardRoutingTest_41FCD82A9E68FB97-001/shard-2-001/cores}
   [junit4]   2> 1252093 ERROR (closeThreadPool-2409-thread-2) [    ] o.a.s.u.StartupLoggingUtils Missing Java Option solr.log.dir. Logging may be missing or incomplete.
   [junit4]   2> 1252093 INFO  (closeThreadPool-2409-thread-2) [    ] o.a.s.s.SolrDispatchFilter Using logger factory org.apache.logging.slf4j.Log4jLoggerFactory
   [junit4]   2> 1252093 INFO  (closeThreadPool-2409-thread-2) [    ] o.a.s.s.SolrDispatchFilter  ___      _       Welcome to Apache Solr™ version 8.1.0
   [junit4]   2> 1252093 INFO  (closeThreadPool-2409-thread-2) [    ] o.a.s.s.SolrDispatchFilter / __| ___| |_ _   Starting in cloud mode on port null
   [junit4]   2> 1252093 INFO  (closeThreadPool-2409-thread-2) [    ] o.a.s.s.SolrDispatchFilter \__ \/ _ \ | '_|  Install dir: null
   [junit4]   2> 1252093 INFO  (closeThreadPool-2409-thread-2) [    ] o.a.s.s.SolrDispatchFilter |___/\___/_|_|    Start time: 2019-03-06T05:47:15.326Z
   [junit4]   2> 1252182 INFO  (zkConnectionManagerCallback-2423-thread-1) [    ] o.a.s.c.c.ConnectionManager zkClient has connected
   [junit4]   2> 1252198 INFO  (zkConnectionManagerCallback-2428-thread-1) [    ] o.a.s.c.c.ConnectionManager zkClient has connected
   [junit4]   2> 1252199 INFO  (closeThreadPool-2409-thread-1) [n:127.0.0.1:36430__    ] o.a.s.c.c.ZkStateReader Updated live nodes from ZooKeeper... (0) -> (2)
   [junit4]   2> 1252200 INFO  (closeThreadPool-2409-thread-1) [n:127.0.0.1:36430__    ] o.a.s.c.s.i.ZkClientClusterStateProvider Cluster at 127.0.0.1:45860/solr ready
   [junit4]   2> 1252200 INFO  (closeThreadPool-2409-thread-1) [n:127.0.0.1:36430__    ] o.a.s.h.a.MetricsHistoryHandler No .system collection, keeping metrics history in memory.
   [junit4]   2> 1252238 INFO  (closeThreadPool-2409-thread-2) [    ] o.a.s.s.SolrDispatchFilter Loading solr.xml from SolrHome (not found in ZooKeeper)
   [junit4]   2> 1252238 INFO  (closeThreadPool-2409-thread-2) [    ] o.a.s.c.SolrXmlConfig Loading container configuration from /home/jenkins/jenkins-slave/workspace/Lucene-Solr-BadApples-Tests-8.x/solr/build/solr-core/test/J0/temp/solr.cloud.ShardRoutingTest_41FCD82A9E68FB97-001/shard-2-001/solr.xml
   [junit4]   2> 1252303 INFO  (closeThreadPool-2409-thread-2) [    ] o.a.s.c.SolrXmlConfig Configuration parameter autoReplicaFailoverWorkLoopDelay is ignored
   [junit4]   2> 1252303 INFO  (closeThreadPool-2409-thread-2) [    ] o.a.s.c.SolrXmlConfig Configuration parameter autoReplicaFailoverBadNodeExpiration is ignored
   [junit4]   2> 1252305 INFO  (closeThreadPool-2409-thread-2) [    ] o.a.s.c.SolrXmlConfig MBean server found: com.sun.jmx.mbeanserver.JmxMBeanServer@1bdd8140, but no JMX reporters were configured - adding default JMX reporter.
   [junit4]   2> 1252414 INFO  (closeThreadPool-2409-thread-1) [n:127.0.0.1:36430__    ] o.a.s.m.r.SolrJmxReporter JMX monitoring for 'solr.node' (registry 'solr.node') enabled at server: com.sun.jmx.mbeanserver.JmxMBeanServer@1bdd8140
   [junit4]   2> 1252507 INFO  (closeThreadPool-2409-thread-1) [n:127.0.0.1:36430__    ] o.a.s.m.r.SolrJmxReporter JMX monitoring for 'solr.jvm' (registry 'solr.jvm') enabled at server: com.sun.jmx.mbeanserver.JmxMBeanServer@1bdd8140
   [junit4]   2> 1252507 INFO  (closeThreadPool-2409-thread-1) [n:127.0.0.1:36430__    ] o.a.s.m.r.SolrJmxReporter JMX monitoring for 'solr.jetty' (registry 'solr.jetty') enabled at server: com.sun.jmx.mbeanserver.JmxMBeanServer@1bdd8140
   [junit4]   2> 1252522 INFO  (closeThreadPool-2409-thread-1) [n:127.0.0.1:36430__    ] o.a.s.c.CorePropertiesLocator Found 0 core definitions underneath /home/jenkins/jenkins-slave/workspace/Lucene-Solr-BadApples-Tests-8.x/solr/build/solr-core/test/J0/../../../../../../../../../../home/jenkins/jenkins-slave/workspace/Lucene-Solr-BadApples-Tests-8.x/solr/build/solr-core/test/J0/temp/solr.cloud.ShardRoutingTest_41FCD82A9E68FB97-001/shard-1-001/cores
   [junit4]   2> 1253167 INFO  (closeThreadPool-2409-thread-2) [    ] o.a.s.h.c.HttpShardHandlerFactory Host whitelist initialized: WhitelistHostChecker [whitelistHosts=null, whitelistHostCheckingEnabled=false]
   [junit4]   2> 1253168 WARN  (closeThreadPool-2409-thread-2) [    ] o.a.s.c.s.i.Http2SolrClient Create Http2SolrClient with HTTP/1.1 transport since Java 8 or lower versions does not support SSL + HTTP/2
   [junit4]   2> 1253219 WARN  (closeThreadPool-2409-thread-2) [    ] o.e.j.u.s.S.config No Client EndPointIdentificationAlgorithm configured for SslContextFactory@3d127356[provider=null,keyStore=null,trustStore=null]
   [junit4]   2> 1253276 WARN  (closeThreadPool-2409-thread-2) [    ] o.a.s.c.s.i.Http2SolrClient Create Http2SolrClient with HTTP/1.1 transport since Java 8 or lower versions does not support SSL + HTTP/2
   [junit4]   2> 1253291 INFO  (TEST-ShardRoutingTest.test-seed#[41FCD82A9E68FB97]) [    ] o.a.s.c.AbstractFullDistribZkTestBase create jetty 3 in directory /home/jenkins/jenkins-slave/workspace/Lucene-Solr-BadApples-Tests-8.x/solr/build/solr-core/test/J0/temp/solr.cloud.ShardRoutingTest_41FCD82A9E68FB97-001/shard-3-001 of type NRT
   [junit4]   2> 1253293 WARN  (closeThreadPool-2409-thread-1) [    ] o.e.j.s.AbstractConnector Ignoring deprecated socket close linger time
   [junit4]   2> 1253293 INFO  (closeThreadPool-2409-thread-1) [    ] o.a.s.c.s.e.JettySolrRunner Start Jetty (original configured port=0)
   [junit4]   2> 1253293 INFO  (closeThreadPool-2409-thread-1) [    ] o.a.s.c.s.e.JettySolrRunner Trying to start Jetty on port 0 try number 1 ...
   [junit4]   2> 1253293 INFO  (closeThreadPool-2409-thread-1) [    ] o.e.j.s.Server jetty-9.4.14.v20181114; built: 2018-11-14T21:20:31.478Z; git: c4550056e785fb5665914545889f21dc136ad9e6; jvm 1.8.0_191-b12
   [junit4]   2> 1253494 INFO  (closeThreadPool-2409-thread-1) [    ] o.e.j.s.session DefaultSessionIdManager workerName=node0
   [junit4]   2> 1253494 INFO  (closeThreadPool-2409-thread-1) [    ] o.e.j.s.session No SessionScavenger set, using defaults
   [junit4]   2> 1253494 INFO  (closeThreadPool-2409-thread-1) [    ] o.e.j.s.session node0 Scavenging every 600000ms
   [junit4]   2> 1253531 INFO  (closeThreadPool-2409-thread-1) [    ] o.e.j.s.h.ContextHandler Started o.e.j.s.ServletContextHandler@5d48cc1e{/_,null,AVAILABLE}
   [junit4]   2> 1253531 WARN  (closeThreadPool-2409-thread-1) [    ] o.e.j.u.s.S.config No Client EndPointIdentificationAlgorithm configured for SslContextFactory@4d9f6191[provider=null,keyStore=null,trustStore=null]
   [junit4]   2> 1253567 INFO  (closeThreadPool-2409-thread-1) [    ] o.e.j.s.AbstractConnector Started ServerConnector@75350fcb{SSL,[ssl, http/1.1]}{127.0.0.1:46583}
   [junit4]   2> 1253567 INFO  (closeThreadPool-2409-thread-1) [    ] o.e.j.s.Server Started @1253800ms
   [junit4]   2> 1253567 INFO  (closeThreadPool-2409-thread-1) [    ] o.a.s.c.s.e.JettySolrRunner Jetty properties: {solr.data.dir=/home/jenkins/jenkins-slave/workspace/Lucene-Solr-BadApples-Tests-8.x/solr/build/solr-core/test/J0/temp/solr.cloud.ShardRoutingTest_41FCD82A9E68FB97-001/tempDir-001/jetty3, replicaType=NRT, solrconfig=solrconfig.xml, hostContext=/_, hostPort=46583, coreRootDirectory=/home/jenkins/jenkins-slave/workspace/Lucene-Solr-BadApples-Tests-8.x/solr/build/solr-core/test/J0/../../../../../../../../../../home/jenkins/jenkins-slave/workspace/Lucene-Solr-BadApples-Tests-8.x/solr/build/solr-core/test/J0/temp/solr.cloud.ShardRoutingTest_41FCD82A9E68FB97-001/shard-3-001/cores}
   [junit4]   2> 1253567 WARN  (closeThreadPool-2409-thread-2) [    ] o.e.j.u.s.S.config No Client EndPointIdentificationAlgorithm configured for SslContextFactory@2cf73481[provider=null,keyStore=null,trustStore=null]
   [junit4]   2> 1253567 ERROR (closeThreadPool-2409-thread-1) [    ] o.a.s.u.StartupLoggingUtils Missing Java Option solr.log.dir. Logging may be missing or incomplete.
   [junit4]   2> 1253567 INFO  (closeThreadPool-2409-thread-1) [    ] o.a.s.s.SolrDispatchFilter Using logger factory org.apache.logging.slf4j.Log4jLoggerFactory
   [junit4]   2> 1253567 INFO  (closeThreadPool-2409-thread-1) [    ] o.a.s.s.SolrDispatchFilter  ___      _       Welcome to Apache Solr™ version 8.1.0
   [junit4]   2> 1253567 INFO  (closeThreadPool-2409-thread-1) [    ] o.a.s.s.SolrDispatchFilter / __| ___| |_ _   Starting in cloud mode on port null
   [junit4]   2> 1253567 INFO  (closeThreadPool-2409-thread-1) [    ] o.a.s.s.SolrDispatchFilter \__ \/ _ \ | '_|  Install dir: null
   [junit4]   2> 1253567 INFO  (closeThreadPool-2409-thread-1) [    ] o.a.s.s.SolrDispatchFilter |___/\___/_|_|    Start time: 2019-03-06T05:47:16.800Z
   [junit4]   2> 1253568 INFO  (closeThreadPool-2409-thread-2) [    ] o.a.s.c.ZkContainer Zookeeper client=127.0.0.1:45860/solr
   [junit4]   2> 1253624 INFO  (zkConnectionManagerCallback-2435-thread-1) [    ] o.a.s.c.c.ConnectionManager zkClient has connected
   [junit4]   2> 1253624 INFO  (zkConnectionManagerCallback-2437-thread-1) [    ] o.a.s.c.c.ConnectionManager zkClient has connected
   [junit4]   2> 1253644 INFO  (closeThreadPool-2409-thread-1) [    ] o.a.s.s.SolrDispatchFilter Loading solr.xml from SolrHome (not found in ZooKeeper)
   [junit4]   2> 1253644 INFO  (closeThreadPool-2409-thread-1) [    ] o.a.s.c.SolrXmlConfig Loading container configuration from /home/jenkins/jenkins-slave/workspace/Lucene-Solr-BadApples-Tests-8.x/solr/build/solr-core/test/J0/temp/solr.cloud.ShardRoutingTest_41FCD82A9E68FB97-001/shard-3-001/solr.xml
   [junit4]   2> 1253647 INFO  (closeThreadPool-2409-thread-1) [    ] o.a.s.c.SolrXmlConfig Configuration parameter autoReplicaFailoverWorkLoopDelay is ignored
   [junit4]   2> 1253647 INFO  (closeThreadPool-2409-thread-1) [    ] o.a.s.c.SolrXmlConfig Configuration parameter autoReplicaFailoverBadNodeExpiration is ignored
   [junit4]   2> 1253682 INFO  (closeThreadPool-2409-thread-1) [    ] o.a.s.c.SolrXmlConfig MBean server found: com.sun.jmx.mbeanserver.JmxMBeanServer@1bdd8140, but no JMX reporters were configured - adding default JMX reporter.
   [junit4]   2> 1253714 INFO  (zkConnectionManagerCallback-2439-thread-1) [    ] o.a.s.c.c.ConnectionManager zkClient has connected
   [junit4]   2> 1253716 INFO  (closeThreadPool-2409-thread-2) [n:127.0.0.1:35460__    ] o.a.s.c.c.ZkStateReader Updated live nodes from ZooKeeper... (0) -> (2)
   [junit4]   2> 1253719 INFO  (closeThreadPool-2409-thread-2) [n:127.0.0.1:35460__    ] o.a.s.c.ZkController Publish node=127.0.0.1:35460__ as DOWN
   [junit4]   2> 1253720 INFO  (closeThreadPool-2409-thread-2) [n:127.0.0.1:35460__    ] o.a.s.c.TransientSolrCoreCacheDefault Allocating transient cache for 4 transient cores
   [junit4]   2> 1253720 INFO  (closeThreadPool-2409-thread-2) [n:127.0.0.1:35460__    ] o.a.s.c.ZkController Register node as live in ZooKeeper:/live_nodes/127.0.0.1:35460__
   [junit4]   2> 1253753 INFO  (zkCallback-2395-thread-1) [    ] o.a.s.c.c.ZkStateReader Updated live nodes from ZooKeeper... (2) -> (3)
   [junit4]   2> 1253754 INFO  (zkCallback-2438-thread-1) [    ] o.a.s.c.c.ZkStateReader Updated live nodes from ZooKeeper... (2) -> (3)
   [junit4]   2> 1253754 INFO  (zkCallback-2407-thread-1) [    ] o.a.s.c.c.ZkStateReader Updated live nodes from ZooKeeper... (2) -> (3)
   [junit4]   2> 1253754 INFO  (zkCallback-2418-thread-1) [    ] o.a.s.c.c.ZkStateReader Updated live nodes from ZooKeeper... (2) -> (3)
   [junit4]   2> 1253754 INFO  (zkCallback-2427-thread-1) [    ] o.a.s.c.c.ZkStateReader Updated live nodes from ZooKeeper... (2) -> (3)
   [junit4]   2> 1253765 INFO  (zkCallback-2388-thread-2) [    ] o.a.s.c.c.ZkStateReader Updated live nodes from ZooKeeper... (2) -> (3)
   [junit4]   2> 1253891 INFO  (zkConnectionManagerCallback-2446-thread-1) [    ] o.a.s.c.c.ConnectionManager zkClient has connected
   [junit4]   2> 1253892 INFO  (closeThreadPool-2409-thread-2) [n:127.0.0.1:35460__    ] o.a.s.c.c.ZkStateReader Updated live nodes from ZooKeeper... (0) -> (3)
   [junit4]   2> 1253893 INFO  (closeThreadPool-2409-thread-2) [n:127.0.0.1:35460__    ] o.a.s.c.s.i.ZkClientClusterStateProvider Cluster at 127.0.0.1:45860/solr ready
   [junit4]   2> 1253984 INFO  (closeThreadPool-2409-thread-2) [n:127.0.0.1:35460__    ] o.a.s.h.a.MetricsHistoryHandler No .system collection, keeping metrics history in memory.
   [junit4]   2> 1254190 INFO  (closeThreadPool-2409-thread-2) [n:127.0.0.1:35460__    ] o.a.s.m.r.SolrJmxReporter JMX monitoring for 'solr.node' (registry 'solr.node') enabled at server: com.sun.jmx.mbeanserver.JmxMBeanServer@1bdd8140
   [junit4]   2> 1254301 INFO  (closeThreadPool-2409-thread-2) [n:127.0.0.1:35460__    ] o.a.s.m.r.SolrJmxReporter JMX monitoring for 'solr.jvm' (registry 'solr.jvm') enabled at server: com.sun.jmx.mbeanserver.JmxMBeanServer@1bdd8140
   [junit4]   2> 1254301 INFO  (closeThreadPool-2409-thread-2) [n:127.0.0.1:35460__    ] o.a.s.m.r.SolrJmxReporter JMX monitoring for 'solr.jetty' (registry 'solr.jetty') enabled at server: com.sun.jmx.mbeanserver.JmxMBeanServer@1bdd8140
   [junit4]   2> 1254302 INFO  (closeThreadPool-2409-thread-2) [n:127.0.0.1:35460__    ] o.a.s.c.CorePropertiesLocator Found 0 core definitions underneath /home/jenkins/jenkins-slave/workspace/Lucene-Solr-BadApples-Tests-8.x/solr/build/solr-core/test/J0/../../../../../../../../../../home/jenkins/jenkins-slave/workspace/Lucene-Solr-BadApples-Tests-8.x/solr/build/solr-core/test/J0/temp/solr.cloud.ShardRoutingTest_41FCD82A9E68FB97-001/shard-2-001/cores
   [junit4]   2> 1254743 INFO  (closeThreadPool-2409-thread-1) [    ] o.a.s.h.c.HttpShardHandlerFactory Host whitelist initialized: WhitelistHostChecker [whitelistHosts=null, whitelistHostCheckingEnabled=false]
   [junit4]   2> 1254744 WARN  (closeThreadPool-2409-thread-1) [    ] o.a.s.c.s.i.Http2SolrClient Create Http2SolrClient with HTTP/1.1 transport since Java 8 or lower versions does not support SSL + HTTP/2
   [junit4]   2> 1254849 INFO  (TEST-ShardRoutingTest.test-seed#[41FCD82A9E68FB97]) [    ] o.a.s.c.AbstractFullDistribZkTestBase create jetty 4 in directory /home/jenkins/jenkins-slave/workspace/Lucene-Solr-BadApples-Tests-8.x/solr/build/solr-core/test/J0/temp/solr.cloud.ShardRoutingTest_41FCD82A9E68FB97-001/shard-4-001 of type NRT
   [junit4]   2> 1254851 WARN  (closeThreadPool-2409-thread-2) [    ] o.e.j.s.AbstractConnector Ignoring deprecated socket close linger time
   [junit4]   2> 1254884 WARN  (closeThreadPool-2409-thread-1) [    ] o.e.j.u.s.S.config No Client EndPointIdentificationAlgorithm configured for SslContextFactory@6e14f7fb[provider=null,keyStore=null,trustStore=null]
   [junit4]   2> 1254885 INFO  (closeThreadPool-2409-thread-2) [    ] o.a.s.c.s.e.JettySolrRunner Start Jetty (original configured port=0)
   [junit4]   2> 1254885 INFO  (closeThreadPool-2409-thread-2) [    ] o.a.s.c.s.e.JettySolrRunner Trying to start Jetty on port 0 try number 1 ...
   [junit4]   2> 1254886 INFO  (closeThreadPool-2409-thread-2) [    ] o.e.j.s.Server jetty-9.4.14.v20181114; built: 2018-11-14T21:20:31.478Z; git: c4550056e785fb5665914545889f21dc136ad9e6; jvm 1.8.0_191-b12
   [junit4]   2> 1254898 WARN  (closeThreadPool-2409-thread-1) [    ] o.a.s.c.s.i.Http2SolrClient Create Http2SolrClient with HTTP/1.1 transport since Java 8 or lower versions does not support SSL + HTTP/2
   [junit4]   2> 1255183 INFO  (closeThreadPool-2409-thread-2) [    ] o.e.j.s.session DefaultSessionIdManager workerName=node0
   [junit4]   2> 1255183 INFO  (closeThreadPool-2409-thread-2) [    ] o.e.j.s.session No SessionScavenger set, using defaults
   [junit4]   2> 1255183 INFO  (closeThreadPool-2409-thread-2) [    ] o.e.j.s.session node0 Scavenging every 660000ms
   [junit4]   2> 1255184 INFO  (closeThreadPool-2409-thread-2) [    ] o.e.j.s.h.ContextHandler Started o.e.j.s.ServletContextHandler@582baee0{/_,null,AVAILABLE}
   [junit4]   2> 1255184 WARN  (closeThreadPool-2409-thread-2) [    ] o.e.j.u.s.S.config No Client EndPointIdentificationAlgorithm configured for SslContextFactory@73b77eb3[provider=null,keyStore=null,trustStore=null]
   [junit4]   2> 1255185 WARN  (closeThreadPool-2409-thread-1) [    ] o.e.j.u.s.S.config No Client EndPointIdentificationAlgorithm configured for SslContextFactory@3cfa74d6[provider=null,keyStore=null,trustStore=null]
   [junit4]   2> 1255186 INFO  (closeThreadPool-2409-thread-1) [    ] o.a.s.c.ZkContainer Zookeeper client=127.0.0.1:45860/solr
   [junit4]   2> 1255187 INFO  (closeThreadPool-2409-thread-2) [    ] o.e.j.s.AbstractConnector Started ServerConnector@3a86a082{SSL,[ssl, http/1.1]}{127.0.0.1:41693}
   [junit4]   2> 1255187 INFO  (closeThreadPool-2409-thread-2) [    ] o.e.j.s.Server Started @1255421ms
   [junit4]   2> 1255187 INFO  (closeThreadPool-2409-thread-2) [    ] o.a.s.c.s.e.JettySolrRunner Jetty properties: {solr.data.dir=/home/jenkins/jenkins-slave/workspace/Lucene-Solr-BadApples-Tests-8.x/solr/build/solr-core/test/J0/temp/solr.cloud.ShardRoutingTest_41FCD82A9E68FB97-001/tempDir-001/jetty4, replicaType=NRT, solrconfig=solrconfig.xml, hostContext=/_, hostPort=41693, coreRootDirectory=/home/jenkins/jenkins-slave/workspace/Lucene-Solr-BadApples-Tests-8.x/solr/build/solr-core/test/J0/../../../../../../../../../../home/jenkins/jenkins-slave/workspace/Lucene-Solr-BadApples-Tests-8.x/solr/build/solr-core/test/J0/temp/solr.cloud.ShardRoutingTest_41FCD82A9E68FB97-001/shard-4-001/cores}
   [junit4]   2> 1255188 ERROR (closeThreadPool-2409-thread-2) [    ] o.a.s.u.StartupLoggingUtils Missing Java Option solr.log.dir. Logging may be missing or incomplete.
   [junit4]   2> 1255188 INFO  (closeThreadPool-2409-thread-2) [    ] o.a.s.s.SolrDispatchFilter Using logger factory org.apache.logging.slf4j.Log4jLoggerFactory
   [junit4]   2> 1255188 INFO  (closeThreadPool-2409-thread-2) [    ] o.a.s.s.SolrDispatchFilter  ___      _       Welcome to Apache Solr™ version 8.1.0
   [junit4]   2> 1255188 INFO  (closeThreadPool-2409-thread-2) [    ] o.a.s.s.SolrDispatchFilter / __| ___| |_ _   Starting in cloud mode on port null
   [junit4]   2> 1255188 INFO  (closeThreadPool-2409-thread-2) [    ] o.a.s.s.SolrDispatchFilter \__ \/ _ \ | '_|  Install dir: null
   [junit4]   2> 1255188 INFO  (closeThreadPool-2409-thread-2) [    ] o.a.s.s.SolrDispatchFilter |___/\___/_|_|    Start time: 2019-03-06T05:47:18.421Z
   [junit4]   2> 1255216 INFO  (zkConnectionManagerCallback-2453-thread-1) [    ] o.a.s.c.c.ConnectionManager zkClient has connected
   [junit4]   2> 1255253 INFO  (zkConnectionManagerCallback-2455-thread-1) [    ] o.a.s.c.c.ConnectionManager zkClient has connected
   [junit4]   2> 1255313 INFO  (zkConnectionManagerCallback-2457-thread-1) [    ] o.a.s.c.c.ConnectionManager zkClient has connected
   [junit4]   2> 1255314 INFO  (closeThreadPool-2409-thread-2) [    ] o.a.s.s.SolrDispatchFilter Loading solr.xml from SolrHome (not found in ZooKeeper)
   [junit4]   2> 1255314 INFO  (closeThreadPool-2409-thread-2) [    ] o.a.s.c.SolrXmlConfig Loading container configuration from /home/jenkins/jenkins-slave/workspace/Lucene-Solr-BadApples-Tests-8.x/solr/build/solr-core/test/J0/temp/solr.cloud.ShardRoutingTest_41FCD82A9E68FB97-001/shard-4-001/solr.xml
   [junit4]   2> 1255352 INFO  (closeThreadPool-2409-thread-1) [    ] o.a.s.c.c.ZkStateReader Updated live nodes from ZooKeeper... (0) -> (3)
   [junit4]   2> 1255370 INFO  (closeThreadPool-2409-thread-2) [    ] o.a.s.c.SolrXmlConfig Configuration parameter autoReplicaFailoverWorkLoopDelay is ignored
   [junit4]   2> 1255370 INFO  (closeThreadPool-2409-thread-2) [    ] o.a.s.c.SolrXmlConfig Configuration parameter autoReplicaFailoverBadNodeExpiration is ignored
   [junit4]   2> 1255371 INFO  (closeThreadPool-2409-thread-1) [    ] o.a.s.c.ZkController Publish node=127.0.0.1:46583__ as DOWN
   [junit4]   2> 1255371 INFO  (closeThreadPool-2409-thread-1) [    ] o.a.s.c.TransientSolrCoreCacheDefault Allocating transient cache for 4 transient cores
   [junit4]   2> 1255371 INFO  (closeThreadPool-2409-thread-1) [    ] o.a.s.c.ZkController Register node as live in ZooKeeper:/live_nodes/127.0.0.1:46583__
   [junit4]   2> 1255378 INFO  (zkCallback-2418-thread-1) [    ] o.a.s.c.c.ZkStateReader Updated live nodes from ZooKeeper... (3) -> (4)
   [junit4]   2> 1255387 INFO  (closeThreadPool-2409-thread-2) [    ] o.a.s.c.SolrXmlConfig MBean server found: com.sun.jmx.mbeanserver.JmxMBeanServer@1bdd8140, but no JMX reporters were configured - adding default JMX reporter.
   [junit4]   2> 1255398 INFO  (zkCallback-2407-thread-1) [    ] o.a.s.c.c.ZkStateReader Updated live nodes from ZooKeeper... (3) -> (4)
   [junit4]   2> 1255398 INFO  (zkCallback-2438-thread-1) [    ] o.a.s.c.c.ZkStateReader Updated live nodes from ZooKeeper... (3) -> (4)
   [junit4]   2> 1255399 INFO  (zkCallback-2388-thread-3) [    ] o.a.s.c.c.ZkStateReader Updated live nodes from ZooKeeper... (3) -> (4)
   [junit4]   2> 1255399 INFO  (zkCallback-2395-thread-1) [    ] o.a.s.c.c.ZkStateReader Updated live nodes from ZooKeeper... (3) -> (4)
   [junit4]   2> 1255407 INFO  (zkCallback-2427-thread-1) [    ] o.a.s.c.c.ZkStateReader Updated live nodes from ZooKeeper... (3) -> (4)
   [junit4]   2> 1255734 INFO  (zkCallback-2445-thread-1) [    ] o.a.s.c.c.ZkStateReader Updated live nodes from ZooKeeper... (3) -> (4)
   [junit4]   2> 1255734 INFO  (zkCallback-2456-thread-1) [    ] o.a.s.c.c.ZkStateReader Updated live nodes from ZooKeeper... (3) -> (4)
   [junit4]   2> 1255986 INFO  (zkConnectionManagerCallback-2464-thread-1) [    ] o.a.s.c.c.ConnectionManager zkClient has connected
   [junit4]   2> 1255987 INFO  (closeThreadPool-2409-thread-1) [    ] o.a.s.c.c.ZkStateReader Updated live nodes from ZooKeeper... (0) -> (4)
   [junit4]   2> 1255988 INFO  (closeThreadPool-2409-thread-1) [    ] o.a.s.c.s.i.ZkClientClusterStateProvider Cluster at 127.0.0.1:45860/solr ready
   [junit4]   2> 1256079 INFO  (closeThreadPool-2409-thread-1) [    ] o.a.s.h.a.MetricsHistoryHandler No .system collection, keeping metrics history in memory.
   [junit4]   2> 1256277 INFO  (closeThreadPool-2409-thread-1) [    ] o.a.s.m.r.SolrJmxReporter JMX monitoring for 'solr.node' (registry 'solr.node') enabled at server: com.sun.jmx.mbeanserver.JmxMBeanServer@1bdd8140
   [junit4]   2> 1256351 INFO  (closeThreadPool-2409-thread-1) [    ] o.a.s.m.r.SolrJmxReporter JMX monitoring for 'solr.jvm' (registry 'solr.jvm') enabled at server: com.sun.jmx.mbeanserver.JmxMBeanServer@1bdd8140
   [junit4]   2> 1256351 INFO  (closeThreadPool-2409-thread-1) [    ] o.a.s.m.r.SolrJmxReporter JMX monitoring for 'solr.jetty' (registry 'solr.jetty') enabled at server: com.sun.jmx.mbeanserver.JmxMBeanServer@1bdd8140
   [junit4]   2> 1256352 INFO  (closeThreadPool-2409-thread-1) [    ] o.a.s.c.CorePropertiesLocator Found 0 core definitions underneath /home/jenkins/jenkins-slave/workspace/Lucene-Solr-BadApples-Tests-8.x/solr/build/solr-core/test/J0/../../../../../../../../../../home/jenkins/jenkins-slave/workspace/Lucene-Solr-BadApples-Tests-8.x/solr/build/solr-core/test/J0/temp/solr.cloud.ShardRoutingTest_41FCD82A9E68FB97-001/shard-3-001/cores
   [junit4]   2> 1256575 INFO  (TEST-ShardRoutingTest.test-seed#[41FCD82A9E68FB97]) [    ] o.a.s.c.AbstractFullDistribZkTestBase create jetty 5 in directory /home/jenkins/jenkins-slave/workspace/Lucene-Solr-BadApples-Tests-8.x/solr/build/solr-core/test/J0/temp/solr.cloud.ShardRoutingTest_41FCD82A9E68FB97-001/shard-5-001 of type NRT
   [junit4]   2> 1256590 WARN  (closeThreadPool-2409-thread-3) [    ] o.e.j.s.AbstractConnector Ignoring deprecated socket close linger time
   [junit4]   2> 1256591 INFO  (closeThreadPool-2409-thread-3) [    ] o.a.s.c.s.e.JettySolrRunner Start Jetty (original configured port=0)
   [junit4]   2> 1256591 INFO  (closeThreadPool-2409-thread-3) [    ] o.a.s.c.s.e.JettySolrRunner Trying to start Jetty on port 0 try number 1 ...
   [junit4]   2> 1256591 INFO  (closeThreadPool-2409-thread-3) [    ] o.e.j.s.Server jetty-9.4.14.v20181114; built: 2018-11-14T21:20:31.478Z; git: c4550056e785fb5665914545889f21dc136ad9e6; jvm 1.8.0_191-b12
   [junit4]   2> 1256638 INFO  (closeThreadPool-2409-thread-3) [    ] o.e.j.s.session DefaultSessionIdManager workerName=node0
   [junit4]   2> 1256638 INFO  (closeThreadPool-2409-thread-3) [    ] o.e.j.s.session No SessionScavenger set, using defaults
   [junit4]   2> 1256638 INFO  (closeThreadPool-2409-thread-3) [    ] o.e.j.s.session node0 Scavenging every 600000ms
   [junit4]   2> 1256638 INFO  (closeThreadPool-2409-thread-3) [    ] o.e.j.s.h.ContextHandler Started o.e.j.s.ServletContextHandler@4df16a7e{/_,null,AVAILABLE}
   [junit4]   2> 1256639 WARN  (closeThreadPool-2409-thread-3) [    ] o.e.j.u.s.S.config No Client EndPointIdentificationAlgorithm configured for SslContextFactory@4bf060b4[provider=null,keyStore=null,trustStore=null]
   [junit4]   2> 1256646 INFO  (closeThreadPool-2409-thread-3) [    ] o.e.j.s.AbstractConnector Started ServerConnector@20292b95{SSL,[ssl, http/1.1]}{127.0.0.1:37358}
   [junit4]   2> 1256646 INFO  (closeThreadPool-2409-thread-3) [    ] o.e.j.s.Server Started @1256879ms
   [junit4]   2> 1256646 INFO  (closeThreadPool-2409-thread-3) [    ] o.a.s.c.s.e.JettySolrRunner Jetty properties: {solr.data.dir=/home/jenkins/jenkins-slave/workspace/Lucene-Solr-BadApples-Tests-8.x/solr/build/solr-core/test/J0/temp/solr.cloud.ShardRoutingTest_41FCD82A9E68FB97-001/tempDir-001/jetty5, replicaType=NRT, solrconfig=solrconfig.xml, hostContext=/_, hostPort=37358, coreRootDirectory=/home/jenkins/jenkins-slave/workspace/Lucene-Solr-BadApples-Tests-8.x/solr/build/solr-core/test/J0/../../../../../../../../../../home/jenkins/jenkins-slave/workspace/Lucene-Solr-BadApples-Tests-8.x/solr/build/solr-core/test/J0/temp/solr.cloud.ShardRoutingTest_41FCD82A9E68FB97-001/shard-5-001/cores}
   [junit4]   2> 1256646 ERROR (closeThreadPool-2409-thread-3) [    ] o.a.s.u.StartupLoggingUtils Missing Java Option solr.log.dir. Logging may be missing or incomplete.
   [junit4]   2> 1256646 INFO  (closeThreadPool-2409-thread-3) [    ] o.a.s.s.SolrDispatchFilter Using logger factory org.apache.logging.slf4j.Log4jLoggerFactory
   [junit4]   2> 1256646 INFO  (closeThreadPool-2409-thread-3) [    ] o.a.s.s.SolrDispatchFilter  ___      _       Welcome to Apache Solr™ version 8.1.0
   [junit4]   2> 1256646 INFO  (closeThreadPool-2409-thread-3) [    ] o.a.s.s.SolrDispatchFilter / __| ___| |_ _   Starting in cloud mode on port null
   [junit4]   2> 1256646 INFO  (closeThreadPool-2409-thread-3) [    ] o.a.s.s.SolrDispatchFilter \__ \/ _ \ | '_|  Install dir: null
   [junit4]   2> 1256646 INFO  (closeThreadPool-2409-thread-3) [    ] o.a.s.s.SolrDispatchFilter |___/\___/_|_|    Start time: 2019-03-06T05:47:19.879Z
   [junit4]   2> 1256682 INFO  (zkConnectionManagerCallback-2467-thread-1) [    ] o.a.s.c.c.ConnectionManager zkClient has connected
   [junit4]   2> 1256699 INFO  (closeThreadPool-2409-thread-3) [    ] o.a.s.s.SolrDispatchFilter Loading solr.xml from SolrHome (not found in ZooKeeper)
   [junit4]   2> 1256699 INFO  (closeThreadPool-2409-thread-3) [    ] o.a.s.c.SolrXmlConfig Loading container configuration from /home/jenkins/jenkins-slave/workspace/Lucene-Solr-BadApples-Tests-8.x/solr/build/solr-core/test/J0/temp/solr.cloud.ShardRoutingTest_41FCD82A9E68FB97-001/shard-5-001/solr.xml
   [junit4]   2> 1256735 INFO  (closeThreadPool-2409-thread-3) [    ] o.a.s.c.SolrXmlConfig Configuration parameter autoReplicaFailoverWorkLoopDelay is ignored
   [junit4]   2> 1256735 INFO  (closeThreadPool-2409-thread-3) [    ] o.a.s.c.SolrXmlConfig Configuration parameter autoReplicaFailoverBadNodeExpiration is ignored
   [junit4]   2> 1256737 INFO  (closeThreadPool-2409-thread-3) [    ] o.a.s.c.SolrXmlConfig MBean server found: com.sun.jmx.mbeanserver.JmxMBeanServer@1bdd8140, but no JMX reporters were configured - adding default JMX reporter.
   [junit4]   2> 1256808 INFO  (closeThreadPool-2409-thread-2) [    ] o.a.s.h.c.HttpShardHandlerFactory Host whitelist initialized: WhitelistHostChecker [whitelistHosts=null, whitelistHostCheckingEnabled=false]
   [junit4]   2> 1256809 WARN  (closeThreadPool-2409-thread-2) [    ] o.a.s.c.s.i.Http2SolrClient Create Http2SolrClient with HTTP/1.1 transport since Java 8 or lower versions does not support SSL + HTTP/2
   [junit4]   2> 1256809 WARN  (closeThreadPool-2409-thread-2) [    ] o.e.j.u.s.S.config No Client EndPointIdentificationAlgorithm configured for SslContextFactory@3e35ef3a[provider=null,keyStore=null,trustStore=null]
   [junit4]   2> 1256824 WARN  (closeThreadPool-2409-thread-2) [    ] o.a.s.c.s.i.Http2SolrClient Create Http2SolrClient with HTTP/1.1 transport since Java 8 or lower versions does not support SSL + HTTP/2
   [junit4]   2> 1256837 WARN  (closeThreadPool-2409-thread-2) [    ] o.e.j.u.s.S.config No Client EndPointIdentificationAlgorithm configured for SslContextFactory@58e8ea48[provider=null,keyStore=null,trustStore=null]
   [junit4]   2> 1256838 INFO  (closeThreadPool-2409-thread-2) [    ] o.a.s.c.ZkContainer Zookeeper client=127.0.0.1:45860/solr
   [junit4]   2> 1257006 INFO  (zkConnectionManagerCallback-2473-thread-1) [    ] o.a.s.c.c.ConnectionManager zkClient has connected
   [junit4]   2> 1257043 INFO  (zkConnectionManagerCallback-2475-thread-1) [    ] o.a.s.c.c.ConnectionManager zkClient has connected
   [junit4]   2> 1257045 INFO  (closeThreadPool-2409-thread-2) [    ] o.a.s.c.c.ZkStateReader Updated live nodes from ZooKeeper... (0) -> (4)
   [junit4]   2> 1257080 INFO  (closeThreadPool-2409-thread-2) [    ] o.a.s.c.ZkController Publish node=127.0.0.1:41693__ as DOWN
   [junit4]   2> 1257081 INFO  (closeThreadPool-2409-thread-2) [    ] o.a.s.c.TransientSolrCoreCacheDefault Allocating transient cache for 4 transient cores
   [junit4]   2> 1257081 INFO  (closeThreadPool-2409-thread-2) [    ] o.a.s.c.ZkController Register node as live in ZooKeeper:/live_nodes/127.0.0.1:41693__
   [junit4]   2> 1257082 INFO  (zkCallback-2438-thread-1) [    ] o.a.s.c.c.ZkStateReader Updated live nodes from ZooKeeper... (4) -> (5)
   [junit4]   2> 1257082 INFO  (zkCallback-2418-thread-1) [    ] o.a.s.c.c.ZkStateReader Updated live nodes from ZooKeeper... (4) -> (5)
   [junit4]   2> 1257082 INFO  (zkCallback-2456-thread-1) [    ] o.a.s.c.c.ZkStateReader Updated live nodes from ZooKeeper... (4) -> (5)
   [junit4]   2> 1257082 INFO  (zkCallback-2445-thread-1) [    ] o.a.s.c.c.ZkStateReader Updated live nodes from ZooKeeper... (4) -> (5)
   [junit4]   2> 1257100 INFO  (zkCallback-2474-thread-1) [    ] o.a.s.c.c.ZkStateReader Updated live nodes from ZooKeeper... (4) -> (5)
   [junit4]   2> 1257104 INFO  (zkCallback-2427-thread-1) [    ] o.a.s.c.c.ZkStateReader Updated live nodes from ZooKeeper... (4) -> (5)
   [junit4]   2> 1257127 INFO  (zkCallback-2407-thread-1) [    ] o.a.s.c.c.ZkStateReader Updated live nodes from ZooKeeper... (4) -> (5)
   [junit4]   2> 1257127 INFO  (zkCallback-2395-thread-1) [    ] o.a.s.c.c.ZkStateReader Updated live nodes from ZooKeeper... (4) -> (5)
   [junit4]   2> 1257136 INFO  (zkCallback-2388-thread-2) [    ] o.a.s.c.c.ZkStateReader Updated live nodes from ZooKeeper... (4) -> (5)
   [junit4]   2> 1257286 INFO  (zkCallback-2463-thread-1) [    ] o.a.s.c.c.ZkStateReader Updated live nodes from ZooKeeper... (4) -> (5)
   [junit4]   2> 1257428 INFO  (zkConnectionManagerCallback-2482-thread-1) [    ] o.a.s.c.c.ConnectionManager zkClient has connected
   [junit4]   2> 1257444 INFO  (closeThreadPool-2409-thread-2) [    ] o.a.s.c.c.ZkStateReader Updated live nodes from ZooKeeper... (0) -> (5)
   [junit4]   2> 1257445 INFO  (closeThreadPool-2409-thread-2) [    ] o.a.s.c.s.i.ZkClientClusterStateProvider Cluster at 127.0.0.1:45860/solr ready
   [junit4]   2> 1257464 INFO  (closeThreadPool-2409-thread-2) [    ] o.a.s.h.a.MetricsHistoryHandler No .system collection, keeping metrics history in memory.
   [junit4]   2> 1257557 INFO  (closeThreadPool-2409-thread-3) [    ] o.a.s.h.c.HttpShardHandlerFactory Host whitelist initialized: WhitelistHostChecker [whitelistHosts=null, whitelistHostCheckingEnabled=false]
   [junit4]   2> 1257557 WARN  (closeThreadPool-2409-thread-3) [    ] o.a.s.c.s.i.Http2SolrClient Create Http2SolrClient with HTTP/1.1 transport since Java 8 or lower versions does not support SSL + HTTP/2
   [junit4]   2> 1257577 INFO  (closeThreadPool-2409-thread-2) [    ] o.a.s.m.r.SolrJmxReporter JMX monitoring for 'solr.node' (registry 'solr.node') enabled at server: com.sun.jmx.mbeanserver.JmxMBeanServer@1bdd8140
   [junit4]   2> 1257617 INFO  (closeThreadPool-2409-thread-2) [    ] o.a.s.m.r.SolrJmxReporter JMX monitoring for 'solr.jvm' (registry 'solr.jvm') enabled at server: com.sun.jmx.mbeanserver.JmxMBeanServer@1bdd8140
   [junit4]   2> 1257618 INFO  (closeThreadPool-2409-thread-2) [    ] o.a.s.m.r.SolrJmxReporter JMX monitoring for 'solr.jetty' (registry 'solr.jetty') enabled at server: com.sun.jmx.mbeanserver.JmxMBeanServer@1bdd8140
   [junit4]   2> 1257651 INFO  (closeThreadPool-2409-thread-2) [    ] o.a.s.c.CorePropertiesLocator Found 0 core definitions underneath /home/jenkins/jenkins-slave/workspace/Lucene-Solr-BadApples-Tests-8.x/solr/build/solr-core/test/J0/../../../../../../../../../../home/jenkins/jenkins-slave/workspace/Lucene-Solr-BadApples-Tests-8.x/solr/build/solr-core/test/J0/temp/solr.cloud.ShardRoutingTest_41FCD82A9E68FB97-001/shard-4-001/cores
   [junit4]   2> 1257668 WARN  (closeThreadPool-2409-thread-3) [    ] o.e.j.u.s.S.config No Client EndPointIdentificationAlgorithm configured for SslContextFactory@1ac6f2f7[provider=null,keyStore=null,trustStore=null]
   [junit4]   2> 1257670 WARN  (closeThreadPool-2409-thread-3) [    ] o.a.s.c.s.i.Http2SolrClient Create Http2SolrClient with HTTP/1.1 transport since Java 8 or lower versions does not support SSL + HTTP/2
   [junit4]   2> 1257805 WARN  (closeThreadPool-2409-thread-3) [    ] o.e.j.u.s.S.config No Client EndPointIdentificationAlgorithm configured for SslContextFactory@5371f2b7[provider=null,keyStore=null,trustStore=null]
   [junit4]   2> 1257826 INFO  (closeThreadPool-2409-thread-3) [    ] o.a.s.c.ZkContainer Zookeeper client=127.0.0.1:45860/solr
   [junit4]   2> 1257955 INFO  (zkConnectionManagerCallback-2489-thread-1) [    ] o.a.s.c.c.ConnectionManager zkClient has connected
   [junit4]   2> 1257988 WARN  (NIOServerCxn.Factory:0.0.0.0/0.0.0.0:0) [    ] o.a.z.s.NIOServerCnxn Unable to read additional data from client sessionid 0x107f5cd0625001a, likely client has closed socket
   [junit4]   2> 1258238 INFO  (zkConnectionManagerCallback-2491-thread-1) [    ] o.a.s.c.c.ConnectionManager zkClient has connected
   [junit4]   2> 1258260 INFO  (closeThreadPool-2409-thread-3) [n:127.0.0.1:37358__    ] o.a.s.c.c.ZkStateReader Updated live nodes from ZooKeeper... (0) -> (5)
   [junit4]   2> 1258262 INFO  (closeThreadPool-2409-thread-3) [n:127.0.0.1:37358__    ] o.a.s.c.ZkController Publish node=127.0.0.1:37358__ as DOWN
   [junit4]   2> 1258279 INFO  (closeThreadPool-2409-thread-3) [n:127.0.0.1:37358__    ] o.a.s.c.TransientSolrCoreCacheDefault Allocating transient cache for 4 transient cores
   [junit4]   2> 1258279 INFO  (closeThreadPool-2409-thread-3) [n:127.0.0.1:37358__    ] o.a.s.c.ZkController Register node as live in ZooKeeper:/live_nodes/127.0.0.1:37358__
   [junit4]   2> 1258299 INFO  (zkCallback-2474-thread-1) [    ] o.a.s.c.c.ZkStateReader Updated live nodes from ZooKeeper... (5) -> (6)
   [junit4]   2> 1258299 INFO  (zkCallback-2388-thread-3) [    ] o.a.s.c.c.ZkStateReader Updated live nodes from ZooKeeper... (5) -> (6)
   [junit4]   2> 1258303 INFO  (zkCallback-2438-thread-1) [    ] o.a.s.c.c.ZkStateReader Updated live nodes from ZooKeeper... (5) -> (6)
   [junit4]   2> 1258303 INFO  (zkCallback-2456-thread-1) [    ] o.a.s.c.c.ZkStateReader Updated live nodes from ZooKeeper... (5) -> (6)
   [junit4]   2> 1258303 INFO  (zkCallback-2418-thread-1) [    ] o.a.s.c.c.ZkStateReader Updated live nodes from ZooKeeper... (5) -> (6)
   [junit4]   2> 1258303 INFO  (zkCallback-2445-thread-1) [    ] o.a.s.c.c.ZkStateReader Updated live nodes from ZooKeeper... (5) -> (6)
   [junit4]   2> 1258336 INFO  (zkCallback-2395-thread-1) [    ] o.a.s.c.c.ZkStateReader Updated live nodes from ZooKeeper... (5) -> (6)
   [junit4]   2> 1258372 INFO  (zkCallback-2407-thread-1) [    ] o.a.s.c.c.ZkStateReader Updated live nodes from ZooKeeper... (5) -> (6)
   [junit4]   2> 1258372 INFO  (zkCallback-2427-thread-1) [    ] o.a.s.c.c.ZkStateReader Updated live nodes from ZooKeeper... (5) -> (6)
   [junit4]   2> 1258404 INFO  (zkCallback-2463-thread-1) [    ] o.a.s.c.c.ZkStateReader Updated live nodes from ZooKeeper... (5) -> (6)
   [junit4]   2> 1258429 INFO  (zkCallback-2490-thread-1) [    ] o.a.s.c.c.ZkStateReader Updated live nodes from ZooKeeper... (5) -> (6)
   [junit4]   2> 1258482 INFO  (zkCallback-2481-thread-1) [    ] o.a.s.c.c.ZkStateReader Updated live nodes from ZooKeeper... (5) -> (6)
   [junit4]   2> 1258587 INFO  (zkConnectionManagerCallback-2498-thread-1) [    ] o.a.s.c.c.ConnectionManager zkClient has connected
   [junit4]   2> 1258611 INFO  (closeThreadPool-2409-thread-3) [n:127.0.0.1:37358__    ] o.a.s.c.c.ZkStateReader Updated live nodes from ZooKeeper... (0) -> (6)
   [junit4]   2> 1258612 INFO  (closeThreadPool-2409-thread-3) [n:127.0.0.1:37358__    ] o.a.s.c.s.i.ZkClientClusterStateProvider Cluster at 127.0.0.1:45860/solr ready
   [junit4]   2> 1258656 INFO  (closeThreadPool-2409-thread-3) [n:127.0.0.1:37358__    ] o.a.s.h.a.MetricsHistoryHandler No .system collection, keeping metrics history in memory.
   [junit4]   2> 1258750 INFO  (closeThreadPool-2409-thread-3) [n:127.0.0.1:37358__    ] o.a.s.m.r.SolrJmxReporter JMX monitoring for 'solr.node' (registry 'solr.node') enabled at server: com.sun.jmx.mbeanserver.JmxMBeanServer@1bdd8140
   [junit4]   2> 1258766 INFO  (TEST-ShardRoutingTest.test-seed#[41FCD82A9E68FB97]) [    ] o.a.s.c.AbstractFullDistribZkTestBase create jetty 6 in directory /home/jenkins/jenkins-slave/workspace/Lucene-Solr-BadApples-Tests-8.x/solr/build/solr-core/test/J0/temp/solr.cloud.ShardRoutingTest_41FCD82A9E68FB97-001/shard-6-001 of type NRT
   [junit4]   2> 1258768 WARN  (closeThreadPool-2409-thread-2) [    ] o.e.j.s.AbstractConnector Ignoring deprecated socket close linger time
   [junit4]   2> 1258768 INFO  (closeThreadPool-2409-thread-2) [    ] o.a.s.c.s.e.JettySolrRunner Start Jetty (original configured port=0)
   [junit4]   2> 1258768 INFO  (closeThreadPool-2409-thread-2) [    ] o.a.s.c.s.e.JettySolrRunner Trying to start Jetty on port 0 try number 1 ...
   [junit4]   2> 1258768 INFO  (closeThreadPool-2409-thread-2) [    ] o.e.j.s.Server jetty-9.4.14.v20181114; built: 2018-11-14T21:20:31.478Z; git: c4550056e785fb5665914545889f21dc136ad9e6; jvm 1.8.0_191-b12
   [junit4]   2> 1258849 INFO  (closeThreadPool-2409-thread-3) [n:127.0.0.1:37358__    ] o.a.s.m.r.SolrJmxReporter JMX monitoring for 'solr.jvm' (registry 'solr.jvm') enabled at server: com.sun.jmx.mbeanserver.JmxMBeanServer@1bdd8140
   [junit4]   2> 1258849 INFO  (closeThreadPool-2409-thread-3) [n:127.0.0.1:37358__    ] o.a.s.m.r.SolrJmxReporter JMX monitoring for 'solr.jetty' (registry 'solr.jetty') enabled at server: com.sun.jmx.mbeanserver.JmxMBeanServer@1bdd8140
   [junit4]   2> 1258867 INFO  (closeThreadPool-2409-thread-3) [n:127.0.0.1:37358__    ] o.a.s.c.CorePropertiesLocator Found 0 core definitions underneath /home/jenkins/jenkins-slave/workspace/Lucene-Solr-BadApples-Tests-8.x/solr/build/solr-core/test/J0/../../../../../../../../../../home/jenkins/jenkins-slave/workspace/Lucene-Solr-BadApples-Tests-8.x/solr/build/solr-core/test/J0/temp/solr.cloud.ShardRoutingTest_41FCD82A9E68FB97-001/shard-5-001/cores
   [junit4]   2> 1258939 INFO  (closeThreadPool-2409-thread-2) [    ] o.e.j.s.session DefaultSessionIdManager workerName=node0
   [junit4]   2> 1258939 INFO  (closeThreadPool-2409-thread-2) [    ] o.e.j.s.session No SessionScavenger set, using defaults
   [junit4]   2> 1258939 INFO  (closeThreadPool-2409-thread-2) [    ] o.e.j.s.session node0 Scavenging every 660000ms
   [junit4]   2> 1258940 INFO  (closeThreadPool-2409-thread-2) [    ] o.e.j.s.h.ContextHandler Started o.e.j.s.ServletContextHandler@3a6fca31{/_,null,AVAILABLE}
   [junit4]   2> 1258940 WARN  (closeThreadPool-2409-thread-2) [    ] o.e.j.u.s.S.config No Client EndPointIdentificationAlgorithm configured for SslContextFactory@486a8700[provider=null,keyStore=null,trustStore=null]
   [junit4]   2> 1258955 INFO  (closeThreadPool-2409-thread-2) [    ] o.e.j.s.AbstractConnector Started ServerConnector@1601b42e{SSL,[ssl, http/1.1]}{127.0.0.1:36667}
   [junit4]   2> 1258955 INFO  (closeThreadPool-2409-thread-2) [    ] o.e.j.s.Server Started @1259188ms
   [junit4]   2> 1258955 INFO  (closeThreadPool-2409-thread-2) [    ] o.a.s.c.s.e.JettySolrRunner Jetty properties: {solr.data.dir=/home/jenkins/jenkins-slave/workspace/Lucene-Solr-BadApples-Tests-8.x/solr/build/solr-core/test/J0/temp/solr.cloud.ShardRoutingTest_41FCD82A9E68FB97-001/tempDir-001/jetty6, replicaType=NRT, solrconfig=solrconfig.xml, hostContext=/_, hostPort=36667, coreRootDirectory=/home/jenkins/jenkins-slave/workspace/Lucene-Solr-BadApples-Tests-8.x/solr/build/solr-core/test/J0/temp/solr.cloud.ShardRoutingTest_41FCD82A9E68FB97-001/shard-6-001/cores}
   [junit4]   2> 1258968 ERROR (closeThreadPool-2409-thread-2) [    ] o.a.s.u.StartupLoggingUtils Missing Java Option solr.log.dir. Logging may be missing or incomplete.
   [junit4]   2> 1258968 INFO  (closeThreadPool-2409-thread-2) [    ] o.a.s.s.SolrDispatchFilter Using logger factory org.apache.logging.slf4j.Log4jLoggerFactory
   [junit4]   2> 1258968 INFO  (closeThreadPool-2409-thread-2) [    ] o.a.s.s.SolrDispatchFilter  ___      _       Welcome to Apache Solr™ version 8.1.0
   [junit4]   2> 1258968 INFO  (closeThreadPool-2409-thread-2) [    ] o.a.s.s.SolrDispatchFilter / __| ___| |_ _   Starting in cloud mode on port null
   [junit4]   2> 1258968 INFO  (closeThreadPool-2409-thread-2) [    ] o.a.s.s.SolrDispatchFilter \__ \/ _ \ | '_|  Install dir: null
   [junit4]   2> 1258968 INFO  (closeThreadPool-2409-thread-2) [    ] o.a.s.s.SolrDispatchFilter |___/\___/_|_|    Start time: 2019-03-06T05:47:22.201Z
   [junit4]   2> 1258970 INFO  (zkConnectionManagerCallback-2501-thread-1) [    ] o.a.s.c.c.ConnectionManager zkClient has connected
   [junit4]   2> 1258971 INFO  (closeThreadPool-2409-thread-2) [    ] o.a.s.s.SolrDispatchFilter Loading solr.xml from SolrHome (not found in ZooKeeper)
   [junit4]   2> 1258971 INFO  (closeThreadPool-2409-thread-2) [    ] o.a.s.c.SolrXmlConfig Loading container configuration from /home/jenkins/jenkins-slave/workspace/Lucene-Solr-BadApples-Tests-8.x/solr/build/solr-core/test/J0/temp/solr.cloud.ShardRoutingTest_41FCD82A9E68FB97-001/shard-6-001/solr.xml
   [junit4]   2> 1259082 INFO  (closeThreadPool-2409-thread-2) [    ] o.a.s.c.SolrXmlConfig Configuration parameter autoReplicaFailoverWorkLoopDelay is ignored
   [junit4]   2> 1259082 INFO  (closeThreadPool-2409-thread-2) [    ] o.a.s.c.SolrXmlConfig Configuration parameter autoReplicaFailoverBadNodeExpiration is ignored
   [junit4]   2> 1259084 INFO  (closeThreadPool-2409-thread-2) [    ] o.a.s.c.SolrXmlConfig MBean server found: com.sun.jmx.mbeanserver.JmxMBeanServer@1bdd8140, but no JMX reporters were configured - adding default JMX reporter.
   [junit4]   2> 1260108 INFO  (closeThreadPool-2409-thread-2) [    ] o.a.s.h.c.HttpShardHandlerFactory Host whitelist initialized: WhitelistHostChecker [whitelistHosts=null, whitelistHostCheckingEnabled=false]
   [junit4]   2> 1260109 WARN  (closeThreadPool-2409-thread-2) [    ] o.a.s.c.s.i.Http2SolrClient Create Http2SolrClient with HTTP/1.1 transport since Java 8 or lower versions does not support SSL + HTTP/2
   [junit4]   2> 1260157 INFO  (TEST-ShardRoutingTest.test-seed#[41FCD82A9E68FB97]) [    ] o.a.s.c.AbstractFullDistribZkTestBase create jetty 7 in directory /home/jenkins/jenkins-slave/workspace/Lucene-Solr-BadApples-Tests-8.x/solr/build/solr-core/test/J0/temp/solr.cloud.ShardRoutingTest_41FCD82A9E68FB97-001/shard-7-001 of type NRT
   [junit4]   2> 1260158 WARN  (closeThreadPool-2409-thread-3) [    ] o.e.j.s.AbstractConnector Ignoring deprecated socket close linger time
   [junit4]   2> 1260158 INFO  (closeThreadPool-2409-thread-3) [    ] o.a.s.c.s.e.JettySolrRunner Start Jetty (original configured port=0)
   [junit4]   2> 1260158 INFO  (closeThreadPool-2409-thread-3) [    ] o.a.s.c.s.e.JettySolrRunner Trying to start Jetty on port 0 try number 1 ...
   [junit4]   2> 1260158 INFO  (closeThreadPool-2409-thread-3) [    ] o.e.j.s.Server jetty-9.4.14.v20181114; built: 2018-11-14T21:20:31.478Z; git: c4550056e785fb5665914545889f21dc136ad9e6; jvm 1.8.0_191-b12
   [junit4]   2> 1260163 WARN  (closeThreadPool-2409-th

[...truncated too long message...]

Apples-Tests-8.x/lucene/top-level-ivy-settings.xml

resolve:

ivy-availability-check:
[loadresource] Do not set property disallowed.ivy.jars.list as its length is 0.

-ivy-fail-disallowed-ivy-version:

ivy-fail:

ivy-configure:
[ivy:configure] :: loading settings :: file = /home/jenkins/jenkins-slave/workspace/Lucene-Solr-BadApples-Tests-8.x/lucene/top-level-ivy-settings.xml

resolve:

ivy-availability-check:
[loadresource] Do not set property disallowed.ivy.jars.list as its length is 0.

-ivy-fail-disallowed-ivy-version:

ivy-fail:

ivy-fail:

ivy-configure:
[ivy:configure] :: loading settings :: file = /home/jenkins/jenkins-slave/workspace/Lucene-Solr-BadApples-Tests-8.x/lucene/top-level-ivy-settings.xml

resolve:

ivy-availability-check:
[loadresource] Do not set property disallowed.ivy.jars.list as its length is 0.

-ivy-fail-disallowed-ivy-version:

ivy-fail:

ivy-configure:
[ivy:configure] :: loading settings :: file = /home/jenkins/jenkins-slave/workspace/Lucene-Solr-BadApples-Tests-8.x/lucene/top-level-ivy-settings.xml

resolve:

ivy-availability-check:
[loadresource] Do not set property disallowed.ivy.jars.list as its length is 0.

-ivy-fail-disallowed-ivy-version:

ivy-fail:

ivy-fail:

ivy-configure:
[ivy:configure] :: loading settings :: file = /home/jenkins/jenkins-slave/workspace/Lucene-Solr-BadApples-Tests-8.x/lucene/top-level-ivy-settings.xml

resolve:

ivy-availability-check:
[loadresource] Do not set property disallowed.ivy.jars.list as its length is 0.

-ivy-fail-disallowed-ivy-version:

ivy-fail:

ivy-fail:

ivy-configure:
[ivy:configure] :: loading settings :: file = /home/jenkins/jenkins-slave/workspace/Lucene-Solr-BadApples-Tests-8.x/lucene/top-level-ivy-settings.xml

resolve:

ivy-availability-check:
[loadresource] Do not set property disallowed.ivy.jars.list as its length is 0.

-ivy-fail-disallowed-ivy-version:

ivy-fail:

ivy-fail:

ivy-configure:
[ivy:configure] :: loading settings :: file = /home/jenkins/jenkins-slave/workspace/Lucene-Solr-BadApples-Tests-8.x/lucene/top-level-ivy-settings.xml

resolve:

ivy-availability-check:
[loadresource] Do not set property disallowed.ivy.jars.list as its length is 0.

-ivy-fail-disallowed-ivy-version:

ivy-fail:

ivy-fail:

ivy-configure:
[ivy:configure] :: loading settings :: file = /home/jenkins/jenkins-slave/workspace/Lucene-Solr-BadApples-Tests-8.x/lucene/top-level-ivy-settings.xml

resolve:

ivy-availability-check:
[loadresource] Do not set property disallowed.ivy.jars.list as its length is 0.

-ivy-fail-disallowed-ivy-version:

ivy-fail:

ivy-fail:

ivy-configure:
[ivy:configure] :: loading settings :: file = /home/jenkins/jenkins-slave/workspace/Lucene-Solr-BadApples-Tests-8.x/lucene/top-level-ivy-settings.xml

resolve:

ivy-availability-check:
[loadresource] Do not set property disallowed.ivy.jars.list as its length is 0.

-ivy-fail-disallowed-ivy-version:

ivy-fail:

ivy-fail:

ivy-configure:
[ivy:configure] :: loading settings :: file = /home/jenkins/jenkins-slave/workspace/Lucene-Solr-BadApples-Tests-8.x/lucene/top-level-ivy-settings.xml

resolve:

ivy-availability-check:
[loadresource] Do not set property disallowed.ivy.jars.list as its length is 0.

-ivy-fail-disallowed-ivy-version:

ivy-fail:

ivy-fail:

ivy-configure:
[ivy:configure] :: loading settings :: file = /home/jenkins/jenkins-slave/workspace/Lucene-Solr-BadApples-Tests-8.x/lucene/top-level-ivy-settings.xml

resolve:

ivy-availability-check:
[loadresource] Do not set property disallowed.ivy.jars.list as its length is 0.

-ivy-fail-disallowed-ivy-version:

ivy-fail:

ivy-fail:

ivy-configure:
[ivy:configure] :: loading settings :: file = /home/jenkins/jenkins-slave/workspace/Lucene-Solr-BadApples-Tests-8.x/lucene/top-level-ivy-settings.xml

resolve:

ivy-availability-check:
[loadresource] Do not set property disallowed.ivy.jars.list as its length is 0.

-ivy-fail-disallowed-ivy-version:

ivy-fail:

ivy-fail:

ivy-configure:
[ivy:configure] :: loading settings :: file = /home/jenkins/jenkins-slave/workspace/Lucene-Solr-BadApples-Tests-8.x/lucene/top-level-ivy-settings.xml

resolve:

ivy-availability-check:
[loadresource] Do not set property disallowed.ivy.jars.list as its length is 0.

-ivy-fail-disallowed-ivy-version:

ivy-fail:

ivy-fail:

ivy-configure:
[ivy:configure] :: loading settings :: file = /home/jenkins/jenkins-slave/workspace/Lucene-Solr-BadApples-Tests-8.x/lucene/top-level-ivy-settings.xml

resolve:

jar-checksums:
    [mkdir] Created dir: /home/jenkins/jenkins-slave/workspace/Lucene-Solr-BadApples-Tests-8.x/solr/null1236996848
     [copy] Copying 239 files to /home/jenkins/jenkins-slave/workspace/Lucene-Solr-BadApples-Tests-8.x/solr/null1236996848
   [delete] Deleting directory /home/jenkins/jenkins-slave/workspace/Lucene-Solr-BadApples-Tests-8.x/solr/null1236996848

check-working-copy:
[ivy:cachepath] :: resolving dependencies :: org.eclipse.jgit#org.eclipse.jgit-caller;working
[ivy:cachepath] confs: [default]
[ivy:cachepath] found org.eclipse.jgit#org.eclipse.jgit;4.6.0.201612231935-r in public
[ivy:cachepath] found com.jcraft#jsch;0.1.53 in public
[ivy:cachepath] found com.googlecode.javaewah#JavaEWAH;1.1.6 in public
[ivy:cachepath] found org.apache.httpcomponents#httpclient;4.3.6 in public
[ivy:cachepath] found org.apache.httpcomponents#httpcore;4.3.3 in public
[ivy:cachepath] found commons-logging#commons-logging;1.1.3 in public
[ivy:cachepath] found commons-codec#commons-codec;1.6 in public
[ivy:cachepath] found org.slf4j#slf4j-api;1.7.2 in public
[ivy:cachepath] :: resolution report :: resolve 28ms :: artifacts dl 1ms
        ---------------------------------------------------------------------
        |                  |            modules            ||   artifacts   |
        |       conf       | number| search|dwnlded|evicted|| number|dwnlded|
        ---------------------------------------------------------------------
        |      default     |   8   |   0   |   0   |   0   ||   8   |   0   |
        ---------------------------------------------------------------------
[wc-checker] Initializing working copy...
[wc-checker] SLF4J: Failed to load class "org.slf4j.impl.StaticLoggerBinder".
[wc-checker] SLF4J: Defaulting to no-operation (NOP) logger implementation
[wc-checker] SLF4J: See http://www.slf4j.org/codes.html#StaticLoggerBinder for further details.
[wc-checker] Checking working copy status...

-jenkins-base:

BUILD SUCCESSFUL
Total time: 234 minutes 15 seconds
Archiving artifacts
java.lang.InterruptedException: no matches found within 10000
        at hudson.FilePath$ValidateAntFileMask.hasMatch(FilePath.java:2847)
        at hudson.FilePath$ValidateAntFileMask.invoke(FilePath.java:2726)
        at hudson.FilePath$ValidateAntFileMask.invoke(FilePath.java:2707)
        at hudson.FilePath$FileCallableWrapper.call(FilePath.java:3086)
Also:   hudson.remoting.Channel$CallSiteStackTrace: Remote call to lucene2
                at hudson.remoting.Channel.attachCallSiteStackTrace(Channel.java:1741)
                at hudson.remoting.UserRequest$ExceptionResponse.retrieve(UserRequest.java:357)
                at hudson.remoting.Channel.call(Channel.java:955)
                at hudson.FilePath.act(FilePath.java:1072)
                at hudson.FilePath.act(FilePath.java:1061)
                at hudson.FilePath.validateAntFileMask(FilePath.java:2705)
                at hudson.tasks.ArtifactArchiver.perform(ArtifactArchiver.java:243)
                at hudson.tasks.BuildStepCompatibilityLayer.perform(BuildStepCompatibilityLayer.java:81)
                at hudson.tasks.BuildStepMonitor$1.perform(BuildStepMonitor.java:20)
                at hudson.model.AbstractBuild$AbstractBuildExecution.perform(AbstractBuild.java:744)
                at hudson.model.AbstractBuild$AbstractBuildExecution.performAllBuildSteps(AbstractBuild.java:690)
                at hudson.model.Build$BuildExecution.post2(Build.java:186)
                at hudson.model.AbstractBuild$AbstractBuildExecution.post(AbstractBuild.java:635)
                at hudson.model.Run.execute(Run.java:1835)
                at hudson.model.FreeStyleBuild.run(FreeStyleBuild.java:43)
                at hudson.model.ResourceController.execute(ResourceController.java:97)
                at hudson.model.Executor.run(Executor.java:429)
Caused: hudson.FilePath$TunneledInterruptedException
        at hudson.FilePath$FileCallableWrapper.call(FilePath.java:3088)
        at hudson.remoting.UserRequest.perform(UserRequest.java:212)
        at hudson.remoting.UserRequest.perform(UserRequest.java:54)
        at hudson.remoting.Request$2.run(Request.java:369)
        at hudson.remoting.InterceptingExecutorService$1.call(InterceptingExecutorService.java:72)
        at java.util.concurrent.FutureTask.run(FutureTask.java:266)
        at java.util.concurrent.ThreadPoolExecutor.runWorker(ThreadPoolExecutor.java:1142)
        at java.util.concurrent.ThreadPoolExecutor$Worker.run(ThreadPoolExecutor.java:617)
        at java.lang.Thread.run(Thread.java:748)
Caused: java.lang.InterruptedException: java.lang.InterruptedException: no matches found within 10000
        at hudson.FilePath.act(FilePath.java:1074)
        at hudson.FilePath.act(FilePath.java:1061)
        at hudson.FilePath.validateAntFileMask(FilePath.java:2705)
        at hudson.tasks.ArtifactArchiver.perform(ArtifactArchiver.java:243)
        at hudson.tasks.BuildStepCompatibilityLayer.perform(BuildStepCompatibilityLayer.java:81)
        at hudson.tasks.BuildStepMonitor$1.perform(BuildStepMonitor.java:20)
        at hudson.model.AbstractBuild$AbstractBuildExecution.perform(AbstractBuild.java:744)
        at hudson.model.AbstractBuild$AbstractBuildExecution.performAllBuildSteps(AbstractBuild.java:690)
        at hudson.model.Build$BuildExecution.post2(Build.java:186)
        at hudson.model.AbstractBuild$AbstractBuildExecution.post(AbstractBuild.java:635)
        at hudson.model.Run.execute(Run.java:1835)
        at hudson.model.FreeStyleBuild.run(FreeStyleBuild.java:43)
        at hudson.model.ResourceController.execute(ResourceController.java:97)
        at hudson.model.Executor.run(Executor.java:429)
No artifacts found that match the file pattern "**/*.events,heapdumps/**,**/hs_err_pid*". Configuration error?
Recording test results
Build step 'Publish JUnit test result report' changed build result to UNSTABLE
Email was triggered for: Unstable (Test Failures)
Sending email for trigger: Unstable (Test Failures)


---------------------------------------------------------------------
To unsubscribe, e-mail: [hidden email]
For additional commands, e-mail: [hidden email]
Reply | Threaded
Open this post in threaded view
|

[JENKINS] Lucene-Solr-BadApples-Tests-8.x - Build # 40 - Still Unstable

Apache Jenkins Server-2
Build: https://builds.apache.org/job/Lucene-Solr-BadApples-Tests-8.x/40/

2 tests failed.
FAILED:  org.apache.solr.cloud.OverseerTest.testOverseerFailure

Error Message:
Test abandoned because suite timeout was reached.

Stack Trace:
java.lang.Exception: Test abandoned because suite timeout was reached.
        at __randomizedtesting.SeedInfo.seed([95FF74B2CEEB6666]:0)


FAILED:  junit.framework.TestSuite.org.apache.solr.cloud.OverseerTest

Error Message:
Suite timeout exceeded (>= 7200000 msec).

Stack Trace:
java.lang.Exception: Suite timeout exceeded (>= 7200000 msec).
        at __randomizedtesting.SeedInfo.seed([95FF74B2CEEB6666]:0)




Build Log:
[...truncated 15669 lines...]
   [junit4] Suite: org.apache.solr.cloud.OverseerTest
   [junit4]   2> Creating dataDir: /home/jenkins/jenkins-slave/workspace/Lucene-Solr-BadApples-Tests-8.x/solr/build/solr-core/test/J1/temp/solr.cloud.OverseerTest_95FF74B2CEEB6666-001/init-core-data-001
   [junit4]   2> 2042663 WARN  (SUITE-OverseerTest-seed#[95FF74B2CEEB6666]-worker) [    ] o.a.s.SolrTestCaseJ4 startTrackingSearchers: numOpens=21 numCloses=21
   [junit4]   2> 2042663 INFO  (SUITE-OverseerTest-seed#[95FF74B2CEEB6666]-worker) [    ] o.a.s.SolrTestCaseJ4 Using PointFields (NUMERIC_POINTS_SYSPROP=true) w/NUMERIC_DOCVALUES_SYSPROP=false
   [junit4]   2> 2042665 INFO  (SUITE-OverseerTest-seed#[95FF74B2CEEB6666]-worker) [    ] o.a.s.SolrTestCaseJ4 Randomized ssl (false) and clientAuth (true) via: @org.apache.solr.util.RandomizeSSL(reason=, ssl=NaN, value=NaN, clientAuth=NaN)
   [junit4]   2> 2042665 INFO  (SUITE-OverseerTest-seed#[95FF74B2CEEB6666]-worker) [    ] o.a.s.SolrTestCaseJ4 SecureRandom sanity checks: test.solr.allowed.securerandom=null & java.security.egd=file:/dev/./urandom
   [junit4]   2> 2042665 INFO  (SUITE-OverseerTest-seed#[95FF74B2CEEB6666]-worker) [    ] o.a.s.c.ZkTestServer STARTING ZK TEST SERVER
   [junit4]   2> 2042672 INFO  (ZkTestServer Run Thread) [    ] o.a.s.c.ZkTestServer client port:0.0.0.0/0.0.0.0:0
   [junit4]   2> 2042672 INFO  (ZkTestServer Run Thread) [    ] o.a.s.c.ZkTestServer Starting server
   [junit4]   2> 2042772 INFO  (SUITE-OverseerTest-seed#[95FF74B2CEEB6666]-worker) [    ] o.a.s.c.ZkTestServer start zk server on port:36057
   [junit4]   2> 2042772 INFO  (SUITE-OverseerTest-seed#[95FF74B2CEEB6666]-worker) [    ] o.a.s.c.ZkTestServer parse host and port list: 127.0.0.1:36057
   [junit4]   2> 2042772 INFO  (SUITE-OverseerTest-seed#[95FF74B2CEEB6666]-worker) [    ] o.a.s.c.ZkTestServer connecting to 127.0.0.1 36057
   [junit4]   2> 2042817 INFO  (zkConnectionManagerCallback-3787-thread-1) [    ] o.a.s.c.c.ConnectionManager zkClient has connected
   [junit4]   2> 2042849 INFO  (zkConnectionManagerCallback-3789-thread-1) [    ] o.a.s.c.c.ConnectionManager zkClient has connected
   [junit4]   2> 2042858 INFO  (SUITE-OverseerTest-seed#[95FF74B2CEEB6666]-worker) [    ] o.a.s.SolrTestCaseJ4 ####initCore
   [junit4]   2> 2042858 INFO  (SUITE-OverseerTest-seed#[95FF74B2CEEB6666]-worker) [    ] o.a.s.SolrTestCaseJ4 ####initCore end
   [junit4]   2> 2042891 INFO  (TEST-OverseerTest.testReplay-seed#[95FF74B2CEEB6666]) [    ] o.a.s.SolrTestCaseJ4 ###Starting testReplay
   [junit4]   2> 2043032 INFO  (zkConnectionManagerCallback-3793-thread-1) [    ] o.a.s.c.c.ConnectionManager zkClient has connected
   [junit4]   2> 2043071 WARN  (TEST-OverseerTest.testReplay-seed#[95FF74B2CEEB6666]) [    ] o.e.j.u.s.S.config No Client EndPointIdentificationAlgorithm configured for SslContextFactory@723c5fd[provider=null,keyStore=null,trustStore=null]
   [junit4]   2> 2043100 INFO  (zkConnectionManagerCallback-3800-thread-1) [    ] o.a.s.c.c.ConnectionManager zkClient has connected
   [junit4]   2> 2043162 INFO  (zkConnectionManagerCallback-3805-thread-1) [    ] o.a.s.c.c.ConnectionManager zkClient has connected
   [junit4]   2> 2043165 INFO  (TEST-OverseerTest.testReplay-seed#[95FF74B2CEEB6666]) [    ] o.a.s.c.s.i.ZkClientClusterStateProvider Cluster at 127.0.0.1:36057/solr ready
   [junit4]   2> 2043167 INFO  (TEST-OverseerTest.testReplay-seed#[95FF74B2CEEB6666]) [    ] o.a.s.c.OverseerElectionContext I am going to be the leader 127.0.0.1:36057_solr
   [junit4]   2> 2043168 INFO  (TEST-OverseerTest.testReplay-seed#[95FF74B2CEEB6666]) [    ] o.a.s.c.Overseer Overseer (id=74306098037260290-127.0.0.1:36057_solr-n_0000000000) starting
   [junit4]   2> 2043179 INFO  (OverseerStateUpdate-74306098037260290-127.0.0.1:36057_solr-n_0000000000) [    ] o.a.s.c.Overseer Starting to work on the main queue : 127.0.0.1:36057_solr
   [junit4]   2> 2043437 INFO  (closeThreadPool-3807-thread-1) [    ] o.a.s.c.Overseer Overseer (id=74306098037260290-127.0.0.1:36057_solr-n_0000000000) closing
   [junit4]   2> 2043438 INFO  (OverseerStateUpdate-74306098037260290-127.0.0.1:36057_solr-n_0000000000) [    ] o.a.s.c.Overseer Overseer Loop exiting : 127.0.0.1:36057_solr
   [junit4]   2> 2043438 INFO  (OverseerAutoScalingTriggerThread-74306098037260290-127.0.0.1:36057_solr-n_0000000000) [    ] o.a.s.c.a.OverseerTriggerThread OverseerTriggerThread woken up but we are closed, exiting.
   [junit4]   2> 2043446 WARN  (OverseerExitThread) [    ] o.a.s.c.Overseer Error communicating with ZooKeeper
   [junit4]   2>           => org.apache.zookeeper.KeeperException$SessionExpiredException: KeeperErrorCode = Session expired for /overseer_elect/leader
   [junit4]   2> at org.apache.zookeeper.KeeperException.create(KeeperException.java:130)
   [junit4]   2> org.apache.zookeeper.KeeperException$SessionExpiredException: KeeperErrorCode = Session expired for /overseer_elect/leader
   [junit4]   2> at org.apache.zookeeper.KeeperException.create(KeeperException.java:130) ~[zookeeper-3.4.13.jar:3.4.13-2d71af4dbe22557fda74f9a9b4309b15a7487f03]
   [junit4]   2> at org.apache.zookeeper.KeeperException.create(KeeperException.java:54) ~[zookeeper-3.4.13.jar:3.4.13-2d71af4dbe22557fda74f9a9b4309b15a7487f03]
   [junit4]   2> at org.apache.zookeeper.ZooKeeper.getData(ZooKeeper.java:1221) ~[zookeeper-3.4.13.jar:3.4.13-2d71af4dbe22557fda74f9a9b4309b15a7487f03]
   [junit4]   2> at org.apache.solr.common.cloud.SolrZkClient.lambda$getData$5(SolrZkClient.java:358) ~[java/:?]
   [junit4]   2> at org.apache.solr.common.cloud.ZkCmdExecutor.retryOperation(ZkCmdExecutor.java:71) ~[java/:?]
   [junit4]   2> at org.apache.solr.common.cloud.SolrZkClient.getData(SolrZkClient.java:358) ~[java/:?]
   [junit4]   2> at org.apache.solr.cloud.Overseer$ClusterStateUpdater.checkIfIamStillLeader(Overseer.java:319) ~[java/:?]
   [junit4]   2> at java.lang.Thread.run(Thread.java:748) [?:1.8.0_191]
   [junit4]   2> 2043504 INFO  (TEST-OverseerTest.testReplay-seed#[95FF74B2CEEB6666]) [    ] o.a.s.SolrTestCaseJ4 ###Ending testReplay
   [junit4]   2> 2043510 INFO  (TEST-OverseerTest.testExternalClusterStateChangeBehavior-seed#[95FF74B2CEEB6666]) [    ] o.a.s.SolrTestCaseJ4 ###Starting testExternalClusterStateChangeBehavior
   [junit4]   2> 2043741 INFO  (zkConnectionManagerCallback-3811-thread-1) [    ] o.a.s.c.c.ConnectionManager zkClient has connected
   [junit4]   2> 2043767 WARN  (TEST-OverseerTest.testExternalClusterStateChangeBehavior-seed#[95FF74B2CEEB6666]) [    ] o.e.j.u.s.S.config No Client EndPointIdentificationAlgorithm configured for SslContextFactory@6fad3a4b[provider=null,keyStore=null,trustStore=null]
   [junit4]   2> 2043784 INFO  (zkConnectionManagerCallback-3818-thread-1) [    ] o.a.s.c.c.ConnectionManager zkClient has connected
   [junit4]   2> 2043826 INFO  (zkConnectionManagerCallback-3823-thread-1) [    ] o.a.s.c.c.ConnectionManager zkClient has connected
   [junit4]   2> 2043832 INFO  (TEST-OverseerTest.testExternalClusterStateChangeBehavior-seed#[95FF74B2CEEB6666]) [    ] o.a.s.c.s.i.ZkClientClusterStateProvider Cluster at 127.0.0.1:36057/solr ready
   [junit4]   2> 2043835 INFO  (TEST-OverseerTest.testExternalClusterStateChangeBehavior-seed#[95FF74B2CEEB6666]) [    ] o.a.s.c.OverseerElectionContext I am going to be the leader 127.0.0.1:36057_solr
   [junit4]   2> 2043835 INFO  (TEST-OverseerTest.testExternalClusterStateChangeBehavior-seed#[95FF74B2CEEB6666]) [    ] o.a.s.c.Overseer Overseer (id=74306098037260293-127.0.0.1:36057_solr-n_0000000000) starting
   [junit4]   2> 2043863 INFO  (OverseerStateUpdate-74306098037260293-127.0.0.1:36057_solr-n_0000000000) [    ] o.a.s.c.Overseer Starting to work on the main queue : 127.0.0.1:36057_solr
   [junit4]   2> 2044054 INFO  (OverseerStateUpdate-74306098037260293-127.0.0.1:36057_solr-n_0000000000) [    ] o.a.s.c.o.SliceMutator createReplica() {
   [junit4]   2>   "operation":"addreplica",
   [junit4]   2>   "collection":"test",
   [junit4]   2>   "shard":"x",
   [junit4]   2>   "base_url":"http://127.0.0.1/solr",
   [junit4]   2>   "core_node_name":"core_node1",
   [junit4]   2>   "node_name":"node1",
   [junit4]   2>   "core":"core1",
   [junit4]   2>   "state":"down"}
   [junit4]   2> 2044155 INFO  (zkCallback-3788-thread-1) [    ] o.a.s.c.c.ZkStateReader A cluster state change: [WatchedEvent state:SyncConnected type:NodeCreated path:/collections/test/state.json] for collection [test] has occurred - updating... (live nodes size: [0])
   [junit4]   2> 2044155 ERROR (OverseerStateUpdate-74306098037260293-127.0.0.1:36057_solr-n_0000000000) [    ] o.a.s.c.Overseer Exception in Overseer main queue loop
   [junit4]   2>           => org.apache.zookeeper.KeeperException$BadVersionException: KeeperErrorCode = BadVersion for /clusterstate.json
   [junit4]   2> at org.apache.zookeeper.KeeperException.create(KeeperException.java:118)
   [junit4]   2> org.apache.zookeeper.KeeperException$BadVersionException: KeeperErrorCode = BadVersion for /clusterstate.json
   [junit4]   2> at org.apache.zookeeper.KeeperException.create(KeeperException.java:118) ~[zookeeper-3.4.13.jar:3.4.13-2d71af4dbe22557fda74f9a9b4309b15a7487f03]
   [junit4]   2> at org.apache.zookeeper.KeeperException.create(KeeperException.java:54) ~[zookeeper-3.4.13.jar:3.4.13-2d71af4dbe22557fda74f9a9b4309b15a7487f03]
   [junit4]   2> at org.apache.zookeeper.ZooKeeper.setData(ZooKeeper.java:1336) ~[zookeeper-3.4.13.jar:3.4.13-2d71af4dbe22557fda74f9a9b4309b15a7487f03]
   [junit4]   2> at org.apache.solr.common.cloud.SolrZkClient.lambda$setData$6(SolrZkClient.java:370) ~[java/:?]
   [junit4]   2> at org.apache.solr.common.cloud.ZkCmdExecutor.retryOperation(ZkCmdExecutor.java:71) ~[java/:?]
   [junit4]   2> at org.apache.solr.common.cloud.SolrZkClient.setData(SolrZkClient.java:370) ~[java/:?]
   [junit4]   2> at org.apache.solr.cloud.overseer.ZkStateWriter.writePendingUpdates(ZkStateWriter.java:220) ~[java/:?]
   [junit4]   2> at org.apache.solr.cloud.Overseer$ClusterStateUpdater.run(Overseer.java:247) ~[java/:?]
   [junit4]   2> at java.lang.Thread.run(Thread.java:748) [?:1.8.0_191]
   [junit4]   2> 2044228 INFO  (closeThreadPool-3825-thread-1) [    ] o.a.s.c.Overseer Overseer (id=74306098037260293-127.0.0.1:36057_solr-n_0000000000) closing
   [junit4]   2> 2044229 INFO  (OverseerStateUpdate-74306098037260293-127.0.0.1:36057_solr-n_0000000000) [    ] o.a.s.c.Overseer Overseer Loop exiting : 127.0.0.1:36057_solr
   [junit4]   2> 2044229 INFO  (OverseerAutoScalingTriggerThread-74306098037260293-127.0.0.1:36057_solr-n_0000000000) [    ] o.a.s.c.a.OverseerTriggerThread OverseerTriggerThread woken up but we are closed, exiting.
   [junit4]   2> 2044252 WARN  (OverseerExitThread) [    ] o.a.s.c.Overseer Error communicating with ZooKeeper
   [junit4]   2>           => org.apache.zookeeper.KeeperException$SessionExpiredException: KeeperErrorCode = Session expired for /overseer_elect/leader
   [junit4]   2> at org.apache.zookeeper.KeeperException.create(KeeperException.java:130)
   [junit4]   2> org.apache.zookeeper.KeeperException$SessionExpiredException: KeeperErrorCode = Session expired for /overseer_elect/leader
   [junit4]   2> at org.apache.zookeeper.KeeperException.create(KeeperException.java:130) ~[zookeeper-3.4.13.jar:3.4.13-2d71af4dbe22557fda74f9a9b4309b15a7487f03]
   [junit4]   2> at org.apache.zookeeper.KeeperException.create(KeeperException.java:54) ~[zookeeper-3.4.13.jar:3.4.13-2d71af4dbe22557fda74f9a9b4309b15a7487f03]
   [junit4]   2> at org.apache.zookeeper.ZooKeeper.getData(ZooKeeper.java:1221) ~[zookeeper-3.4.13.jar:3.4.13-2d71af4dbe22557fda74f9a9b4309b15a7487f03]
   [junit4]   2> at org.apache.solr.common.cloud.SolrZkClient.lambda$getData$5(SolrZkClient.java:358) ~[java/:?]
   [junit4]   2> at org.apache.solr.common.cloud.ZkCmdExecutor.retryOperation(ZkCmdExecutor.java:71) ~[java/:?]
   [junit4]   2> at org.apache.solr.common.cloud.SolrZkClient.getData(SolrZkClient.java:358) ~[java/:?]
   [junit4]   2> at org.apache.solr.cloud.Overseer$ClusterStateUpdater.checkIfIamStillLeader(Overseer.java:319) ~[java/:?]
   [junit4]   2> at java.lang.Thread.run(Thread.java:748) [?:1.8.0_191]
   [junit4]   2> 2044376 INFO  (TEST-OverseerTest.testExternalClusterStateChangeBehavior-seed#[95FF74B2CEEB6666]) [    ] o.a.s.SolrTestCaseJ4 ###Ending testExternalClusterStateChangeBehavior
   [junit4]   2> 2044381 INFO  (TEST-OverseerTest.testStateChange-seed#[95FF74B2CEEB6666]) [    ] o.a.s.SolrTestCaseJ4 ###Starting testStateChange
   [junit4]   2> 2044616 INFO  (zkConnectionManagerCallback-3829-thread-1) [    ] o.a.s.c.c.ConnectionManager zkClient has connected
   [junit4]   2> 2044619 WARN  (TEST-OverseerTest.testStateChange-seed#[95FF74B2CEEB6666]) [    ] o.e.j.u.s.S.config No Client EndPointIdentificationAlgorithm configured for SslContextFactory@3c7f5e5b[provider=null,keyStore=null,trustStore=null]
   [junit4]   2> 2044628 INFO  (zkConnectionManagerCallback-3836-thread-1) [    ] o.a.s.c.c.ConnectionManager zkClient has connected
   [junit4]   2> 2044652 INFO  (zkConnectionManagerCallback-3841-thread-1) [    ] o.a.s.c.c.ConnectionManager zkClient has connected
   [junit4]   2> 2044654 INFO  (TEST-OverseerTest.testStateChange-seed#[95FF74B2CEEB6666]) [    ] o.a.s.c.s.i.ZkClientClusterStateProvider Cluster at 127.0.0.1:36057/solr ready
   [junit4]   2> 2044656 INFO  (TEST-OverseerTest.testStateChange-seed#[95FF74B2CEEB6666]) [    ] o.a.s.c.OverseerElectionContext I am going to be the leader 127.0.0.1:36057_solr
   [junit4]   2> 2044656 INFO  (TEST-OverseerTest.testStateChange-seed#[95FF74B2CEEB6666]) [    ] o.a.s.c.Overseer Overseer (id=74306098037260296-127.0.0.1:36057_solr-n_0000000000) starting
   [junit4]   2> 2044682 INFO  (OverseerStateUpdate-74306098037260296-127.0.0.1:36057_solr-n_0000000000) [    ] o.a.s.c.Overseer Starting to work on the main queue : 127.0.0.1:36057_solr
   [junit4]   2> 2045027 INFO  (closeThreadPool-3843-thread-1) [    ] o.a.s.c.Overseer Overseer (id=74306098037260296-127.0.0.1:36057_solr-n_0000000000) closing
   [junit4]   2> 2045027 INFO  (OverseerStateUpdate-74306098037260296-127.0.0.1:36057_solr-n_0000000000) [    ] o.a.s.c.Overseer Overseer Loop exiting : 127.0.0.1:36057_solr
   [junit4]   2> 2045029 INFO  (OverseerAutoScalingTriggerThread-74306098037260296-127.0.0.1:36057_solr-n_0000000000) [    ] o.a.s.c.a.OverseerTriggerThread OverseerTriggerThread woken up but we are closed, exiting.
   [junit4]   2> 2045047 WARN  (OverseerExitThread) [    ] o.a.s.c.Overseer Error communicating with ZooKeeper
   [junit4]   2>           => org.apache.zookeeper.KeeperException$SessionExpiredException: KeeperErrorCode = Session expired for /overseer_elect/leader
   [junit4]   2> at org.apache.zookeeper.KeeperException.create(KeeperException.java:130)
   [junit4]   2> org.apache.zookeeper.KeeperException$SessionExpiredException: KeeperErrorCode = Session expired for /overseer_elect/leader
   [junit4]   2> at org.apache.zookeeper.KeeperException.create(KeeperException.java:130) ~[zookeeper-3.4.13.jar:3.4.13-2d71af4dbe22557fda74f9a9b4309b15a7487f03]
   [junit4]   2> at org.apache.zookeeper.KeeperException.create(KeeperException.java:54) ~[zookeeper-3.4.13.jar:3.4.13-2d71af4dbe22557fda74f9a9b4309b15a7487f03]
   [junit4]   2> at org.apache.zookeeper.ZooKeeper.getData(ZooKeeper.java:1221) ~[zookeeper-3.4.13.jar:3.4.13-2d71af4dbe22557fda74f9a9b4309b15a7487f03]
   [junit4]   2> at org.apache.solr.common.cloud.SolrZkClient.lambda$getData$5(SolrZkClient.java:358) ~[java/:?]
   [junit4]   2> at org.apache.solr.common.cloud.ZkCmdExecutor.retryOperation(ZkCmdExecutor.java:71) ~[java/:?]
   [junit4]   2> at org.apache.solr.common.cloud.SolrZkClient.getData(SolrZkClient.java:358) ~[java/:?]
   [junit4]   2> at org.apache.solr.cloud.Overseer$ClusterStateUpdater.checkIfIamStillLeader(Overseer.java:319) ~[java/:?]
   [junit4]   2> at java.lang.Thread.run(Thread.java:748) [?:1.8.0_191]
   [junit4]   2> 2045120 INFO  (TEST-OverseerTest.testStateChange-seed#[95FF74B2CEEB6666]) [    ] o.a.s.SolrTestCaseJ4 ###Ending testStateChange
   [junit4]   2> 2045125 INFO  (TEST-OverseerTest.testDoubleAssignment-seed#[95FF74B2CEEB6666]) [    ] o.a.s.SolrTestCaseJ4 ###Starting testDoubleAssignment
   [junit4]   2> 2045264 INFO  (zkConnectionManagerCallback-3847-thread-1) [    ] o.a.s.c.c.ConnectionManager zkClient has connected
   [junit4]   2> 2045278 INFO  (zkCallback-3788-thread-3) [    ] o.a.s.c.c.ZkStateReader Updated live nodes from ZooKeeper... (0) -> (1)
   [junit4]   2> 2045292 INFO  (zkCallback-3846-thread-1) [    ] o.a.s.c.c.ZkStateReader Updated live nodes from ZooKeeper... (0) -> (1)
   [junit4]   2> 2045300 INFO  (zkConnectionManagerCallback-3851-thread-1) [    ] o.a.s.c.c.ConnectionManager zkClient has connected
   [junit4]   2> 2045325 WARN  (TEST-OverseerTest.testDoubleAssignment-seed#[95FF74B2CEEB6666]) [    ] o.e.j.u.s.S.config No Client EndPointIdentificationAlgorithm configured for SslContextFactory@609a799b[provider=null,keyStore=null,trustStore=null]
   [junit4]   2> 2045350 INFO  (zkConnectionManagerCallback-3858-thread-1) [    ] o.a.s.c.c.ConnectionManager zkClient has connected
   [junit4]   2> 2045388 INFO  (zkConnectionManagerCallback-3863-thread-1) [    ] o.a.s.c.c.ConnectionManager zkClient has connected
   [junit4]   2> 2045389 INFO  (TEST-OverseerTest.testDoubleAssignment-seed#[95FF74B2CEEB6666]) [    ] o.a.s.c.c.ZkStateReader Updated live nodes from ZooKeeper... (0) -> (1)
   [junit4]   2> 2045390 INFO  (TEST-OverseerTest.testDoubleAssignment-seed#[95FF74B2CEEB6666]) [    ] o.a.s.c.s.i.ZkClientClusterStateProvider Cluster at 127.0.0.1:36057/solr ready
   [junit4]   2> 2045400 INFO  (TEST-OverseerTest.testDoubleAssignment-seed#[95FF74B2CEEB6666]) [    ] o.a.s.c.OverseerElectionContext I am going to be the leader 127.0.0.1:36057_solr
   [junit4]   2> 2045401 INFO  (TEST-OverseerTest.testDoubleAssignment-seed#[95FF74B2CEEB6666]) [    ] o.a.s.c.Overseer Overseer (id=74306098037260300-127.0.0.1:36057_solr-n_0000000000) starting
   [junit4]   2> 2045431 INFO  (OverseerStateUpdate-74306098037260300-127.0.0.1:36057_solr-n_0000000000) [    ] o.a.s.c.Overseer Starting to work on the main queue : 127.0.0.1:36057_solr
   [junit4]   2> 2045432 INFO  (OverseerStateUpdate-74306098037260300-127.0.0.1:36057_solr-n_0000000000) [    ] o.a.s.c.c.ZkStateReader Updated live nodes from ZooKeeper... (0) -> (1)
   [junit4]   2> 2045556 INFO  (zkConnectionManagerCallback-3868-thread-1) [    ] o.a.s.c.c.ConnectionManager zkClient has connected
   [junit4]   2> 2045565 INFO  (TEST-OverseerTest.testDoubleAssignment-seed#[95FF74B2CEEB6666]) [    ] o.a.s.c.c.ZkStateReader Updated live nodes from ZooKeeper... (0) -> (1)
   [junit4]   2> 2045566 INFO  (TEST-OverseerTest.testDoubleAssignment-seed#[95FF74B2CEEB6666]) [    ] o.a.s.c.s.i.ZkClientClusterStateProvider Cluster at 127.0.0.1:36057/solr ready
   [junit4]   2> 2045677 INFO  (TEST-OverseerTest.testDoubleAssignment-seed#[95FF74B2CEEB6666]) [    ] o.a.s.c.ShardLeaderElectionContextBase make sure parent is created /collections/collection1/leaders/shard1
   [junit4]   2> 2045695 INFO  (TEST-OverseerTest.testDoubleAssignment-seed#[95FF74B2CEEB6666]) [    ] o.a.s.c.ShardLeaderElectionContextBase Creating leader registration node /collections/collection1/leaders/shard1/leader after winning as /collections/collection1/leader_elect/shard1/election/74306098037260299-node1_core1-n_0000000000
   [junit4]   2> 2045724 INFO  (zkCallback-3850-thread-1) [    ] o.a.s.c.c.ZkStateReader Updated live nodes from ZooKeeper... (1) -> (0)
   [junit4]   2> 2045724 INFO  (zkCallback-3788-thread-3) [    ] o.a.s.c.c.ZkStateReader Updated live nodes from ZooKeeper... (1) -> (0)
   [junit4]   2> 2045724 INFO  (zkCallback-3846-thread-1) [    ] o.a.s.c.c.ZkStateReader Updated live nodes from ZooKeeper... (1) -> (0)
   [junit4]   2> 2045735 INFO  (zkCallback-3862-thread-1) [    ] o.a.s.c.c.ZkStateReader Updated live nodes from ZooKeeper... (1) -> (0)
   [junit4]   2> 2045747 INFO  (zkConnectionManagerCallback-3870-thread-1) [    ] o.a.s.c.c.ConnectionManager zkClient has connected
   [junit4]   2> 2045747 INFO  (zkCallback-3867-thread-2) [    ] o.a.s.c.c.ZkStateReader Updated live nodes from ZooKeeper... (1) -> (0)
   [junit4]   2> 2045776 INFO  (zkCallback-3862-thread-1) [    ] o.a.s.c.c.ZkStateReader Updated live nodes from ZooKeeper... (0) -> (1)
   [junit4]   2> 2045776 INFO  (zkCallback-3850-thread-1) [    ] o.a.s.c.c.ZkStateReader Updated live nodes from ZooKeeper... (0) -> (1)
   [junit4]   2> 2045779 INFO  (zkCallback-3867-thread-2) [    ] o.a.s.c.c.ZkStateReader Updated live nodes from ZooKeeper... (0) -> (1)
   [junit4]   2> 2045779 INFO  (zkCallback-3788-thread-3) [    ] o.a.s.c.c.ZkStateReader Updated live nodes from ZooKeeper... (0) -> (1)
   [junit4]   2> 2045796 INFO  (zkCallback-3869-thread-1) [    ] o.a.s.c.c.ZkStateReader Updated live nodes from ZooKeeper... (0) -> (1)
   [junit4]   2> 2045797 INFO  (TEST-OverseerTest.testDoubleAssignment-seed#[95FF74B2CEEB6666]) [    ] o.a.s.c.ShardLeaderElectionContextBase make sure parent is created /collections/collection1/leaders/shard1
   [junit4]   2> 2045798 INFO  (TEST-OverseerTest.testDoubleAssignment-seed#[95FF74B2CEEB6666]) [    ] o.a.s.c.ShardLeaderElectionContextBase Creating leader registration node /collections/collection1/leaders/shard1/leader after winning as /collections/collection1/leader_elect/shard1/election/74306098037260304-node1_core1-n_0000000001
   [junit4]   2> 2045822 INFO  (zkCallback-3788-thread-3) [    ] o.a.s.c.c.ZkStateReader Updated live nodes from ZooKeeper... (1) -> (0)
   [junit4]   2> 2045822 INFO  (zkCallback-3869-thread-1) [    ] o.a.s.c.c.ZkStateReader Updated live nodes from ZooKeeper... (1) -> (0)
   [junit4]   2> 2045822 INFO  (zkCallback-3862-thread-1) [    ] o.a.s.c.c.ZkStateReader Updated live nodes from ZooKeeper... (1) -> (0)
   [junit4]   2> 2045822 INFO  (zkCallback-3867-thread-2) [    ] o.a.s.c.c.ZkStateReader Updated live nodes from ZooKeeper... (1) -> (0)
   [junit4]   2> 2045899 WARN  (NIOServerCxn.Factory:0.0.0.0/0.0.0.0:0) [    ] o.a.z.s.NIOServerCnxn Unable to read additional data from client sessionid 0x107fd00a228000e, likely client has closed socket
   [junit4]   2> 2045908 WARN  (OverseerStateUpdate-74306098037260300-127.0.0.1:36057_solr-n_0000000000) [    ] o.a.s.c.Overseer Solr cannot talk to ZK, exiting Overseer main queue loop
   [junit4]   2>           => org.apache.zookeeper.KeeperException$SessionExpiredException: KeeperErrorCode = Session expired for /clusterstate.json
   [junit4]   2> at org.apache.zookeeper.KeeperException.create(KeeperException.java:130)
   [junit4]   2> org.apache.zookeeper.KeeperException$SessionExpiredException: KeeperErrorCode = Session expired for /clusterstate.json
   [junit4]   2> at org.apache.zookeeper.KeeperException.create(KeeperException.java:130) ~[zookeeper-3.4.13.jar:3.4.13-2d71af4dbe22557fda74f9a9b4309b15a7487f03]
   [junit4]   2> at org.apache.zookeeper.KeeperException.create(KeeperException.java:54) ~[zookeeper-3.4.13.jar:3.4.13-2d71af4dbe22557fda74f9a9b4309b15a7487f03]
   [junit4]   2> at org.apache.zookeeper.ZooKeeper.setData(ZooKeeper.java:1336) ~[zookeeper-3.4.13.jar:3.4.13-2d71af4dbe22557fda74f9a9b4309b15a7487f03]
   [junit4]   2> at org.apache.solr.common.cloud.SolrZkClient.lambda$setData$6(SolrZkClient.java:370) ~[java/:?]
   [junit4]   2> at org.apache.solr.common.cloud.ZkCmdExecutor.retryOperation(ZkCmdExecutor.java:71) ~[java/:?]
   [junit4]   2> at org.apache.solr.common.cloud.SolrZkClient.setData(SolrZkClient.java:370) ~[java/:?]
   [junit4]   2> at org.apache.solr.cloud.overseer.ZkStateWriter.writePendingUpdates(ZkStateWriter.java:220) ~[java/:?]
   [junit4]   2> at org.apache.solr.cloud.Overseer$ClusterStateUpdater.run(Overseer.java:247) ~[java/:?]
   [junit4]   2> at java.lang.Thread.run(Thread.java:748) [?:1.8.0_191]
   [junit4]   2> 2045908 INFO  (OverseerStateUpdate-74306098037260300-127.0.0.1:36057_solr-n_0000000000) [    ] o.a.s.c.Overseer Overseer Loop exiting : 127.0.0.1:36057_solr
   [junit4]   2> 2045908 INFO  (closeThreadPool-3874-thread-1) [    ] o.a.s.c.Overseer Overseer (id=74306098037260300-127.0.0.1:36057_solr-n_0000000000) closing
   [junit4]   2> 2045913 INFO  (OverseerAutoScalingTriggerThread-74306098037260300-127.0.0.1:36057_solr-n_0000000000) [    ] o.a.s.c.a.OverseerTriggerThread OverseerTriggerThread woken up but we are closed, exiting.
   [junit4]   2> 2045946 WARN  (OverseerExitThread) [    ] o.a.s.c.Overseer Error communicating with ZooKeeper
   [junit4]   2>           => org.apache.zookeeper.KeeperException$SessionExpiredException: KeeperErrorCode = Session expired for /overseer_elect/leader
   [junit4]   2> at org.apache.zookeeper.KeeperException.create(KeeperException.java:130)
   [junit4]   2> org.apache.zookeeper.KeeperException$SessionExpiredException: KeeperErrorCode = Session expired for /overseer_elect/leader
   [junit4]   2> at org.apache.zookeeper.KeeperException.create(KeeperException.java:130) ~[zookeeper-3.4.13.jar:3.4.13-2d71af4dbe22557fda74f9a9b4309b15a7487f03]
   [junit4]   2> at org.apache.zookeeper.KeeperException.create(KeeperException.java:54) ~[zookeeper-3.4.13.jar:3.4.13-2d71af4dbe22557fda74f9a9b4309b15a7487f03]
   [junit4]   2> at org.apache.zookeeper.ZooKeeper.getData(ZooKeeper.java:1221) ~[zookeeper-3.4.13.jar:3.4.13-2d71af4dbe22557fda74f9a9b4309b15a7487f03]
   [junit4]   2> at org.apache.solr.common.cloud.SolrZkClient.lambda$getData$5(SolrZkClient.java:358) ~[java/:?]
   [junit4]   2> at org.apache.solr.common.cloud.ZkCmdExecutor.retryOperation(ZkCmdExecutor.java:71) ~[java/:?]
   [junit4]   2> at org.apache.solr.common.cloud.SolrZkClient.getData(SolrZkClient.java:358) ~[java/:?]
   [junit4]   2> at org.apache.solr.cloud.Overseer$ClusterStateUpdater.checkIfIamStillLeader(Overseer.java:319) ~[java/:?]
   [junit4]   2> at java.lang.Thread.run(Thread.java:748) [?:1.8.0_191]
   [junit4]   2> 2046056 INFO  (TEST-OverseerTest.testDoubleAssignment-seed#[95FF74B2CEEB6666]) [    ] o.a.s.SolrTestCaseJ4 ###Ending testDoubleAssignment
   [junit4]   2> 2046066 INFO  (TEST-OverseerTest.testShardLeaderChange-seed#[95FF74B2CEEB6666]) [    ] o.a.s.SolrTestCaseJ4 ###Starting testShardLeaderChange
   [junit4]   2> 2046240 INFO  (zkConnectionManagerCallback-3878-thread-1) [    ] o.a.s.c.c.ConnectionManager zkClient has connected
   [junit4]   2> 2046271 WARN  (TEST-OverseerTest.testShardLeaderChange-seed#[95FF74B2CEEB6666]) [    ] o.e.j.u.s.S.config No Client EndPointIdentificationAlgorithm configured for SslContextFactory@26e331d1[provider=null,keyStore=null,trustStore=null]
   [junit4]   2> 2046297 WARN  (Thread-5488) [    ] o.e.j.u.s.S.config No Client EndPointIdentificationAlgorithm configured for SslContextFactory@46b4260c[provider=null,keyStore=null,trustStore=null]
   [junit4]   2> 2046309 INFO  (zkConnectionManagerCallback-3886-thread-1) [    ] o.a.s.c.c.ConnectionManager zkClient has connected
   [junit4]   2> 2046328 WARN  (TEST-OverseerTest.testShardLeaderChange-seed#[95FF74B2CEEB6666]) [    ] o.e.j.u.s.S.config No Client EndPointIdentificationAlgorithm configured for SslContextFactory@69dc77b0[provider=null,keyStore=null,trustStore=null]
   [junit4]   2> 2046329 INFO  (zkConnectionManagerCallback-3890-thread-1) [    ] o.a.s.c.c.ConnectionManager zkClient has connected
   [junit4]   2> 2046347 INFO  (zkConnectionManagerCallback-3902-thread-1) [    ] o.a.s.c.c.ConnectionManager zkClient has connected
   [junit4]   2> 2046347 INFO  (zkConnectionManagerCallback-3897-thread-1) [    ] o.a.s.c.c.ConnectionManager zkClient has connected
   [junit4]   2> 2046357 INFO  (Thread-5488) [    ] o.a.s.c.s.i.ZkClientClusterStateProvider Cluster at 127.0.0.1:36057/solr ready
   [junit4]   2> 2046358 INFO  (Thread-5488) [    ] o.a.s.c.OverseerElectionContext I am going to be the leader 127.0.0.1:36057_solr
   [junit4]   2> 2046359 INFO  (Thread-5488) [    ] o.a.s.c.Overseer Overseer (id=74306098037260305-127.0.0.1:36057_solr-n_0000000000) starting
   [junit4]   2> 2046402 INFO  (zkConnectionManagerCallback-3907-thread-1) [    ] o.a.s.c.c.ConnectionManager zkClient has connected
   [junit4]   2> 2046404 INFO  (OverseerStateUpdate-74306098037260305-127.0.0.1:36057_solr-n_0000000000) [    ] o.a.s.c.Overseer Starting to work on the main queue : 127.0.0.1:36057_solr
   [junit4]   2> 2046408 INFO  (TEST-OverseerTest.testShardLeaderChange-seed#[95FF74B2CEEB6666]) [    ] o.a.s.c.s.i.ZkClientClusterStateProvider Cluster at 127.0.0.1:36057/solr ready
   [junit4]   2> 2046448 INFO  (zkConnectionManagerCallback-3909-thread-1) [    ] o.a.s.c.c.ConnectionManager zkClient has connected
   [junit4]   2> 2046469 INFO  (zkCallback-3788-thread-3) [    ] o.a.s.c.c.ZkStateReader Updated live nodes from ZooKeeper... (0) -> (1)
   [junit4]   2> 2046488 INFO  (zkCallback-3908-thread-1) [    ] o.a.s.c.c.ZkStateReader Updated live nodes from ZooKeeper... (0) -> (1)
   [junit4]   2> 2046489 INFO  (zkCallback-3901-thread-1) [    ] o.a.s.c.c.ZkStateReader Updated live nodes from ZooKeeper... (0) -> (1)
   [junit4]   2> 2046501 INFO  (zkCallback-3906-thread-1) [    ] o.a.s.c.c.ZkStateReader Updated live nodes from ZooKeeper... (0) -> (1)
   [junit4]   2> 2046501 INFO  (zkCallback-3877-thread-1) [    ] o.a.s.c.c.ZkStateReader Updated live nodes from ZooKeeper... (0) -> (1)
   [junit4]   2> 2046544 INFO  (Thread-5488) [    ] o.a.s.c.OverseerTest Killing overseer.
   [junit4]   2> 2046577 INFO  (zkConnectionManagerCallback-3913-thread-1) [    ] o.a.s.c.c.ConnectionManager zkClient has connected
   [junit4]   2> 2046577 INFO  (Thread-5488) [    ] o.a.s.c.Overseer Overseer (id=74306098037260305-127.0.0.1:36057_solr-n_0000000000) closing
   [junit4]   2> 2046577 INFO  (OverseerStateUpdate-74306098037260305-127.0.0.1:36057_solr-n_0000000000) [    ] o.a.s.c.Overseer Overseer Loop exiting : 127.0.0.1:36057_solr
   [junit4]   2> 2046577 INFO  (OverseerAutoScalingTriggerThread-74306098037260305-127.0.0.1:36057_solr-n_0000000000) [    ] o.a.s.c.a.OverseerTriggerThread OverseerTriggerThread woken up but we are closed, exiting.
   [junit4]   2> 2046583 INFO  (zkCallback-3885-thread-1) [    ] o.a.s.c.OverseerElectionContext I am going to be the leader 127.0.0.1:36057_solr
   [junit4]   2> 2046591 INFO  (zkCallback-3885-thread-1) [    ] o.a.s.c.Overseer Overseer (id=74306098037260306-127.0.0.1:36057_solr-n_0000000001) starting
   [junit4]   2> 2046599 WARN  (OverseerExitThread) [    ] o.a.s.c.Overseer Error communicating with ZooKeeper
   [junit4]   2>           => org.apache.zookeeper.KeeperException$SessionExpiredException: KeeperErrorCode = Session expired for /overseer_elect/leader
   [junit4]   2> at org.apache.zookeeper.KeeperException.create(KeeperException.java:130)
   [junit4]   2> org.apache.zookeeper.KeeperException$SessionExpiredException: KeeperErrorCode = Session expired for /overseer_elect/leader
   [junit4]   2> at org.apache.zookeeper.KeeperException.create(KeeperException.java:130) ~[zookeeper-3.4.13.jar:3.4.13-2d71af4dbe22557fda74f9a9b4309b15a7487f03]
   [junit4]   2> at org.apache.zookeeper.KeeperException.create(KeeperException.java:54) ~[zookeeper-3.4.13.jar:3.4.13-2d71af4dbe22557fda74f9a9b4309b15a7487f03]
   [junit4]   2> at org.apache.zookeeper.ZooKeeper.getData(ZooKeeper.java:1221) ~[zookeeper-3.4.13.jar:3.4.13-2d71af4dbe22557fda74f9a9b4309b15a7487f03]
   [junit4]   2> at org.apache.solr.common.cloud.SolrZkClient.lambda$getData$5(SolrZkClient.java:358) ~[java/:?]
   [junit4]   2> at org.apache.solr.common.cloud.ZkCmdExecutor.retryOperation(ZkCmdExecutor.java:71) ~[java/:?]
   [junit4]   2> at org.apache.solr.common.cloud.SolrZkClient.getData(SolrZkClient.java:358) ~[java/:?]
   [junit4]   2> at org.apache.solr.cloud.Overseer$ClusterStateUpdater.checkIfIamStillLeader(Overseer.java:319) ~[java/:?]
   [junit4]   2> at java.lang.Thread.run(Thread.java:748) [?:1.8.0_191]
   [junit4]   2> 2046630 WARN  (Thread-5488) [    ] o.e.j.u.s.S.config No Client EndPointIdentificationAlgorithm configured for SslContextFactory@2c0a06b1[provider=null,keyStore=null,trustStore=null]
   [junit4]   2> 2046656 INFO  (OverseerStateUpdate-74306098037260306-127.0.0.1:36057_solr-n_0000000001) [    ] o.a.s.c.Overseer Starting to work on the main queue : 127.0.0.1:36057_solr
   [junit4]   2> 2046659 INFO  (OverseerStateUpdate-74306098037260306-127.0.0.1:36057_solr-n_0000000001) [    ] o.a.s.c.c.ZkStateReader Updated live nodes from ZooKeeper... (0) -> (1)
   [junit4]   2> 2046684 INFO  (zkConnectionManagerCallback-3920-thread-1) [    ] o.a.s.c.c.ConnectionManager zkClient has connected
   [junit4]   2> 2046737 INFO  (TEST-OverseerTest.testShardLeaderChange-seed#[95FF74B2CEEB6666]) [    ] o.a.s.c.ShardLeaderElectionContextBase make sure parent is created /collections/collection1/leaders/shard1
   [junit4]   2> 2046747 INFO  (TEST-OverseerTest.testShardLeaderChange-seed#[95FF74B2CEEB6666]) [    ] o.a.s.c.ShardLeaderElectionContextBase Creating leader registration node /collections/collection1/leaders/shard1/leader after winning as /collections/collection1/leader_elect/shard1/election/74306098037260311-node1_core1-n_0000000000
   [junit4]   2> org.apache.solr.common.SolrException: org.apache.zookeeper.KeeperException$SessionExpiredException: KeeperErrorCode = Session expired for /overseer/queue
   [junit4]   2> at org.apache.solr.cloud.ZkDistributedQueue.<init>(ZkDistributedQueue.java:129)
   [junit4]   2> at org.apache.solr.cloud.Overseer.getStateUpdateQueue(Overseer.java:690)
   [junit4]   2> at org.apache.solr.cloud.Overseer.getStateUpdateQueue(Overseer.java:678)
   [junit4]   2> at org.apache.solr.cloud.Overseer.offerStateUpdate(Overseer.java:851)
   [junit4]   2> at org.apache.solr.cloud.ShardLeaderElectionContextBase.runLeaderProcess(ElectionContext.java:250)
   [junit4]   2> at org.apache.solr.cloud.LeaderElector.runIamLeaderProcess(LeaderElector.java:171)
   [junit4]   2> at org.apache.solr.cloud.LeaderElector.checkIfIamLeader(LeaderElector.java:136)
   [junit4]   2> at org.apache.solr.cloud.LeaderElector.joinElection(LeaderElector.java:308)
   [junit4]   2> at org.apache.solr.cloud.LeaderElector.joinElection(LeaderElector.java:217)
   [junit4]   2> at org.apache.solr.cloud.OverseerTest$MockZKController.publishState(OverseerTest.java:248)
   [junit4]   2> at org.apache.solr.cloud.OverseerTest.testShardLeaderChange(OverseerTest.java:930)
   [junit4]   2> at sun.reflect.NativeMethodAccessorImpl.invoke0(Native Method)
   [junit4]   2> at sun.reflect.NativeMethodAccessorImpl.invoke(NativeMethodAccessorImpl.java:62)
   [junit4]   2> at sun.reflect.DelegatingMethodAccessorImpl.invoke(DelegatingMethodAccessorImpl.java:43)
   [junit4]   2> at java.lang.reflect.Method.invoke(Method.java:498)
   [junit4]   2> at com.carrotsearch.randomizedtesting.RandomizedRunner.invoke(RandomizedRunner.java:1750)
   [junit4]   2> at com.carrotsearch.randomizedtesting.RandomizedRunner$8.evaluate(RandomizedRunner.java:938)
   [junit4]   2> at com.carrotsearch.randomizedtesting.RandomizedRunner$9.evaluate(RandomizedRunner.java:974)
   [junit4]   2> at com.carrotsearch.randomizedtesting.RandomizedRunner$10.evaluate(RandomizedRunner.java:988)
   [junit4]   2> at com.carrotsearch.randomizedtesting.rules.SystemPropertiesRestoreRule$1.evaluate(SystemPropertiesRestoreRule.java:57)
   [junit4]   2> at org.apache.lucene.util.TestRuleSetupTeardownChained$1.evaluate(TestRuleSetupTeardownChained.java:49)
   [junit4]   2> at org.apache.lucene.util.AbstractBeforeAfterRule$1.evaluate(AbstractBeforeAfterRule.java:45)
   [junit4]   2> at org.apache.lucene.util.TestRuleThreadAndTestName$1.evaluate(TestRuleThreadAndTestName.java:48)
   [junit4]   2> at org.apache.lucene.util.TestRuleIgnoreAfterMaxFailures$1.evaluate(TestRuleIgnoreAfterMaxFailures.java:64)
   [junit4]   2> at org.apache.lucene.util.TestRuleMarkFailure$1.evaluate(TestRuleMarkFailure.java:47)
   [junit4]   2> at com.carrotsearch.randomizedtesting.rules.StatementAdapter.evaluate(StatementAdapter.java:36)
   [junit4]   2> at com.carrotsearch.randomizedtesting.ThreadLeakControl$StatementRunner.run(ThreadLeakControl.java:368)
   [junit4]   2> at com.carrotsearch.randomizedtesting.ThreadLeakControl.forkTimeoutingTask(ThreadLeakControl.java:817)
   [junit4]   2> at com.carrotsearch.randomizedtesting.ThreadLeakControl$3.evaluate(ThreadLeakControl.java:468)
   [junit4]   2> at com.carrotsearch.randomizedtesting.RandomizedRunner.runSingleTest(RandomizedRunner.java:947)
   [junit4]   2> at com.carrotsearch.randomizedtesting.RandomizedRunner$5.evaluate(RandomizedRunner.java:832)
   [junit4]   2> at com.carrotsearch.randomizedtesting.RandomizedRunner$6.evaluate(RandomizedRunner.java:883)
   [junit4]   2> at com.carrotsearch.randomizedtesting.RandomizedRunner$7.evaluate(RandomizedRunner.java:894)
   [junit4]   2> at com.carrotsearch.randomizedtesting.rules.StatementAdapter.evaluate(StatementAdapter.java:36)
   [junit4]   2> at com.carrotsearch.randomizedtesting.rules.SystemPropertiesRestoreRule$1.evaluate(SystemPropertiesRestoreRule.java:57)
   [junit4]   2> at org.apache.lucene.util.AbstractBeforeAfterRule$1.evaluate(AbstractBeforeAfterRule.java:45)
   [junit4]   2> at com.carrotsearch.randomizedtesting.rules.StatementAdapter.evaluate(StatementAdapter.java:36)
   [junit4]   2> at org.apache.lucene.util.TestRuleStoreClassName$1.evaluate(TestRuleStoreClassName.java:41)
   [junit4]   2> at com.carrotsearch.randomizedtesting.rules.NoShadowingOrOverridesOnMethodsRule$1.evaluate(NoShadowingOrOverridesOnMethodsRule.java:40)
   [junit4]   2> at com.carrotsearch.randomizedtesting.rules.NoShadowingOrOverridesOnMethodsRule$1.evaluate(NoShadowingOrOverridesOnMethodsRule.java:40)
   [junit4]   2> at com.carrotsearch.randomizedtesting.rules.StatementAdapter.evaluate(StatementAdapter.java:36)
   [junit4]   2> at com.carrotsearch.randomizedtesting.rules.StatementAdapter.evaluate(StatementAdapter.java:36)
   [junit4]   2> at com.carrotsearch.randomizedtesting.rules.StatementAdapter.evaluate(StatementAdapter.java:36)
   [junit4]   2> at org.apache.lucene.util.TestRuleAssertionsRequired$1.evaluate(TestRuleAssertionsRequired.java:53)
   [junit4]   2> at org.apache.lucene.util.TestRuleMarkFailure$1.evaluate(TestRuleMarkFailure.java:47)
   [junit4]   2> at org.apache.lucene.util.TestRuleIgnoreAfterMaxFailures$1.evaluate(TestRuleIgnoreAfterMaxFailures.java:64)
   [junit4]   2> at org.apache.lucene.util.TestRuleIgnoreTestSuites$1.evaluate(TestRuleIgnoreTestSuites.java:54)
   [junit4]   2> at com.carrotsearch.randomizedtesting.rules.StatementAdapter.evaluate(StatementAdapter.java:36)
   [junit4]   2> at com.carrotsearch.randomizedtesting.ThreadLeakControl$StatementRunner.run(ThreadLeakControl.java:368)
   [junit4]   2> at java.lang.Thread.run(Thread.java:748)
   [junit4]   2> Caused by: org.apache.zookeeper.KeeperException$SessionExpiredException: KeeperErrorCode = Session expired for /overseer/queue
   [junit4]   2> at org.apache.zookeeper.KeeperException.create(KeeperException.java:130)
   [junit4]   2> at org.apache.zookeeper.KeeperException.create(KeeperException.java:54)
   [junit4]   2> at org.apache.zookeeper.ZooKeeper.exists(ZooKeeper.java:1111)
   [junit4]   2> at org.apache.solr.common.cloud.SolrZkClient.lambda$exists$3(SolrZkClient.java:334)
   [junit4]   2> at org.apache.solr.common.cloud.ZkCmdExecutor.retryOperation(ZkCmdExecutor.java:71)
   [junit4]   2> at org.apache.solr.common.cloud.SolrZkClient.exists(SolrZkClient.java:334)
   [junit4]   2> at org.apache.solr.common.cloud.ZkCmdExecutor.ensureExists(ZkCmdExecutor.java:108)
   [junit4]   2> at org.apache.solr.common.cloud.ZkCmdExecutor.ensureExists(ZkCmdExecutor.java:93)
   [junit4]   2> at org.apache.solr.cloud.ZkDistributedQueue.<init>(ZkDistributedQueue.java:127)
   [junit4]   2> ... 49 more
   [junit4]   2> 2046757 INFO  (TEST-OverseerTest.testShardLeaderChange-seed#[95FF74B2CEEB6666]) [    ] o.a.s.c.ShardLeaderElectionContextBase make sure parent is created /collections/collection1/leaders/shard1
   [junit4]   2> 2046758 INFO  (TEST-OverseerTest.testShardLeaderChange-seed#[95FF74B2CEEB6666]) [    ] o.a.s.c.ShardLeaderElectionContextBase Creating leader registration node /collections/collection1/leaders/shard1/leader after winning as /collections/collection1/leader_elect/shard1/election/74306098037260311-node1_core1-n_0000000001
   [junit4]   2> 2046792 INFO  (zkConnectionManagerCallback-3925-thread-1) [    ] o.a.s.c.c.ConnectionManager zkClient has connected
   [junit4]   2> 2046848 INFO  (Thread-5488) [    ] o.a.s.c.c.ZkStateReader Updated live nodes from ZooKeeper... (0) -> (1)
   [junit4]   2> 2046849 INFO  (Thread-5488) [    ] o.a.s.c.s.i.ZkClientClusterStateProvider Cluster at 127.0.0.1:36057/solr ready
   [junit4]   2> 2046868 INFO  (TEST-OverseerTest.testShardLeaderChange-seed#[95FF74B2CEEB6666]) [    ] o.a.s.c.ShardLeaderElectionContextBase make sure parent is created /collections/collection1/leaders/shard1
   [junit4]   2> 2046881 INFO  (TEST-OverseerTest.testShardLeaderChange-seed#[95FF74B2CEEB6666]) [    ] o.a.s.c.ShardLeaderElectionContextBase Creating leader registration node /collections/collection1/leaders/shard1/leader after winning as /collections/collection1/leader_elect/shard1/election/74306098037260311-node1_core1-n_0000000002
   [junit4]   2> 2046954 INFO  (zkConnectionManagerCallback-3927-thread-1) [    ] o.a.s.c.c.ConnectionManager zkClient has connected
   [junit4]   2> 2046957 INFO  (TEST-OverseerTest.testShardLeaderChange-seed#[95FF74B2CEEB6666]) [    ] o.a.s.c.c.ZkStateReader Updated live nodes from ZooKeeper... (0) -> (1)
   [junit4]   2> 2046989 INFO  (zkCallback-3788-thread-3) [    ] o.a.s.c.c.ZkStateReader Updated live nodes from ZooKeeper... (1) -> (2)
   [junit4]   2> 2046989 INFO  (zkCallback-3906-thread-1) [    ] o.a.s.c.c.ZkStateReader Updated live nodes from ZooKeeper... (1) -> (2)
   [junit4]   2> 2046989 INFO  (zkCallback-3901-thread-1) [    ] o.a.s.c.c.ZkStateReader Updated live nodes from ZooKeeper... (1) -> (2)
   [junit4]   2> 2046989 INFO  (zkCallback-3885-thread-2) [    ] o.a.s.c.c.ZkStateReader Updated live nodes from ZooKeeper... (1) -> (2)
   [junit4]   2> 2046989 INFO  (zkCallback-3908-thread-1) [    ] o.a.s.c.c.ZkStateReader Updated live nodes from ZooKeeper... (1) -> (2)
   [junit4]   2> 2047001 INFO  (TEST-OverseerTest.testShardLeaderChange-seed#[95FF74B2CEEB6666]) [    ] o.a.s.c.ShardLeaderElectionContextBase make sure parent is created /collections/collection1/leaders/shard1
   [junit4]   2> 2047002 INFO  (TEST-OverseerTest.testShardLeaderChange-seed#[95FF74B2CEEB6666]) [    ] o.a.s.c.ShardLeaderElectionContextBase Creating leader registration node /collections/collection1/leaders/shard1/leader after winning as /collections/collection1/leader_elect/shard1/election/74306098037260311-node1_core1-n_0000000003
   [junit4]   2> 2047015 INFO  (zkCallback-3924-thread-1) [    ] o.a.s.c.c.ZkStateReader Updated live nodes from ZooKeeper... (1) -> (2)
   [junit4]   2> 2047083 INFO  (zkCallback-3926-thread-1) [    ] o.a.s.c.c.ZkStateReader Updated live nodes from ZooKeeper... (1) -> (2)
   [junit4]   2> 2047251 INFO  (TEST-OverseerTest.testShardLeaderChange-seed#[95FF74B2CEEB6666]) [    ] o.a.s.c.ShardLeaderElectionContextBase make sure parent is created /collections/collection1/leaders/shard1
   [junit4]   2> 2047263 INFO  (zkCallback-3926-thread-1) [    ] o.a.s.c.ShardLeaderElectionContextBase Creating leader registration node /collections/collection1/leaders/shard1/leader after winning as /collections/collection1/leader_elect/shard1/election/74306098037260315-node2_core4-n_0000000004
   [junit4]   2> 2047263 INFO  (zkCallback-3906-thread-1) [    ] o.a.s.c.c.ZkStateReader Updated live nodes from ZooKeeper... (2) -> (1)
   [junit4]   2> 2047263 INFO  (zkCallback-3788-thread-3) [    ] o.a.s.c.c.ZkStateReader Updated live nodes from ZooKeeper... (2) -> (1)
   [junit4]   2> 2047263 INFO  (zkCallback-3924-thread-1) [    ] o.a.s.c.c.ZkStateReader Updated live nodes from ZooKeeper... (2) -> (1)
   [junit4]   2> 2047263 INFO  (zkCallback-3885-thread-2) [    ] o.a.s.c.c.ZkStateReader Updated live nodes from ZooKeeper... (2) -> (1)
   [junit4]   2> 2047264 INFO  (zkCallback-3901-thread-1) [    ] o.a.s.c.c.ZkStateReader Updated live nodes from ZooKeeper... (2) -> (1)
   [junit4]   2> 2047264 INFO  (zkCallback-3908-thread-1) [    ] o.a.s.c.c.ZkStateReader Updated live nodes from ZooKeeper... (2) -> (1)
   [junit4]   2> 2047278 INFO  (zkCallback-3926-thread-2) [    ] o.a.s.c.c.ZkStateReader Updated live nodes from ZooKeeper... (2) -> (1)
   [junit4]   2> 2047326 INFO  (zkConnectionManagerCallback-3931-thread-1) [    ] o.a.s.c.c.ConnectionManager zkClient has connected
   [junit4]   2> 2047391 INFO  (zkConnectionManagerCallback-3936-thread-1) [    ] o.a.s.c.c.ConnectionManager zkClient has connected
   [junit4]   2> 2047420 INFO  (TEST-OverseerTest.testShardLeaderChange-seed#[95FF74B2CEEB6666]) [    ] o.a.s.c.c.ZkStateReader Updated live nodes from ZooKeeper... (0) -> (1)
   [junit4]   2> 2047421 INFO  (TEST-OverseerTest.testShardLeaderChange-seed#[95FF74B2CEEB6666]) [    ] o.a.s.c.s.i.ZkClientClusterStateProvider Cluster at 127.0.0.1:36057/solr ready
   [junit4]   2> 2047476 INFO  (Thread-5488) [    ] o.a.s.c.OverseerTest Killing overseer.
   [junit4]   2> 2047493 INFO  (zkConnectionManagerCallback-3938-thread-1) [    ] o.a.s.c.c.ConnectionManager zkClient has connected
   [junit4]   2> 2047524 INFO  (TEST-OverseerTest.testShardLeaderChange-seed#[95FF74B2CEEB6666]) [    ] o.a.s.c.c.ZkStateReader Updated live nodes from ZooKeeper... (0) -> (1)
   [junit4]   2> 2047542 INFO  (zkConnectionManagerCallback-3940-thread-1) [    ] o.a.s.c.c.ConnectionManager zkClient has connected
   [junit4]   2> 2047542 INFO  (Thread-5488) [    ] o.a.s.c.Overseer Overseer (id=74306098037260305-127.0.0.1:36057_solr-n_0000000000) closing
   [junit4]   2> 2047558 WARN  (Thread-5488) [    ] o.e.j.u.s.S.config No Client EndPointIdentificationAlgorithm configured for SslContextFactory@439c0e4[provider=null,keyStore=null,trustStore=null]
   [junit4]   2> 2047569 INFO  (zkCallback-3906-thread-1) [    ] o.a.s.c.c.ZkStateReader Updated live nodes from ZooKeeper... (1) -> (2)
   [junit4]   2> 2047569 INFO  (zkCallback-3901-thread-1) [    ] o.a.s.c.c.ZkStateReader Updated live nodes from ZooKeeper... (1) -> (2)
   [junit4]   2> 2047569 INFO  (zkCallback-3885-thread-1) [    ] o.a.s.c.c.ZkStateReader Updated live nodes from ZooKeeper... (1) -> (2)
   [junit4]   2> 2047569 INFO  (zkCallback-3788-thread-3) [    ] o.a.s.c.c.ZkStateReader Updated live nodes from ZooKeeper... (1) -> (2)
   [junit4]   2> 2047570 WARN  (OverseerStateUpdate-74306098037260306-127.0.0.1:36057_solr-n_0000000001) [    ] o.a.s.c.o.ClusterStateMutator Collection collection1 already exists. exit
   [junit4]   2> 2047590 INFO  (zkCallback-3924-thread-1) [    ] o.a.s.c.c.ZkStateReader Updated live nodes from ZooKeeper... (1) -> (2)
   [junit4]   2> 2047590 INFO  (zkCallback-3926-thread-1) [    ] o.a.s.c.c.ZkStateReader Updated live nodes from ZooKeeper... (1) -> (2)
   [junit4]   2> 2047592 INFO  (TEST-OverseerTest.testShardLeaderChange-seed#[95FF74B2CEEB6666]) [    ] o.a.s.c.ShardLeaderElectionContextBase make sure parent is created /collections/collection1/leaders/shard1
   [junit4]   2> 2047593 INFO  (zkCallback-3937-thread-1) [    ] o.a.s.c.c.ZkStateReader Updated live nodes from ZooKeeper... (1) -> (2)
   [junit4]   2> 2047593 INFO  (zkConnectionManagerCallback-3949-thread-1) [    ] o.a.s.c.c.ConnectionManager zkClient has connected
   [junit4]   2> 2047594 INFO  (zkCallback-3935-thread-1) [    ] o.a.s.c.c.ZkStateReader Updated live nodes from ZooKeeper... (1) -> (2)
   [junit4]   2> 2047594 INFO  (zkCallback-3937-thread-1) [    ] o.a.s.c.ShardLeaderElectionContextBase Creating leader registration node /collections/collection1/leaders/shard1/leader after winning as /collections/collection1/leader_elect/shard1/election/74306098037260318-node1_core1-n_0000000005
   [junit4]   2> 2047595 INFO  (zkCallback-3885-thread-1) [    ] o.a.s.c.c.ZkStateReader Updated live nodes from ZooKeeper... (2) -> (1)
   [junit4]   2> 2047596 INFO  (zkCallback-3935-thread-1) [    ] o.a.s.c.c.ZkStateReader Updated live nodes from ZooKeeper... (2) -> (1)
   [junit4]   2> 2047611 INFO  (zkCallback-3906-thread-1) [    ] o.a.s.c.c.ZkStateReader Updated live nodes from ZooKeeper... (2) -> (1)
   [junit4]   2> 2047611 INFO  (zkCallback-3901-thread-1) [    ] o.a.s.c.c.ZkStateReader Updated live nodes from ZooKeeper... (2) -> (1)
   [junit4]   2> 2047611 INFO  (zkCallback-3788-thread-3) [    ] o.a.s.c.c.ZkStateReader Updated live nodes from ZooKeeper... (2) -> (1)
   [junit4]   2> 2047612 INFO  (zkCallback-3937-thread-2) [    ] o.a.s.c.c.ZkStateReader Updated live nodes from ZooKeeper... (2) -> (1)
   [junit4]   2> 2047616 INFO  (zkCallback-3926-thread-1) [    ] o.a.s.c.c.ZkStateReader Updated live nodes from ZooKeeper... (2) -> (1)
   [junit4]   2> 2047616 INFO  (zkCallback-3924-thread-1) [    ] o.a.s.c.c.ZkStateReader Updated live nodes from ZooKeeper... (2) -> (1)
   [junit4]   2> 2047668 INFO  (zkConnectionManagerCallback-3954-thread-1) [    ] o.a.s.c.c.ConnectionManager zkClient has connected
   [junit4]   2> 2047669 INFO  (Thread-5488) [    ] o.a.s.c.c.ZkStateReader Updated live nodes from ZooKeeper... (0) -> (1)
   [junit4]   2> 2047670 INFO  (Thread-5488) [    ] o.a.s.c.s.i.ZkClientClusterStateProvider Cluster at 127.0.0.1:36057/solr ready
   [junit4]   2> 2047784 INFO  (TEST-OverseerTest.testShardLeaderChange-seed#[95FF74B2CEEB6666]) [    ] o.a.s.c.ShardLeaderElectionContextBase make sure parent is created /collections/collection1/leaders/shard1
   [junit4]   2> 2047833 INFO  (TEST-OverseerTest.testShardLeaderChange-seed#[95FF74B2CEEB6666]) [    ] o.a.s.c.ShardLeaderElectionContextBase Creating leader registration node /collections/collection1/leaders/shard1/leader after winning as /collections/collection1/leader_elect/shard1/election/74306098037260318-node1_core1-n_0000000006
   [junit4]   2> 2047996 ERROR (Finalizer) [    ] o.a.s.c.CoreContainer CoreContainer was not close prior to finalize(), indicates a bug -- POSSIBLE RESOURCE LEAK!!!  instance=1086989557
   [junit4]   2> 2047996 ERROR (Finalizer) [    ] o.a.s.c.CoreContainer CoreContainer was not close prior to finalize(), indicates a bug -- POSSIBLE RESOURCE LEAK!!!  instance=1236901821
   [junit4]   2> 2047996 ERROR (Finalizer) [    ] o.a.s.c.CoreContainer CoreContainer was not close prior to finalize(), indicates a bug -- POSSIBLE RESOURCE LEAK!!!  instance=949151302
   [junit4]   2> 2047996 ERROR (Finalizer) [    ] o.a.s.c.CoreContainer CoreContainer was not close prior to finalize(), indicates a bug -- POSSIBLE RESOURCE LEAK!!!  instance=405077228
   [junit4]   2> 2047996 ERROR (Finalizer) [    ] o.a.s.c.CoreContainer CoreContainer was not close prior to finalize(), indicates a bug -- POSSIBLE RESOURCE LEAK!!!  instance=165191313
   [junit4]   2> 2048007 INFO  (zkConnectionManagerCallback-3956-thread-1) [    ] o.a.s.c.c.ConnectionManager zkClient has connected
   [junit4]   2> 2048032 INFO  (TEST-OverseerTest.testShardLeaderChange-seed#[95FF74B2CEEB6666]) [    ] o.a.s.c.c.ZkStateReader Updated live nodes from ZooKeeper... (0) -> (1)
   [junit4]   2> 2048035 INFO  (zkCallback-3924-thread-1) [    ] o.a.s.c.c.ZkStateReader Updated live nodes from ZooKeeper... (1) -> (2)
   [junit4]   2> 2048035 INFO  (zkCallback-3935-thread-1) [    ] o.a.s.c.c.ZkStateReader Updated live nodes from ZooKeeper... (1) -> (2)
   [junit4]   2> 2048035 INFO  (zkCallback-3885-thread-1) [    ] o.a.s.c.c.ZkStateReader Updated live nodes from ZooKeeper... (1) -> (2)
   [junit4]   2> 2048035 INFO  (zkCallback-3937-thread-2) [    ] o.a.s.c.c.ZkStateReader Updated live nodes from ZooKeeper... (1) -> (2)
   [junit4]   2> 2048052 INFO  (zkCallback-3788-thread-2) [    ] o.a.s.c.c.ZkStateReader Updated live nodes from ZooKeeper... (1) -> (2)
   [junit4]   2> 2048064 INFO  (zkCallback-3955-thread-1) [    ] o.a.s.c.c.ZkStateReader Updated live nodes from ZooKeeper... (1) -> (2)
   [junit4]   2> 2048088 INFO  (TEST-OverseerTest.testShardLeaderChange-seed#[95FF74B2CEEB6666]) [    ] o.a.s.c.ShardLeaderElectionContextBase make sure parent is created /collections/collection1/leaders/shard1
   [junit4]   2> 2048089 INFO  (zkCallback-3953-thread-2) [    ] o.a.s.c.c.ZkStateReader Updated live nodes from ZooKeeper... (1) -> (2)
   [junit4]   2> 2048089 INFO  (zkCallback-3901-thread-2) [    ] o.a.s.c.c.ZkStateReader Updated live nodes from ZooKeeper... (1) -> (2)
   [junit4]   2> 2048090 INFO  (TEST-OverseerTest.testShardLeaderChange-seed#[95FF74B2CEEB6666]) [    ] o.a.s.c.ShardLeaderElectionContextBase Creating leader registration node /collections/collection1/leaders/shard1/leader after winning as /collections/collection1/leader_elect/shard1/election/74306098037260318-node1_core1-n_0000000007
   [junit4]   2> 2048091 INFO  (zkCallback-3906-thread-2) [    ] o.a.s.c.c.ZkStateReader Updated live nodes from ZooKeeper... (1) -> (2)
   [junit4]   2> 2048095 INFO  (TEST-OverseerTest.testShardLeaderChange-seed#[95FF74B2CEEB6666]) [    ] o.a.s.c.ShardLeaderElectionContextBase make sure parent is created /collections/collection1/leaders/shard1
   [junit4]   2> 2048105 INFO  (zkCallback-3955-thread-1) [    ] o.a.s.c.ShardLeaderElectionContextBase Creating leader registration node /collections/collection1/leaders/shard1/leader after winning as /collections/collection1/leader_elect/shard1/election/74306098037260322-node2_core4-n_0000000008
   [junit4]   2> 2048107 INFO  (zkCallback-3924-thread-1) [    ] o.a.s.c.c.ZkStateReader Updated live nodes from ZooKeeper... (2) -> (1)
   [junit4]   2> 2048107 INFO  (zkCallback-3935-thread-1) [    ] o.a.s.c.c.ZkStateReader Updated live nodes from ZooKeeper... (2) -> (1)
   [junit4]   2> 2048107 INFO  (zkCallback-3885-thread-1) [    ] o.a.s.c.c.ZkStateReader Updated live nodes from ZooKeeper... (2) -> (1)
   [junit4]   2> 2048107 INFO  (zkCallback-3953-thread-2) [    ] o.a.s.c.c.ZkStateReader Updated live nodes from ZooKeeper... (2) -> (1)
   [junit4]   2> 2048107 INFO  (zkCallback-3901-thread-2) [    ] o.a.s.c.c.ZkStateReader Updated live nodes from ZooKeeper... (2) -> (1)
   [junit4]   2> 2048107 INFO  (zkCallback-3906-thread-2) [    ] o.a.s.c.c.ZkStateReader Updated live nodes from ZooKeeper... (2) -> (1)
   [junit4]   2> 2048107 INFO  (zkCallback-3937-thread-2) [    ] o.a.s.c.c.ZkStateReader Updated live nodes from ZooKeeper... (2) -> (1)
   [junit4]   2> 2048107 INFO  (zkCallback-3788-thread-2) [    ] o.a.s.c.c.ZkStateReader Updated live nodes from ZooKeeper... (2) -> (1)
   [junit4]   2> 2048109 INFO  (zkCallback-3955-thread-2) [    ] o.a.s.c.c.ZkStateReader Updated live nodes from ZooKeeper... (2) -> (1)
   [junit4]   2> 2048109 WARN  (NIOServerCxn.Factory:0.0.0.0/0.0.0.0:0) [    ] o.a.z.s.NIOServerCnxn Unable to read additional data from client sessionid 0x107fd00a228001e, likely client has closed socket
   [junit4]   2> 2048110 INFO  (zkConnectionManagerCallback-3960-thread-1) [    ] o.a.s.c.c.ConnectionManager zkClient has connected
   [junit4]   2> 2048149 INFO  (zkConnectionManagerCallback-3965-thread-1) [    ] o.a.s.c.c.ConnectionManager zkClient has connected
   [junit4]   2> 2048234 INFO  (TEST-OverseerTest.testShardLeaderChange-seed#[95FF74B2CEEB6666]) [    ] o.a.s.c.c.ZkStateReader Updated live nodes from ZooKeeper... (0) -> (1)
   [junit4]   2> 2048275 INFO  (TEST-OverseerTest.testShardLeaderChange-seed#[95FF74B2CEEB6666]) [    ] o.a.s.c.s.i.ZkClientClusterStateProvider Cluster at 127.0.0.1:36057/solr ready
   [junit4]   2> 2048306 INFO  (Thread-5488) [    ] o.a.s.c.OverseerTest Killing overseer.
   [junit4]   2> 2048307 INFO  (zkConnectionManagerCallback-3967-thread-1) [    ] o.a.s.c.c.ConnectionManager zkClient has connected
   [junit4]   2> 2048347 INFO  (TEST-OverseerTest.testShardLeaderChange-seed#[95FF74B2CEEB6666]) [    ] o.a.s.c.c.ZkStateReader Updated live nodes from ZooKeeper... (0) -> (1)
   [junit4]   2> 2048364 INFO  (zkCallback-3788-thread-2) [    ] o.a.s.c.c.ZkStateReader Updated live nodes from ZooKeeper... (1) -> (2)
   [junit4]   2> 2048364 INFO  (zkCallback-3924-thread-1) [    ] o.a.s.c.c.ZkStateReader Updated live nodes from ZooKeeper... (1) -> (2)
   [junit4]   2> 2048364 INFO  (zkCallback-3906-thread-2) [    ] o.a.s.c.c.ZkStateReader Updated live nodes from ZooKeeper... (1) -> (2)
   [junit4]   2> 2048364 INFO  (zkCallback-3935-thread-1) [    ] o.a.s.c.c.ZkStateReader Updated live nodes from ZooKeeper... (1) -> (2)
   [junit4]   2> 2048368 INFO  (zkCallback-3901-thread-2) [    ] o.a.s.c.c.ZkStateReader Updated live nodes from ZooKeeper... (1) -> (2)
   [junit4]   2> 2048368 INFO  (zkCallback-3953-thread-2) [    ] o.a.s.c.c.ZkStateReader Updated live nodes from ZooKeeper... (1) -> (2)
   [junit4]   2> 2048380 INFO  (zkCallback-3885-thread-1) [    ] o.a.s.c.c.ZkStateReader Updated live nodes from ZooKeeper... (1) -> (2)
   [junit4]   2> 2048380 INFO  (zkCallback-3955-thread-2) [    ] o.a.s.c.c.ZkStateReader Updated live nodes from ZooKeeper... (1) -> (2)
   [junit4]   2> 2048381 WARN  (OverseerStateUpdate-74306098037260306-127.0.0.1:36057_solr-n_0000000001) [    ] o.a.s.c.o.ClusterStateMutator Collection collection1 already exists. exit
   [junit4]   2> 2048419 INFO  (TEST-OverseerTest.testShardLeaderChange-seed#[95FF74B2CEEB6666]) [    ] o.a.s.c.ShardLeaderElectionContextBase make sure parent is created /collections/collection1/leaders/shard1
   [junit4]   2> 2048420 INFO  (zkCallback-3966-thread-1) [    ] o.a.s.c.c.ZkStateReader Updated live nodes from ZooKeeper... (1) -> (2)
   [junit4]   2> 2048420 INFO  (zkConnectionManagerCallback-3969-thread-1) [    ] o.a.s.c.c.ConnectionManager zkClient has connected
   [junit4]   2> 2048421 INFO  (Thread-5488) [    ] o.a.s.c.Overseer Overseer (id=74306098037260305-127.0.0.1:36057_solr-n_0000000000) closing
   [junit4]   2> 2048428 INFO  (zkCallback-3964-thread-1) [    ] o.a.s.c.c.ZkStateReader Updated live nodes from ZooKeeper... (1) -> (2)
   [junit4]   2> 2048439 WARN  (Thread-5488) [    ] o.e.j.u.s.S.config No Client EndPointIdentificationAlgorithm configured for SslContextFactory@6e28e3cd[provider=null,keyStore=null,trustStore=null]
   [junit4]   2> 2048448 INFO  (zkCallback-3788-thread-2) [    ] o.a.s.c.c.ZkStateReader Updated live nodes from ZooKeeper... (2) -> (1)
   [junit4]   2> 2048448 INFO  (zkCallback-3901-thread-2) [    ] o.a.s.c.c.ZkStateReader Updated live nodes from ZooKeeper... (2) -> (1)
   [junit4]   2> 2048448 INFO  (zkCallback-3924-thread-1) [    ] o.a.s.c.c.ZkStateReader Updated live nodes from ZooKeeper... (2) -> (1)
   [junit4]   2> 2048448 INFO  (zkCallback-3953-thread-2) [    ] o.a.s.c.c.ZkStateReader Updated live nodes from ZooKeeper... (2) -> (1)
   [junit4]   2> 2048448 INFO  (zkCallback-3885-thread-1) [    ] o.a.s.c.c.ZkStateReader Updated live nodes from ZooKeeper... (2) -> (1)
   [junit4]   2> 2048448 INFO  (zkCallback-3935-thread-1) [    ] o.a.s.c.c.ZkStateReader Updated live nodes from ZooKeeper... (2) -> (1)
   [junit4]   2> 2048449 INFO  (zkCallback-3955-thread-2) [    ] o.a.s.c.c.ZkStateReader Updated live nodes from ZooKeeper... (2) -> (1)
   [junit4]   2> 2048449 INFO  (zkCallback-3906-thread-2) [    ] o.a.s.c.c.ZkStateReader Updated live nodes from ZooKeeper... (2) -> (1)
   [junit4]   2> 2048462 INFO  (zkCallback-3966-thread-1) [    ] o.a.s.c.ShardLeaderElectionContextBase Creating leader registration node /collections/collection1/leaders/shard1/leader after winning as /collections/collection1/leader_elect/shard1/election/74306098037260325-node1_core1-n_0000000009
   [junit4]   2> 2048465 INFO  (zkCallback-3966-thread-2) [    ] o.a.s.c.c.ZkStateReader Updated live nodes from ZooKeeper... (2) -> (1)
   [junit4]   2> 2048469 INFO  (zkConnectionManagerCallback-3978-thread-1) [    ] o.a.s.c.c.ConnectionManager zkClient has connected
   [junit4]   2> 2048493 INFO  (zkCallback-3964-thread-1) [    ] o.a.s.c.c.ZkStateReader Updated live nodes from ZooKeeper... (2) -> (1)
   [junit4]   2> 2048501 INFO  (zkConnectionManagerCallback-3983-thread-1) [    ] o.a.s.c.c.ConnectionManager zkClient has connected
   [junit4]   2> 2048514 INFO  (Thread-5488) [    ] o.a.s.c.c.ZkStateReader Updated live nodes from ZooKeeper... (0) -> (1)
   [junit4]   2> 2048515 INFO  (Thread-5488) [    ] o.a.s.c.s.i.ZkClientClusterStateProvider Cluster at 127.0.0.1:36057/solr ready
   [junit4]   2> 2048615 INFO  (TEST-OverseerTest.testShardLeaderChange-seed#[95FF74B2CEEB6666]) [    ] o.a.s.c.ShardLeaderElectionContextBase make sure parent is created /collections/collection1/leaders/shard1
   [junit4]   2> 2048617 INFO  (TEST-OverseerTest.testShardLeaderChange-seed#[95FF74B2CEEB6666]) [    ] o.a.s.c.ShardLeaderElectionContextBase Creating leader registration node /collections/collection1/leaders/shard1/leader after winning as /collections/collection1/leader_elect/shard1/election/74306098037260325-node1_core1-n_0000000010
   [junit4]   2> 2048688 INFO  (zkConnectionManagerCallback-3985-thread-1) [    ] o.a.s.c.c.ConnectionManager zkClient has connected
   [junit4]   2> 2048691 INFO  (TEST-OverseerTest.testShardLeaderChange-seed#[95FF74B2CEEB6666]) [    ] o.a.s.c.c.ZkStateReader Updated live nodes from ZooKeeper... (0) -> (1)
   [junit4]   2> 2048703 INFO  (zkCallback-3906-thread-2) [    ] o.a.s.c.c.ZkStateReader Updated live nodes from ZooKeeper... (1) -> (2)
   [junit4]   2> 2048703 INFO  (zkCallback-3885-thread-1) [    ] o.a.s.c.c.ZkStateReader Updated live nodes from ZooKeeper... (1) -> (2)
   [junit4]   2> 2048703 INFO  (zkCallback-3788-thread-2) [    ] o.a.s.c.c.ZkStateReader Updated live nodes from ZooKeeper... (1) -> (2)
   [junit4]   2> 2048703 INFO  (zkCallback-3924-thread-1) [    ] o.a.s.c.c.ZkStateReader Updated live nodes from ZooKeeper... (1) -> (2)
   [junit4]   2> 2048703 INFO  (zkCallback-3935-thread-1) [    ] o.a.s.c.c.ZkStateReader Updated live nodes from ZooKeeper... (1) -> (2)
   [junit4]   2> 2048703 INFO  (zkCallback-3964-thread-1) [    ] o.a.s.c.c.ZkStateReader Updated live nodes from ZooKeeper... (1) -> (2)
   [junit4]   2> 2048704 INFO  (zkCallback-3984-thread-1) [    ] o.a.s.c.c.ZkStateReader Updated live nodes from ZooKeeper... (1) -> (2)
   [junit4]   2> 2048704 INFO  (zkCallback-3953-thread-2) [    ] o.a.s.c.c.ZkStateReader Updated live nodes from ZooKeeper... (1) -> (2)
   [junit4]   2> 2048704 INFO  (zkCallback-3982-thread-1) [    ] o.a.s.c.c.ZkStateReader Updated live nodes from ZooKeeper... (1) -> (2)
   [junit4]   2> 2048704 INFO  (zkCallback-3966-thread-2) [    ] o.a.s.c.c.ZkStateReader Updated live nodes from ZooKeeper... (1) -> (2)
   [junit4]   2> 2048704 INFO  (zkCallback-3901-thread-2) [    ] o.a.s.c.c.ZkStateReader Updated live nodes from ZooKeeper... (1) -> (2)
   [junit4]   2> 2048707 INFO  (TEST-OverseerTest.testShardLeaderChange-seed#[95FF74B2CEEB6666]) [    ] o.a.s.c.ShardLeaderElectionContextBase make sure parent is created /collections/collection1/leaders/shard1
   [junit4]   2> 2048709 INFO  (TEST-OverseerTest.testShardLeaderChange-seed#[95FF74B2CEEB6666]) [    ] o.a.s.c.ShardLeaderElectionContextBase Creating leader registration node /collections/collection1/leaders/shard1/leader after winning as /collections/collection1/leader_elect/shard1/election/74306098037260325-node1_core1-n_0000000011
   [junit4]   2> 2048813 INFO  (TEST-OverseerTest.testShardLeaderChange-seed#[95FF74B2CEEB6666]) [    ] o.a.s.c.ShardLeaderElectionContextBase make sure parent is created /collections/collection1/leaders/shard1
   [junit4]   2> 2048815 INFO  (zkCallback-3984-thread-1) [    ] o.a.s.c.ShardLeaderElectionContextBase Creating leader registration node /collections/collection1/leaders/shard1/leader after winning as /collections/collection1/leader_elect/shard1/election/74306098037260329-node2_core4-n_0000000012
   [junit4]   2> 2048816 INFO  (zkCallback-3984-thread-1) [    ] o.a.s.c.u.RetryUtil Retry due to Throwable, org.apache.zookeeper.KeeperException$NodeExistsException KeeperErrorCode = NodeExists
   [junit4]   2> 2048817 INFO  (zkCallback-3924-thread-1) [    ] o.a.s.c.c.ZkStateReader Updated live nodes from ZooKeeper... (2) -> (1)
   [junit4]   2> 2048817 INFO  (zkCallback-3966-thread-2) [    ] o.a.s.c.c.ZkStateReader Updated live nodes from ZooKeeper... (2) -> (1)
   [junit4]   2> 2048818 INFO  (zkCallback-3982-thread-1) [    ] o.a.s.c.c.ZkStateReader Updated live nodes from ZooKeeper... (2) -> (1)
   [junit4]   2> 2048818 INFO  (zkCallback-3953-thread-2) [    ] o.a.s.c.c.ZkStateReader Updated live nodes from ZooKeeper... (2) -> (1)
   [junit4]   2> 2048818 INFO  (zkCallback-3906-thread-2) [    ] o.a.s.c.c.ZkStateReader Updated live nodes from ZooKeeper... (2) -> (1)
   [junit4]   2> 2048818 INFO  (zkCallback-3901-thread-2) [    ] o.a.s.c.c.ZkStateReader Updated live nodes from ZooKeeper... (2) -> (1)
   [junit4]   2> 2048834 INFO  (zkCallback-3984-thread-2) [    ] o.a.s.c.c.ZkStateReader Updated live nodes from ZooKeeper... (2) -> (1)
   [junit4]   2> 2048838 INFO  (zkCallback-3885-thread-1) [    ] o.a.s.c.c.ZkStateReader Updated live nodes from ZooKeeper... (2) -> (1)
   [junit4]   2> 2048838 INFO  (zkCallback-3964-thread-1) [    ] o.a.s.c.c.ZkStateReader Updated live nodes from ZooKeeper... (2) -> (1)
   [junit4]   2> 2048838 INFO  (zkCallback-3935-thread-1) [    ] o.a.s.c.c.ZkStateReader Updated live nodes from ZooKeeper... (2) -> (1)
   [junit4]   2> 2048849 INFO  (zkCallback-3788-thread-2) [    ] o.a.s.c.c.ZkStateReader Updated live nodes from ZooKeeper... (2) -> (1)
   [junit4]   2> 2048850 INFO  (zkConnectionManagerCallback-3989-thread-1) [    ] o.a.s.c.c.ConnectionManager zkClient has connected
   [junit4]   2> 2048919 INFO  (zkConnectionManagerCallback-3994-thread-1) [    ] o.a.s.c.c.ConnectionManager zkClient has connected
   [junit4]   2> 2048935 INFO  (TEST-OverseerTest.testShardLeaderChange-seed#[95FF74B2CEEB6666]) [    ] o.a.s.c.c.ZkStateReader Updated live nodes from ZooKeeper... (0) -> (1)
   [junit4]   2> 2048936 INFO  (TEST-OverseerTest.testShardLeaderChange-seed#[95FF74B2CEEB6666]) [    ] o.a.s.c.s.i.ZkClientClusterStateProvider Cluster at 127.0.0.1:36057/solr ready
   [junit4]   2> 2053821 INFO  (zkCallback-3984-thread-1) [    ] o.a.s.c.ShardLeaderElectionContextBase Creating leader registration node /collections/collection1/leaders/shard1/leader after winning as /collections/collection1/leader_elect/shard1/election/74306098037260329-node2_core4-n_0000000012
   [junit4]   2> 2054017 INFO  (zkConnectionManagerCallback-3996-thread-1) [    ] o.a.s.c.c.ConnectionManager zkClient has connected
   [junit4]   2> 2054020 INFO  (TEST-OverseerTest.testShardLeaderChange-seed#[95FF74B2CEEB6666]) [    ] o.a.s.c.c.ZkStateReader Updated live nodes from ZooKeeper... (0) -> (1)
   [junit4]   2> 2054022 INFO  (zkCallback-3788-thread-2) [    ] o.a.s.c.c.ZkStateReader Updated live nodes from ZooKeeper... (1) -> (2)
   [junit4]   2> 2054022 INFO  (zkCallback-3906-thread-2) [    ] o.a.s.c.c.ZkStateReader Updated live nodes from ZooKeeper... (1) -> (2)
   [junit4]   2> 2054022 INFO  (zkCallback-3935-thread-1) [    ] o.a.s.c.c.ZkStateReader Updated live nodes from ZooKeeper... (1) -> (2)
   [junit4]   2> 2054022 INFO  (zkCallback-3984-thread-1) [    ] o.a.s.c.c.ZkStateReader Updated live nodes from ZooKeeper... (1) -> (2)
   [junit4]   2> 2054022 INFO  (zkCallback-3901-thread-2) [    ] o.a.s.c.c.ZkStateReader Updated live nodes from ZooKeeper... (1) -> (2)
   [junit4]   2> 2054023 INFO  (zkCallback-3964-thread-1) [    ] o.a.s.c.c.ZkStateReader Updated live nodes from ZooKeeper... (1) -> (2)
   [junit4]   2> 2054023 INFO  (zkCallback-3953-thread-2) [    ] o.a.s.c.c.ZkStateReader Updated live nodes from ZooKeeper... (1) -> (2)
   [junit4]   2> 2054023 INFO  (zkCallback-3982-thread-1) [    ] o.a.s.c.c.ZkStateReader Updated live nodes from ZooKeeper... (1) -> (2)
   [junit4]   2> 2054023 INFO  (zkCallback-3924-thread-1) [    ] o.a.s.c.c.ZkStateReader Updated live nodes from ZooKeeper... (1) -> (2)
   [junit4]   2> 2054049 INFO  (Thread-5488) [    ] o.a.s.c.OverseerTest Killing overseer.
   [junit4]   2> 2054050 INFO  (zkCallback-3993-thread-1) [    ] o.a.s.c.c.ZkStateReader Updated live nodes from ZooKeeper... (1) -> (2)
   [junit4]   2> 2054050 INFO  (zkCallback-3995-thread-1) [    ] o.a.s.c.c.ZkStateReader Updated live nodes from ZooKeeper... (1) -> (2)
   [junit4]   2> 2054051 WARN  (OverseerStateUpdate-74306098037260306-127.0.0.1:36057_solr-n_0000000001) [    ] o.a.s.c.o.ClusterStateMutator Collection collection1 already exists. exit
   [junit4]   2> 2054052 INFO  (zkCallback-3885-thread-1) [    ] o.a.s.c.c.ZkStateReader Updated live nodes from ZooKeeper... (1) -> (2)
   [junit4]   2> 2054082 INFO  (TEST-OverseerTest.testShardLeaderChange-seed#[95FF74B2CEEB6666]) [    ] o.a.s.c.ShardLeaderElectionContextBase make sure parent is created /collections/collection1/leaders/shard1
   [junit4]   2> 2054099 INFO  (zkCallback-3993-thread-1) [    ] o.a.s.c.c.ZkStateReader Updated live nodes from ZooKeeper... (2) -> (1)
   [junit4]   2> 2054105 INFO  (zkConnectionManagerCallback-4000-thread-1) [    ] o.a.s.c.c.ConnectionManager zkClient has connected
   [junit4]   2> 2054105 INFO  (Thread-5488) [    ] o.a.s.c.Overseer Overseer (id=74306098037260305-127.0.0.1:36057_solr-n_0000000000) closing
   [junit4]   2> 2054117 INFO  (zkCallback-3788-thread-2) [    ] o.a.s.c.c.ZkStateReader Updated live nodes from ZooKeeper... (2) -> (1)
   [junit4]   2> 2054117 INFO  (zkCallback-3953-thread-2) [    ] o.a.s.c.c.ZkStateReader Updated live nodes from ZooKeeper... (2) -> (1)
   [junit4]   2> 2054117 INFO  (zkCallback-3982-thread-1) [    ] o.a.s.c.c.ZkStateReader Updated live nodes from ZooKeeper... (2) -> (1)
   [junit4]   2> 2054117 INFO  (zkCallback-3901-thread-2) [    ] o.a.s.c.c.ZkStateReader Updated live nodes from ZooKeeper... (2) -> (1)
   [junit4]   2> 2054117 INFO  (zkCallback-3935-thread-1) [    ] o.a.s.c.c.ZkStateReader Updated live nodes from ZooKeeper... (2) -> (1)
   [junit4]   2> 2054117 INFO  (zkCallback-3964-thread-1) [    ] o.a.s.c.c.ZkStateReader Updated live nodes from ZooKeeper... (2) -> (1)
   [junit4]   2> 2054118 INFO  (zkCallback-3906-thread-2) [    ] o.a.s.c.c.ZkStateReader Updated live nodes from ZooKeeper... (2) -> (1)
   [junit4]   2> 2054118 INFO  (zkCallback-3924-thread-1) [    ] o.a.s.c.c.ZkStateReader Updated live nodes from ZooKeeper... (2) -> (1)
   [junit4]   2> 2054121 INFO  (zkCallback-3995-thread-2) [    ] o.a.s.c.c.ZkStateReader Updated live nodes from ZooKeeper... (2) -> (1)
   [junit4]   2> 2054129 INFO  (zkCallback-3885-thread-1) [    ] o.a.s.c.c.ZkStateReader Updated live nodes from ZooKeeper... (2) -> (1)
   [junit4]   2> 2054137 INFO  (zkCallback-3995-thread-1) [    ] o.a.s.c.ShardLeaderElectionContextBase Creating leader registration node /collections/collection1/leaders/shard1/leader after winning as /collections/collection1/leader_elect/shard1/election/74306098037260332-node1_core1-n_0000000013
   [junit4]   2> 2054143 WARN  (Thread-5488) [    ] o.e.j.u.s.S.config No Client EndPointIdentificationAlgorithm configured for SslContextFactory@2b462e73[provider=null,keyStore=null,trustStore=null]
   [junit4]   2> 2054184 INFO  (zkConnectionManagerCallback-4007-thread-1) [    ] o.a.s.c.c.ConnectionManager zkClient has connected
   [junit4]   2> 2054231 INFO  (zkConnectionManagerCallback-4012-thread-1) [    ] o.a.s.c.c.ConnectionManager zkClient has connected
   [junit4]   2> 2054233 INFO  (Thread-5488) [    ] o.a.s.c.c.ZkStateReader Updated live nodes from ZooKeeper... (0) -> (1)
   [junit4]   2> 2054234 INFO  (Thread-5488) [    ] o.a.s.c.s.i.ZkClientClusterStateProvider Cluster at 127.0.0.1:36057/solr ready
   [junit4]   2> 2054311 INFO  (TEST-OverseerTest.testShardLeaderChange-seed#[95FF74B2CEEB6666]) [    ] o.a.s.c.ShardLeaderElectionContextBase make sure parent is created /collections/collection1/leaders/shard1
   [junit4]   2> 2054322 INFO  (TEST-OverseerTest.testShardLeaderChange-seed#[95FF74B2CEEB6666]) [    ] o.a.s.c.ShardLeaderElectionContextBase Creating leader registration node /collections/collection1/leaders/shard1/leader after winning as /collections/collection1/leader_elect/shard1/election/74306098037260332-node1_core1-n_0000000014
   [junit4]   2> 2054372 INFO  (zkConnectionManagerCallback-4014-thread-1) [    ] o.a.s.c.c.ConnectionManager zkClient has connected
   [junit4]   2> 2054382 INFO  (TEST-OverseerTest.testShardLeaderChange-seed#[95FF74B2CEEB6666]) [    ] o.a.s.c.c.ZkStateReader Updated live nodes from ZooKeeper... (0) -> (1)
   [junit4]   2> 2054398 INFO  (zkCallback-4011-thread-1) [    ] o.a.s.c.c.ZkStateReader Updated live nodes from ZooKeeper... (1) -> (2)
   [junit4]   2> 2054398 INFO  (zkCallback-3993-thread-1) [    ] o.a.s.c.c.ZkStateReader Updated live nodes from ZooKeeper... (1) -> (2)
   [junit4]   2> 2054409 INFO  (zkCallback-3906-thread-2) [    ] o.a.s.c.c.ZkStateReader Updated live nodes from ZooKeeper... (1) -> (2)
   [junit4]   2> 2054409 INFO  (zkCallback-3953-thread-2) [    ] o.a.s.c.c.ZkStateReader Updated live nodes from ZooKeeper... (1) -> (2)
   [junit4]   2> 2054409 INFO  (zkCallback-3964-thread-1) [    ] o.a.s.c.c.ZkStateReader Updated live nodes from ZooKeeper... (1) -> (2)
   [junit4]   2> 2054417 INFO  (zkCallback-4013-thread-1) [    ] o.a.s.c.c.ZkStateReader Updated live nodes from ZooKeeper... (1) -> (2)
   [junit4]   2> 2054429 INFO  (zkCallback-3885-thread-1) [    ] o.a.s.c.c.ZkStateReader Updated live nodes from ZooKeeper... (1) -> (2)
   [junit4]   2> 2054429 INFO  (zkCallback-3924-thread-1) [    ] o.a.s.c.c.ZkStateReader Updated live nodes from ZooKeeper... (1) -> (2)
   [junit4]   2> 2054429 INFO  (zkCallback-3982-thread-1) [    ] o.a.s.c.c.ZkStateReader Updated live nodes from ZooKeeper... (1) -> (2)
   [junit4]   2> 2054429 INFO  (zkCallback-3935-thread-1) [    ] o.a.s.c.c.ZkStateReader Updated live nodes from ZooKeeper... (1) -> (2)
   [junit4]   2> 2054429 INFO  (zkCallback-3788-thread-2) [    ] o.a.s.c.c.ZkStateReader Updated live nodes from ZooKeeper... (1) -> (2)
   [junit4]   2> 2054429 INFO  (zkCallback-3901-thread-2) [    ] o.a.s.c.c.ZkStateReader Updated live nodes from ZooKeeper... (1) -> (2)
   [junit4]   2> 2054453 INFO  (zkCallback-3995-thread-1) [    ] o.a.s.c.c.ZkStateReader Updated live nodes from ZooKeeper... (1) -> (2)
   [junit4]   2> 2054455 INFO  (TEST-OverseerTest.testShardLeaderChange-seed#[95FF74B2CEEB6666]) [    ] o.a.s.c.ShardLeaderElectionContextBase make sure parent is created /collections/collection1/leaders/shard1
   [junit4]   2> 2054456 INFO  (TEST-OverseerTest.testShardLeaderChange-seed#[95FF74B2CEEB6666]) [    ] o.a.s.c.ShardLeaderElectionContextBase Creating leader registration node /collections/collection1/leaders/shard1/leader after winning as /collections/collection1/leader_elect/shard1/election/74306098037260332-node1_core1-n_0000000015
   [junit4]   2> 2054508 INFO  (TEST-OverseerTest.testShardLeaderChange-seed#[95FF74B2CEEB6666]) [    ] o.a.s.c.ShardLeaderElectionContextBase make sure parent is created /collections/collection1/leaders/shard1
   [junit4]   2> 2054509 INFO  (zkCallback-4013-thread-1) [    ] o.a.s.c.ShardLeaderElectionContextBase Creating leader registration node /collections/collection1/leaders/shard1/leader after winning as /collections/collection1/leader_elect/shard1/election/74306098037260336-node2_core4-n_0000000016
   [junit4]   2> 2054526 INFO  (zkCallback-3788-thread-2) [    ] o.a.s.c.c.ZkStateReader Updated live nodes from ZooKeeper... (2) -> (1)
   [junit4]   2> 2054526 INFO  (zkCallback-3993-thread-1) [    ] o.a.s.c.c.ZkStateReader Updated live nodes from ZooKeeper... (2) -> (1)
   [junit4]   2> 2054526 INFO  (zkCallback-3995-thread-1) [    ] o.a.s.c.c.ZkStateReader Updated live nodes from ZooKeeper... (2) -> (1)
   [junit4]   2> 2054539 INFO  (zkCallback-3885-thread-1) [    ] o.a.s.c.c.ZkStateReader Updated live nodes from ZooKeeper... (2) -> (1)
   [junit4]   2> 2054539 INFO  (zkCallback-3901-thread-2) [    ] o.a.s.c.c.ZkStateReader Updated live nodes from ZooKeeper... (2) -> (1)
   [junit4]   2> 2054539 INFO  (zkCallback-3964-thread-1) [    ] o.a.s.c.c.ZkStateReader Updated live nodes from ZooKeeper... (2) -> (1)
   [junit4]   2> 2054539 INFO  (zkCallback-3982-thread-1) [    ] o.a.s.c.c.ZkStateReader Updated live nodes from ZooKeeper... (2) -> (1)
   [junit4]   2> 2054539 INFO  (zkCallback-3953-thread-2) [    ] o.a.s.c.c.ZkStateReader Updated live nodes from ZooKeeper... (2) -> (1)
   [junit4]   2> 2054539 INFO  (zkCallback-3924-thread-1) [    ] o.a.s.c.c.ZkStateReader Updated live nodes from ZooKeeper... (2) -> (1)
   [junit4]   2> 2054539 INFO  (zkCallback-3935-thread-1) [    ] o.a.s.c.c.ZkStateReader Updated live nodes from ZooKeeper... (2) -> (1)
   [junit4]   2> 2054539 INFO  (zkCallback-3906-thread-2) [    ] o.a.s.c.c.ZkStateReader Updated live nodes from ZooKeeper... (2) -> (1)
   [junit4]   2> 2054543 INFO  (zkCallback-4011-thread-1) [    ] o.a.s.c.c.ZkStateReader Updated live nodes from ZooKeeper... (2) -> (1)
   [junit4]   2> 2054543 INFO  (zkCallback-4013-thread-2) [    ] o.a.s.c.c.ZkStateReader Updated live nodes from ZooKeeper... (2) -> (1)
   [junit4]   2> 2054575 INFO  (zkConnectionManagerCallback-4018-thread-1) [    ] o.a.s.c.c.ConnectionManager zkClient has connected
   [junit4]   2> 2054636 INFO  (zkConnectionManagerCallback-4023-thread-1) [    ] o.a.s.c.c.ConnectionManager zkClient has connected
   [junit4]   2> 2054744 INFO  (TEST-OverseerTest.testShardLeaderChange-seed#[95FF74B2CEEB6666]) [    ] o.a.s.c.c.ZkStateReader Updated live nodes from ZooKeeper... (0) -> (1)
   [junit4]   2> 2054794 INFO  (TEST-OverseerTest.testShardLeaderChange-seed#[95FF74B2CEEB6666]) [    ] o.a.s.c.s.i.ZkClientClusterStateProvider Cluster at 127.0.0.1:36057/solr ready
   [junit4]   2> 2054808 INFO  (zkConnectionManagerCallback-4025-thread-1) [    ] o.a.s.c.c.ConnectionManager zkClient has connected
   [junit4]   2> 2054823 INFO  (TEST-OverseerTest.testShardLeaderChange-seed#[95FF74B2CEEB6666]) [    ] o.a.s.c.c.ZkStateReader Updated live nodes from ZooKeeper... (0) -> (1)
   [junit4]   2> 2054825 INFO  (zkCallback-3993-thread-1) [    ] o.a.s.c.c.ZkStateReader Updated live nodes from ZooKeeper... (1) -> (2)
   [junit4]   2> 2054826 INFO  (zkCallback-4024-thread-1) [    ] o.a.s.c.c.ZkStateReader Updated live nodes from ZooKeeper... (1) -> (2)
   [junit4]   2> 2054826 INFO  (zkCallback-4022-thread-1) [    ] o.a.s.c.c.ZkStateReader Updated live nodes from ZooKeeper... (1) -> (2)
   [junit4]   2> 2054834 INFO  (zkCallback-4013-thread-1) [    ] o.a.s.c.c.ZkStateReader Updated live nodes from ZooKeeper... (1) -> (2)
   [junit4]   2> 2054835 INFO  (zkCallback-3788-thread-2) [    ] o.a.s.c.c.ZkStateReader Updated live nodes from ZooKeeper... (1) -> (2)
   [junit4]   2> 2054835 INFO  (zkCallback-4011-thread-1) [    ] o.a.s.c.c.ZkStateReader Updated live nodes from ZooKeeper... (1) -> (2)
   [junit4]   2> 2054841 INFO  (Thread-5488) [    ] o.a.s.c.OverseerTest Killing overseer.
   [junit4]   2> 2054871 INFO  (zkCallback-3885-thread-2) [    ] o.a.s.c.c.ZkStateReader Updated live nodes from ZooKeeper... (1) -> (2)
   [junit4]   2> 2054872 INFO  (TEST-OverseerTest.testShardLeaderChange-seed#[95FF74B2CEEB6666]) [    ] o.a.s.c.ShardLeaderElectionContextBase make sure parent is created /collections/collection1/leaders/shard1
   [junit4]   2> 2054874 INFO  (zkCallback-4011-thread-1) [    ] o.a.s.c.c.ZkStateReader Updated live nodes from ZooKeeper... (2) -> (1)
   [junit4]   2> 2054874 INFO  (zkCallback-3885-thread-2) [    ] o.a.s.c.c.ZkStateReader Updated live nodes from ZooKeeper... (2) -> (1)
   [junit4]   2> 2054874 INFO  (zkCallback-3993-thread-1) [    ] o.a.s.c.c.ZkStateReader Updated live nodes from ZooKeeper... (2) -> (1)
   [junit4]   2> 2054874 INFO  (zkCallback-4013-thread-1) [    ] o.a.s.c.c.ZkStateReader Updated live nodes from ZooKeeper... (2) -> (1)
   [junit4]   2> 2054879 INFO  (zkCallback-3953-thread-2) [    ] o.a.s.c.c.ZkStateReader Updated live nodes from ZooKeeper... (1) -> (2)
   [junit4]   2> 2054879 INFO  (zkCallback-3901-thread-2) [    ] o.a.s.c.c.ZkStateReader Updated live nodes from ZooKeeper... (1) -> (2)
   [junit4]   2> 2054879 INFO  (zkCallback-3906-thread-2) [    ] o.a.s.c.c.ZkStateReader Updated live nodes from ZooKeeper... (1) -> (2)
   [junit4]   2> 2054879 INFO  (zkCallback-3982-thread-1) [    ] o.a.s.c.c.ZkStateReader Updated live nodes from ZooKeeper... (1) -> (2)
   [junit4]   2> 2054879 INFO  (zkCallback-3924-thread-1) [    ] o.a.s.c.c.ZkStateReader Updated live nodes from ZooKeeper... (1) -> (2)
   [junit4]   2> 2054879 INFO  (zkCallback-3964-thread-1) [    ] o.a.s.c.c.ZkStateReader Updated live nodes from ZooKeeper... (1) -> (2)
   [junit4]   2> 2054879 INFO  (zkCallback-3935-thread-1) [    ] o.a.s.c.c.ZkStateReader Updated live nodes from ZooKeeper... (1) -> (2)
   [junit4]   2> 2054891 INFO  (zkCallback-3964-thread-1) [    ] o.a.s.c.c.ZkStateReader Updated live nodes from ZooKeeper... (2) -> (1)
   [junit4]   2> 2054891 INFO  (zkCallback-3906-thread-2) [    ] o.a.s.c.c.ZkStateReader Updated live nodes from ZooKeeper... (2) -> (1)
   [junit4]   2> 2054896 INFO  (zkCallback-3924-thread-1) [    ] o.a.s.c.c.ZkStateReader Updated live nodes from ZooKeeper... (2) -> (1)
   [junit4]   2> 2054896 INFO  (zkCallback-3935-thread-1) [    ] o.a.s.c.c.ZkStateReader Updated live nodes from ZooKeeper... (2) -> (1)
   [junit4]   2> 2054896 INFO  (zkCallback-3901-thread-2) [    ] o.a.s.c.c.ZkStateReader Updated live nodes from ZooKeeper... (2) -> (1)
   [junit4]   2> 2054896 INFO  (zkCallback-3953-thread-2) [    ] o.a.s.c.c.ZkStateReader Updated live nodes from ZooKeeper... (2) -> (1)
   [junit4]   2> 2054896 INFO  (zkCallback-3982-thread-1) [    ] o.a.s.c.c.ZkStateReader Updated live nodes from ZooKeeper... (2) -> (1)
   [junit4]   2> 2054915 WARN  (OverseerStateUpdate-74306098037260306-127.0.0.1:36057_solr-n_0000000001) [    ] o.a.s.c.o.ClusterStateMutator Collection collection1 already exists. exit
   [junit4]   2> 2054927 INFO  (zkCallback-3788-thread-2) [    ] o.a.s.c.c.ZkStateReader Updated live nodes from ZooKeeper... (2) -> (1)
   [junit4]   2> 2054928 INFO  (zkConnectionManagerCallback-4029-thread-1) [    ] o.a.s.c.c.ConnectionManager zkClient has connected
   [junit4]   2> 2054928 INFO  (Thread-5488) [    ] o.a.s.c.Overseer Overseer (id=74306098037260305-127.0.0.1:36057_solr-n_0000000000) closing
   [junit4]   2> 2054940 INFO  (zkCallback-4022-thread-1) [    ] o.a.s.c.c.ZkStateReader Updated live nodes from ZooKeeper... (2) -> (1)
   [junit4]   2> 2054944 INFO  (zkCallback-4024-thread-2) [    ] o.a.s.c.c.ZkStateReader Updated live nodes from ZooKeeper... (2) -> (1)
   [junit4]   2> 2054956 INFO  (zkCallback-4024-thread-1) [    ] o.a.s.c.ShardLeaderElectionContextBase Creating leader registration node /collections/collection1/leaders/shard1/leader after winning as /collections/collection1/leader_elect/shard1/election/74306098037260339-node1_core1-n_0000000017
   [junit4]   2> 2055078 WARN  (Thread-5488) [    ] o.e.j.u.s.S.config No Client EndPointIdentificationAlgorithm configured for SslContextFactory@1996af38[provider=null,keyStore=null,trustStore=null]
   [junit4]   2> 2055110 INFO  (zkConnectionManagerCallback-4036-thread-1) [    ] o.a.s.c.c.ConnectionManager zkClient has connected
   [junit4]   2> 2055150 INFO  (zkConnectionManagerCallback-4041-thread-1) [    ] o.a.s.c.c.ConnectionManager zkClient has connected
   [junit4]   2> 2055151 INFO  (Thread-5488) [    ] o.a.s.c.c.ZkStateReader Updated live nodes from ZooKeeper... (0) -> (1)
   [junit4]   2> 2055152 INFO  (Thread-5488) [    ] o.a.s.c.s.i.ZkClientClusterStateProvider Cluster at 127.0.0.1:36057/solr ready
   [junit4]   2> 2055245 INFO  (TEST-OverseerTest.testShardLeaderChange-seed#[95FF74B2CEEB6666]) [    ] o.a.s.c.ShardLeaderElectionContextBase make sure parent is created /collections/collection1/leaders/shard1
   [junit4]   2> 2055246 INFO  (TEST-OverseerTest.testShardLeaderChange-seed#[95FF74B2CEEB6666]) [    ] o.a.s.c.ShardLeaderElectionContextBase Creating leader registration node /collections/collection1/leaders/shard1/leader after winning as /collections/collection1/leader_elect/shard1/election/74306098037260339-node1_core1-n_0000000018
   [junit4]   2> 2055298 INFO  (zkConnectionManagerCallback-4043-thread-1) [    ] o.a.s.c.c.ConnectionManager zkClient has connected
   [junit4]   2> 2055448 INFO  (TEST-OverseerTest.testShardLeaderChange-seed#[95FF74B2CEEB6666]) [    ] o.a.s.c.c.ZkStateReader Updated live nodes from ZooKeeper... (0) -> (1)
   [junit4]   2> 2055462 INFO  (zkCallback-3788-thread-2) [    ] o.a.s.c.c.ZkStateReader Updated live nodes from ZooKeeper... (1) -> (2)
   [junit4]   2> 2055462 INFO  (zkCallback-4024-thread-2) [    ] o.a.s.c.c.ZkStateReader Updated live nodes from ZooKeeper... (1) -> (2)
   [junit4]   2> 2055463 INFO  (zkCallback-3993-thread-1) [    ] o.a.s.c.c.ZkStateReader Updated live nodes from ZooKeeper... (1) -> (2)
   [junit4]   2> 2055463 INFO  (zkCallback-3964-thread-1) [    ] o.a.s.c.c.ZkStateReader Updated live nodes from ZooKeeper... (1) -> (2)
   [junit4]   2> 2055463 INFO  (zkCallback-4011-thread-1) [    ] o.a.s.c.c.ZkStateReader Updated live nodes from ZooKeeper... (1) -> (2)
   [junit4]   2> 2055463 INFO  (zkCallback-3885-thread-2) [    ] o.a.s.c.c.ZkStateReader Updated live nodes from ZooKeeper... (1) -> (2)
   [junit4]   2> 2055463 INFO  (zkCallback-3906-thread-2) [    ] o.a.s.c.c.ZkStateReader Updated live nodes from ZooKeeper... (1) -> (2)
   [junit4]   2> 2055466 INFO  (TEST-OverseerTest.testShardLeaderChange-seed#[95FF74B2CEEB6666]) [    ] o.a.s.c.ShardLeaderElectionContextBase make sure parent is created /collections/collection1/leaders/shard1
   [junit4]   2> 2055479 INFO  (zkCallback-3924-thread-1) [    ] o.a.s.c.c.ZkStateReader Updated live nodes from ZooKeeper... (1) -> (2)
   [junit4]   2> 2055479 INFO  (zkCallback-3901-thread-2) [    ] o.a.s.c.c.ZkStateReader Updated live nodes from ZooKeeper... (1) -> (2)
   [junit4]   2> 2055479 INFO  (zkCallback-3982-thread-1) [    ] o.a.s.c.c.ZkStateReader Updated live nodes from ZooKeeper... (1) -> (2)
   [junit4]   2> 2055479 INFO  (zkCallback-3935-thread-1) [    ] o.a.s.c.c.ZkStateReader Updated live nodes from ZooKeeper... (1) -> (2)
   [junit4]   2> 2055479 INFO  (zkCallback-3953-thread-2) [    ] o.a.s.c.c.ZkStateReader Updated live nodes from ZooKeeper... (1) -> (2)
   [junit4]   2> 2055495 INFO  (zkCallback-4040-thread-1) [    ] o.a.s.c.c.ZkStateReader Updated live nodes from ZooKeeper... (1) -> (2)
   [junit4]   2> 2055507 INFO  (zkCallback-4042-thread-1) [    ] o.a.s.c.c.ZkStateReader Updated live nodes from ZooKeeper... (1) -> (2)
   [junit4]   2> 2055519 INFO  (zkCallback-4022-thread-1) [    ] o.a.s.c.c.ZkStateReader Updated live nodes from ZooKeeper... (1) -> (2)
   [junit4]   2> 2055520 INFO  (TEST-OverseerTest.testShardLeaderChange-seed#[95FF74B2CEEB6666]) [    ] o.a.s.c.ShardLeaderElectionContextBase Creating leader registration node /collections/collection1/leaders/shard1/leader after winning as /collections/collection1/leader_elect/shard1/election/74306098037260339-node1_core1-n_0000000019
   [junit4]   2> 2055701 INFO  (TEST-OverseerTest.testShardLeaderChange-seed#[95FF74B2CEEB6666]) [    ] o.a.s.c.ShardLeaderElectionContextBase make sure parent is created /collections/collection1/leaders/shard1
   [junit4]   2> 2055792 INFO  (zkCallback-3993-thread-1) [    ] o.a.s.c.c.ZkStateReader Updated live nodes from ZooKeeper... (2) -> (1)
   [junit4]   2> 2055793 INFO  (zkCallback-4022-thread-1) [    ] o.a.s.c.c.ZkStateReader Updated live nodes from ZooKeeper... (2) -> (1)
   [junit4]   2> 2055793 INFO  (zkCallback-4040-thread-1) [    ] o.a.s.c.c.ZkStateReader Updated live nodes from ZooKeeper... (2) -> (1)
   [junit4]   2> 2055793 INFO  (zkCallback-3788-thread-2) [    ] o.a.s.c.c.ZkStateReader Updated live nodes from ZooKeeper... (2) -> (1)
   [junit4]   2> 2055793 INFO  (zkCallback-3964-thread-1) [    ] o.a.s.c.c.ZkStateReader Updated live nodes from ZooKeeper... (2) -> (1)
   [junit4]   2> 2055793 INFO  (zkCallback-3906-thread-2) [    ] o.a.s.c.c.ZkStateReader Updated live nodes from ZooKeeper... (2) -> (1)
   [junit4]   2> 2055793 INFO  (zkCallback-4011-thread-1) [    ] o.a.s.c.c.ZkStateReader Updated live nodes from ZooKeeper... (2) -> (1)
   [junit4]   2> 2055793 INFO  (zkCallback-3885-thread-2) [    ] o.a.s.c.c.ZkStateReader Updated live nodes from ZooKeeper... (2) -> (1)
   [junit4]   2> 2055793 INFO  (zkCallback-4024-thread-2) [    ] o.a.s.c.c.ZkStateReader Updated live nodes from ZooKeeper... (2) -> (1)
   [junit4]   2> 2055812 INFO  (zkCallback-3901-thread-2) [    ] o.a.s.c.c.ZkStateReader Updated live nodes from ZooKeeper... (2) -> (1)
   [junit4]   2> 2055812 INFO  (zkCallback-3982-thread-1) [    ] o.a.s.c.c.ZkStateReader Updated live nodes from ZooKeeper... (2) -> (1)
   [junit4]   2> 2055812 INFO  (zkCallback-3935-thread-1) [    ] o.a.s.c.c.ZkStateReader Updated live nodes from ZooKeeper... (2) -> (1)
   [junit4]   2> 2055812 INFO  (zkCallback-3924-thread-1) [    ] o.a.s.c.c.ZkStateReader Updated live nodes from ZooKeep

[...truncated too long message...]

BadApples-Tests-8.x/lucene/top-level-ivy-settings.xml

resolve:

ivy-availability-check:
[loadresource] Do not set property disallowed.ivy.jars.list as its length is 0.

-ivy-fail-disallowed-ivy-version:

ivy-fail:

ivy-configure:
[ivy:configure] :: loading settings :: file = /home/jenkins/jenkins-slave/workspace/Lucene-Solr-BadApples-Tests-8.x/lucene/top-level-ivy-settings.xml

resolve:

ivy-availability-check:
[loadresource] Do not set property disallowed.ivy.jars.list as its length is 0.

-ivy-fail-disallowed-ivy-version:

ivy-fail:

ivy-fail:

ivy-configure:
[ivy:configure] :: loading settings :: file = /home/jenkins/jenkins-slave/workspace/Lucene-Solr-BadApples-Tests-8.x/lucene/top-level-ivy-settings.xml

resolve:

ivy-availability-check:
[loadresource] Do not set property disallowed.ivy.jars.list as its length is 0.

-ivy-fail-disallowed-ivy-version:

ivy-fail:

ivy-configure:
[ivy:configure] :: loading settings :: file = /home/jenkins/jenkins-slave/workspace/Lucene-Solr-BadApples-Tests-8.x/lucene/top-level-ivy-settings.xml

resolve:

ivy-availability-check:
[loadresource] Do not set property disallowed.ivy.jars.list as its length is 0.

-ivy-fail-disallowed-ivy-version:

ivy-fail:

ivy-fail:

ivy-configure:
[ivy:configure] :: loading settings :: file = /home/jenkins/jenkins-slave/workspace/Lucene-Solr-BadApples-Tests-8.x/lucene/top-level-ivy-settings.xml

resolve:

ivy-availability-check:
[loadresource] Do not set property disallowed.ivy.jars.list as its length is 0.

-ivy-fail-disallowed-ivy-version:

ivy-fail:

ivy-fail:

ivy-configure:
[ivy:configure] :: loading settings :: file = /home/jenkins/jenkins-slave/workspace/Lucene-Solr-BadApples-Tests-8.x/lucene/top-level-ivy-settings.xml

resolve:

ivy-availability-check:
[loadresource] Do not set property disallowed.ivy.jars.list as its length is 0.

-ivy-fail-disallowed-ivy-version:

ivy-fail:

ivy-fail:

ivy-configure:
[ivy:configure] :: loading settings :: file = /home/jenkins/jenkins-slave/workspace/Lucene-Solr-BadApples-Tests-8.x/lucene/top-level-ivy-settings.xml

resolve:

ivy-availability-check:
[loadresource] Do not set property disallowed.ivy.jars.list as its length is 0.

-ivy-fail-disallowed-ivy-version:

ivy-fail:

ivy-fail:

ivy-configure:
[ivy:configure] :: loading settings :: file = /home/jenkins/jenkins-slave/workspace/Lucene-Solr-BadApples-Tests-8.x/lucene/top-level-ivy-settings.xml

resolve:

ivy-availability-check:
[loadresource] Do not set property disallowed.ivy.jars.list as its length is 0.

-ivy-fail-disallowed-ivy-version:

ivy-fail:

ivy-fail:

ivy-configure:
[ivy:configure] :: loading settings :: file = /home/jenkins/jenkins-slave/workspace/Lucene-Solr-BadApples-Tests-8.x/lucene/top-level-ivy-settings.xml

resolve:

ivy-availability-check:
[loadresource] Do not set property disallowed.ivy.jars.list as its length is 0.

-ivy-fail-disallowed-ivy-version:

ivy-fail:

ivy-fail:

ivy-configure:
[ivy:configure] :: loading settings :: file = /home/jenkins/jenkins-slave/workspace/Lucene-Solr-BadApples-Tests-8.x/lucene/top-level-ivy-settings.xml

resolve:

ivy-availability-check:
[loadresource] Do not set property disallowed.ivy.jars.list as its length is 0.

-ivy-fail-disallowed-ivy-version:

ivy-fail:

ivy-fail:

ivy-configure:
[ivy:configure] :: loading settings :: file = /home/jenkins/jenkins-slave/workspace/Lucene-Solr-BadApples-Tests-8.x/lucene/top-level-ivy-settings.xml

resolve:

ivy-availability-check:
[loadresource] Do not set property disallowed.ivy.jars.list as its length is 0.

-ivy-fail-disallowed-ivy-version:

ivy-fail:

ivy-fail:

ivy-configure:
[ivy:configure] :: loading settings :: file = /home/jenkins/jenkins-slave/workspace/Lucene-Solr-BadApples-Tests-8.x/lucene/top-level-ivy-settings.xml

resolve:

ivy-availability-check:
[loadresource] Do not set property disallowed.ivy.jars.list as its length is 0.

-ivy-fail-disallowed-ivy-version:

ivy-fail:

ivy-fail:

ivy-configure:
[ivy:configure] :: loading settings :: file = /home/jenkins/jenkins-slave/workspace/Lucene-Solr-BadApples-Tests-8.x/lucene/top-level-ivy-settings.xml

resolve:

ivy-availability-check:
[loadresource] Do not set property disallowed.ivy.jars.list as its length is 0.

-ivy-fail-disallowed-ivy-version:

ivy-fail:

ivy-fail:

ivy-configure:
[ivy:configure] :: loading settings :: file = /home/jenkins/jenkins-slave/workspace/Lucene-Solr-BadApples-Tests-8.x/lucene/top-level-ivy-settings.xml

resolve:

jar-checksums:
    [mkdir] Created dir: /home/jenkins/jenkins-slave/workspace/Lucene-Solr-BadApples-Tests-8.x/solr/null716810307
     [copy] Copying 239 files to /home/jenkins/jenkins-slave/workspace/Lucene-Solr-BadApples-Tests-8.x/solr/null716810307
   [delete] Deleting directory /home/jenkins/jenkins-slave/workspace/Lucene-Solr-BadApples-Tests-8.x/solr/null716810307

check-working-copy:
[ivy:cachepath] :: resolving dependencies :: org.eclipse.jgit#org.eclipse.jgit-caller;working
[ivy:cachepath] confs: [default]
[ivy:cachepath] found org.eclipse.jgit#org.eclipse.jgit;4.6.0.201612231935-r in public
[ivy:cachepath] found com.jcraft#jsch;0.1.53 in public
[ivy:cachepath] found com.googlecode.javaewah#JavaEWAH;1.1.6 in public
[ivy:cachepath] found org.apache.httpcomponents#httpclient;4.3.6 in public
[ivy:cachepath] found org.apache.httpcomponents#httpcore;4.3.3 in public
[ivy:cachepath] found commons-logging#commons-logging;1.1.3 in public
[ivy:cachepath] found commons-codec#commons-codec;1.6 in public
[ivy:cachepath] found org.slf4j#slf4j-api;1.7.2 in public
[ivy:cachepath] :: resolution report :: resolve 93ms :: artifacts dl 1ms
        ---------------------------------------------------------------------
        |                  |            modules            ||   artifacts   |
        |       conf       | number| search|dwnlded|evicted|| number|dwnlded|
        ---------------------------------------------------------------------
        |      default     |   8   |   0   |   0   |   0   ||   8   |   0   |
        ---------------------------------------------------------------------
[wc-checker] Initializing working copy...
[wc-checker] SLF4J: Failed to load class "org.slf4j.impl.StaticLoggerBinder".
[wc-checker] SLF4J: Defaulting to no-operation (NOP) logger implementation
[wc-checker] SLF4J: See http://www.slf4j.org/codes.html#StaticLoggerBinder for further details.
[wc-checker] Checking working copy status...

-jenkins-base:

BUILD SUCCESSFUL
Total time: 303 minutes 32 seconds
Archiving artifacts
java.lang.InterruptedException: no matches found within 10000
        at hudson.FilePath$ValidateAntFileMask.hasMatch(FilePath.java:2847)
        at hudson.FilePath$ValidateAntFileMask.invoke(FilePath.java:2726)
        at hudson.FilePath$ValidateAntFileMask.invoke(FilePath.java:2707)
        at hudson.FilePath$FileCallableWrapper.call(FilePath.java:3086)
Also:   hudson.remoting.Channel$CallSiteStackTrace: Remote call to lucene2
                at hudson.remoting.Channel.attachCallSiteStackTrace(Channel.java:1741)
                at hudson.remoting.UserRequest$ExceptionResponse.retrieve(UserRequest.java:357)
                at hudson.remoting.Channel.call(Channel.java:955)
                at hudson.FilePath.act(FilePath.java:1072)
                at hudson.FilePath.act(FilePath.java:1061)
                at hudson.FilePath.validateAntFileMask(FilePath.java:2705)
                at hudson.tasks.ArtifactArchiver.perform(ArtifactArchiver.java:243)
                at hudson.tasks.BuildStepCompatibilityLayer.perform(BuildStepCompatibilityLayer.java:81)
                at hudson.tasks.BuildStepMonitor$1.perform(BuildStepMonitor.java:20)
                at hudson.model.AbstractBuild$AbstractBuildExecution.perform(AbstractBuild.java:744)
                at hudson.model.AbstractBuild$AbstractBuildExecution.performAllBuildSteps(AbstractBuild.java:690)
                at hudson.model.Build$BuildExecution.post2(Build.java:186)
                at hudson.model.AbstractBuild$AbstractBuildExecution.post(AbstractBuild.java:635)
                at hudson.model.Run.execute(Run.java:1835)
                at hudson.model.FreeStyleBuild.run(FreeStyleBuild.java:43)
                at hudson.model.ResourceController.execute(ResourceController.java:97)
                at hudson.model.Executor.run(Executor.java:429)
Caused: hudson.FilePath$TunneledInterruptedException
        at hudson.FilePath$FileCallableWrapper.call(FilePath.java:3088)
        at hudson.remoting.UserRequest.perform(UserRequest.java:212)
        at hudson.remoting.UserRequest.perform(UserRequest.java:54)
        at hudson.remoting.Request$2.run(Request.java:369)
        at hudson.remoting.InterceptingExecutorService$1.call(InterceptingExecutorService.java:72)
        at java.util.concurrent.FutureTask.run(FutureTask.java:266)
        at java.util.concurrent.ThreadPoolExecutor.runWorker(ThreadPoolExecutor.java:1142)
        at java.util.concurrent.ThreadPoolExecutor$Worker.run(ThreadPoolExecutor.java:617)
        at java.lang.Thread.run(Thread.java:748)
Caused: java.lang.InterruptedException: java.lang.InterruptedException: no matches found within 10000
        at hudson.FilePath.act(FilePath.java:1074)
        at hudson.FilePath.act(FilePath.java:1061)
        at hudson.FilePath.validateAntFileMask(FilePath.java:2705)
        at hudson.tasks.ArtifactArchiver.perform(ArtifactArchiver.java:243)
        at hudson.tasks.BuildStepCompatibilityLayer.perform(BuildStepCompatibilityLayer.java:81)
        at hudson.tasks.BuildStepMonitor$1.perform(BuildStepMonitor.java:20)
        at hudson.model.AbstractBuild$AbstractBuildExecution.perform(AbstractBuild.java:744)
        at hudson.model.AbstractBuild$AbstractBuildExecution.performAllBuildSteps(AbstractBuild.java:690)
        at hudson.model.Build$BuildExecution.post2(Build.java:186)
        at hudson.model.AbstractBuild$AbstractBuildExecution.post(AbstractBuild.java:635)
        at hudson.model.Run.execute(Run.java:1835)
        at hudson.model.FreeStyleBuild.run(FreeStyleBuild.java:43)
        at hudson.model.ResourceController.execute(ResourceController.java:97)
        at hudson.model.Executor.run(Executor.java:429)
No artifacts found that match the file pattern "**/*.events,heapdumps/**,**/hs_err_pid*". Configuration error?
Recording test results
Build step 'Publish JUnit test result report' changed build result to UNSTABLE
Email was triggered for: Unstable (Test Failures)
Sending email for trigger: Unstable (Test Failures)


---------------------------------------------------------------------
To unsubscribe, e-mail: [hidden email]
For additional commands, e-mail: [hidden email]