[JENKINS] Lucene-Solr-BadApples-Tests-master - Build # 281 - Unstable

classic Classic list List threaded Threaded
1 message Options
Reply | Threaded
Open this post in threaded view
|

[JENKINS] Lucene-Solr-BadApples-Tests-master - Build # 281 - Unstable

Apache Jenkins Server-2
Build: https://builds.apache.org/job/Lucene-Solr-BadApples-Tests-master/281/

2 tests failed.
FAILED:  org.apache.lucene.classification.utils.ConfusionMatrixGeneratorTest.testGetConfusionMatrixWithBM25NB

Error Message:
expected:<7> but was:<6>

Stack Trace:
java.lang.AssertionError: expected:<7> but was:<6>
        at __randomizedtesting.SeedInfo.seed([1E2D7C81072DE2C5:A5C6FA63D444078A]:0)
        at org.junit.Assert.fail(Assert.java:88)
        at org.junit.Assert.failNotEquals(Assert.java:834)
        at org.junit.Assert.assertEquals(Assert.java:645)
        at org.junit.Assert.assertEquals(Assert.java:631)
        at org.apache.lucene.classification.utils.ConfusionMatrixGeneratorTest.checkCM(ConfusionMatrixGeneratorTest.java:110)
        at org.apache.lucene.classification.utils.ConfusionMatrixGeneratorTest.testGetConfusionMatrixWithBM25NB(ConfusionMatrixGeneratorTest.java:135)
        at sun.reflect.NativeMethodAccessorImpl.invoke0(Native Method)
        at sun.reflect.NativeMethodAccessorImpl.invoke(NativeMethodAccessorImpl.java:62)
        at sun.reflect.DelegatingMethodAccessorImpl.invoke(DelegatingMethodAccessorImpl.java:43)
        at java.lang.reflect.Method.invoke(Method.java:498)
        at com.carrotsearch.randomizedtesting.RandomizedRunner.invoke(RandomizedRunner.java:1750)
        at com.carrotsearch.randomizedtesting.RandomizedRunner$8.evaluate(RandomizedRunner.java:938)
        at com.carrotsearch.randomizedtesting.RandomizedRunner$9.evaluate(RandomizedRunner.java:974)
        at com.carrotsearch.randomizedtesting.RandomizedRunner$10.evaluate(RandomizedRunner.java:988)
        at org.apache.lucene.util.TestRuleSetupTeardownChained$1.evaluate(TestRuleSetupTeardownChained.java:49)
        at org.apache.lucene.util.AbstractBeforeAfterRule$1.evaluate(AbstractBeforeAfterRule.java:45)
        at org.apache.lucene.util.TestRuleThreadAndTestName$1.evaluate(TestRuleThreadAndTestName.java:48)
        at org.apache.lucene.util.TestRuleIgnoreAfterMaxFailures$1.evaluate(TestRuleIgnoreAfterMaxFailures.java:64)
        at org.apache.lucene.util.TestRuleMarkFailure$1.evaluate(TestRuleMarkFailure.java:47)
        at com.carrotsearch.randomizedtesting.rules.StatementAdapter.evaluate(StatementAdapter.java:36)
        at com.carrotsearch.randomizedtesting.ThreadLeakControl$StatementRunner.run(ThreadLeakControl.java:368)
        at com.carrotsearch.randomizedtesting.ThreadLeakControl.forkTimeoutingTask(ThreadLeakControl.java:817)
        at com.carrotsearch.randomizedtesting.ThreadLeakControl$3.evaluate(ThreadLeakControl.java:468)
        at com.carrotsearch.randomizedtesting.RandomizedRunner.runSingleTest(RandomizedRunner.java:947)
        at com.carrotsearch.randomizedtesting.RandomizedRunner$5.evaluate(RandomizedRunner.java:832)
        at com.carrotsearch.randomizedtesting.RandomizedRunner$6.evaluate(RandomizedRunner.java:883)
        at com.carrotsearch.randomizedtesting.RandomizedRunner$7.evaluate(RandomizedRunner.java:894)
        at org.apache.lucene.util.AbstractBeforeAfterRule$1.evaluate(AbstractBeforeAfterRule.java:45)
        at com.carrotsearch.randomizedtesting.rules.StatementAdapter.evaluate(StatementAdapter.java:36)
        at org.apache.lucene.util.TestRuleStoreClassName$1.evaluate(TestRuleStoreClassName.java:41)
        at com.carrotsearch.randomizedtesting.rules.NoShadowingOrOverridesOnMethodsRule$1.evaluate(NoShadowingOrOverridesOnMethodsRule.java:40)
        at com.carrotsearch.randomizedtesting.rules.NoShadowingOrOverridesOnMethodsRule$1.evaluate(NoShadowingOrOverridesOnMethodsRule.java:40)
        at com.carrotsearch.randomizedtesting.rules.StatementAdapter.evaluate(StatementAdapter.java:36)
        at com.carrotsearch.randomizedtesting.rules.StatementAdapter.evaluate(StatementAdapter.java:36)
        at com.carrotsearch.randomizedtesting.rules.StatementAdapter.evaluate(StatementAdapter.java:36)
        at org.apache.lucene.util.TestRuleAssertionsRequired$1.evaluate(TestRuleAssertionsRequired.java:53)
        at org.apache.lucene.util.TestRuleMarkFailure$1.evaluate(TestRuleMarkFailure.java:47)
        at org.apache.lucene.util.TestRuleIgnoreAfterMaxFailures$1.evaluate(TestRuleIgnoreAfterMaxFailures.java:64)
        at org.apache.lucene.util.TestRuleIgnoreTestSuites$1.evaluate(TestRuleIgnoreTestSuites.java:54)
        at com.carrotsearch.randomizedtesting.rules.StatementAdapter.evaluate(StatementAdapter.java:36)
        at com.carrotsearch.randomizedtesting.ThreadLeakControl$StatementRunner.run(ThreadLeakControl.java:368)
        at java.lang.Thread.run(Thread.java:748)


FAILED:  junit.framework.TestSuite.org.apache.solr.handler.TestReplicationHandler

Error Message:
ObjectTracker found 4 object(s) that were not released!!! [SolrCore, MockDirectoryWrapper, MockDirectoryWrapper, InternalHttpClient] org.apache.solr.common.util.ObjectReleaseTracker$ObjectTrackerException: org.apache.solr.core.SolrCore  at org.apache.solr.common.util.ObjectReleaseTracker.track(ObjectReleaseTracker.java:42)  at org.apache.solr.core.SolrCore.<init>(SolrCore.java:1062)  at org.apache.solr.core.SolrCore.<init>(SolrCore.java:882)  at org.apache.solr.core.CoreContainer.createFromDescriptor(CoreContainer.java:1189)  at org.apache.solr.core.CoreContainer.lambda$load$13(CoreContainer.java:695)  at com.codahale.metrics.InstrumentedExecutorService$InstrumentedCallable.call(InstrumentedExecutorService.java:197)  at java.util.concurrent.FutureTask.run(FutureTask.java:266)  at org.apache.solr.common.util.ExecutorUtil$MDCAwareThreadPoolExecutor.lambda$execute$0(ExecutorUtil.java:209)  at java.util.concurrent.ThreadPoolExecutor.runWorker(ThreadPoolExecutor.java:1149)  at java.util.concurrent.ThreadPoolExecutor$Worker.run(ThreadPoolExecutor.java:624)  at java.lang.Thread.run(Thread.java:748)  org.apache.solr.common.util.ObjectReleaseTracker$ObjectTrackerException: org.apache.lucene.store.MockDirectoryWrapper  at org.apache.solr.common.util.ObjectReleaseTracker.track(ObjectReleaseTracker.java:42)  at org.apache.solr.core.CachingDirectoryFactory.get(CachingDirectoryFactory.java:348)  at org.apache.solr.core.SolrCore.getNewIndexDir(SolrCore.java:367)  at org.apache.solr.core.SolrCore.initIndex(SolrCore.java:746)  at org.apache.solr.core.SolrCore.<init>(SolrCore.java:975)  at org.apache.solr.core.SolrCore.<init>(SolrCore.java:882)  at org.apache.solr.core.CoreContainer.createFromDescriptor(CoreContainer.java:1189)  at org.apache.solr.core.CoreContainer.lambda$load$13(CoreContainer.java:695)  at com.codahale.metrics.InstrumentedExecutorService$InstrumentedCallable.call(InstrumentedExecutorService.java:197)  at java.util.concurrent.FutureTask.run(FutureTask.java:266)  at org.apache.solr.common.util.ExecutorUtil$MDCAwareThreadPoolExecutor.lambda$execute$0(ExecutorUtil.java:209)  at java.util.concurrent.ThreadPoolExecutor.runWorker(ThreadPoolExecutor.java:1149)  at java.util.concurrent.ThreadPoolExecutor$Worker.run(ThreadPoolExecutor.java:624)  at java.lang.Thread.run(Thread.java:748)  org.apache.solr.common.util.ObjectReleaseTracker$ObjectTrackerException: org.apache.lucene.store.MockDirectoryWrapper  at org.apache.solr.common.util.ObjectReleaseTracker.track(ObjectReleaseTracker.java:42)  at org.apache.solr.core.CachingDirectoryFactory.get(CachingDirectoryFactory.java:348)  at org.apache.solr.update.SolrIndexWriter.create(SolrIndexWriter.java:95)  at org.apache.solr.core.SolrCore.initIndex(SolrCore.java:778)  at org.apache.solr.core.SolrCore.<init>(SolrCore.java:975)  at org.apache.solr.core.SolrCore.<init>(SolrCore.java:882)  at org.apache.solr.core.CoreContainer.createFromDescriptor(CoreContainer.java:1189)  at org.apache.solr.core.CoreContainer.lambda$load$13(CoreContainer.java:695)  at com.codahale.metrics.InstrumentedExecutorService$InstrumentedCallable.call(InstrumentedExecutorService.java:197)  at java.util.concurrent.FutureTask.run(FutureTask.java:266)  at org.apache.solr.common.util.ExecutorUtil$MDCAwareThreadPoolExecutor.lambda$execute$0(ExecutorUtil.java:209)  at java.util.concurrent.ThreadPoolExecutor.runWorker(ThreadPoolExecutor.java:1149)  at java.util.concurrent.ThreadPoolExecutor$Worker.run(ThreadPoolExecutor.java:624)  at java.lang.Thread.run(Thread.java:748)  org.apache.solr.common.util.ObjectReleaseTracker$ObjectTrackerException: org.apache.http.impl.client.InternalHttpClient  at org.apache.solr.common.util.ObjectReleaseTracker.track(ObjectReleaseTracker.java:42)  at org.apache.solr.client.solrj.impl.HttpClientUtil.createClient(HttpClientUtil.java:321)  at org.apache.solr.client.solrj.impl.HttpClientUtil.createClient(HttpClientUtil.java:330)  at org.apache.solr.handler.IndexFetcher.createHttpClient(IndexFetcher.java:230)  at org.apache.solr.handler.IndexFetcher.<init>(IndexFetcher.java:272)  at org.apache.solr.handler.ReplicationHandler.inform(ReplicationHandler.java:1222)  at org.apache.solr.core.SolrResourceLoader.inform(SolrResourceLoader.java:696)  at org.apache.solr.core.SolrCore.<init>(SolrCore.java:1008)  at org.apache.solr.core.SolrCore.<init>(SolrCore.java:882)  at org.apache.solr.core.CoreContainer.createFromDescriptor(CoreContainer.java:1189)  at org.apache.solr.core.CoreContainer.lambda$load$13(CoreContainer.java:695)  at com.codahale.metrics.InstrumentedExecutorService$InstrumentedCallable.call(InstrumentedExecutorService.java:197)  at java.util.concurrent.FutureTask.run(FutureTask.java:266)  at org.apache.solr.common.util.ExecutorUtil$MDCAwareThreadPoolExecutor.lambda$execute$0(ExecutorUtil.java:209)  at java.util.concurrent.ThreadPoolExecutor.runWorker(ThreadPoolExecutor.java:1149)  at java.util.concurrent.ThreadPoolExecutor$Worker.run(ThreadPoolExecutor.java:624)  at java.lang.Thread.run(Thread.java:748)   expected null, but was:<ObjectTracker found 4 object(s) that were not released!!! [SolrCore, MockDirectoryWrapper, MockDirectoryWrapper, InternalHttpClient] org.apache.solr.common.util.ObjectReleaseTracker$ObjectTrackerException: org.apache.solr.core.SolrCore  at org.apache.solr.common.util.ObjectReleaseTracker.track(ObjectReleaseTracker.java:42)  at org.apache.solr.core.SolrCore.<init>(SolrCore.java:1062)  at org.apache.solr.core.SolrCore.<init>(SolrCore.java:882)  at org.apache.solr.core.CoreContainer.createFromDescriptor(CoreContainer.java:1189)  at org.apache.solr.core.CoreContainer.lambda$load$13(CoreContainer.java:695)  at com.codahale.metrics.InstrumentedExecutorService$InstrumentedCallable.call(InstrumentedExecutorService.java:197)  at java.util.concurrent.FutureTask.run(FutureTask.java:266)  at org.apache.solr.common.util.ExecutorUtil$MDCAwareThreadPoolExecutor.lambda$execute$0(ExecutorUtil.java:209)  at java.util.concurrent.ThreadPoolExecutor.runWorker(ThreadPoolExecutor.java:1149)  at java.util.concurrent.ThreadPoolExecutor$Worker.run(ThreadPoolExecutor.java:624)  at java.lang.Thread.run(Thread.java:748)  org.apache.solr.common.util.ObjectReleaseTracker$ObjectTrackerException: org.apache.lucene.store.MockDirectoryWrapper  at org.apache.solr.common.util.ObjectReleaseTracker.track(ObjectReleaseTracker.java:42)  at org.apache.solr.core.CachingDirectoryFactory.get(CachingDirectoryFactory.java:348)  at org.apache.solr.core.SolrCore.getNewIndexDir(SolrCore.java:367)  at org.apache.solr.core.SolrCore.initIndex(SolrCore.java:746)  at org.apache.solr.core.SolrCore.<init>(SolrCore.java:975)  at org.apache.solr.core.SolrCore.<init>(SolrCore.java:882)  at org.apache.solr.core.CoreContainer.createFromDescriptor(CoreContainer.java:1189)  at org.apache.solr.core.CoreContainer.lambda$load$13(CoreContainer.java:695)  at com.codahale.metrics.InstrumentedExecutorService$InstrumentedCallable.call(InstrumentedExecutorService.java:197)  at java.util.concurrent.FutureTask.run(FutureTask.java:266)  at org.apache.solr.common.util.ExecutorUtil$MDCAwareThreadPoolExecutor.lambda$execute$0(ExecutorUtil.java:209)  at java.util.concurrent.ThreadPoolExecutor.runWorker(ThreadPoolExecutor.java:1149)  at java.util.concurrent.ThreadPoolExecutor$Worker.run(ThreadPoolExecutor.java:624)  at java.lang.Thread.run(Thread.java:748)  org.apache.solr.common.util.ObjectReleaseTracker$ObjectTrackerException: org.apache.lucene.store.MockDirectoryWrapper  at org.apache.solr.common.util.ObjectReleaseTracker.track(ObjectReleaseTracker.java:42)  at org.apache.solr.core.CachingDirectoryFactory.get(CachingDirectoryFactory.java:348)  at org.apache.solr.update.SolrIndexWriter.create(SolrIndexWriter.java:95)  at org.apache.solr.core.SolrCore.initIndex(SolrCore.java:778)  at org.apache.solr.core.SolrCore.<init>(SolrCore.java:975)  at org.apache.solr.core.SolrCore.<init>(SolrCore.java:882)  at org.apache.solr.core.CoreContainer.createFromDescriptor(CoreContainer.java:1189)  at org.apache.solr.core.CoreContainer.lambda$load$13(CoreContainer.java:695)  at com.codahale.metrics.InstrumentedExecutorService$InstrumentedCallable.call(InstrumentedExecutorService.java:197)  at java.util.concurrent.FutureTask.run(FutureTask.java:266)  at org.apache.solr.common.util.ExecutorUtil$MDCAwareThreadPoolExecutor.lambda$execute$0(ExecutorUtil.java:209)  at java.util.concurrent.ThreadPoolExecutor.runWorker(ThreadPoolExecutor.java:1149)  at java.util.concurrent.ThreadPoolExecutor$Worker.run(ThreadPoolExecutor.java:624)  at java.lang.Thread.run(Thread.java:748)  org.apache.solr.common.util.ObjectReleaseTracker$ObjectTrackerException: org.apache.http.impl.client.InternalHttpClient  at org.apache.solr.common.util.ObjectReleaseTracker.track(ObjectReleaseTracker.java:42)  at org.apache.solr.client.solrj.impl.HttpClientUtil.createClient(HttpClientUtil.java:321)  at org.apache.solr.client.solrj.impl.HttpClientUtil.createClient(HttpClientUtil.java:330)  at org.apache.solr.handler.IndexFetcher.createHttpClient(IndexFetcher.java:230)  at org.apache.solr.handler.IndexFetcher.<init>(IndexFetcher.java:272)  at org.apache.solr.handler.ReplicationHandler.inform(ReplicationHandler.java:1222)  at org.apache.solr.core.SolrResourceLoader.inform(SolrResourceLoader.java:696)  at org.apache.solr.core.SolrCore.<init>(SolrCore.java:1008)  at org.apache.solr.core.SolrCore.<init>(SolrCore.java:882)  at org.apache.solr.core.CoreContainer.createFromDescriptor(CoreContainer.java:1189)  at org.apache.solr.core.CoreContainer.lambda$load$13(CoreContainer.java:695)  at com.codahale.metrics.InstrumentedExecutorService$InstrumentedCallable.call(InstrumentedExecutorService.java:197)  at java.util.concurrent.FutureTask.run(FutureTask.java:266)  at org.apache.solr.common.util.ExecutorUtil$MDCAwareThreadPoolExecutor.lambda$execute$0(ExecutorUtil.java:209)  at java.util.concurrent.ThreadPoolExecutor.runWorker(ThreadPoolExecutor.java:1149)  at java.util.concurrent.ThreadPoolExecutor$Worker.run(ThreadPoolExecutor.java:624)  at java.lang.Thread.run(Thread.java:748)  >

Stack Trace:
java.lang.AssertionError: ObjectTracker found 4 object(s) that were not released!!! [SolrCore, MockDirectoryWrapper, MockDirectoryWrapper, InternalHttpClient]
org.apache.solr.common.util.ObjectReleaseTracker$ObjectTrackerException: org.apache.solr.core.SolrCore
        at org.apache.solr.common.util.ObjectReleaseTracker.track(ObjectReleaseTracker.java:42)
        at org.apache.solr.core.SolrCore.<init>(SolrCore.java:1062)
        at org.apache.solr.core.SolrCore.<init>(SolrCore.java:882)
        at org.apache.solr.core.CoreContainer.createFromDescriptor(CoreContainer.java:1189)
        at org.apache.solr.core.CoreContainer.lambda$load$13(CoreContainer.java:695)
        at com.codahale.metrics.InstrumentedExecutorService$InstrumentedCallable.call(InstrumentedExecutorService.java:197)
        at java.util.concurrent.FutureTask.run(FutureTask.java:266)
        at org.apache.solr.common.util.ExecutorUtil$MDCAwareThreadPoolExecutor.lambda$execute$0(ExecutorUtil.java:209)
        at java.util.concurrent.ThreadPoolExecutor.runWorker(ThreadPoolExecutor.java:1149)
        at java.util.concurrent.ThreadPoolExecutor$Worker.run(ThreadPoolExecutor.java:624)
        at java.lang.Thread.run(Thread.java:748)

org.apache.solr.common.util.ObjectReleaseTracker$ObjectTrackerException: org.apache.lucene.store.MockDirectoryWrapper
        at org.apache.solr.common.util.ObjectReleaseTracker.track(ObjectReleaseTracker.java:42)
        at org.apache.solr.core.CachingDirectoryFactory.get(CachingDirectoryFactory.java:348)
        at org.apache.solr.core.SolrCore.getNewIndexDir(SolrCore.java:367)
        at org.apache.solr.core.SolrCore.initIndex(SolrCore.java:746)
        at org.apache.solr.core.SolrCore.<init>(SolrCore.java:975)
        at org.apache.solr.core.SolrCore.<init>(SolrCore.java:882)
        at org.apache.solr.core.CoreContainer.createFromDescriptor(CoreContainer.java:1189)
        at org.apache.solr.core.CoreContainer.lambda$load$13(CoreContainer.java:695)
        at com.codahale.metrics.InstrumentedExecutorService$InstrumentedCallable.call(InstrumentedExecutorService.java:197)
        at java.util.concurrent.FutureTask.run(FutureTask.java:266)
        at org.apache.solr.common.util.ExecutorUtil$MDCAwareThreadPoolExecutor.lambda$execute$0(ExecutorUtil.java:209)
        at java.util.concurrent.ThreadPoolExecutor.runWorker(ThreadPoolExecutor.java:1149)
        at java.util.concurrent.ThreadPoolExecutor$Worker.run(ThreadPoolExecutor.java:624)
        at java.lang.Thread.run(Thread.java:748)

org.apache.solr.common.util.ObjectReleaseTracker$ObjectTrackerException: org.apache.lucene.store.MockDirectoryWrapper
        at org.apache.solr.common.util.ObjectReleaseTracker.track(ObjectReleaseTracker.java:42)
        at org.apache.solr.core.CachingDirectoryFactory.get(CachingDirectoryFactory.java:348)
        at org.apache.solr.update.SolrIndexWriter.create(SolrIndexWriter.java:95)
        at org.apache.solr.core.SolrCore.initIndex(SolrCore.java:778)
        at org.apache.solr.core.SolrCore.<init>(SolrCore.java:975)
        at org.apache.solr.core.SolrCore.<init>(SolrCore.java:882)
        at org.apache.solr.core.CoreContainer.createFromDescriptor(CoreContainer.java:1189)
        at org.apache.solr.core.CoreContainer.lambda$load$13(CoreContainer.java:695)
        at com.codahale.metrics.InstrumentedExecutorService$InstrumentedCallable.call(InstrumentedExecutorService.java:197)
        at java.util.concurrent.FutureTask.run(FutureTask.java:266)
        at org.apache.solr.common.util.ExecutorUtil$MDCAwareThreadPoolExecutor.lambda$execute$0(ExecutorUtil.java:209)
        at java.util.concurrent.ThreadPoolExecutor.runWorker(ThreadPoolExecutor.java:1149)
        at java.util.concurrent.ThreadPoolExecutor$Worker.run(ThreadPoolExecutor.java:624)
        at java.lang.Thread.run(Thread.java:748)

org.apache.solr.common.util.ObjectReleaseTracker$ObjectTrackerException: org.apache.http.impl.client.InternalHttpClient
        at org.apache.solr.common.util.ObjectReleaseTracker.track(ObjectReleaseTracker.java:42)
        at org.apache.solr.client.solrj.impl.HttpClientUtil.createClient(HttpClientUtil.java:321)
        at org.apache.solr.client.solrj.impl.HttpClientUtil.createClient(HttpClientUtil.java:330)
        at org.apache.solr.handler.IndexFetcher.createHttpClient(IndexFetcher.java:230)
        at org.apache.solr.handler.IndexFetcher.<init>(IndexFetcher.java:272)
        at org.apache.solr.handler.ReplicationHandler.inform(ReplicationHandler.java:1222)
        at org.apache.solr.core.SolrResourceLoader.inform(SolrResourceLoader.java:696)
        at org.apache.solr.core.SolrCore.<init>(SolrCore.java:1008)
        at org.apache.solr.core.SolrCore.<init>(SolrCore.java:882)
        at org.apache.solr.core.CoreContainer.createFromDescriptor(CoreContainer.java:1189)
        at org.apache.solr.core.CoreContainer.lambda$load$13(CoreContainer.java:695)
        at com.codahale.metrics.InstrumentedExecutorService$InstrumentedCallable.call(InstrumentedExecutorService.java:197)
        at java.util.concurrent.FutureTask.run(FutureTask.java:266)
        at org.apache.solr.common.util.ExecutorUtil$MDCAwareThreadPoolExecutor.lambda$execute$0(ExecutorUtil.java:209)
        at java.util.concurrent.ThreadPoolExecutor.runWorker(ThreadPoolExecutor.java:1149)
        at java.util.concurrent.ThreadPoolExecutor$Worker.run(ThreadPoolExecutor.java:624)
        at java.lang.Thread.run(Thread.java:748)

 expected null, but was:<ObjectTracker found 4 object(s) that were not released!!! [SolrCore, MockDirectoryWrapper, MockDirectoryWrapper, InternalHttpClient]
org.apache.solr.common.util.ObjectReleaseTracker$ObjectTrackerException: org.apache.solr.core.SolrCore
        at org.apache.solr.common.util.ObjectReleaseTracker.track(ObjectReleaseTracker.java:42)
        at org.apache.solr.core.SolrCore.<init>(SolrCore.java:1062)
        at org.apache.solr.core.SolrCore.<init>(SolrCore.java:882)
        at org.apache.solr.core.CoreContainer.createFromDescriptor(CoreContainer.java:1189)
        at org.apache.solr.core.CoreContainer.lambda$load$13(CoreContainer.java:695)
        at com.codahale.metrics.InstrumentedExecutorService$InstrumentedCallable.call(InstrumentedExecutorService.java:197)
        at java.util.concurrent.FutureTask.run(FutureTask.java:266)
        at org.apache.solr.common.util.ExecutorUtil$MDCAwareThreadPoolExecutor.lambda$execute$0(ExecutorUtil.java:209)
        at java.util.concurrent.ThreadPoolExecutor.runWorker(ThreadPoolExecutor.java:1149)
        at java.util.concurrent.ThreadPoolExecutor$Worker.run(ThreadPoolExecutor.java:624)
        at java.lang.Thread.run(Thread.java:748)

org.apache.solr.common.util.ObjectReleaseTracker$ObjectTrackerException: org.apache.lucene.store.MockDirectoryWrapper
        at org.apache.solr.common.util.ObjectReleaseTracker.track(ObjectReleaseTracker.java:42)
        at org.apache.solr.core.CachingDirectoryFactory.get(CachingDirectoryFactory.java:348)
        at org.apache.solr.core.SolrCore.getNewIndexDir(SolrCore.java:367)
        at org.apache.solr.core.SolrCore.initIndex(SolrCore.java:746)
        at org.apache.solr.core.SolrCore.<init>(SolrCore.java:975)
        at org.apache.solr.core.SolrCore.<init>(SolrCore.java:882)
        at org.apache.solr.core.CoreContainer.createFromDescriptor(CoreContainer.java:1189)
        at org.apache.solr.core.CoreContainer.lambda$load$13(CoreContainer.java:695)
        at com.codahale.metrics.InstrumentedExecutorService$InstrumentedCallable.call(InstrumentedExecutorService.java:197)
        at java.util.concurrent.FutureTask.run(FutureTask.java:266)
        at org.apache.solr.common.util.ExecutorUtil$MDCAwareThreadPoolExecutor.lambda$execute$0(ExecutorUtil.java:209)
        at java.util.concurrent.ThreadPoolExecutor.runWorker(ThreadPoolExecutor.java:1149)
        at java.util.concurrent.ThreadPoolExecutor$Worker.run(ThreadPoolExecutor.java:624)
        at java.lang.Thread.run(Thread.java:748)

org.apache.solr.common.util.ObjectReleaseTracker$ObjectTrackerException: org.apache.lucene.store.MockDirectoryWrapper
        at org.apache.solr.common.util.ObjectReleaseTracker.track(ObjectReleaseTracker.java:42)
        at org.apache.solr.core.CachingDirectoryFactory.get(CachingDirectoryFactory.java:348)
        at org.apache.solr.update.SolrIndexWriter.create(SolrIndexWriter.java:95)
        at org.apache.solr.core.SolrCore.initIndex(SolrCore.java:778)
        at org.apache.solr.core.SolrCore.<init>(SolrCore.java:975)
        at org.apache.solr.core.SolrCore.<init>(SolrCore.java:882)
        at org.apache.solr.core.CoreContainer.createFromDescriptor(CoreContainer.java:1189)
        at org.apache.solr.core.CoreContainer.lambda$load$13(CoreContainer.java:695)
        at com.codahale.metrics.InstrumentedExecutorService$InstrumentedCallable.call(InstrumentedExecutorService.java:197)
        at java.util.concurrent.FutureTask.run(FutureTask.java:266)
        at org.apache.solr.common.util.ExecutorUtil$MDCAwareThreadPoolExecutor.lambda$execute$0(ExecutorUtil.java:209)
        at java.util.concurrent.ThreadPoolExecutor.runWorker(ThreadPoolExecutor.java:1149)
        at java.util.concurrent.ThreadPoolExecutor$Worker.run(ThreadPoolExecutor.java:624)
        at java.lang.Thread.run(Thread.java:748)

org.apache.solr.common.util.ObjectReleaseTracker$ObjectTrackerException: org.apache.http.impl.client.InternalHttpClient
        at org.apache.solr.common.util.ObjectReleaseTracker.track(ObjectReleaseTracker.java:42)
        at org.apache.solr.client.solrj.impl.HttpClientUtil.createClient(HttpClientUtil.java:321)
        at org.apache.solr.client.solrj.impl.HttpClientUtil.createClient(HttpClientUtil.java:330)
        at org.apache.solr.handler.IndexFetcher.createHttpClient(IndexFetcher.java:230)
        at org.apache.solr.handler.IndexFetcher.<init>(IndexFetcher.java:272)
        at org.apache.solr.handler.ReplicationHandler.inform(ReplicationHandler.java:1222)
        at org.apache.solr.core.SolrResourceLoader.inform(SolrResourceLoader.java:696)
        at org.apache.solr.core.SolrCore.<init>(SolrCore.java:1008)
        at org.apache.solr.core.SolrCore.<init>(SolrCore.java:882)
        at org.apache.solr.core.CoreContainer.createFromDescriptor(CoreContainer.java:1189)
        at org.apache.solr.core.CoreContainer.lambda$load$13(CoreContainer.java:695)
        at com.codahale.metrics.InstrumentedExecutorService$InstrumentedCallable.call(InstrumentedExecutorService.java:197)
        at java.util.concurrent.FutureTask.run(FutureTask.java:266)
        at org.apache.solr.common.util.ExecutorUtil$MDCAwareThreadPoolExecutor.lambda$execute$0(ExecutorUtil.java:209)
        at java.util.concurrent.ThreadPoolExecutor.runWorker(ThreadPoolExecutor.java:1149)
        at java.util.concurrent.ThreadPoolExecutor$Worker.run(ThreadPoolExecutor.java:624)
        at java.lang.Thread.run(Thread.java:748)

>
        at __randomizedtesting.SeedInfo.seed([DEF1A172944FD378]:0)
        at org.junit.Assert.fail(Assert.java:88)
        at org.junit.Assert.failNotNull(Assert.java:755)
        at org.junit.Assert.assertNull(Assert.java:737)
        at org.apache.solr.SolrTestCaseJ4.teardownTestCases(SolrTestCaseJ4.java:322)
        at sun.reflect.GeneratedMethodAccessor39.invoke(Unknown Source)
        at sun.reflect.DelegatingMethodAccessorImpl.invoke(DelegatingMethodAccessorImpl.java:43)
        at java.lang.reflect.Method.invoke(Method.java:498)
        at com.carrotsearch.randomizedtesting.RandomizedRunner.invoke(RandomizedRunner.java:1750)
        at com.carrotsearch.randomizedtesting.RandomizedRunner$7.evaluate(RandomizedRunner.java:901)
        at com.carrotsearch.randomizedtesting.rules.StatementAdapter.evaluate(StatementAdapter.java:36)
        at com.carrotsearch.randomizedtesting.rules.SystemPropertiesRestoreRule$1.evaluate(SystemPropertiesRestoreRule.java:57)
        at org.apache.lucene.util.AbstractBeforeAfterRule$1.evaluate(AbstractBeforeAfterRule.java:45)
        at com.carrotsearch.randomizedtesting.rules.StatementAdapter.evaluate(StatementAdapter.java:36)
        at org.apache.lucene.util.TestRuleStoreClassName$1.evaluate(TestRuleStoreClassName.java:41)
        at com.carrotsearch.randomizedtesting.rules.NoShadowingOrOverridesOnMethodsRule$1.evaluate(NoShadowingOrOverridesOnMethodsRule.java:40)
        at com.carrotsearch.randomizedtesting.rules.NoShadowingOrOverridesOnMethodsRule$1.evaluate(NoShadowingOrOverridesOnMethodsRule.java:40)
        at com.carrotsearch.randomizedtesting.rules.StatementAdapter.evaluate(StatementAdapter.java:36)
        at com.carrotsearch.randomizedtesting.rules.StatementAdapter.evaluate(StatementAdapter.java:36)
        at com.carrotsearch.randomizedtesting.rules.StatementAdapter.evaluate(StatementAdapter.java:36)
        at org.apache.lucene.util.TestRuleAssertionsRequired$1.evaluate(TestRuleAssertionsRequired.java:53)
        at org.apache.lucene.util.TestRuleMarkFailure$1.evaluate(TestRuleMarkFailure.java:47)
        at org.apache.lucene.util.TestRuleIgnoreAfterMaxFailures$1.evaluate(TestRuleIgnoreAfterMaxFailures.java:64)
        at org.apache.lucene.util.TestRuleIgnoreTestSuites$1.evaluate(TestRuleIgnoreTestSuites.java:54)
        at com.carrotsearch.randomizedtesting.rules.StatementAdapter.evaluate(StatementAdapter.java:36)
        at com.carrotsearch.randomizedtesting.ThreadLeakControl$StatementRunner.run(ThreadLeakControl.java:368)
        at java.lang.Thread.run(Thread.java:748)




Build Log:
[...truncated 7018 lines...]
   [junit4] Suite: org.apache.lucene.classification.utils.ConfusionMatrixGeneratorTest
   [junit4]   2> NOTE: reproduce with: ant test  -Dtestcase=ConfusionMatrixGeneratorTest -Dtests.method=testGetConfusionMatrixWithBM25NB -Dtests.seed=1E2D7C81072DE2C5 -Dtests.multiplier=2 -Dtests.slow=true -Dtests.badapples=true -Dtests.locale=he-IL -Dtests.timezone=PRT -Dtests.asserts=true -Dtests.file.encoding=UTF-8
   [junit4] FAILURE 13.3s J0 | ConfusionMatrixGeneratorTest.testGetConfusionMatrixWithBM25NB <<<
   [junit4]    > Throwable #1: java.lang.AssertionError: expected:<7> but was:<6>
   [junit4]    > at __randomizedtesting.SeedInfo.seed([1E2D7C81072DE2C5:A5C6FA63D444078A]:0)
   [junit4]    > at org.apache.lucene.classification.utils.ConfusionMatrixGeneratorTest.checkCM(ConfusionMatrixGeneratorTest.java:110)
   [junit4]    > at org.apache.lucene.classification.utils.ConfusionMatrixGeneratorTest.testGetConfusionMatrixWithBM25NB(ConfusionMatrixGeneratorTest.java:135)
   [junit4]    > at java.lang.Thread.run(Thread.java:748)
   [junit4]   2> NOTE: test params are: codec=Asserting(Lucene80): {bool=FSTOrd50, cat=FSTOrd50, text=FST50}, docValues:{}, maxPointsInLeafNode=288, maxMBSortInHeap=7.6813441290381865, sim=Asserting(org.apache.lucene.search.similarities.AssertingSimilarity@3a1acfa4), locale=he-IL, timezone=PRT
   [junit4]   2> NOTE: Linux 4.4.0-112-generic amd64/Oracle Corporation 1.8.0_191 (64-bit)/cpus=4,threads=1,free=218180992,total=319291392
   [junit4]   2> NOTE: All tests run in this JVM: [ConfusionMatrixGeneratorTest]
   [junit4] Completed [1/12 (1!)] on J0 in 33.19s, 7 tests, 1 failure <<< FAILURES!

[...truncated 7767 lines...]
   [junit4] Suite: org.apache.solr.handler.TestReplicationHandler
   [junit4]   2> 4401125 INFO  (SUITE-TestReplicationHandler-seed#[DEF1A172944FD378]-worker) [    ] o.a.s.SolrTestCaseJ4 SecureRandom sanity checks: test.solr.allowed.securerandom=null & java.security.egd=file:/dev/./urandom
   [junit4]   2> Creating dataDir: /home/jenkins/jenkins-slave/workspace/Lucene-Solr-BadApples-Tests-master/solr/build/solr-core/test/J0/temp/solr.handler.TestReplicationHandler_DEF1A172944FD378-001/init-core-data-001
   [junit4]   2> 4401125 WARN  (SUITE-TestReplicationHandler-seed#[DEF1A172944FD378]-worker) [    ] o.a.s.SolrTestCaseJ4 startTrackingSearchers: numOpens=1 numCloses=1
   [junit4]   2> 4401125 INFO  (SUITE-TestReplicationHandler-seed#[DEF1A172944FD378]-worker) [    ] o.a.s.SolrTestCaseJ4 Using TrieFields (NUMERIC_POINTS_SYSPROP=false) w/NUMERIC_DOCVALUES_SYSPROP=false
   [junit4]   2> 4401135 INFO  (SUITE-TestReplicationHandler-seed#[DEF1A172944FD378]-worker) [    ] o.a.s.SolrTestCaseJ4 Randomized ssl (false) and clientAuth (false) via: @org.apache.solr.SolrTestCaseJ4$SuppressSSL(bugUrl=None)
   [junit4]   2> 4401138 INFO  (TEST-TestReplicationHandler.doTestReplicateAfterCoreReload-seed#[DEF1A172944FD378]) [    ] o.a.s.SolrTestCaseJ4 ###Starting doTestReplicateAfterCoreReload
   [junit4]   2> 4401139 INFO  (TEST-TestReplicationHandler.doTestReplicateAfterCoreReload-seed#[DEF1A172944FD378]) [    ] o.a.s.SolrTestCaseJ4 Writing core.properties file to /home/jenkins/jenkins-slave/workspace/Lucene-Solr-BadApples-Tests-master/solr/build/solr-core/test/J0/temp/solr.handler.TestReplicationHandler_DEF1A172944FD378-001/solr-instance-001/collection1
   [junit4]   2> 4401142 WARN  (TEST-TestReplicationHandler.doTestReplicateAfterCoreReload-seed#[DEF1A172944FD378]) [    ] o.e.j.s.AbstractConnector Ignoring deprecated socket close linger time
   [junit4]   2> 4401142 INFO  (TEST-TestReplicationHandler.doTestReplicateAfterCoreReload-seed#[DEF1A172944FD378]) [    ] o.a.s.c.s.e.JettySolrRunner Start Jetty (original configured port=0)
   [junit4]   2> 4401142 INFO  (TEST-TestReplicationHandler.doTestReplicateAfterCoreReload-seed#[DEF1A172944FD378]) [    ] o.a.s.c.s.e.JettySolrRunner Trying to start Jetty on port 0 try number 1 ...
   [junit4]   2> 4401142 INFO  (TEST-TestReplicationHandler.doTestReplicateAfterCoreReload-seed#[DEF1A172944FD378]) [    ] o.e.j.s.Server jetty-9.4.14.v20181114; built: 2018-11-14T21:20:31.478Z; git: c4550056e785fb5665914545889f21dc136ad9e6; jvm 1.8.0_191-b12
   [junit4]   2> 4401186 INFO  (TEST-TestReplicationHandler.doTestReplicateAfterCoreReload-seed#[DEF1A172944FD378]) [    ] o.e.j.s.session DefaultSessionIdManager workerName=node0
   [junit4]   2> 4401186 INFO  (TEST-TestReplicationHandler.doTestReplicateAfterCoreReload-seed#[DEF1A172944FD378]) [    ] o.e.j.s.session No SessionScavenger set, using defaults
   [junit4]   2> 4401186 INFO  (TEST-TestReplicationHandler.doTestReplicateAfterCoreReload-seed#[DEF1A172944FD378]) [    ] o.e.j.s.session node0 Scavenging every 600000ms
   [junit4]   2> 4401187 INFO  (TEST-TestReplicationHandler.doTestReplicateAfterCoreReload-seed#[DEF1A172944FD378]) [    ] o.e.j.s.h.ContextHandler Started o.e.j.s.ServletContextHandler@e636964{/solr,null,AVAILABLE}
   [junit4]   2> 4401188 INFO  (TEST-TestReplicationHandler.doTestReplicateAfterCoreReload-seed#[DEF1A172944FD378]) [    ] o.e.j.s.AbstractConnector Started ServerConnector@7c6e93b3{HTTP/1.1,[http/1.1, h2c]}{127.0.0.1:46400}
   [junit4]   2> 4401188 INFO  (TEST-TestReplicationHandler.doTestReplicateAfterCoreReload-seed#[DEF1A172944FD378]) [    ] o.e.j.s.Server Started @4401481ms
   [junit4]   2> 4401188 INFO  (TEST-TestReplicationHandler.doTestReplicateAfterCoreReload-seed#[DEF1A172944FD378]) [    ] o.a.s.c.s.e.JettySolrRunner Jetty properties: {solr.data.dir=/home/jenkins/jenkins-slave/workspace/Lucene-Solr-BadApples-Tests-master/solr/build/solr-core/test/J0/temp/solr.handler.TestReplicationHandler_DEF1A172944FD378-001/solr-instance-001/collection1/data, hostContext=/solr, hostPort=46400}
   [junit4]   2> 4401188 ERROR (TEST-TestReplicationHandler.doTestReplicateAfterCoreReload-seed#[DEF1A172944FD378]) [    ] o.a.s.u.StartupLoggingUtils Missing Java Option solr.log.dir. Logging may be missing or incomplete.
   [junit4]   2> 4401188 INFO  (TEST-TestReplicationHandler.doTestReplicateAfterCoreReload-seed#[DEF1A172944FD378]) [    ] o.a.s.s.SolrDispatchFilter Using logger factory org.apache.logging.slf4j.Log4jLoggerFactory
   [junit4]   2> 4401189 INFO  (TEST-TestReplicationHandler.doTestReplicateAfterCoreReload-seed#[DEF1A172944FD378]) [    ] o.a.s.s.SolrDispatchFilter  ___      _       Welcome to Apache Solr? version 9.0.0
   [junit4]   2> 4401189 INFO  (TEST-TestReplicationHandler.doTestReplicateAfterCoreReload-seed#[DEF1A172944FD378]) [    ] o.a.s.s.SolrDispatchFilter / __| ___| |_ _   Starting in standalone mode on port null
   [junit4]   2> 4401189 INFO  (TEST-TestReplicationHandler.doTestReplicateAfterCoreReload-seed#[DEF1A172944FD378]) [    ] o.a.s.s.SolrDispatchFilter \__ \/ _ \ | '_|  Install dir: null
   [junit4]   2> 4401189 INFO  (TEST-TestReplicationHandler.doTestReplicateAfterCoreReload-seed#[DEF1A172944FD378]) [    ] o.a.s.s.SolrDispatchFilter |___/\___/_|_|    Start time: 2019-02-11T09:51:09.402Z
   [junit4]   2> 4401189 INFO  (TEST-TestReplicationHandler.doTestReplicateAfterCoreReload-seed#[DEF1A172944FD378]) [    ] o.a.s.c.SolrXmlConfig Loading container configuration from /home/jenkins/jenkins-slave/workspace/Lucene-Solr-BadApples-Tests-master/solr/build/solr-core/test/J0/temp/solr.handler.TestReplicationHandler_DEF1A172944FD378-001/solr-instance-001/solr.xml
   [junit4]   2> 4401192 INFO  (TEST-TestReplicationHandler.doTestReplicateAfterCoreReload-seed#[DEF1A172944FD378]) [    ] o.a.s.c.SolrXmlConfig Configuration parameter autoReplicaFailoverWorkLoopDelay is ignored
   [junit4]   2> 4401192 INFO  (TEST-TestReplicationHandler.doTestReplicateAfterCoreReload-seed#[DEF1A172944FD378]) [    ] o.a.s.c.SolrXmlConfig Configuration parameter autoReplicaFailoverBadNodeExpiration is ignored
   [junit4]   2> 4401193 INFO  (TEST-TestReplicationHandler.doTestReplicateAfterCoreReload-seed#[DEF1A172944FD378]) [    ] o.a.s.c.SolrXmlConfig MBean server found: com.sun.jmx.mbeanserver.JmxMBeanServer@39588ba5, but no JMX reporters were configured - adding default JMX reporter.
   [junit4]   2> 4401360 INFO  (TEST-TestReplicationHandler.doTestReplicateAfterCoreReload-seed#[DEF1A172944FD378]) [    ] o.a.s.h.c.HttpShardHandlerFactory Host whitelist initialized: WhitelistHostChecker [whitelistHosts=null, whitelistHostCheckingEnabled=true]
   [junit4]   2> 4401376 WARN  (TEST-TestReplicationHandler.doTestReplicateAfterCoreReload-seed#[DEF1A172944FD378]) [    ] o.e.j.u.s.S.config No Client EndPointIdentificationAlgorithm configured for SslContextFactory@446aa372[provider=null,keyStore=null,trustStore=null]
   [junit4]   2> 4401381 WARN  (TEST-TestReplicationHandler.doTestReplicateAfterCoreReload-seed#[DEF1A172944FD378]) [    ] o.e.j.u.s.S.config No Client EndPointIdentificationAlgorithm configured for SslContextFactory@52f874cd[provider=null,keyStore=null,trustStore=null]
   [junit4]   2> 4401418 INFO  (TEST-TestReplicationHandler.doTestReplicateAfterCoreReload-seed#[DEF1A172944FD378]) [    ] o.a.s.c.TransientSolrCoreCacheDefault Allocating transient cache for 4 transient cores
   [junit4]   2> 4401418 INFO  (TEST-TestReplicationHandler.doTestReplicateAfterCoreReload-seed#[DEF1A172944FD378]) [    ] o.a.s.h.a.MetricsHistoryHandler No .system collection, keeping metrics history in memory.
   [junit4]   2> 4401531 INFO  (TEST-TestReplicationHandler.doTestReplicateAfterCoreReload-seed#[DEF1A172944FD378]) [    ] o.a.s.m.r.SolrJmxReporter JMX monitoring for 'solr.node' (registry 'solr.node') enabled at server: com.sun.jmx.mbeanserver.JmxMBeanServer@39588ba5
   [junit4]   2> 4401548 INFO  (TEST-TestReplicationHandler.doTestReplicateAfterCoreReload-seed#[DEF1A172944FD378]) [    ] o.a.s.m.r.SolrJmxReporter JMX monitoring for 'solr.jvm' (registry 'solr.jvm') enabled at server: com.sun.jmx.mbeanserver.JmxMBeanServer@39588ba5
   [junit4]   2> 4401548 INFO  (TEST-TestReplicationHandler.doTestReplicateAfterCoreReload-seed#[DEF1A172944FD378]) [    ] o.a.s.m.r.SolrJmxReporter JMX monitoring for 'solr.jetty' (registry 'solr.jetty') enabled at server: com.sun.jmx.mbeanserver.JmxMBeanServer@39588ba5
   [junit4]   2> 4401550 INFO  (TEST-TestReplicationHandler.doTestReplicateAfterCoreReload-seed#[DEF1A172944FD378]) [    ] o.a.s.c.CorePropertiesLocator Found 1 core definitions underneath /home/jenkins/jenkins-slave/workspace/Lucene-Solr-BadApples-Tests-master/solr/build/solr-core/test/J0/temp/solr.handler.TestReplicationHandler_DEF1A172944FD378-001/solr-instance-001/.
   [junit4]   2> 4401550 INFO  (TEST-TestReplicationHandler.doTestReplicateAfterCoreReload-seed#[DEF1A172944FD378]) [    ] o.a.s.c.CorePropertiesLocator Cores are: [collection1]
   [junit4]   2> 4401560 INFO  (coreLoadExecutor-12037-thread-1) [    x:collection1] o.a.s.c.SolrConfig Using Lucene MatchVersion: 9.0.0
   [junit4]   2> 4401567 INFO  (coreLoadExecutor-12037-thread-1) [    x:collection1] o.a.s.s.IndexSchema [collection1] Schema name=test
   [junit4]   2> 4401581 INFO  (coreLoadExecutor-12037-thread-1) [    x:collection1] o.a.s.s.IndexSchema Loaded schema test/1.2 with uniqueid field id
   [junit4]   2> 4401581 INFO  (coreLoadExecutor-12037-thread-1) [    x:collection1] o.a.s.c.CoreContainer Creating SolrCore 'collection1' using configuration from instancedir /home/jenkins/jenkins-slave/workspace/Lucene-Solr-BadApples-Tests-master/solr/build/solr-core/test/J0/temp/solr.handler.TestReplicationHandler_DEF1A172944FD378-001/solr-instance-001/./collection1, trusted=true
   [junit4]   2> 4401581 INFO  (coreLoadExecutor-12037-thread-1) [    x:collection1] o.a.s.m.r.SolrJmxReporter JMX monitoring for 'solr.core.collection1' (registry 'solr.core.collection1') enabled at server: com.sun.jmx.mbeanserver.JmxMBeanServer@39588ba5
   [junit4]   2> 4401581 INFO  (coreLoadExecutor-12037-thread-1) [    x:collection1] o.a.s.c.SolrCore [[collection1] ] Opening new SolrCore at [/home/jenkins/jenkins-slave/workspace/Lucene-Solr-BadApples-Tests-master/solr/build/solr-core/test/J0/temp/solr.handler.TestReplicationHandler_DEF1A172944FD378-001/solr-instance-001/collection1], dataDir=[/home/jenkins/jenkins-slave/workspace/Lucene-Solr-BadApples-Tests-master/solr/build/solr-core/test/J0/temp/solr.handler.TestReplicationHandler_DEF1A172944FD378-001/solr-instance-001/./collection1/data/]
   [junit4]   2> 4401582 INFO  (coreLoadExecutor-12037-thread-1) [    x:collection1] o.a.s.u.RandomMergePolicy RandomMergePolicy wrapping class org.apache.lucene.index.LogByteSizeMergePolicy: [LogByteSizeMergePolicy: minMergeSize=1677721, mergeFactor=13, maxMergeSize=2147483648, maxMergeSizeForForcedMerge=9223372036854775807, calibrateSizeByDeletes=false, maxMergeDocs=2147483647, maxCFSSegmentSizeMB=8.796093022207999E12, noCFSRatio=0.0]
   [junit4]   2> 4401664 INFO  (coreLoadExecutor-12037-thread-1) [    x:collection1] o.a.s.u.CommitTracker Hard AutoCommit: disabled
   [junit4]   2> 4401664 INFO  (coreLoadExecutor-12037-thread-1) [    x:collection1] o.a.s.u.CommitTracker Soft AutoCommit: disabled
   [junit4]   2> 4401665 INFO  (coreLoadExecutor-12037-thread-1) [    x:collection1] o.a.s.u.RandomMergePolicy RandomMergePolicy wrapping class org.apache.lucene.index.TieredMergePolicy: [TieredMergePolicy: maxMergeAtOnce=27, maxMergeAtOnceExplicit=33, maxMergedSegmentMB=50.4912109375, floorSegmentMB=0.2255859375, forceMergeDeletesPctAllowed=19.49163641954628, segmentsPerTier=26.0, maxCFSSegmentSizeMB=8.796093022207999E12, noCFSRatio=1.0, deletesPctAllowed=38.96060720959311
   [junit4]   2> 4401665 INFO  (coreLoadExecutor-12037-thread-1) [    x:collection1] o.a.s.s.SolrIndexSearcher Opening [Searcher@1685ae79[collection1] main]
   [junit4]   2> 4401665 INFO  (coreLoadExecutor-12037-thread-1) [    x:collection1] o.a.s.r.ManagedResourceStorage File-based storage initialized to use dir: /home/jenkins/jenkins-slave/workspace/Lucene-Solr-BadApples-Tests-master/solr/build/solr-core/test/J0/temp/solr.handler.TestReplicationHandler_DEF1A172944FD378-001/solr-instance-001/collection1/conf
   [junit4]   2> 4401666 INFO  (coreLoadExecutor-12037-thread-1) [    x:collection1] o.a.s.h.ReplicationHandler Replication enabled for following config files: schema.xml,xslt/dummy.xsl
   [junit4]   2> 4401666 INFO  (coreLoadExecutor-12037-thread-1) [    x:collection1] o.a.s.h.ReplicationHandler Commits will be reserved for 10000ms.
   [junit4]   2> 4401668 INFO  (TEST-TestReplicationHandler.doTestReplicateAfterCoreReload-seed#[DEF1A172944FD378]) [    ] o.a.s.SolrTestCaseJ4 Writing core.properties file to /home/jenkins/jenkins-slave/workspace/Lucene-Solr-BadApples-Tests-master/solr/build/solr-core/test/J0/temp/solr.handler.TestReplicationHandler_DEF1A172944FD378-001/solr-instance-002/collection1
   [junit4]   2> 4401670 WARN  (TEST-TestReplicationHandler.doTestReplicateAfterCoreReload-seed#[DEF1A172944FD378]) [    ] o.e.j.s.AbstractConnector Ignoring deprecated socket close linger time
   [junit4]   2> 4401670 INFO  (TEST-TestReplicationHandler.doTestReplicateAfterCoreReload-seed#[DEF1A172944FD378]) [    ] o.a.s.c.s.e.JettySolrRunner Start Jetty (original configured port=0)
   [junit4]   2> 4401670 INFO  (TEST-TestReplicationHandler.doTestReplicateAfterCoreReload-seed#[DEF1A172944FD378]) [    ] o.a.s.c.s.e.JettySolrRunner Trying to start Jetty on port 0 try number 1 ...
   [junit4]   2> 4401670 INFO  (TEST-TestReplicationHandler.doTestReplicateAfterCoreReload-seed#[DEF1A172944FD378]) [    ] o.e.j.s.Server jetty-9.4.14.v20181114; built: 2018-11-14T21:20:31.478Z; git: c4550056e785fb5665914545889f21dc136ad9e6; jvm 1.8.0_191-b12
   [junit4]   2> 4401673 INFO  (searcherExecutor-12038-thread-1-processing-x:collection1) [    x:collection1] o.a.s.c.SolrCore [collection1] Registered new searcher Searcher@1685ae79[collection1] main{ExitableDirectoryReader(UninvertingDirectoryReader())}
   [junit4]   2> 4401674 INFO  (TEST-TestReplicationHandler.doTestReplicateAfterCoreReload-seed#[DEF1A172944FD378]) [    ] o.e.j.s.session DefaultSessionIdManager workerName=node0
   [junit4]   2> 4401674 INFO  (TEST-TestReplicationHandler.doTestReplicateAfterCoreReload-seed#[DEF1A172944FD378]) [    ] o.e.j.s.session No SessionScavenger set, using defaults
   [junit4]   2> 4401674 INFO  (TEST-TestReplicationHandler.doTestReplicateAfterCoreReload-seed#[DEF1A172944FD378]) [    ] o.e.j.s.session node0 Scavenging every 600000ms
   [junit4]   2> 4401674 INFO  (TEST-TestReplicationHandler.doTestReplicateAfterCoreReload-seed#[DEF1A172944FD378]) [    ] o.e.j.s.h.ContextHandler Started o.e.j.s.ServletContextHandler@606e4334{/solr,null,AVAILABLE}
   [junit4]   2> 4401675 INFO  (TEST-TestReplicationHandler.doTestReplicateAfterCoreReload-seed#[DEF1A172944FD378]) [    ] o.e.j.s.AbstractConnector Started ServerConnector@5c800584{HTTP/1.1,[http/1.1, h2c]}{127.0.0.1:34951}
   [junit4]   2> 4401675 INFO  (TEST-TestReplicationHandler.doTestReplicateAfterCoreReload-seed#[DEF1A172944FD378]) [    ] o.e.j.s.Server Started @4401968ms
   [junit4]   2> 4401675 INFO  (TEST-TestReplicationHandler.doTestReplicateAfterCoreReload-seed#[DEF1A172944FD378]) [    ] o.a.s.c.s.e.JettySolrRunner Jetty properties: {solr.data.dir=/home/jenkins/jenkins-slave/workspace/Lucene-Solr-BadApples-Tests-master/solr/build/solr-core/test/J0/temp/solr.handler.TestReplicationHandler_DEF1A172944FD378-001/solr-instance-002/collection1/data, hostContext=/solr, hostPort=34951}
   [junit4]   2> 4401675 ERROR (TEST-TestReplicationHandler.doTestReplicateAfterCoreReload-seed#[DEF1A172944FD378]) [    ] o.a.s.u.StartupLoggingUtils Missing Java Option solr.log.dir. Logging may be missing or incomplete.
   [junit4]   2> 4401675 INFO  (TEST-TestReplicationHandler.doTestReplicateAfterCoreReload-seed#[DEF1A172944FD378]) [    ] o.a.s.s.SolrDispatchFilter Using logger factory org.apache.logging.slf4j.Log4jLoggerFactory
   [junit4]   2> 4401675 INFO  (TEST-TestReplicationHandler.doTestReplicateAfterCoreReload-seed#[DEF1A172944FD378]) [    ] o.a.s.s.SolrDispatchFilter  ___      _       Welcome to Apache Solr? version 9.0.0
   [junit4]   2> 4401675 INFO  (TEST-TestReplicationHandler.doTestReplicateAfterCoreReload-seed#[DEF1A172944FD378]) [    ] o.a.s.s.SolrDispatchFilter / __| ___| |_ _   Starting in standalone mode on port null
   [junit4]   2> 4401675 INFO  (TEST-TestReplicationHandler.doTestReplicateAfterCoreReload-seed#[DEF1A172944FD378]) [    ] o.a.s.s.SolrDispatchFilter \__ \/ _ \ | '_|  Install dir: null
   [junit4]   2> 4401675 INFO  (TEST-TestReplicationHandler.doTestReplicateAfterCoreReload-seed#[DEF1A172944FD378]) [    ] o.a.s.s.SolrDispatchFilter |___/\___/_|_|    Start time: 2019-02-11T09:51:09.888Z
   [junit4]   2> 4401676 INFO  (TEST-TestReplicationHandler.doTestReplicateAfterCoreReload-seed#[DEF1A172944FD378]) [    ] o.a.s.c.SolrXmlConfig Loading container configuration from /home/jenkins/jenkins-slave/workspace/Lucene-Solr-BadApples-Tests-master/solr/build/solr-core/test/J0/temp/solr.handler.TestReplicationHandler_DEF1A172944FD378-001/solr-instance-002/solr.xml
   [junit4]   2> 4401679 INFO  (TEST-TestReplicationHandler.doTestReplicateAfterCoreReload-seed#[DEF1A172944FD378]) [    ] o.a.s.c.SolrXmlConfig Configuration parameter autoReplicaFailoverWorkLoopDelay is ignored
   [junit4]   2> 4401679 INFO  (TEST-TestReplicationHandler.doTestReplicateAfterCoreReload-seed#[DEF1A172944FD378]) [    ] o.a.s.c.SolrXmlConfig Configuration parameter autoReplicaFailoverBadNodeExpiration is ignored
   [junit4]   2> 4401680 INFO  (TEST-TestReplicationHandler.doTestReplicateAfterCoreReload-seed#[DEF1A172944FD378]) [    ] o.a.s.c.SolrXmlConfig MBean server found: com.sun.jmx.mbeanserver.JmxMBeanServer@39588ba5, but no JMX reporters were configured - adding default JMX reporter.
   [junit4]   2> 4402158 INFO  (TEST-TestReplicationHandler.doTestReplicateAfterCoreReload-seed#[DEF1A172944FD378]) [    ] o.a.s.h.c.HttpShardHandlerFactory Host whitelist initialized: WhitelistHostChecker [whitelistHosts=null, whitelistHostCheckingEnabled=true]
   [junit4]   2> 4402159 WARN  (TEST-TestReplicationHandler.doTestReplicateAfterCoreReload-seed#[DEF1A172944FD378]) [    ] o.e.j.u.s.S.config No Client EndPointIdentificationAlgorithm configured for SslContextFactory@32be1602[provider=null,keyStore=null,trustStore=null]
   [junit4]   2> 4402162 WARN  (TEST-TestReplicationHandler.doTestReplicateAfterCoreReload-seed#[DEF1A172944FD378]) [    ] o.e.j.u.s.S.config No Client EndPointIdentificationAlgorithm configured for SslContextFactory@71e7685b[provider=null,keyStore=null,trustStore=null]
   [junit4]   2> 4402196 INFO  (TEST-TestReplicationHandler.doTestReplicateAfterCoreReload-seed#[DEF1A172944FD378]) [    ] o.a.s.c.TransientSolrCoreCacheDefault Allocating transient cache for 4 transient cores
   [junit4]   2> 4402196 INFO  (TEST-TestReplicationHandler.doTestReplicateAfterCoreReload-seed#[DEF1A172944FD378]) [    ] o.a.s.h.a.MetricsHistoryHandler No .system collection, keeping metrics history in memory.
   [junit4]   2> 4402221 INFO  (TEST-TestReplicationHandler.doTestReplicateAfterCoreReload-seed#[DEF1A172944FD378]) [    ] o.a.s.m.r.SolrJmxReporter JMX monitoring for 'solr.node' (registry 'solr.node') enabled at server: com.sun.jmx.mbeanserver.JmxMBeanServer@39588ba5
   [junit4]   2> 4402241 INFO  (TEST-TestReplicationHandler.doTestReplicateAfterCoreReload-seed#[DEF1A172944FD378]) [    ] o.a.s.m.r.SolrJmxReporter JMX monitoring for 'solr.jvm' (registry 'solr.jvm') enabled at server: com.sun.jmx.mbeanserver.JmxMBeanServer@39588ba5
   [junit4]   2> 4402241 INFO  (TEST-TestReplicationHandler.doTestReplicateAfterCoreReload-seed#[DEF1A172944FD378]) [    ] o.a.s.m.r.SolrJmxReporter JMX monitoring for 'solr.jetty' (registry 'solr.jetty') enabled at server: com.sun.jmx.mbeanserver.JmxMBeanServer@39588ba5
   [junit4]   2> 4402243 INFO  (TEST-TestReplicationHandler.doTestReplicateAfterCoreReload-seed#[DEF1A172944FD378]) [    ] o.a.s.c.CorePropertiesLocator Found 1 core definitions underneath /home/jenkins/jenkins-slave/workspace/Lucene-Solr-BadApples-Tests-master/solr/build/solr-core/test/J0/temp/solr.handler.TestReplicationHandler_DEF1A172944FD378-001/solr-instance-002/.
   [junit4]   2> 4402243 INFO  (TEST-TestReplicationHandler.doTestReplicateAfterCoreReload-seed#[DEF1A172944FD378]) [    ] o.a.s.c.CorePropertiesLocator Cores are: [collection1]
   [junit4]   2> 4402261 INFO  (coreLoadExecutor-12050-thread-1) [    x:collection1] o.a.s.c.SolrConfig Using Lucene MatchVersion: 9.0.0
   [junit4]   2> 4402268 INFO  (coreLoadExecutor-12050-thread-1) [    x:collection1] o.a.s.s.IndexSchema [collection1] Schema name=test
   [junit4]   2> 4402298 INFO  (coreLoadExecutor-12050-thread-1) [    x:collection1] o.a.s.s.IndexSchema Loaded schema test/1.2 with uniqueid field id
   [junit4]   2> 4402298 INFO  (coreLoadExecutor-12050-thread-1) [    x:collection1] o.a.s.c.CoreContainer Creating SolrCore 'collection1' using configuration from instancedir /home/jenkins/jenkins-slave/workspace/Lucene-Solr-BadApples-Tests-master/solr/build/solr-core/test/J0/temp/solr.handler.TestReplicationHandler_DEF1A172944FD378-001/solr-instance-002/./collection1, trusted=true
   [junit4]   2> 4402299 INFO  (coreLoadExecutor-12050-thread-1) [    x:collection1] o.a.s.m.r.SolrJmxReporter JMX monitoring for 'solr.core.collection1' (registry 'solr.core.collection1') enabled at server: com.sun.jmx.mbeanserver.JmxMBeanServer@39588ba5
   [junit4]   2> 4402299 INFO  (coreLoadExecutor-12050-thread-1) [    x:collection1] o.a.s.c.SolrCore [[collection1] ] Opening new SolrCore at [/home/jenkins/jenkins-slave/workspace/Lucene-Solr-BadApples-Tests-master/solr/build/solr-core/test/J0/temp/solr.handler.TestReplicationHandler_DEF1A172944FD378-001/solr-instance-002/collection1], dataDir=[/home/jenkins/jenkins-slave/workspace/Lucene-Solr-BadApples-Tests-master/solr/build/solr-core/test/J0/temp/solr.handler.TestReplicationHandler_DEF1A172944FD378-001/solr-instance-002/./collection1/data/]
   [junit4]   2> 4402322 INFO  (coreLoadExecutor-12050-thread-1) [    x:collection1] o.a.s.u.RandomMergePolicy RandomMergePolicy wrapping class org.apache.lucene.index.LogByteSizeMergePolicy: [LogByteSizeMergePolicy: minMergeSize=1677721, mergeFactor=13, maxMergeSize=2147483648, maxMergeSizeForForcedMerge=9223372036854775807, calibrateSizeByDeletes=false, maxMergeDocs=2147483647, maxCFSSegmentSizeMB=8.796093022207999E12, noCFSRatio=0.0]
   [junit4]   2> 4402435 INFO  (coreLoadExecutor-12050-thread-1) [    x:collection1] o.a.s.u.CommitTracker Hard AutoCommit: disabled
   [junit4]   2> 4402436 INFO  (coreLoadExecutor-12050-thread-1) [    x:collection1] o.a.s.u.CommitTracker Soft AutoCommit: disabled
   [junit4]   2> 4402436 INFO  (coreLoadExecutor-12050-thread-1) [    x:collection1] o.a.s.u.RandomMergePolicy RandomMergePolicy wrapping class org.apache.lucene.index.TieredMergePolicy: [TieredMergePolicy: maxMergeAtOnce=27, maxMergeAtOnceExplicit=33, maxMergedSegmentMB=50.4912109375, floorSegmentMB=0.2255859375, forceMergeDeletesPctAllowed=19.49163641954628, segmentsPerTier=26.0, maxCFSSegmentSizeMB=8.796093022207999E12, noCFSRatio=1.0, deletesPctAllowed=38.96060720959311
   [junit4]   2> 4402437 INFO  (coreLoadExecutor-12050-thread-1) [    x:collection1] o.a.s.s.SolrIndexSearcher Opening [Searcher@4946ec8c[collection1] main]
   [junit4]   2> 4402437 INFO  (coreLoadExecutor-12050-thread-1) [    x:collection1] o.a.s.r.ManagedResourceStorage File-based storage initialized to use dir: /home/jenkins/jenkins-slave/workspace/Lucene-Solr-BadApples-Tests-master/solr/build/solr-core/test/J0/temp/solr.handler.TestReplicationHandler_DEF1A172944FD378-001/solr-instance-002/collection1/conf
   [junit4]   2> 4402438 INFO  (coreLoadExecutor-12050-thread-1) [    x:collection1] o.a.s.h.ReplicationHandler Poll scheduled at an interval of 1000ms
   [junit4]   2> 4402438 INFO  (coreLoadExecutor-12050-thread-1) [    x:collection1] o.a.s.h.ReplicationHandler Commits will be reserved for 10000ms.
   [junit4]   2> 4402452 INFO  (searcherExecutor-12051-thread-1-processing-x:collection1) [    x:collection1] o.a.s.c.SolrCore [collection1] Registered new searcher Searcher@4946ec8c[collection1] main{ExitableDirectoryReader(UninvertingDirectoryReader())}
   [junit4]   2> 4402454 INFO  (qtp717742420-49507) [    x:collection1] o.a.s.c.S.Request [collection1]  webapp=/solr path=/replication params={qt=/replication&wt=javabin&version=2&command=indexversion} status=0 QTime=0
   [junit4]   2> 4402454 INFO  (indexFetcher-12055-thread-1) [    ] o.a.s.h.IndexFetcher Master's generation: 1
   [junit4]   2> 4402454 INFO  (indexFetcher-12055-thread-1) [    ] o.a.s.h.IndexFetcher Master's version: 0
   [junit4]   2> 4402454 INFO  (indexFetcher-12055-thread-1) [    ] o.a.s.h.IndexFetcher Slave's generation: 1
   [junit4]   2> 4402454 INFO  (indexFetcher-12055-thread-1) [    ] o.a.s.h.IndexFetcher Slave's version: 0
   [junit4]   2> 4402454 INFO  (indexFetcher-12055-thread-1) [    ] o.a.s.h.IndexFetcher New index in Master. Deleting mine...
   [junit4]   2> 4402501 INFO  (indexFetcher-12055-thread-1) [    ] o.a.s.s.SolrIndexSearcher Opening [Searcher@387f43f0[collection1] main]
   [junit4]   2> 4402502 INFO  (TEST-TestReplicationHandler.doTestReplicateAfterCoreReload-seed#[DEF1A172944FD378]) [    ] o.a.s.c.CoreContainer Shutting down CoreContainer instance=983114425
   [junit4]   2> 4402502 INFO  (searcherExecutor-12051-thread-1) [    ] o.a.s.c.SolrCore [collection1] Registered new searcher Searcher@387f43f0[collection1] main{ExitableDirectoryReader(UninvertingDirectoryReader())}
   [junit4]   2> 4402503 INFO  (indexFetcher-12055-thread-1) [    ] o.a.s.c.SolrCore [collection1]  CLOSING SolrCore org.apache.solr.core.SolrCore@16065f70
   [junit4]   2> 4402503 INFO  (indexFetcher-12055-thread-1) [    ] o.a.s.m.SolrMetricManager Closing metric reporters for registry=solr.core.collection1, tag=16065f70
   [junit4]   2> 4402503 INFO  (indexFetcher-12055-thread-1) [    ] o.a.s.m.r.SolrJmxReporter Closing reporter [org.apache.solr.metrics.reporters.SolrJmxReporter@42ff7cc6: rootName = null, domain = solr.core.collection1, service url = null, agent id = null] for registry solr.core.collection1 / com.codahale.metrics.MetricRegistry@76b52e9c
   [junit4]   2> 4402539 INFO  (TEST-TestReplicationHandler.doTestReplicateAfterCoreReload-seed#[DEF1A172944FD378]) [    ] o.a.s.m.SolrMetricManager Closing metric reporters for registry=solr.node, tag=null
   [junit4]   2> 4402539 INFO  (TEST-TestReplicationHandler.doTestReplicateAfterCoreReload-seed#[DEF1A172944FD378]) [    ] o.a.s.m.r.SolrJmxReporter Closing reporter [org.apache.solr.metrics.reporters.SolrJmxReporter@42c77fbf: rootName = null, domain = solr.node, service url = null, agent id = null] for registry solr.node / com.codahale.metrics.MetricRegistry@7bdb7595
   [junit4]   2> 4402575 INFO  (TEST-TestReplicationHandler.doTestReplicateAfterCoreReload-seed#[DEF1A172944FD378]) [    ] o.a.s.m.SolrMetricManager Closing metric reporters for registry=solr.jvm, tag=null
   [junit4]   2> 4402575 INFO  (TEST-TestReplicationHandler.doTestReplicateAfterCoreReload-seed#[DEF1A172944FD378]) [    ] o.a.s.m.r.SolrJmxReporter Closing reporter [org.apache.solr.metrics.reporters.SolrJmxReporter@1319ee3a: rootName = null, domain = solr.jvm, service url = null, agent id = null] for registry solr.jvm / com.codahale.metrics.MetricRegistry@7ff6c4e9
   [junit4]   2> 4402590 INFO  (TEST-TestReplicationHandler.doTestReplicateAfterCoreReload-seed#[DEF1A172944FD378]) [    ] o.a.s.m.SolrMetricManager Closing metric reporters for registry=solr.jetty, tag=null
   [junit4]   2> 4402590 INFO  (TEST-TestReplicationHandler.doTestReplicateAfterCoreReload-seed#[DEF1A172944FD378]) [    ] o.a.s.m.r.SolrJmxReporter Closing reporter [org.apache.solr.metrics.reporters.SolrJmxReporter@121b32ba: rootName = null, domain = solr.jetty, service url = null, agent id = null] for registry solr.jetty / com.codahale.metrics.MetricRegistry@617c07bb
   [junit4]   1> Done close org.apache.solr.common.util.ExecutorUtil$MDCAwareThreadPoolExecutor@4c0422b4[Terminated, pool size = 0, active threads = 0, queued tasks = 0, completed tasks = 1]
   [junit4]   1> Done close org.apache.solr.common.util.ExecutorUtil$MDCAwareThreadPoolExecutor@664489d7[Terminated, pool size = 0, active threads = 0, queued tasks = 0, completed tasks = 1]
   [junit4]   2> 4402605 INFO  (TEST-TestReplicationHandler.doTestReplicateAfterCoreReload-seed#[DEF1A172944FD378]) [    ] o.e.j.s.AbstractConnector Stopped ServerConnector@5c800584{HTTP/1.1,[http/1.1, h2c]}{127.0.0.1:0}
   [junit4]   2> 4402605 INFO  (TEST-TestReplicationHandler.doTestReplicateAfterCoreReload-seed#[DEF1A172944FD378]) [    ] o.e.j.s.h.ContextHandler Stopped o.e.j.s.ServletContextHandler@606e4334{/solr,null,UNAVAILABLE}
   [junit4]   2> 4402605 INFO  (TEST-TestReplicationHandler.doTestReplicateAfterCoreReload-seed#[DEF1A172944FD378]) [    ] o.e.j.s.session node0 Stopped scavenging
   [junit4]   2> 4402614 INFO  (TEST-TestReplicationHandler.doTestReplicateAfterCoreReload-seed#[DEF1A172944FD378]) [    ] o.a.s.c.CoreContainer Shutting down CoreContainer instance=743082680
   [junit4]   2> 4402615 INFO  (coreCloseExecutor-12058-thread-1) [    x:collection1] o.a.s.c.SolrCore [collection1]  CLOSING SolrCore org.apache.solr.core.SolrCore@70d1457
   [junit4]   2> 4402615 INFO  (coreCloseExecutor-12058-thread-1) [    x:collection1] o.a.s.m.SolrMetricManager Closing metric reporters for registry=solr.core.collection1, tag=70d1457
   [junit4]   2> 4402615 INFO  (coreCloseExecutor-12058-thread-1) [    x:collection1] o.a.s.m.r.SolrJmxReporter Closing reporter [org.apache.solr.metrics.reporters.SolrJmxReporter@18fc0fbf: rootName = null, domain = solr.core.collection1, service url = null, agent id = null] for registry solr.core.collection1 / com.codahale.metrics.MetricRegistry@2932d7f7
   [junit4]   2> 4402627 INFO  (TEST-TestReplicationHandler.doTestReplicateAfterCoreReload-seed#[DEF1A172944FD378]) [    ] o.a.s.m.SolrMetricManager Closing metric reporters for registry=solr.node, tag=null
   [junit4]   2> 4402627 INFO  (TEST-TestReplicationHandler.doTestReplicateAfterCoreReload-seed#[DEF1A172944FD378]) [    ] o.a.s.m.r.SolrJmxReporter Closing reporter [org.apache.solr.metrics.reporters.SolrJmxReporter@71e9696a: rootName = null, domain = solr.node, service url = null, agent id = null] for registry solr.node / com.codahale.metrics.MetricRegistry@4a735c79
   [junit4]   2> 4402628 INFO  (TEST-TestReplicationHandler.doTestReplicateAfterCoreReload-seed#[DEF1A172944FD378]) [    ] o.a.s.m.SolrMetricManager Closing metric reporters for registry=solr.jvm, tag=null
   [junit4]   2> 4402628 INFO  (TEST-TestReplicationHandler.doTestReplicateAfterCoreReload-seed#[DEF1A172944FD378]) [    ] o.a.s.m.r.SolrJmxReporter Closing reporter [org.apache.solr.metrics.reporters.SolrJmxReporter@53e23ae4: rootName = null, domain = solr.jvm, service url = null, agent id = null] for registry solr.jvm / com.codahale.metrics.MetricRegistry@7ff6c4e9
   [junit4]   2> 4402628 INFO  (TEST-TestReplicationHandler.doTestReplicateAfterCoreReload-seed#[DEF1A172944FD378]) [    ] o.a.s.m.SolrMetricManager Closing metric reporters for registry=solr.jetty, tag=null
   [junit4]   2> 4402628 INFO  (TEST-TestReplicationHandler.doTestReplicateAfterCoreReload-seed#[DEF1A172944FD378]) [    ] o.a.s.m.r.SolrJmxReporter Closing reporter [org.apache.solr.metrics.reporters.SolrJmxReporter@3663ef40: rootName = null, domain = solr.jetty, service url = null, agent id = null] for registry solr.jetty / com.codahale.metrics.MetricRegistry@617c07bb
   [junit4]   1> Done close org.apache.solr.common.util.ExecutorUtil$MDCAwareThreadPoolExecutor@612ddbd2[Terminated, pool size = 0, active threads = 0, queued tasks = 0, completed tasks = 1]
   [junit4]   1> Done close org.apache.solr.common.util.ExecutorUtil$MDCAwareThreadPoolExecutor@5f4fcd3d[Terminated, pool size = 0, active threads = 0, queued tasks = 0, completed tasks = 1]
   [junit4]   2> 4402655 INFO  (TEST-TestReplicationHandler.doTestReplicateAfterCoreReload-seed#[DEF1A172944FD378]) [    ] o.e.j.s.AbstractConnector Stopped ServerConnector@7c6e93b3{HTTP/1.1,[http/1.1, h2c]}{127.0.0.1:0}
   [junit4]   2> 4402655 INFO  (TEST-TestReplicationHandler.doTestReplicateAfterCoreReload-seed#[DEF1A172944FD378]) [    ] o.e.j.s.h.ContextHandler Stopped o.e.j.s.ServletContextHandler@e636964{/solr,null,UNAVAILABLE}
   [junit4]   2> 4402655 INFO  (TEST-TestReplicationHandler.doTestReplicateAfterCoreReload-seed#[DEF1A172944FD378]) [    ] o.e.j.s.session node0 Stopped scavenging
   [junit4]   2> 4402656 WARN  (TEST-TestReplicationHandler.doTestReplicateAfterCoreReload-seed#[DEF1A172944FD378]) [    ] o.e.j.s.AbstractConnector Ignoring deprecated socket close linger time
   [junit4]   2> 4402656 INFO  (TEST-TestReplicationHandler.doTestReplicateAfterCoreReload-seed#[DEF1A172944FD378]) [    ] o.a.s.c.s.e.JettySolrRunner Start Jetty (original configured port=0)
   [junit4]   2> 4402656 INFO  (TEST-TestReplicationHandler.doTestReplicateAfterCoreReload-seed#[DEF1A172944FD378]) [    ] o.a.s.c.s.e.JettySolrRunner Trying to start Jetty on port 0 try number 1 ...
   [junit4]   2> 4402656 INFO  (TEST-TestReplicationHandler.doTestReplicateAfterCoreReload-seed#[DEF1A172944FD378]) [    ] o.e.j.s.Server jetty-9.4.14.v20181114; built: 2018-11-14T21:20:31.478Z; git: c4550056e785fb5665914545889f21dc136ad9e6; jvm 1.8.0_191-b12
   [junit4]   2> 4402657 INFO  (TEST-TestReplicationHandler.doTestReplicateAfterCoreReload-seed#[DEF1A172944FD378]) [    ] o.e.j.s.session DefaultSessionIdManager workerName=node0
   [junit4]   2> 4402657 INFO  (TEST-TestReplicationHandler.doTestReplicateAfterCoreReload-seed#[DEF1A172944FD378]) [    ] o.e.j.s.session No SessionScavenger set, using defaults
   [junit4]   2> 4402657 INFO  (TEST-TestReplicationHandler.doTestReplicateAfterCoreReload-seed#[DEF1A172944FD378]) [    ] o.e.j.s.session node0 Scavenging every 660000ms
   [junit4]   2> 4402657 INFO  (TEST-TestReplicationHandler.doTestReplicateAfterCoreReload-seed#[DEF1A172944FD378]) [    ] o.e.j.s.h.ContextHandler Started o.e.j.s.ServletContextHandler@141368c3{/solr,null,AVAILABLE}
   [junit4]   2> 4402658 INFO  (TEST-TestReplicationHandler.doTestReplicateAfterCoreReload-seed#[DEF1A172944FD378]) [    ] o.e.j.s.AbstractConnector Started ServerConnector@5aab9b1f{HTTP/1.1,[http/1.1, h2c]}{127.0.0.1:38028}
   [junit4]   2> 4402658 INFO  (TEST-TestReplicationHandler.doTestReplicateAfterCoreReload-seed#[DEF1A172944FD378]) [    ] o.e.j.s.Server Started @4402951ms
   [junit4]   2> 4402658 INFO  (TEST-TestReplicationHandler.doTestReplicateAfterCoreReload-seed#[DEF1A172944FD378]) [    ] o.a.s.c.s.e.JettySolrRunner Jetty properties: {solr.data.dir=/home/jenkins/jenkins-slave/workspace/Lucene-Solr-BadApples-Tests-master/solr/build/solr-core/test/J0/temp/solr.handler.TestReplicationHandler_DEF1A172944FD378-001/solr-instance-001/collection1/data, hostContext=/solr, hostPort=38028}
   [junit4]   2> 4402658 ERROR (TEST-TestReplicationHandler.doTestReplicateAfterCoreReload-seed#[DEF1A172944FD378]) [    ] o.a.s.u.StartupLoggingUtils Missing Java Option solr.log.dir. Logging may be missing or incomplete.
   [junit4]   2> 4402658 INFO  (TEST-TestReplicationHandler.doTestReplicateAfterCoreReload-seed#[DEF1A172944FD378]) [    ] o.a.s.s.SolrDispatchFilter Using logger factory org.apache.logging.slf4j.Log4jLoggerFactory
   [junit4]   2> 4402658 INFO  (TEST-TestReplicationHandler.doTestReplicateAfterCoreReload-seed#[DEF1A172944FD378]) [    ] o.a.s.s.SolrDispatchFilter  ___      _       Welcome to Apache Solr? version 9.0.0
   [junit4]   2> 4402658 INFO  (TEST-TestReplicationHandler.doTestReplicateAfterCoreReload-seed#[DEF1A172944FD378]) [    ] o.a.s.s.SolrDispatchFilter / __| ___| |_ _   Starting in standalone mode on port null
   [junit4]   2> 4402658 INFO  (TEST-TestReplicationHandler.doTestReplicateAfterCoreReload-seed#[DEF1A172944FD378]) [    ] o.a.s.s.SolrDispatchFilter \__ \/ _ \ | '_|  Install dir: null
   [junit4]   2> 4402658 INFO  (TEST-TestReplicationHandler.doTestReplicateAfterCoreReload-seed#[DEF1A172944FD378]) [    ] o.a.s.s.SolrDispatchFilter |___/\___/_|_|    Start time: 2019-02-11T09:51:10.871Z
   [junit4]   2> 4402658 INFO  (TEST-TestReplicationHandler.doTestReplicateAfterCoreReload-seed#[DEF1A172944FD378]) [    ] o.a.s.c.SolrXmlConfig Loading container configuration from /home/jenkins/jenkins-slave/workspace/Lucene-Solr-BadApples-Tests-master/solr/build/solr-core/test/J0/temp/solr.handler.TestReplicationHandler_DEF1A172944FD378-001/solr-instance-001/solr.xml
   [junit4]   2> 4402678 INFO  (TEST-TestReplicationHandler.doTestReplicateAfterCoreReload-seed#[DEF1A172944FD378]) [    ] o.a.s.c.SolrXmlConfig Configuration parameter autoReplicaFailoverWorkLoopDelay is ignored
   [junit4]   2> 4402678 INFO  (TEST-TestReplicationHandler.doTestReplicateAfterCoreReload-seed#[DEF1A172944FD378]) [    ] o.a.s.c.SolrXmlConfig Configuration parameter autoReplicaFailoverBadNodeExpiration is ignored
   [junit4]   2> 4402679 INFO  (TEST-TestReplicationHandler.doTestReplicateAfterCoreReload-seed#[DEF1A172944FD378]) [    ] o.a.s.c.SolrXmlConfig MBean server found: com.sun.jmx.mbeanserver.JmxMBeanServer@39588ba5, but no JMX reporters were configured - adding default JMX reporter.
   [junit4]   2> 4402877 INFO  (TEST-TestReplicationHandler.doTestReplicateAfterCoreReload-seed#[DEF1A172944FD378]) [    ] o.a.s.h.c.HttpShardHandlerFactory Host whitelist initialized: WhitelistHostChecker [whitelistHosts=null, whitelistHostCheckingEnabled=true]
   [junit4]   2> 4402890 WARN  (TEST-TestReplicationHandler.doTestReplicateAfterCoreReload-seed#[DEF1A172944FD378]) [    ] o.e.j.u.s.S.config No Client EndPointIdentificationAlgorithm configured for SslContextFactory@693cedc3[provider=null,keyStore=null,trustStore=null]
   [junit4]   2> 4402894 WARN  (TEST-TestReplicationHandler.doTestReplicateAfterCoreReload-seed#[DEF1A172944FD378]) [    ] o.e.j.u.s.S.config No Client EndPointIdentificationAlgorithm configured for SslContextFactory@f53bc5f[provider=null,keyStore=null,trustStore=null]
   [junit4]   2> 4403011 INFO  (TEST-TestReplicationHandler.doTestReplicateAfterCoreReload-seed#[DEF1A172944FD378]) [    ] o.a.s.c.TransientSolrCoreCacheDefault Allocating transient cache for 4 transient cores
   [junit4]   2> 4403011 INFO  (TEST-TestReplicationHandler.doTestReplicateAfterCoreReload-seed#[DEF1A172944FD378]) [    ] o.a.s.h.a.MetricsHistoryHandler No .system collection, keeping metrics history in memory.
   [junit4]   2> 4403082 INFO  (TEST-TestReplicationHandler.doTestReplicateAfterCoreReload-seed#[DEF1A172944FD378]) [    ] o.a.s.m.r.SolrJmxReporter JMX monitoring for 'solr.node' (registry 'solr.node') enabled at server: com.sun.jmx.mbeanserver.JmxMBeanServer@39588ba5
   [junit4]   2> 4403132 INFO  (TEST-TestReplicationHandler.doTestReplicateAfterCoreReload-seed#[DEF1A172944FD378]) [    ] o.a.s.m.r.SolrJmxReporter JMX monitoring for 'solr.jvm' (registry 'solr.jvm') enabled at server: com.sun.jmx.mbeanserver.JmxMBeanServer@39588ba5
   [junit4]   2> 4403133 INFO  (TEST-TestReplicationHandler.doTestReplicateAfterCoreReload-seed#[DEF1A172944FD378]) [    ] o.a.s.m.r.SolrJmxReporter JMX monitoring for 'solr.jetty' (registry 'solr.jetty') enabled at server: com.sun.jmx.mbeanserver.JmxMBeanServer@39588ba5
   [junit4]   2> 4403135 INFO  (TEST-TestReplicationHandler.doTestReplicateAfterCoreReload-seed#[DEF1A172944FD378]) [    ] o.a.s.c.CorePropertiesLocator Found 1 core definitions underneath /home/jenkins/jenkins-slave/workspace/Lucene-Solr-BadApples-Tests-master/solr/build/solr-core/test/J0/temp/solr.handler.TestReplicationHandler_DEF1A172944FD378-001/solr-instance-001/.
   [junit4]   2> 4403135 INFO  (TEST-TestReplicationHandler.doTestReplicateAfterCoreReload-seed#[DEF1A172944FD378]) [    ] o.a.s.c.CorePropertiesLocator Cores are: [collection1]
   [junit4]   2> 4403227 INFO  (coreLoadExecutor-12068-thread-1) [    x:collection1] o.a.s.c.SolrConfig Using Lucene MatchVersion: 9.0.0
   [junit4]   2> 4403295 INFO  (coreLoadExecutor-12068-thread-1) [    x:collection1] o.a.s.s.IndexSchema [collection1] Schema name=test
   [junit4]   2> 4403297 INFO  (coreLoadExecutor-12068-thread-1) [    x:collection1] o.a.s.s.IndexSchema Loaded schema test/1.2 with uniqueid field id
   [junit4]   2> 4403297 INFO  (coreLoadExecutor-12068-thread-1) [    x:collection1] o.a.s.c.CoreContainer Creating SolrCore 'collection1' using configuration from instancedir /home/jenkins/jenkins-slave/workspace/Lucene-Solr-BadApples-Tests-master/solr/build/solr-core/test/J0/temp/solr.handler.TestReplicationHandler_DEF1A172944FD378-001/solr-instance-001/./collection1, trusted=true
   [junit4]   2> 4403297 INFO  (coreLoadExecutor-12068-thread-1) [    x:collection1] o.a.s.m.r.SolrJmxReporter JMX monitoring for 'solr.core.collection1' (registry 'solr.core.collection1') enabled at server: com.sun.jmx.mbeanserver.JmxMBeanServer@39588ba5
   [junit4]   2> 4403297 INFO  (coreLoadExecutor-12068-thread-1) [    x:collection1] o.a.s.c.SolrCore [[collection1] ] Opening new SolrCore at [/home/jenkins/jenkins-slave/workspace/Lucene-Solr-BadApples-Tests-master/solr/build/solr-core/test/J0/temp/solr.handler.TestReplicationHandler_DEF1A172944FD378-001/solr-instance-001/collection1], dataDir=[/home/jenkins/jenkins-slave/workspace/Lucene-Solr-BadApples-Tests-master/solr/build/solr-core/test/J0/temp/solr.handler.TestReplicationHandler_DEF1A172944FD378-001/solr-instance-001/./collection1/data/]
   [junit4]   2> 4403315 INFO  (coreLoadExecutor-12068-thread-1) [    x:collection1] o.a.s.u.RandomMergePolicy RandomMergePolicy wrapping class org.apache.lucene.index.LogByteSizeMergePolicy: [LogByteSizeMergePolicy: minMergeSize=1677721, mergeFactor=13, maxMergeSize=2147483648, maxMergeSizeForForcedMerge=9223372036854775807, calibrateSizeByDeletes=false, maxMergeDocs=2147483647, maxCFSSegmentSizeMB=8.796093022207999E12, noCFSRatio=0.0]
   [junit4]   2> 4403500 INFO  (coreLoadExecutor-12068-thread-1) [    x:collection1] o.a.s.u.CommitTracker Hard AutoCommit: disabled
   [junit4]   2> 4403500 INFO  (coreLoadExecutor-12068-thread-1) [    x:collection1] o.a.s.u.CommitTracker Soft AutoCommit: disabled
   [junit4]   2> 4403500 INFO  (coreLoadExecutor-12068-thread-1) [    x:collection1] o.a.s.u.RandomMergePolicy RandomMergePolicy wrapping class org.apache.lucene.index.TieredMergePolicy: [TieredMergePolicy: maxMergeAtOnce=27, maxMergeAtOnceExplicit=33, maxMergedSegmentMB=50.4912109375, floorSegmentMB=0.2255859375, forceMergeDeletesPctAllowed=19.49163641954628, segmentsPerTier=26.0, maxCFSSegmentSizeMB=8.796093022207999E12, noCFSRatio=1.0, deletesPctAllowed=38.96060720959311
   [junit4]   2> 4403513 INFO  (coreLoadExecutor-12068-thread-1) [    x:collection1] o.a.s.s.SolrIndexSearcher Opening [Searcher@59bf2f28[collection1] main]
   [junit4]   2> 4403513 INFO  (coreLoadExecutor-12068-thread-1) [    x:collection1] o.a.s.r.ManagedResourceStorage File-based storage initialized to use dir: /home/jenkins/jenkins-slave/workspace/Lucene-Solr-BadApples-Tests-master/solr/build/solr-core/test/J0/temp/solr.handler.TestReplicationHandler_DEF1A172944FD378-001/solr-instance-001/collection1/conf
   [junit4]   2> 4403514 INFO  (coreLoadExecutor-12068-thread-1) [    x:collection1] o.a.s.h.ReplicationHandler Replication enabled for following config files: schema.xml
   [junit4]   2> 4403514 INFO  (coreLoadExecutor-12068-thread-1) [    x:collection1] o.a.s.h.ReplicationHandler Commits will be reserved for 10000ms.
   [junit4]   2> 4403514 INFO  (searcherExecutor-12069-thread-1-processing-x:collection1) [    x:collection1] o.a.s.c.SolrCore [collection1] Registered new searcher Searcher@59bf2f28[collection1] main{ExitableDirectoryReader(UninvertingDirectoryReader())}
   [junit4]   2> 4404058 INFO  (qtp1470665711-49562) [    x:collection1] o.a.s.u.DirectUpdateHandler2 [collection1] REMOVING ALL DOCUMENTS FROM INDEX
   [junit4]   2> 4404072 INFO  (qtp1470665711-49562) [    x:collection1] o.a.s.u.p.LogUpdateProcessorFactory [collection1]  webapp=/solr path=/update params={wt=javabin&version=2}{deleteByQuery=*:*} 0 13
   [junit4]   2> 4404073 INFO  (qtp1470665711-49562) [    x:collection1] o.a.s.u.p.LogUpdateProcessorFactory [collection1]  webapp=/solr path=/update params={wt=javabin&version=2}{add=[0]} 0 0
   [junit4]   2> 4404073 INFO  (qtp1470665711-49562) [    x:collection1] o.a.s.u.p.LogUpdateProcessorFactory [collection1]  webapp=/solr path=/update params={wt=javabin&version=2}{add=[1]} 0 0
   [junit4]   2> 4404073 INFO  (qtp1470665711-49562) [    x:collection1] o.a.s.u.p.LogUpdateProcessorFactory [collection1]  webapp=/solr path=/update params={wt=javabin&version=2}{add=[2]} 0 0
   [junit4]   2> 4404074 INFO  (qtp1470665711-49562) [    x:collection1] o.a.s.u.p.LogUpdateProcessorFactory [collection1]  webapp=/solr path=/update params={wt=javabin&version=2}{add=[3]} 0 0
   [junit4]   2> 4404074 INFO  (qtp1470665711-49562) [    x:collection1] o.a.s.u.p.LogUpdateProcessorFactory [collection1]  webapp=/solr path=/update params={wt=javabin&version=2}{add=[4]} 0 0
   [junit4]   2> 4404074 INFO  (qtp1470665711-49562) [    x:collection1] o.a.s.u.p.LogUpdateProcessorFactory [collection1]  webapp=/solr path=/update params={wt=javabin&version=2}{add=[5]} 0 0
   [junit4]   2> 4404075 INFO  (qtp1470665711-49562) [    x:collection1] o.a.s.u.p.LogUpdateProcessorFactory [collection1]  webapp=/solr path=/update params={wt=javabin&version=2}{add=[6]} 0 0
   [junit4]   2> 4404075 INFO  (qtp1470665711-49562) [    x:collection1] o.a.s.u.p.LogUpdateProcessorFactory [collection1]  webapp=/solr path=/update params={wt=javabin&version=2}{add=[7]} 0 0
   [junit4]   2> 4404075 INFO  (qtp1470665711-49562) [    x:collection1] o.a.s.u.p.LogUpdateProcessorFactory [collection1]  webapp=/solr path=/update params={wt=javabin&version=2}{add=[8]} 0 0
   [junit4]   2> 4404075 INFO  (qtp1470665711-49562) [    x:collection1] o.a.s.u.p.LogUpdateProcessorFactory [collection1]  webapp=/solr path=/update params={wt=javabin&version=2}{add=[9]} 0 0
   [junit4]   2> 4404092 INFO  (qtp1470665711-49562) [    x:collection1] o.a.s.u.DirectUpdateHandler2 start commit{,optimize=false,openSearcher=true,waitSearcher=true,expungeDeletes=false,softCommit=false,prepareCommit=false}
   [junit4]   2> 4404092 INFO  (qtp1470665711-49562) [    x:collection1] o.a.s.u.SolrIndexWriter Calling setCommitData with IW:org.apache.solr.update.SolrIndexWriter@218c39e1 commitCommandVersion:0
   [junit4]   2> 4404095 INFO  (qtp1470665711-49562) [    x:collection1] o.a.s.s.SolrIndexSearcher Opening [Searcher@2aee19b9[collection1] main]
   [junit4]   2> 4404108 INFO  (qtp1470665711-49562) [    x:collection1] o.a.s.u.DirectUpdateHandler2 end_commit_flush
   [junit4]   2> 4404109 INFO  (searcherExecutor-12069-thread-1-processing-x:collection1) [    x:collection1] o.a.s.c.SolrCore [collection1] Registered new searcher Searcher@2aee19b9[collection1] main{ExitableDirectoryReader(UninvertingDirectoryReader(Uninverting(_0(9.0.0):C10:[diagnostics={os=Linux, java.vendor=Oracle Corporation, java.version=1.8.0_191, java.vm.version=25.191-b12, lucene.version=9.0.0, os.arch=amd64, java.runtime.version=1.8.0_191-b12, source=flush, os.version=4.4.0-112-generic, timestamp=1549878672306}]:[attributes={Lucene50StoredFieldsFormat.mode=BEST_SPEED}])))}
   [junit4]   2> 4404111 INFO  (qtp1470665711-49562) [    x:collection1] o.a.s.u.p.LogUpdateProcessorFactory [collection1]  webapp=/solr path=/update params={waitSearcher=true&commit=true&softCommit=false&wt=javabin&version=2}{commit=} 0 18
   [junit4]   2> 4404111 INFO  (qtp1470665711-49562) [    x:collection1] o.a.s.c.S.Request [collection1]  webapp=/solr path=/select params={q=*:*&sort=id+desc&wt=javabin&version=2} hits=10 status=0 QTime=0
   [junit4]   2> 4404112 INFO  (TEST-TestReplicationHandler.doTestReplicateAfterCoreReload-seed#[DEF1A172944FD378]) [    ] o.a.s.h.TestReplicationHandler Waited for 0ms and found 10 docs
   [junit4]   2> 4404129 WARN  (TEST-TestReplicationHandler.doTestReplicateAfterCoreReload-seed#[DEF1A172944FD378]) [    ] o.e.j.s.AbstractConnector Ignoring deprecated socket close linger time
   [junit4]   2> 4404130 INFO  (TEST-TestReplicationHandler.doTestReplicateAfterCoreReload-seed#[DEF1A172944FD378]) [    ] o.a.s.c.s.e.JettySolrRunner Start Jetty (original configured port=0)
   [junit4]   2> 4404130 INFO  (TEST-TestReplicationHandler.doTestReplicateAfterCoreReload-seed#[DEF1A172944FD378]) [    ] o.a.s.c.s.e.JettySolrRunner Trying to start Jetty on port 0 try number 1 ...
   [junit4]   2> 4404130 INFO  (TEST-TestReplicationHandler.doTestReplicateAfterCoreReload-seed#[DEF1A172944FD378]) [    ] o.e.j.s.Server jetty-9.4.14.v20181114; built: 2018-11-14T21:20:31.478Z; git: c4550056e785fb5665914545889f21dc136ad9e6; jvm 1.8.0_191-b12
   [junit4]   2> 4404132 INFO  (TEST-TestReplicationHandler.doTestReplicateAfterCoreReload-seed#[DEF1A172944FD378]) [    ] o.e.j.s.session DefaultSessionIdManager workerName=node0
   [junit4]   2> 4404132 INFO  (TEST-TestReplicationHandler.doTestReplicateAfterCoreReload-seed#[DEF1A172944FD378]) [    ] o.e.j.s.session No SessionScavenger set, using defaults
   [junit4]   2> 4404132 INFO  (TEST-TestReplicationHandler.doTestReplicateAfterCoreReload-seed#[DEF1A172944FD378]) [    ] o.e.j.s.session node0 Scavenging every 600000ms
   [junit4]   2> 4404132 INFO  (TEST-TestReplicationHandler.doTestReplicateAfterCoreReload-seed#[DEF1A172944FD378]) [    ] o.e.j.s.h.ContextHandler Started o.e.j.s.ServletContextHandler@8820a66{/solr,null,AVAILABLE}
   [junit4]   2> 4404134 INFO  (TEST-TestReplicationHandler.doTestReplicateAfterCoreReload-seed#[DEF1A172944FD378]) [    ] o.e.j.s.AbstractConnector Started ServerConnector@1cc08de3{HTTP/1.1,[http/1.1, h2c]}{127.0.0.1:34094}
   [junit4]   2> 4404134 INFO  (TEST-TestReplicationHandler.doTestReplicateAfterCoreReload-seed#[DEF1A172944FD378]) [    ] o.e.j.s.Server Started @4404427ms
   [junit4]   2> 4404134 INFO  (TEST-TestReplicationHandler.doTestReplicateAfterCoreReload-seed#[DEF1A172944FD378]) [    ] o.a.s.c.s.e.JettySolrRunner Jetty properties: {solr.data.dir=/home/jenkins/jenkins-slave/workspace/Lucene-Solr-BadApples-Tests-master/solr/build/solr-core/test/J0/temp/solr.handler.TestReplicationHandler_DEF1A172944FD378-001/solr-instance-002/collection1/data, hostContext=/solr, hostPort=34094}
   [junit4]   2> 4404134 ERROR (TEST-TestReplicationHandler.doTestReplicateAfterCoreReload-seed#[DEF1A172944FD378]) [    ] o.a.s.u.StartupLoggingUtils Missing Java Option solr.log.dir. Logging may be missing or incomplete.
   [junit4]   2> 4404134 INFO  (TEST-TestReplicationHandler.doTestReplicateAfterCoreReload-seed#[DEF1A172944FD378]) [    ] o.a.s.s.SolrDispatchFilter Using logger factory org.apache.logging.slf4j.Log4jLoggerFactory
   [junit4]   2> 4404134 INFO  (TEST-TestReplicationHandler.doTestReplicateAfterCoreReload-seed#[DEF1A172944FD378]) [    ] o.a.s.s.SolrDispatchFilter  ___      _       Welcome to Apache Solr? version 9.0.0
   [junit4]   2> 4404134 INFO  (TEST-TestReplicationHandler.doTestReplicateAfterCoreReload-seed#[DEF1A172944FD378]) [    ] o.a.s.s.SolrDispatchFilter / __| ___| |_ _   Starting in standalone mode on port null
   [junit4]   2> 4404134 INFO  (TEST-TestReplicationHandler.doTestReplicateAfterCoreReload-seed#[DEF1A172944FD378]) [    ] o.a.s.s.SolrDispatchFilter \__ \/ _ \ | '_|  Install dir: null
   [junit4]   2> 4404134 INFO  (TEST-TestReplicationHandler.doTestReplicateAfterCoreReload-seed#[DEF1A172944FD378]) [    ] o.a.s.s.SolrDispatchFilter |___/\___/_|_|    Start time: 2019-02-11T09:51:12.347Z
   [junit4]   2> 4404134 INFO  (TEST-TestReplicationHandler.doTestReplicateAfterCoreReload-seed#[DEF1A172944FD378]) [    ] o.a.s.c.SolrXmlConfig Loading container configuration from /home/jenkins/jenkins-slave/workspace/Lucene-Solr-BadApples-Tests-master/solr/build/solr-core/test/J0/temp/solr.handler.TestReplicationHandler_DEF1A172944FD378-001/solr-instance-002/solr.xml
   [junit4]   2> 4404154 INFO  (TEST-TestReplicationHandler.doTestReplicateAfterCoreReload-seed#[DEF1A172944FD378]) [    ] o.a.s.c.SolrXmlConfig Configuration parameter autoReplicaFailoverWorkLoopDelay is ignored
   [junit4]   2> 4404154 INFO  (TEST-TestReplicationHandler.doTestReplicateAfterCoreReload-seed#[DEF1A172944FD378]) [    ] o.a.s.c.SolrXmlConfig Configuration parameter autoReplicaFailoverBadNodeExpiration is ignored
   [junit4]   2> 4404256 INFO  (TEST-TestReplicationHandler.doTestReplicateAfterCoreReload-seed#[DEF1A172944FD378]) [    ] o.a.s.c.SolrXmlConfig MBean server found: com.sun.jmx.mbeanserver.JmxMBeanServer@39588ba5, but no JMX reporters were configured - adding default JMX reporter.
   [junit4]   2> 4405150 INFO  (TEST-TestReplicationHandler.doTestReplicateAfterCoreReload-seed#[DEF1A172944FD378]) [    ] o.a.s.h.c.HttpShardHandlerFactory Host whitelist initialized: WhitelistHostChecker [whitelistHosts=null, whitelistHostCheckingEnabled=true]
   [junit4]   2> 4405171 WARN  (TEST-TestReplicationHandler.doTestReplicateAfterCoreReload-seed#[DEF1A172944FD378]) [    ] o.e.j.u.s.S.config No Client EndPointIdentificationAlgorithm configured for SslContextFactory@2dfbd2f8[provider=null,keyStore=null,trustStore=null]
   [junit4]   2> 4405209 WARN  (TEST-TestReplicationHandler.doTestReplicateAfterCoreReload-seed#[DEF1A172944FD378]) [    ] o.e.j.u.s.S.config No Client EndPointIdentificationAlgorithm configured for SslContextFactory@6de5401b[provider=null,keyStore=null,trustStore=null]
   [junit4]   2> 4405296 INFO  (TEST-TestReplicationHandler.doTestReplicateAfterCoreReload-seed#[DEF1A172944FD378]) [    ] o.a.s.c.TransientSolrCoreCacheDefault Allocating transient cache for 4 transient cores
   [junit4]   2> 4405296 INFO  (TEST-TestReplicationHandler.doTestReplicateAfterCoreReload-seed#[DEF1A172944FD378]) [    ] o.a.s.h.a.MetricsHistoryHandler No .system collection, keeping metrics history in memory.
   [junit4]   2> 4405371 INFO  (TEST-TestReplicationHandler.doTestReplicateAfterCoreReload-seed#[DEF1A172944FD378]) [    ] o.a.s.m.r.SolrJmxReporter JMX monitoring for 'solr.node' (registry 'solr.node') enabled at server: com.sun.jmx.mbeanserver.JmxMBeanServer@39588ba5
   [junit4]   2> 4405427 INFO  (TEST-TestReplicationHandler.doTestReplicateAfterCoreReload-seed#[DEF1A172944FD378]) [    ] o.a.s.m.r.SolrJmxReporter JMX monitoring for 'solr.jvm' (registry 'solr.jvm') enabled at server: com.sun.jmx.mbeanserver.JmxMBeanServer@39588ba5
   [junit4]   2> 4405427 INFO  (TEST-TestReplicationHandler.doTestReplicateAfterCoreReload-seed#[DEF1A172944FD378]) [    ] o.a.s.m.r.SolrJmxReporter JMX monitoring for 'solr.jetty' (registry 'solr.jetty') enabled at server: com.sun.jmx.mbeanserver.JmxMBeanServer@39588ba5
   [junit4]   2> 4405441 INFO  (TEST-TestReplicationHandler.doTestReplicateAfterCoreReload-seed#[DEF1A172944FD378]) [    ] o.a.s.c.CorePropertiesLocator Found 1 core definitions underneath /home/jenkins/jenkins-slave/workspace/Lucene-Solr-BadApples-Tests-master/solr/build/solr-core/test/J0/temp/solr.handler.TestReplicationHandler_DEF1A172944FD378-001/solr-instance-002/.
   [junit4]   2> 4405441 INFO  (TEST-TestReplicationHandler.doTestReplicateAfterCoreReload-seed#[DEF1A172944FD378]) [    ] o.a.s.c.CorePropertiesLocator Cores are: [collection1]
   [junit4]   2> 4405500 INFO  (coreLoadExecutor-12081-thread-1) [    x:collection1] o.a.s.c.SolrConfig Using Lucene MatchVersion: 9.0.0
   [junit4]   2> 4405587 INFO  (coreLoadExecutor-12081-thread-1) [    x:collection1] o.a.s.s.IndexSchema [collection1] Schema name=test
   [junit4]   2> 4405589 INFO  (coreLoadExecutor-12081-thread-1) [    x:collection1] o.a.s.s.IndexSchema Loaded schema test/1.2 with uniqueid field id
   [junit4]   2> 4405589 INFO  (coreLoadExecutor-12081-thread-1) [    x:collection1] o.a.s.c.CoreContainer Creating SolrCore 'collection1' using configuration from instancedir /home/jenkins/jenkins-slave/workspace/Lucene-Solr-BadApples-Tests-master/solr/build/solr-core/test/J0/temp/solr.handler.TestReplicationHandler_DEF1A172944FD378-001/solr-instance-002/./collection1, trusted=true
   [junit4]   2> 4405589 INFO  (coreLoadExecutor-12081-thread-1) [    x:collection1] o.a.s.m.r.SolrJmxReporter JMX monitoring for 'solr.core.collection1' (registry 'solr.core.collection1') enabled at server: com.sun.jmx.mbeanserver.JmxMBeanServer@39588ba5
   [junit4]   2> 4405603 INFO  (coreLoadExecutor-12081-thread-1) [    x:collection1] o.a.s.c.SolrCore [[collection1] ] Opening new SolrCore at [/home/jenkins/jenkins-slave/workspace/Lucene-Solr-BadApples-Tests-master/solr/build/solr-core/test/J0/temp/solr.handler.TestReplicationHandler_DEF1A172944FD378-001/solr-instance-002/collection1], dataDir=[/home/jenkins/jenkins-slave/workspace/Lucene-Solr-BadApples-Tests-master/solr/build/solr-core/test/J0/temp/solr.handler.TestReplicationHandler_DEF1A172944FD378-001/solr-instance-002/./collection1/data/]
   [junit4]   2> 4405604 INFO  (coreLoadExecutor-12081-thread-1) [    x:collection1] o.a.s.u.RandomMergePolicy RandomMergePolicy wrapping class org.apache.lucene.index.LogByteSizeMergePolicy: [LogByteSizeMergePolicy: minMergeSize=1677721, mergeFactor=13, maxMergeSize=2147483648, maxMergeSizeForForcedMerge=9223372036854775807, calibrateSizeByDeletes=false, maxMergeDocs=2147483647, maxCFSSegmentSizeMB=8.796093022207999E12, noCFSRatio=0.0]
   [junit4]   2> 4405906 INFO  (coreLoadExecutor-12081-thread-1) [    x:collection1] o.a.s.u.CommitTracker Hard AutoCommit: disabled
   [junit4]   2> 4405906 INFO  (coreLoadExecutor-12081-thread-1) [    x:collection1] o.a.s.u.CommitTracker Soft AutoCommit: disabled
   [junit4]   2> 4405907 INFO  (coreLoadExecutor-12081-thread-1) [    x:collection1] o.a.s.u.RandomMergePolicy RandomMergePolicy wrapping class org.apache.lucene.index.TieredMergePolicy: [TieredMergePolicy: maxMergeAtOnce=27, maxMergeAtOnceExplicit=33, maxMergedSegmentMB=50.4912109375, floorSegmentMB=0.2255859375, forceMergeDeletesPctAllowed=19.49163641954628, segmentsPerTier=26.0, maxCFSSegmentSizeMB=8.796093022207999E12, noCFSRatio=1.0, deletesPctAllowed=38.96060720959311
   [junit4]   2> 4405907 INFO  (coreLoadExecutor-12081-thread-1) [    x:collection1] o.a.s.s.SolrIndexSearcher Opening [Searcher@6907c889[collection1] main]
   [junit4]   2> 4405907 INFO  (coreLoadExecutor-12081-thread-1) [    x:collection1] o.a.s.r.ManagedResourceStorage File-based storage initialized to use dir: /home/jenkins/jenkins-slave/workspace/Lucene-Solr-BadApples-Tests-master/solr/build/solr-core/test/J0/temp/solr.handler.TestReplicationHandler_DEF1A172944FD378-001/solr-instance-002/collection1/conf
   [junit4]   2> 4405910 INFO  (coreLoadExecutor-12081-thread-1) [    x:collection1] o.a.s.h.ReplicationHandler Poll scheduled at an interval of 1000ms
   [junit4]   2> 4405910 INFO  (coreLoadExecutor-12081-thread-1) [    x:collection1] o.a.s.h.ReplicationHandler Commits will be reserved for 10000ms.
   [junit4]   2> 4405910 INFO  (searcherExecutor-12082-thread-1-processing-x:collection1) [    x:collection1] o.a.s.c.SolrCore [collection1] Registered new searcher Searcher@6907c889[collection1] main{ExitableDirectoryReader(UninvertingDirectoryReader())}
   [junit4]   2> 4405932 INFO  (qtp1470665711-49564) [    x:collection1] o.a.s.c.S.Request [collection1]  webapp=/solr path=/replication params={qt=/replication&wt=javabin&version=2&command=indexversion} status=0 QTime=0
   [junit4]   2> 4405933 INFO  (indexFetcher-12086-thread-1) [    ] o.a.s.h.IndexFetcher Master's generation: 2
   [junit4]   2> 4405933 INFO  (indexFetcher-12086-thread-1) [    ] o.a.s.h.IndexFetcher Master's version: 1549878672305
   [junit4]   2> 4405933 INFO  (indexFetcher-12086-thread-1) [    ] o.a.s.h.IndexFetcher Slave's generation: 1
   [junit4]   2> 4405933 INFO  (indexFetcher-12086-thread-1) [    ] o.a.s.h.IndexFetcher Slave's version: 0
   [junit4]   2> 4405933 INFO  (indexFetcher-12086-thread-1) [    ] o.a.s.h.IndexFetcher Starting replication process
   [junit4]   2> 4405948 INFO  (qtp156873419-49584) [    x:collection1] o.a.s.c.S.Request [collection1]  webapp=/solr path=/select params={q=*:*&sort=id+desc&wt=javabin&version=2} hits=0 status=0 QTime=0
   [junit4]   2> 4405948 INFO  (TEST-TestReplicationHandler.doTestReplicateAfterCoreReload-seed#[DEF1A172944FD378]) [    ] o.a.s.h.TestReplicationHandler Waiting for 10 docs
   [junit4]   2> 4405950 INFO  (qtp1470665711-49565) [    x:collection1] o.a.s.c.S.Request [collection1]  webapp=/solr path=/replication params={generation=2&qt=/replication&tlogFiles=false&wt=javabin&version=2&command=filelist} status=0 QTime=2
   [junit4]   2> 4405950 INFO  (indexFetcher-12086-thread-1) [    ] o.a.s.h.IndexFetcher Number of files in latest index in master: 10
   [junit4]   2> 4405964 INFO  (indexFetcher-12086-thread-1) [    ] o.a.s.u.RandomMergePolicy RandomMergePolicy wrapping class org.apache.lucene.index.LogByteSizeMergePolicy: [LogByteSizeMergePolicy: minMergeSize=1677721, mergeFactor=21, maxMergeSize=2147483648, maxMergeSizeForForcedMerge=9223372036854775807, calibrateSizeByDeletes=true, maxMergeDocs=2147483647, maxCFSSegmentSizeMB=8.79609302220799

[...truncated too long message...]

s.xml

resolve:

ivy-availability-check:
[loadresource] Do not set property disallowed.ivy.jars.list as its length is 0.

-ivy-fail-disallowed-ivy-version:

ivy-fail:

ivy-configure:
[ivy:configure] :: loading settings :: file = /home/jenkins/jenkins-slave/workspace/Lucene-Solr-BadApples-Tests-master/lucene/top-level-ivy-settings.xml

resolve:

ivy-availability-check:
[loadresource] Do not set property disallowed.ivy.jars.list as its length is 0.

-ivy-fail-disallowed-ivy-version:

ivy-fail:

ivy-fail:

ivy-configure:
[ivy:configure] :: loading settings :: file = /home/jenkins/jenkins-slave/workspace/Lucene-Solr-BadApples-Tests-master/lucene/top-level-ivy-settings.xml

resolve:

ivy-availability-check:
[loadresource] Do not set property disallowed.ivy.jars.list as its length is 0.

-ivy-fail-disallowed-ivy-version:

ivy-fail:

ivy-configure:
[ivy:configure] :: loading settings :: file = /home/jenkins/jenkins-slave/workspace/Lucene-Solr-BadApples-Tests-master/lucene/top-level-ivy-settings.xml

resolve:

ivy-availability-check:
[loadresource] Do not set property disallowed.ivy.jars.list as its length is 0.

-ivy-fail-disallowed-ivy-version:

ivy-fail:

ivy-fail:

ivy-configure:
[ivy:configure] :: loading settings :: file = /home/jenkins/jenkins-slave/workspace/Lucene-Solr-BadApples-Tests-master/lucene/top-level-ivy-settings.xml

resolve:

ivy-availability-check:
[loadresource] Do not set property disallowed.ivy.jars.list as its length is 0.

-ivy-fail-disallowed-ivy-version:

ivy-fail:

ivy-fail:

ivy-configure:
[ivy:configure] :: loading settings :: file = /home/jenkins/jenkins-slave/workspace/Lucene-Solr-BadApples-Tests-master/lucene/top-level-ivy-settings.xml

resolve:

ivy-availability-check:
[loadresource] Do not set property disallowed.ivy.jars.list as its length is 0.

-ivy-fail-disallowed-ivy-version:

ivy-fail:

ivy-fail:

ivy-configure:
[ivy:configure] :: loading settings :: file = /home/jenkins/jenkins-slave/workspace/Lucene-Solr-BadApples-Tests-master/lucene/top-level-ivy-settings.xml

resolve:

ivy-availability-check:
[loadresource] Do not set property disallowed.ivy.jars.list as its length is 0.

-ivy-fail-disallowed-ivy-version:

ivy-fail:

ivy-fail:

ivy-configure:
[ivy:configure] :: loading settings :: file = /home/jenkins/jenkins-slave/workspace/Lucene-Solr-BadApples-Tests-master/lucene/top-level-ivy-settings.xml

resolve:

ivy-availability-check:
[loadresource] Do not set property disallowed.ivy.jars.list as its length is 0.

-ivy-fail-disallowed-ivy-version:

ivy-fail:

ivy-fail:

ivy-configure:
[ivy:configure] :: loading settings :: file = /home/jenkins/jenkins-slave/workspace/Lucene-Solr-BadApples-Tests-master/lucene/top-level-ivy-settings.xml

resolve:

ivy-availability-check:
[loadresource] Do not set property disallowed.ivy.jars.list as its length is 0.

-ivy-fail-disallowed-ivy-version:

ivy-fail:

ivy-fail:

ivy-configure:
[ivy:configure] :: loading settings :: file = /home/jenkins/jenkins-slave/workspace/Lucene-Solr-BadApples-Tests-master/lucene/top-level-ivy-settings.xml

resolve:

ivy-availability-check:
[loadresource] Do not set property disallowed.ivy.jars.list as its length is 0.

-ivy-fail-disallowed-ivy-version:

ivy-fail:

ivy-fail:

ivy-configure:
[ivy:configure] :: loading settings :: file = /home/jenkins/jenkins-slave/workspace/Lucene-Solr-BadApples-Tests-master/lucene/top-level-ivy-settings.xml

resolve:

ivy-availability-check:
[loadresource] Do not set property disallowed.ivy.jars.list as its length is 0.

-ivy-fail-disallowed-ivy-version:

ivy-fail:

ivy-fail:

ivy-configure:
[ivy:configure] :: loading settings :: file = /home/jenkins/jenkins-slave/workspace/Lucene-Solr-BadApples-Tests-master/lucene/top-level-ivy-settings.xml

resolve:

ivy-availability-check:
[loadresource] Do not set property disallowed.ivy.jars.list as its length is 0.

-ivy-fail-disallowed-ivy-version:

ivy-fail:

ivy-fail:

ivy-configure:
[ivy:configure] :: loading settings :: file = /home/jenkins/jenkins-slave/workspace/Lucene-Solr-BadApples-Tests-master/lucene/top-level-ivy-settings.xml

resolve:

ivy-availability-check:
[loadresource] Do not set property disallowed.ivy.jars.list as its length is 0.

-ivy-fail-disallowed-ivy-version:

ivy-fail:

ivy-fail:

ivy-configure:
[ivy:configure] :: loading settings :: file = /home/jenkins/jenkins-slave/workspace/Lucene-Solr-BadApples-Tests-master/lucene/top-level-ivy-settings.xml

resolve:

jar-checksums:
    [mkdir] Created dir: /home/jenkins/jenkins-slave/workspace/Lucene-Solr-BadApples-Tests-master/solr/null730167471
     [copy] Copying 237 files to /home/jenkins/jenkins-slave/workspace/Lucene-Solr-BadApples-Tests-master/solr/null730167471
   [delete] Deleting directory /home/jenkins/jenkins-slave/workspace/Lucene-Solr-BadApples-Tests-master/solr/null730167471

check-working-copy:
[ivy:cachepath] :: resolving dependencies :: org.eclipse.jgit#org.eclipse.jgit-caller;working
[ivy:cachepath] confs: [default]
[ivy:cachepath] found org.eclipse.jgit#org.eclipse.jgit;4.6.0.201612231935-r in public
[ivy:cachepath] found com.jcraft#jsch;0.1.53 in public
[ivy:cachepath] found com.googlecode.javaewah#JavaEWAH;1.1.6 in public
[ivy:cachepath] found org.apache.httpcomponents#httpclient;4.3.6 in public
[ivy:cachepath] found org.apache.httpcomponents#httpcore;4.3.3 in public
[ivy:cachepath] found commons-logging#commons-logging;1.1.3 in public
[ivy:cachepath] found commons-codec#commons-codec;1.6 in public
[ivy:cachepath] found org.slf4j#slf4j-api;1.7.2 in public
[ivy:cachepath] :: resolution report :: resolve 73ms :: artifacts dl 1ms
        ---------------------------------------------------------------------
        |                  |            modules            ||   artifacts   |
        |       conf       | number| search|dwnlded|evicted|| number|dwnlded|
        ---------------------------------------------------------------------
        |      default     |   8   |   0   |   0   |   0   ||   8   |   0   |
        ---------------------------------------------------------------------
[wc-checker] Initializing working copy...
[wc-checker] SLF4J: Failed to load class "org.slf4j.impl.StaticLoggerBinder".
[wc-checker] SLF4J: Defaulting to no-operation (NOP) logger implementation
[wc-checker] SLF4J: See http://www.slf4j.org/codes.html#StaticLoggerBinder for further details.
[wc-checker] Checking working copy status...

-jenkins-base:

BUILD SUCCESSFUL
Total time: 238 minutes 16 seconds
Archiving artifacts
java.lang.InterruptedException: no matches found within 10000
        at hudson.FilePath$ValidateAntFileMask.hasMatch(FilePath.java:2847)
        at hudson.FilePath$ValidateAntFileMask.invoke(FilePath.java:2726)
        at hudson.FilePath$ValidateAntFileMask.invoke(FilePath.java:2707)
        at hudson.FilePath$FileCallableWrapper.call(FilePath.java:3086)
Also:   hudson.remoting.Channel$CallSiteStackTrace: Remote call to lucene2
                at hudson.remoting.Channel.attachCallSiteStackTrace(Channel.java:1741)
                at hudson.remoting.UserRequest$ExceptionResponse.retrieve(UserRequest.java:357)
                at hudson.remoting.Channel.call(Channel.java:955)
                at hudson.FilePath.act(FilePath.java:1072)
                at hudson.FilePath.act(FilePath.java:1061)
                at hudson.FilePath.validateAntFileMask(FilePath.java:2705)
                at hudson.tasks.ArtifactArchiver.perform(ArtifactArchiver.java:243)
                at hudson.tasks.BuildStepCompatibilityLayer.perform(BuildStepCompatibilityLayer.java:81)
                at hudson.tasks.BuildStepMonitor$1.perform(BuildStepMonitor.java:20)
                at hudson.model.AbstractBuild$AbstractBuildExecution.perform(AbstractBuild.java:744)
                at hudson.model.AbstractBuild$AbstractBuildExecution.performAllBuildSteps(AbstractBuild.java:690)
                at hudson.model.Build$BuildExecution.post2(Build.java:186)
                at hudson.model.AbstractBuild$AbstractBuildExecution.post(AbstractBuild.java:635)
                at hudson.model.Run.execute(Run.java:1835)
                at hudson.model.FreeStyleBuild.run(FreeStyleBuild.java:43)
                at hudson.model.ResourceController.execute(ResourceController.java:97)
                at hudson.model.Executor.run(Executor.java:429)
Caused: hudson.FilePath$TunneledInterruptedException
        at hudson.FilePath$FileCallableWrapper.call(FilePath.java:3088)
        at hudson.remoting.UserRequest.perform(UserRequest.java:212)
        at hudson.remoting.UserRequest.perform(UserRequest.java:54)
        at hudson.remoting.Request$2.run(Request.java:369)
        at hudson.remoting.InterceptingExecutorService$1.call(InterceptingExecutorService.java:72)
        at java.util.concurrent.FutureTask.run(FutureTask.java:266)
        at java.util.concurrent.ThreadPoolExecutor.runWorker(ThreadPoolExecutor.java:1142)
        at java.util.concurrent.ThreadPoolExecutor$Worker.run(ThreadPoolExecutor.java:617)
        at java.lang.Thread.run(Thread.java:748)
Caused: java.lang.InterruptedException: java.lang.InterruptedException: no matches found within 10000
        at hudson.FilePath.act(FilePath.java:1074)
        at hudson.FilePath.act(FilePath.java:1061)
        at hudson.FilePath.validateAntFileMask(FilePath.java:2705)
        at hudson.tasks.ArtifactArchiver.perform(ArtifactArchiver.java:243)
        at hudson.tasks.BuildStepCompatibilityLayer.perform(BuildStepCompatibilityLayer.java:81)
        at hudson.tasks.BuildStepMonitor$1.perform(BuildStepMonitor.java:20)
        at hudson.model.AbstractBuild$AbstractBuildExecution.perform(AbstractBuild.java:744)
        at hudson.model.AbstractBuild$AbstractBuildExecution.performAllBuildSteps(AbstractBuild.java:690)
        at hudson.model.Build$BuildExecution.post2(Build.java:186)
        at hudson.model.AbstractBuild$AbstractBuildExecution.post(AbstractBuild.java:635)
        at hudson.model.Run.execute(Run.java:1835)
        at hudson.model.FreeStyleBuild.run(FreeStyleBuild.java:43)
        at hudson.model.ResourceController.execute(ResourceController.java:97)
        at hudson.model.Executor.run(Executor.java:429)
No artifacts found that match the file pattern "**/*.events,heapdumps/**,**/hs_err_pid*". Configuration error?
Recording test results
Build step 'Publish JUnit test result report' changed build result to UNSTABLE
Email was triggered for: Unstable (Test Failures)
Sending email for trigger: Unstable (Test Failures)


---------------------------------------------------------------------
To unsubscribe, e-mail: [hidden email]
For additional commands, e-mail: [hidden email]