[JENKINS] Lucene-Solr-BadApples-master-Linux (32bit/jdk1.8.0_172) - Build # 144 - Failure!

classic Classic list List threaded Threaded
3 messages Options
Reply | Threaded
Open this post in threaded view
|

[JENKINS] Lucene-Solr-BadApples-master-Linux (32bit/jdk1.8.0_172) - Build # 144 - Failure!

Policeman Jenkins Server-2
Build: https://jenkins.thetaphi.de/job/Lucene-Solr-BadApples-master-Linux/144/
Java: 32bit/jdk1.8.0_172 -client -XX:+UseParallelGC

All tests passed

Build Log:
[...truncated 23800 lines...]
    [javac] Compiling 6 source files to /home/jenkins/workspace/Lucene-Solr-BadApples-master-Linux/solr/build/contrib/solr-prometheus-exporter/classes/java
    [javac] /home/jenkins/workspace/Lucene-Solr-BadApples-master-Linux/solr/contrib/prometheus-exporter/src/java/org/apache/solr/prometheus/collector/SolrCollector.java:21: error: cannot find symbol
    [javac] import org.apache.solr.core.Config;
    [javac]                            ^
    [javac]   symbol:   class Config
    [javac]   location: package org.apache.solr.core
    [javac] /home/jenkins/workspace/Lucene-Solr-BadApples-master-Linux/solr/contrib/prometheus-exporter/src/java/org/apache/solr/prometheus/collector/SolrCollector.java:60: error: cannot find symbol
    [javac]   private Config config;
    [javac]           ^
    [javac]   symbol:   class Config
    [javac]   location: class SolrCollector
    [javac] /home/jenkins/workspace/Lucene-Solr-BadApples-master-Linux/solr/contrib/prometheus-exporter/src/java/org/apache/solr/prometheus/collector/SolrCollector.java:68: error: cannot find symbol
    [javac]   public SolrCollector(SolrClient solrClient, Config config, int numThreads) {
    [javac]                                               ^
    [javac]   symbol:   class Config
    [javac]   location: class SolrCollector
    [javac] /home/jenkins/workspace/Lucene-Solr-BadApples-master-Linux/solr/contrib/prometheus-exporter/src/java/org/apache/solr/prometheus/exporter/SolrExporter.java:32: error: cannot find symbol
    [javac] import org.apache.solr.core.Config;
    [javac]                            ^
    [javac]   symbol:   class Config
    [javac]   location: package org.apache.solr.core
    [javac] /home/jenkins/workspace/Lucene-Solr-BadApples-master-Linux/solr/contrib/prometheus-exporter/src/java/org/apache/solr/prometheus/exporter/SolrExporter.java:87: error: cannot find symbol
    [javac]   private Config config;
    [javac]           ^
    [javac]   symbol:   class Config
    [javac]   location: class SolrExporter
    [javac] /home/jenkins/workspace/Lucene-Solr-BadApples-master-Linux/solr/contrib/prometheus-exporter/src/java/org/apache/solr/prometheus/exporter/SolrExporter.java:118: error: cannot find symbol
    [javac]     this.config = new Config(this.loader, configPath.getFileName().toString());
    [javac]                       ^
    [javac]   symbol:   class Config
    [javac]   location: class SolrExporter
    [javac] Note: /home/jenkins/workspace/Lucene-Solr-BadApples-master-Linux/solr/contrib/prometheus-exporter/src/java/org/apache/solr/prometheus/exporter/SolrExporter.java uses or overrides a deprecated API.
    [javac] Note: Recompile with -Xlint:deprecation for details.
    [javac] Note: Some input files use unchecked or unsafe operations.
    [javac] Note: Recompile with -Xlint:unchecked for details.
    [javac] 6 errors

BUILD FAILED
/home/jenkins/workspace/Lucene-Solr-BadApples-master-Linux/build.xml:642: The following error occurred while executing this line:
/home/jenkins/workspace/Lucene-Solr-BadApples-master-Linux/build.xml:577: The following error occurred while executing this line:
/home/jenkins/workspace/Lucene-Solr-BadApples-master-Linux/build.xml:59: The following error occurred while executing this line:
/home/jenkins/workspace/Lucene-Solr-BadApples-master-Linux/solr/build.xml:287: The following error occurred while executing this line:
/home/jenkins/workspace/Lucene-Solr-BadApples-master-Linux/solr/common-build.xml:479: The following error occurred while executing this line:
/home/jenkins/workspace/Lucene-Solr-BadApples-master-Linux/solr/common-build.xml:558: The following error occurred while executing this line:
/home/jenkins/workspace/Lucene-Solr-BadApples-master-Linux/lucene/common-build.xml:558: The following error occurred while executing this line:
/home/jenkins/workspace/Lucene-Solr-BadApples-master-Linux/lucene/common-build.xml:2056: Compile failed; see the compiler error output for details.

Total time: 107 minutes 7 seconds
Build step 'Invoke Ant' marked build as failure
Archiving artifacts
Setting ANT_1_8_2_HOME=/var/lib/jenkins/tools/hudson.tasks.Ant_AntInstallation/ANT_1.8.2
[WARNINGS] Skipping publisher since build result is FAILURE
Recording test results
Setting ANT_1_8_2_HOME=/var/lib/jenkins/tools/hudson.tasks.Ant_AntInstallation/ANT_1.8.2
Email was triggered for: Failure - Any
Sending email for trigger: Failure - Any
Setting ANT_1_8_2_HOME=/var/lib/jenkins/tools/hudson.tasks.Ant_AntInstallation/ANT_1.8.2
Setting ANT_1_8_2_HOME=/var/lib/jenkins/tools/hudson.tasks.Ant_AntInstallation/ANT_1.8.2
Setting ANT_1_8_2_HOME=/var/lib/jenkins/tools/hudson.tasks.Ant_AntInstallation/ANT_1.8.2
Setting ANT_1_8_2_HOME=/var/lib/jenkins/tools/hudson.tasks.Ant_AntInstallation/ANT_1.8.2


---------------------------------------------------------------------
To unsubscribe, e-mail: [hidden email]
For additional commands, e-mail: [hidden email]
Reply | Threaded
Open this post in threaded view
|

[JENKINS] Lucene-Solr-BadApples-master-Linux (64bit/jdk1.8.0_172) - Build # 145 - Unstable!

Policeman Jenkins Server-2
Build: https://jenkins.thetaphi.de/job/Lucene-Solr-BadApples-master-Linux/145/
Java: 64bit/jdk1.8.0_172 -XX:+UseCompressedOops -XX:+UseConcMarkSweepGC

3 tests failed.
FAILED:  org.apache.solr.cloud.autoscaling.sim.TestSimTriggerIntegration.testNodeMarkersRegistration

Error Message:
Path /autoscaling/nodeAdded/127.0.0.1:10052_solr should have been deleted

Stack Trace:
java.lang.AssertionError: Path /autoscaling/nodeAdded/127.0.0.1:10052_solr should have been deleted
        at __randomizedtesting.SeedInfo.seed([89355BF3689E75DE:918FD3FF66ABB831]:0)
        at org.junit.Assert.fail(Assert.java:88)
        at org.junit.Assert.assertTrue(Assert.java:41)
        at org.junit.Assert.assertFalse(Assert.java:64)
        at org.apache.solr.cloud.autoscaling.sim.TestSimTriggerIntegration.testNodeMarkersRegistration(TestSimTriggerIntegration.java:911)
        at sun.reflect.NativeMethodAccessorImpl.invoke0(Native Method)
        at sun.reflect.NativeMethodAccessorImpl.invoke(NativeMethodAccessorImpl.java:62)
        at sun.reflect.DelegatingMethodAccessorImpl.invoke(DelegatingMethodAccessorImpl.java:43)
        at java.lang.reflect.Method.invoke(Method.java:498)
        at com.carrotsearch.randomizedtesting.RandomizedRunner.invoke(RandomizedRunner.java:1750)
        at com.carrotsearch.randomizedtesting.RandomizedRunner$8.evaluate(RandomizedRunner.java:938)
        at com.carrotsearch.randomizedtesting.RandomizedRunner$9.evaluate(RandomizedRunner.java:974)
        at com.carrotsearch.randomizedtesting.RandomizedRunner$10.evaluate(RandomizedRunner.java:988)
        at com.carrotsearch.randomizedtesting.rules.SystemPropertiesRestoreRule$1.evaluate(SystemPropertiesRestoreRule.java:57)
        at org.apache.lucene.util.TestRuleSetupTeardownChained$1.evaluate(TestRuleSetupTeardownChained.java:49)
        at org.apache.lucene.util.AbstractBeforeAfterRule$1.evaluate(AbstractBeforeAfterRule.java:45)
        at org.apache.lucene.util.TestRuleThreadAndTestName$1.evaluate(TestRuleThreadAndTestName.java:48)
        at org.apache.lucene.util.TestRuleIgnoreAfterMaxFailures$1.evaluate(TestRuleIgnoreAfterMaxFailures.java:64)
        at org.apache.lucene.util.TestRuleMarkFailure$1.evaluate(TestRuleMarkFailure.java:47)
        at com.carrotsearch.randomizedtesting.rules.StatementAdapter.evaluate(StatementAdapter.java:36)
        at com.carrotsearch.randomizedtesting.ThreadLeakControl$StatementRunner.run(ThreadLeakControl.java:368)
        at com.carrotsearch.randomizedtesting.ThreadLeakControl.forkTimeoutingTask(ThreadLeakControl.java:817)
        at com.carrotsearch.randomizedtesting.ThreadLeakControl$3.evaluate(ThreadLeakControl.java:468)
        at com.carrotsearch.randomizedtesting.RandomizedRunner.runSingleTest(RandomizedRunner.java:947)
        at com.carrotsearch.randomizedtesting.RandomizedRunner$5.evaluate(RandomizedRunner.java:832)
        at com.carrotsearch.randomizedtesting.RandomizedRunner$6.evaluate(RandomizedRunner.java:883)
        at com.carrotsearch.randomizedtesting.RandomizedRunner$7.evaluate(RandomizedRunner.java:894)
        at com.carrotsearch.randomizedtesting.rules.StatementAdapter.evaluate(StatementAdapter.java:36)
        at com.carrotsearch.randomizedtesting.rules.SystemPropertiesRestoreRule$1.evaluate(SystemPropertiesRestoreRule.java:57)
        at org.apache.lucene.util.AbstractBeforeAfterRule$1.evaluate(AbstractBeforeAfterRule.java:45)
        at com.carrotsearch.randomizedtesting.rules.StatementAdapter.evaluate(StatementAdapter.java:36)
        at org.apache.lucene.util.TestRuleStoreClassName$1.evaluate(TestRuleStoreClassName.java:41)
        at com.carrotsearch.randomizedtesting.rules.NoShadowingOrOverridesOnMethodsRule$1.evaluate(NoShadowingOrOverridesOnMethodsRule.java:40)
        at com.carrotsearch.randomizedtesting.rules.NoShadowingOrOverridesOnMethodsRule$1.evaluate(NoShadowingOrOverridesOnMethodsRule.java:40)
        at com.carrotsearch.randomizedtesting.rules.StatementAdapter.evaluate(StatementAdapter.java:36)
        at com.carrotsearch.randomizedtesting.rules.StatementAdapter.evaluate(StatementAdapter.java:36)
        at com.carrotsearch.randomizedtesting.rules.StatementAdapter.evaluate(StatementAdapter.java:36)
        at org.apache.lucene.util.TestRuleAssertionsRequired$1.evaluate(TestRuleAssertionsRequired.java:53)
        at org.apache.lucene.util.TestRuleMarkFailure$1.evaluate(TestRuleMarkFailure.java:47)
        at org.apache.lucene.util.TestRuleIgnoreAfterMaxFailures$1.evaluate(TestRuleIgnoreAfterMaxFailures.java:64)
        at org.apache.lucene.util.TestRuleIgnoreTestSuites$1.evaluate(TestRuleIgnoreTestSuites.java:54)
        at com.carrotsearch.randomizedtesting.rules.StatementAdapter.evaluate(StatementAdapter.java:36)
        at com.carrotsearch.randomizedtesting.ThreadLeakControl$StatementRunner.run(ThreadLeakControl.java:368)
        at java.lang.Thread.run(Thread.java:748)


FAILED:  org.apache.solr.cloud.autoscaling.sim.TestSimTriggerIntegration.testNodeMarkersRegistration

Error Message:
Path /autoscaling/nodeAdded/127.0.0.1:10024_solr wasn't created

Stack Trace:
java.lang.AssertionError: Path /autoscaling/nodeAdded/127.0.0.1:10024_solr wasn't created
        at __randomizedtesting.SeedInfo.seed([89355BF3689E75DE:918FD3FF66ABB831]:0)
        at org.junit.Assert.fail(Assert.java:88)
        at org.junit.Assert.assertTrue(Assert.java:41)
        at org.apache.solr.cloud.autoscaling.sim.TestSimTriggerIntegration.testNodeMarkersRegistration(TestSimTriggerIntegration.java:907)
        at sun.reflect.NativeMethodAccessorImpl.invoke0(Native Method)
        at sun.reflect.NativeMethodAccessorImpl.invoke(NativeMethodAccessorImpl.java:62)
        at sun.reflect.DelegatingMethodAccessorImpl.invoke(DelegatingMethodAccessorImpl.java:43)
        at java.lang.reflect.Method.invoke(Method.java:498)
        at com.carrotsearch.randomizedtesting.RandomizedRunner.invoke(RandomizedRunner.java:1750)
        at com.carrotsearch.randomizedtesting.RandomizedRunner$8.evaluate(RandomizedRunner.java:938)
        at com.carrotsearch.randomizedtesting.RandomizedRunner$9.evaluate(RandomizedRunner.java:974)
        at com.carrotsearch.randomizedtesting.RandomizedRunner$10.evaluate(RandomizedRunner.java:988)
        at com.carrotsearch.randomizedtesting.rules.SystemPropertiesRestoreRule$1.evaluate(SystemPropertiesRestoreRule.java:57)
        at org.apache.lucene.util.TestRuleSetupTeardownChained$1.evaluate(TestRuleSetupTeardownChained.java:49)
        at org.apache.lucene.util.AbstractBeforeAfterRule$1.evaluate(AbstractBeforeAfterRule.java:45)
        at org.apache.lucene.util.TestRuleThreadAndTestName$1.evaluate(TestRuleThreadAndTestName.java:48)
        at org.apache.lucene.util.TestRuleIgnoreAfterMaxFailures$1.evaluate(TestRuleIgnoreAfterMaxFailures.java:64)
        at org.apache.lucene.util.TestRuleMarkFailure$1.evaluate(TestRuleMarkFailure.java:47)
        at com.carrotsearch.randomizedtesting.rules.StatementAdapter.evaluate(StatementAdapter.java:36)
        at com.carrotsearch.randomizedtesting.ThreadLeakControl$StatementRunner.run(ThreadLeakControl.java:368)
        at com.carrotsearch.randomizedtesting.ThreadLeakControl.forkTimeoutingTask(ThreadLeakControl.java:817)
        at com.carrotsearch.randomizedtesting.ThreadLeakControl$3.evaluate(ThreadLeakControl.java:468)
        at com.carrotsearch.randomizedtesting.RandomizedRunner.runSingleTest(RandomizedRunner.java:947)
        at com.carrotsearch.randomizedtesting.RandomizedRunner$5.evaluate(RandomizedRunner.java:832)
        at com.carrotsearch.randomizedtesting.RandomizedRunner$6.evaluate(RandomizedRunner.java:883)
        at com.carrotsearch.randomizedtesting.RandomizedRunner$7.evaluate(RandomizedRunner.java:894)
        at com.carrotsearch.randomizedtesting.rules.StatementAdapter.evaluate(StatementAdapter.java:36)
        at com.carrotsearch.randomizedtesting.rules.SystemPropertiesRestoreRule$1.evaluate(SystemPropertiesRestoreRule.java:57)
        at org.apache.lucene.util.AbstractBeforeAfterRule$1.evaluate(AbstractBeforeAfterRule.java:45)
        at com.carrotsearch.randomizedtesting.rules.StatementAdapter.evaluate(StatementAdapter.java:36)
        at org.apache.lucene.util.TestRuleStoreClassName$1.evaluate(TestRuleStoreClassName.java:41)
        at com.carrotsearch.randomizedtesting.rules.NoShadowingOrOverridesOnMethodsRule$1.evaluate(NoShadowingOrOverridesOnMethodsRule.java:40)
        at com.carrotsearch.randomizedtesting.rules.NoShadowingOrOverridesOnMethodsRule$1.evaluate(NoShadowingOrOverridesOnMethodsRule.java:40)
        at com.carrotsearch.randomizedtesting.rules.StatementAdapter.evaluate(StatementAdapter.java:36)
        at com.carrotsearch.randomizedtesting.rules.StatementAdapter.evaluate(StatementAdapter.java:36)
        at com.carrotsearch.randomizedtesting.rules.StatementAdapter.evaluate(StatementAdapter.java:36)
        at org.apache.lucene.util.TestRuleAssertionsRequired$1.evaluate(TestRuleAssertionsRequired.java:53)
        at org.apache.lucene.util.TestRuleMarkFailure$1.evaluate(TestRuleMarkFailure.java:47)
        at org.apache.lucene.util.TestRuleIgnoreAfterMaxFailures$1.evaluate(TestRuleIgnoreAfterMaxFailures.java:64)
        at org.apache.lucene.util.TestRuleIgnoreTestSuites$1.evaluate(TestRuleIgnoreTestSuites.java:54)
        at com.carrotsearch.randomizedtesting.rules.StatementAdapter.evaluate(StatementAdapter.java:36)
        at com.carrotsearch.randomizedtesting.ThreadLeakControl$StatementRunner.run(ThreadLeakControl.java:368)
        at java.lang.Thread.run(Thread.java:748)


FAILED:  org.apache.solr.cloud.autoscaling.sim.TestSimTriggerIntegration.testNodeMarkersRegistration

Error Message:
Path /autoscaling/nodeAdded/127.0.0.1:10297_solr should have been deleted

Stack Trace:
java.lang.AssertionError: Path /autoscaling/nodeAdded/127.0.0.1:10297_solr should have been deleted
        at __randomizedtesting.SeedInfo.seed([89355BF3689E75DE:918FD3FF66ABB831]:0)
        at org.junit.Assert.fail(Assert.java:88)
        at org.junit.Assert.assertTrue(Assert.java:41)
        at org.junit.Assert.assertFalse(Assert.java:64)
        at org.apache.solr.cloud.autoscaling.sim.TestSimTriggerIntegration.testNodeMarkersRegistration(TestSimTriggerIntegration.java:911)
        at sun.reflect.NativeMethodAccessorImpl.invoke0(Native Method)
        at sun.reflect.NativeMethodAccessorImpl.invoke(NativeMethodAccessorImpl.java:62)
        at sun.reflect.DelegatingMethodAccessorImpl.invoke(DelegatingMethodAccessorImpl.java:43)
        at java.lang.reflect.Method.invoke(Method.java:498)
        at com.carrotsearch.randomizedtesting.RandomizedRunner.invoke(RandomizedRunner.java:1750)
        at com.carrotsearch.randomizedtesting.RandomizedRunner$8.evaluate(RandomizedRunner.java:938)
        at com.carrotsearch.randomizedtesting.RandomizedRunner$9.evaluate(RandomizedRunner.java:974)
        at com.carrotsearch.randomizedtesting.RandomizedRunner$10.evaluate(RandomizedRunner.java:988)
        at com.carrotsearch.randomizedtesting.rules.SystemPropertiesRestoreRule$1.evaluate(SystemPropertiesRestoreRule.java:57)
        at org.apache.lucene.util.TestRuleSetupTeardownChained$1.evaluate(TestRuleSetupTeardownChained.java:49)
        at org.apache.lucene.util.AbstractBeforeAfterRule$1.evaluate(AbstractBeforeAfterRule.java:45)
        at org.apache.lucene.util.TestRuleThreadAndTestName$1.evaluate(TestRuleThreadAndTestName.java:48)
        at org.apache.lucene.util.TestRuleIgnoreAfterMaxFailures$1.evaluate(TestRuleIgnoreAfterMaxFailures.java:64)
        at org.apache.lucene.util.TestRuleMarkFailure$1.evaluate(TestRuleMarkFailure.java:47)
        at com.carrotsearch.randomizedtesting.rules.StatementAdapter.evaluate(StatementAdapter.java:36)
        at com.carrotsearch.randomizedtesting.ThreadLeakControl$StatementRunner.run(ThreadLeakControl.java:368)
        at com.carrotsearch.randomizedtesting.ThreadLeakControl.forkTimeoutingTask(ThreadLeakControl.java:817)
        at com.carrotsearch.randomizedtesting.ThreadLeakControl$3.evaluate(ThreadLeakControl.java:468)
        at com.carrotsearch.randomizedtesting.RandomizedRunner.runSingleTest(RandomizedRunner.java:947)
        at com.carrotsearch.randomizedtesting.RandomizedRunner$5.evaluate(RandomizedRunner.java:832)
        at com.carrotsearch.randomizedtesting.RandomizedRunner$6.evaluate(RandomizedRunner.java:883)
        at com.carrotsearch.randomizedtesting.RandomizedRunner$7.evaluate(RandomizedRunner.java:894)
        at com.carrotsearch.randomizedtesting.rules.StatementAdapter.evaluate(StatementAdapter.java:36)
        at com.carrotsearch.randomizedtesting.rules.SystemPropertiesRestoreRule$1.evaluate(SystemPropertiesRestoreRule.java:57)
        at org.apache.lucene.util.AbstractBeforeAfterRule$1.evaluate(AbstractBeforeAfterRule.java:45)
        at com.carrotsearch.randomizedtesting.rules.StatementAdapter.evaluate(StatementAdapter.java:36)
        at org.apache.lucene.util.TestRuleStoreClassName$1.evaluate(TestRuleStoreClassName.java:41)
        at com.carrotsearch.randomizedtesting.rules.NoShadowingOrOverridesOnMethodsRule$1.evaluate(NoShadowingOrOverridesOnMethodsRule.java:40)
        at com.carrotsearch.randomizedtesting.rules.NoShadowingOrOverridesOnMethodsRule$1.evaluate(NoShadowingOrOverridesOnMethodsRule.java:40)
        at com.carrotsearch.randomizedtesting.rules.StatementAdapter.evaluate(StatementAdapter.java:36)
        at com.carrotsearch.randomizedtesting.rules.StatementAdapter.evaluate(StatementAdapter.java:36)
        at com.carrotsearch.randomizedtesting.rules.StatementAdapter.evaluate(StatementAdapter.java:36)
        at org.apache.lucene.util.TestRuleAssertionsRequired$1.evaluate(TestRuleAssertionsRequired.java:53)
        at org.apache.lucene.util.TestRuleMarkFailure$1.evaluate(TestRuleMarkFailure.java:47)
        at org.apache.lucene.util.TestRuleIgnoreAfterMaxFailures$1.evaluate(TestRuleIgnoreAfterMaxFailures.java:64)
        at org.apache.lucene.util.TestRuleIgnoreTestSuites$1.evaluate(TestRuleIgnoreTestSuites.java:54)
        at com.carrotsearch.randomizedtesting.rules.StatementAdapter.evaluate(StatementAdapter.java:36)
        at com.carrotsearch.randomizedtesting.ThreadLeakControl$StatementRunner.run(ThreadLeakControl.java:368)
        at java.lang.Thread.run(Thread.java:748)




Build Log:
[...truncated 14564 lines...]
   [junit4] Suite: org.apache.solr.cloud.autoscaling.sim.TestSimTriggerIntegration
   [junit4]   2> 1572508 INFO  (SUITE-TestSimTriggerIntegration-seed#[89355BF3689E75DE]-worker) [    ] o.a.s.SolrTestCaseJ4 SecureRandom sanity checks: test.solr.allowed.securerandom=null & java.security.egd=file:/dev/./urandom
   [junit4]   2> Creating dataDir: /home/jenkins/workspace/Lucene-Solr-BadApples-master-Linux/solr/build/solr-core/test/J2/temp/solr.cloud.autoscaling.sim.TestSimTriggerIntegration_89355BF3689E75DE-001/init-core-data-001
   [junit4]   2> 1572509 INFO  (SUITE-TestSimTriggerIntegration-seed#[89355BF3689E75DE]-worker) [    ] o.a.s.SolrTestCaseJ4 Using PointFields (NUMERIC_POINTS_SYSPROP=true) w/NUMERIC_DOCVALUES_SYSPROP=false
   [junit4]   2> 1572509 INFO  (SUITE-TestSimTriggerIntegration-seed#[89355BF3689E75DE]-worker) [    ] o.a.s.SolrTestCaseJ4 Randomized ssl (true) and clientAuth (false) via: @org.apache.solr.util.RandomizeSSL(reason=, value=NaN, ssl=NaN, clientAuth=NaN)
   [junit4]   2> 1572512 INFO  (TEST-TestSimTriggerIntegration.testCooldown-seed#[89355BF3689E75DE]) [    ] o.a.s.SolrTestCaseJ4 ###Starting testCooldown
   [junit4]   2> 1572515 DEBUG (TEST-TestSimTriggerIntegration.testCooldown-seed#[89355BF3689E75DE]) [    ] o.a.s.c.a.s.SimClusterStateProvider --- new Overseer leader: 127.0.0.1:10273_solr
   [junit4]   2> 1572515 DEBUG (Simulated OverseerAutoScalingTriggerThread) [    ] o.a.s.c.a.OverseerTriggerThread Adding .auto_add_replicas and .scheduled_maintenance triggers
   [junit4]   2> 1572515 DEBUG (Simulated OverseerAutoScalingTriggerThread) [    ] o.a.s.c.a.OverseerTriggerThread Refreshing /autoscaling.json with znode version 1
   [junit4]   2> 1572515 DEBUG (Simulated OverseerAutoScalingTriggerThread) [    ] o.a.s.c.a.OverseerTriggerThread Current znodeVersion 1, lastZnodeVersion 0
   [junit4]   2> 1572515 DEBUG (Simulated OverseerAutoScalingTriggerThread) [    ] o.a.s.c.a.OverseerTriggerThread Processed trigger updates upto znodeVersion 1
   [junit4]   2> 1572517 DEBUG (Simulated OverseerAutoScalingTriggerThread) [    ] o.a.s.c.a.NodeLostTrigger NodeLostTrigger .auto_add_replicas - Initial livenodes: [127.0.0.1:10273_solr]
   [junit4]   2> 1572525 DEBUG (TEST-TestSimTriggerIntegration.testCooldown-seed#[89355BF3689E75DE]) [    ] o.a.s.c.a.s.SimClusterStateProvider ** creating new collection states, currentVersion=0
   [junit4]   2> 1572525 DEBUG (TEST-TestSimTriggerIntegration.testCooldown-seed#[89355BF3689E75DE]) [    ] o.a.s.c.a.s.SimClusterStateProvider ** saved cluster state version 0
   [junit4]   2> 1572525 INFO  (TEST-TestSimTriggerIntegration.testCooldown-seed#[89355BF3689E75DE]) [    ] o.a.s.h.a.MetricsHistoryHandler No .system collection, keeping metrics history in memory.
   [junit4]   2> 1572533 DEBUG (ScheduledTrigger-10267-thread-1) [    ] o.a.s.c.a.NodeLostTrigger Running NodeLostTrigger: .auto_add_replicas with currently live nodes: 2 and last live nodes: 1
   [junit4]   2> 1572537 DEBUG (Simulated OverseerAutoScalingTriggerThread) [    ] o.a.s.c.a.OverseerTriggerThread -- cleaning old nodeLost / nodeAdded markers
   [junit4]   2> 1572537 DEBUG (Simulated OverseerAutoScalingTriggerThread) [    ] o.a.s.c.a.OverseerTriggerThread Current znodeVersion 1, lastZnodeVersion 1
   [junit4]   2> 1572545 DEBUG (simCloudManagerPool-10266-thread-2) [    ] o.a.s.c.a.AutoScalingHandler Verified autoscaling configuration
   [junit4]   2> 1572545 DEBUG (simCloudManagerPool-10266-thread-2) [    ] o.a.s.c.a.OverseerTriggerThread Refreshing /autoscaling.json with znode version 2
   [junit4]   2> 1572546 DEBUG (Simulated OverseerAutoScalingTriggerThread) [    ] o.a.s.c.a.OverseerTriggerThread Processed trigger updates upto znodeVersion 2
   [junit4]   2> 1572546 DEBUG (Simulated OverseerAutoScalingTriggerThread) [    ] o.a.s.c.a.OverseerTriggerThread -- cleaning old nodeLost / nodeAdded markers
   [junit4]   2> 1572546 DEBUG (Simulated OverseerAutoScalingTriggerThread) [    ] o.a.s.c.a.OverseerTriggerThread Current znodeVersion 2, lastZnodeVersion 2
   [junit4]   2> 1572550 DEBUG (simCloudManagerPool-10266-thread-3) [    ] o.a.s.c.a.AutoScalingHandler Verified autoscaling configuration
   [junit4]   2> 1572550 DEBUG (simCloudManagerPool-10266-thread-3) [    ] o.a.s.c.a.OverseerTriggerThread Refreshing /autoscaling.json with znode version 3
   [junit4]   2> 1572550 DEBUG (Simulated OverseerAutoScalingTriggerThread) [    ] o.a.s.c.a.OverseerTriggerThread Processed trigger updates upto znodeVersion 3
   [junit4]   2> 1572550 INFO  (Simulated OverseerAutoScalingTriggerThread) [    ] o.a.s.c.a.s.TestSimTriggerIntegration TestTriggerAction init
   [junit4]   2> 1572550 DEBUG (Simulated OverseerAutoScalingTriggerThread) [    ] o.a.s.c.a.NodeAddedTrigger NodeAddedTrigger node_added_cooldown_trigger - Initial livenodes: [127.0.0.1:10274_solr, 127.0.0.1:10273_solr]
   [junit4]   2> 1572550 DEBUG (Simulated OverseerAutoScalingTriggerThread) [    ] o.a.s.c.a.NodeAddedTrigger NodeAddedTrigger node_added_cooldown_trigger instantiated with properties: {event=nodeAdded, waitFor=1, actions=[{name=test, class=org.apache.solr.cloud.autoscaling.sim.TestSimTriggerIntegration$TestTriggerAction}], enabled=true}
   [junit4]   2> 1572550 DEBUG (Simulated OverseerAutoScalingTriggerThread) [    ] o.a.s.c.a.OverseerTriggerThread -- cleaning old nodeLost / nodeAdded markers
   [junit4]   2> 1572550 DEBUG (Simulated OverseerAutoScalingTriggerThread) [    ] o.a.s.c.a.OverseerTriggerThread Current znodeVersion 3, lastZnodeVersion 3
   [junit4]   2> 1572554 DEBUG (simCloudManagerPool-10266-thread-4) [    ] o.a.s.c.a.AutoScalingHandler Verified autoscaling configuration
   [junit4]   2> 1572554 DEBUG (simCloudManagerPool-10266-thread-4) [    ] o.a.s.c.a.OverseerTriggerThread Refreshing /autoscaling.json with znode version 4
   [junit4]   2> 1572554 DEBUG (Simulated OverseerAutoScalingTriggerThread) [    ] o.a.s.c.a.OverseerTriggerThread Processed trigger updates upto znodeVersion 4
   [junit4]   2> 1572554 DEBUG (Simulated OverseerAutoScalingTriggerThread) [    ] o.a.s.c.a.OverseerTriggerThread -- cleaning old nodeLost / nodeAdded markers
   [junit4]   2> 1572554 DEBUG (TEST-TestSimTriggerIntegration.testCooldown-seed#[89355BF3689E75DE]) [    ] o.a.s.c.a.s.SimClusterStateProvider -- creating marker: /autoscaling/nodeAdded/127.0.0.1:10275_solr
   [junit4]   2> 1572554 DEBUG (Simulated OverseerAutoScalingTriggerThread) [    ] o.a.s.c.a.OverseerTriggerThread Current znodeVersion 4, lastZnodeVersion 4
   [junit4]   2> 1572557 DEBUG (ScheduledTrigger-10267-thread-1) [    ] o.a.s.c.a.NodeAddedTrigger Running NodeAddedTrigger node_added_cooldown_trigger
   [junit4]   2> 1572557 DEBUG (ScheduledTrigger-10267-thread-1) [    ] o.a.s.c.a.NodeAddedTrigger Found livenodes: 3
   [junit4]   2> 1572557 DEBUG (ScheduledTrigger-10267-thread-1) [    ] o.a.s.c.a.NodeAddedTrigger Tracking new node: 127.0.0.1:10275_solr at time 1878085732570065
   [junit4]   2> 1572558 DEBUG (ScheduledTrigger-10267-thread-2) [    ] o.a.s.c.a.NodeLostTrigger Running NodeLostTrigger: .auto_add_replicas with currently live nodes: 3 and last live nodes: 2
   [junit4]   2> 1572578 DEBUG (ScheduledTrigger-10267-thread-1) [    ] o.a.s.c.a.NodeAddedTrigger Running NodeAddedTrigger node_added_cooldown_trigger
   [junit4]   2> 1572578 DEBUG (ScheduledTrigger-10267-thread-3) [    ] o.a.s.c.a.NodeLostTrigger Running NodeLostTrigger: .auto_add_replicas with currently live nodes: 3 and last live nodes: 3
   [junit4]   2> 1572578 DEBUG (ScheduledTrigger-10267-thread-1) [    ] o.a.s.c.a.NodeAddedTrigger Found livenodes: 3
   [junit4]   2> 1572578 DEBUG (ScheduledTrigger-10267-thread-1) [    ] o.a.s.c.a.NodeAddedTrigger NodeAddedTrigger node_added_cooldown_trigger firing registered processor for nodes: [127.0.0.1:10275_solr] added at times [1878085732570065], now=1878086743533065
   [junit4]   2> 1572578 DEBUG (ScheduledTrigger-10267-thread-1) [    ] o.a.s.c.a.SystemLogListener Collection .system missing, skip sending event {
   [junit4]   2>   "id":"6ac1be8f293d1T9wi5s1ktn3jjrjn1yj28y3ven",
   [junit4]   2>   "source":"node_added_cooldown_trigger",
   [junit4]   2>   "eventTime":1878085732570065,
   [junit4]   2>   "eventType":"NODEADDED",
   [junit4]   2>   "properties":{
   [junit4]   2>     "eventTimes":[1878085732570065],
   [junit4]   2>     "preferredOperation":"movereplica",
   [junit4]   2>     "_enqueue_time_":1878086766032715,
   [junit4]   2>     "nodeNames":["127.0.0.1:10275_solr"]}}
   [junit4]   2> 1572578 DEBUG (ScheduledTrigger-10267-thread-1) [    ] o.a.s.c.a.NodeAddedTrigger Removing new node from tracking: 127.0.0.1:10275_solr
   [junit4]   2> 1572579 DEBUG (AutoscalingActionExecutor-10268-thread-1) [    ] o.a.s.c.a.SystemLogListener Collection .system missing, skip sending event {
   [junit4]   2>   "id":"6ac1be8f293d1T9wi5s1ktn3jjrjn1yj28y3ven",
   [junit4]   2>   "source":"node_added_cooldown_trigger",
   [junit4]   2>   "eventTime":1878085732570065,
   [junit4]   2>   "eventType":"NODEADDED",
   [junit4]   2>   "properties":{
   [junit4]   2>     "eventTimes":[1878085732570065],
   [junit4]   2>     "preferredOperation":"movereplica",
   [junit4]   2>     "_enqueue_time_":1878086766032715,
   [junit4]   2>     "nodeNames":["127.0.0.1:10275_solr"]}}
   [junit4]   2> 1572679 DEBUG (TEST-TestSimTriggerIntegration.testCooldown-seed#[89355BF3689E75DE]) [    ] o.a.s.c.a.s.SimClusterStateProvider -- creating marker: /autoscaling/nodeAdded/127.0.0.1:10276_solr
   [junit4]   2> 1572679 DEBUG (ScheduledTrigger-10267-thread-4) [    ] o.a.s.c.a.NodeLostTrigger Running NodeLostTrigger: .auto_add_replicas with currently live nodes: 4 and last live nodes: 3
   [junit4]   2> 1572680 DEBUG (ScheduledTrigger-10267-thread-2) [    ] o.a.s.c.a.NodeAddedTrigger Running NodeAddedTrigger node_added_cooldown_trigger
   [junit4]   2> 1572680 DEBUG (ScheduledTrigger-10267-thread-2) [    ] o.a.s.c.a.NodeAddedTrigger Found livenodes: 4
   [junit4]   2> 1572680 DEBUG (ScheduledTrigger-10267-thread-2) [    ] o.a.s.c.a.NodeAddedTrigger Tracking new node: 127.0.0.1:10276_solr at time 1878091848574065
   [junit4]   2> 1572700 DEBUG (ScheduledTrigger-10267-thread-4) [    ] o.a.s.c.a.NodeLostTrigger Running NodeLostTrigger: .auto_add_replicas with currently live nodes: 4 and last live nodes: 4
   [junit4]   2> 1572700 DEBUG (ScheduledTrigger-10267-thread-3) [    ] o.a.s.c.a.NodeAddedTrigger Running NodeAddedTrigger node_added_cooldown_trigger
   [junit4]   2> 1572700 DEBUG (ScheduledTrigger-10267-thread-3) [    ] o.a.s.c.a.NodeAddedTrigger Found livenodes: 4
   [junit4]   2> 1572700 DEBUG (ScheduledTrigger-10267-thread-3) [    ] o.a.s.c.a.NodeAddedTrigger NodeAddedTrigger node_added_cooldown_trigger firing registered processor for nodes: [127.0.0.1:10276_solr] added at times [1878091848574065], now=1878092857586065
   [junit4]   2> 1572700 DEBUG (ScheduledTrigger-10267-thread-3) [    ] o.a.s.c.a.SystemLogListener Collection .system missing, skip sending event {
   [junit4]   2>   "id":"6ac1d557d6471T9wi5s1ktn3jjrjn1yj28y3veo",
   [junit4]   2>   "source":"node_added_cooldown_trigger",
   [junit4]   2>   "eventTime":1878091848574065,
   [junit4]   2>   "eventType":"NODEADDED",
   [junit4]   2>   "properties":{
   [junit4]   2>     "eventTimes":[1878091848574065],
   [junit4]   2>     "preferredOperation":"movereplica",
   [junit4]   2>     "_enqueue_time_":1878092862399465,
   [junit4]   2>     "nodeNames":["127.0.0.1:10276_solr"]}}
   [junit4]   2> 1572700 DEBUG (ScheduledTrigger-10267-thread-3) [    ] o.a.s.c.a.NodeAddedTrigger Removing new node from tracking: 127.0.0.1:10276_solr
   [junit4]   2> 1572700 DEBUG (AutoscalingActionExecutor-10268-thread-1) [    ] o.a.s.c.a.SystemLogListener Collection .system missing, skip sending event {
   [junit4]   2>   "id":"6ac1d557d6471T9wi5s1ktn3jjrjn1yj28y3veo",
   [junit4]   2>   "source":"node_added_cooldown_trigger",
   [junit4]   2>   "eventTime":1878091848574065,
   [junit4]   2>   "eventType":"NODEADDED",
   [junit4]   2>   "properties":{
   [junit4]   2>     "eventTimes":[1878091848574065],
   [junit4]   2>     "preferredOperation":"movereplica",
   [junit4]   2>     "_enqueue_time_":1878092862399465,
   [junit4]   2>     "nodeNames":["127.0.0.1:10276_solr"]}}
   [junit4]   2> 1572800 DEBUG (ScheduledTrigger-10267-thread-1) [    ] o.a.s.c.a.NodeAddedTrigger Running NodeAddedTrigger node_added_cooldown_trigger
   [junit4]   2> 1572800 DEBUG (ScheduledTrigger-10267-thread-2) [    ] o.a.s.c.a.NodeLostTrigger Running NodeLostTrigger: .auto_add_replicas with currently live nodes: 4 and last live nodes: 4
   [junit4]   2> 1572800 DEBUG (ScheduledTrigger-10267-thread-1) [    ] o.a.s.c.a.NodeAddedTrigger Found livenodes: 4
   [junit4]   2> 1572821 DEBUG (ScheduledTrigger-10267-thread-4) [    ] o.a.s.c.a.NodeAddedTrigger Running NodeAddedTrigger node_added_cooldown_trigger
   [junit4]   2> 1572821 DEBUG (ScheduledTrigger-10267-thread-2) [    ] o.a.s.c.a.NodeLostTrigger Running NodeLostTrigger: .auto_add_replicas with currently live nodes: 4 and last live nodes: 4
   [junit4]   2> 1572821 DEBUG (ScheduledTrigger-10267-thread-4) [    ] o.a.s.c.a.NodeAddedTrigger Found livenodes: 4
   [junit4]   2> 1572841 DEBUG (ScheduledTrigger-10267-thread-4) [    ] o.a.s.c.a.NodeAddedTrigger Running NodeAddedTrigger node_added_cooldown_trigger
   [junit4]   2> 1572841 DEBUG (ScheduledTrigger-10267-thread-3) [    ] o.a.s.c.a.NodeLostTrigger Running NodeLostTrigger: .auto_add_replicas with currently live nodes: 4 and last live nodes: 4
   [junit4]   2> 1572841 DEBUG (ScheduledTrigger-10267-thread-4) [    ] o.a.s.c.a.NodeAddedTrigger Found livenodes: 4
   [junit4]   2> 1572861 INFO  (Simulated OverseerAutoScalingTriggerThread) [    ] o.a.s.c.a.OverseerTriggerThread OverseerTriggerThread woken up but we are closed, exiting.
   [junit4]   2> 1572861 DEBUG (TEST-TestSimTriggerIntegration.testCooldown-seed#[89355BF3689E75DE]) [    ] o.a.s.c.a.OverseerTriggerThread OverseerTriggerThread has been closed explicitly
   [junit4]   2> 1572861 INFO  (TEST-TestSimTriggerIntegration.testCooldown-seed#[89355BF3689E75DE]) [    ] o.a.s.SolrTestCaseJ4 ###Ending testCooldown
   [junit4] IGNOR/A 0.00s J2 | TestSimTriggerIntegration.testNodeLostTrigger
   [junit4]    > Assumption #1: 'awaitsfix' test group is disabled (@AwaitsFix(bugUrl=https://issues.apache.org/jira/browse/SOLR-12028))
   [junit4]   2> 1572863 INFO  (TEST-TestSimTriggerIntegration.testListeners-seed#[89355BF3689E75DE]) [    ] o.a.s.SolrTestCaseJ4 ###Starting testListeners
   [junit4]   2> 1572866 DEBUG (TEST-TestSimTriggerIntegration.testListeners-seed#[89355BF3689E75DE]) [    ] o.a.s.c.a.s.SimClusterStateProvider --- new Overseer leader: 127.0.0.1:10277_solr
   [junit4]   2> 1572866 DEBUG (Simulated OverseerAutoScalingTriggerThread) [    ] o.a.s.c.a.OverseerTriggerThread Adding .auto_add_replicas and .scheduled_maintenance triggers
   [junit4]   2> 1572866 DEBUG (TEST-TestSimTriggerIntegration.testListeners-seed#[89355BF3689E75DE]) [    ] o.a.s.c.a.s.SimClusterStateProvider ** creating new collection states, currentVersion=0
   [junit4]   2> 1572866 DEBUG (Simulated OverseerAutoScalingTriggerThread) [    ] o.a.s.c.a.OverseerTriggerThread Refreshing /autoscaling.json with znode version 1
   [junit4]   2> 1572866 DEBUG (TEST-TestSimTriggerIntegration.testListeners-seed#[89355BF3689E75DE]) [    ] o.a.s.c.a.s.SimClusterStateProvider ** saved cluster state version 0
   [junit4]   2> 1572866 INFO  (TEST-TestSimTriggerIntegration.testListeners-seed#[89355BF3689E75DE]) [    ] o.a.s.h.a.MetricsHistoryHandler No .system collection, keeping metrics history in memory.
   [junit4]   2> 1572866 DEBUG (Simulated OverseerAutoScalingTriggerThread) [    ] o.a.s.c.a.OverseerTriggerThread Current znodeVersion 1, lastZnodeVersion 0
   [junit4]   2> 1572866 DEBUG (Simulated OverseerAutoScalingTriggerThread) [    ] o.a.s.c.a.OverseerTriggerThread Processed trigger updates upto znodeVersion 1
   [junit4]   2> 1572867 DEBUG (Simulated OverseerAutoScalingTriggerThread) [    ] o.a.s.c.a.NodeLostTrigger NodeLostTrigger .auto_add_replicas - Initial livenodes: [127.0.0.1:10278_solr, 127.0.0.1:10277_solr]
   [junit4]   2> 1572867 DEBUG (Simulated OverseerAutoScalingTriggerThread) [    ] o.a.s.c.a.OverseerTriggerThread -- cleaning old nodeLost / nodeAdded markers
   [junit4]   2> 1572867 DEBUG (Simulated OverseerAutoScalingTriggerThread) [    ] o.a.s.c.a.OverseerTriggerThread Current znodeVersion 1, lastZnodeVersion 1
   [junit4]   2> 1572867 DEBUG (ScheduledTrigger-10273-thread-2) [    ] o.a.s.c.a.NodeLostTrigger Running NodeLostTrigger: .auto_add_replicas with currently live nodes: 2 and last live nodes: 2
   [junit4]   2> 1572867 DEBUG (simCloudManagerPool-10272-thread-2) [    ] o.a.s.c.a.AutoScalingHandler Verified autoscaling configuration
   [junit4]   2> 1572867 DEBUG (simCloudManagerPool-10272-thread-2) [    ] o.a.s.c.a.OverseerTriggerThread Refreshing /autoscaling.json with znode version 2
   [junit4]   2> 1572868 DEBUG (Simulated OverseerAutoScalingTriggerThread) [    ] o.a.s.c.a.OverseerTriggerThread Processed trigger updates upto znodeVersion 2
   [junit4]   2> 1572868 DEBUG (Simulated OverseerAutoScalingTriggerThread) [    ] o.a.s.c.a.OverseerTriggerThread -- cleaning old nodeLost / nodeAdded markers
   [junit4]   2> 1572868 DEBUG (Simulated OverseerAutoScalingTriggerThread) [    ] o.a.s.c.a.OverseerTriggerThread Current znodeVersion 2, lastZnodeVersion 2
   [junit4]   2> 1572869 DEBUG (simCloudManagerPool-10272-thread-3) [    ] o.a.s.c.a.AutoScalingHandler Verified autoscaling configuration
   [junit4]   2> 1572869 DEBUG (simCloudManagerPool-10272-thread-3) [    ] o.a.s.c.a.OverseerTriggerThread Refreshing /autoscaling.json with znode version 3
   [junit4]   2> 1572869 DEBUG (Simulated OverseerAutoScalingTriggerThread) [    ] o.a.s.c.a.OverseerTriggerThread Processed trigger updates upto znodeVersion 3
   [junit4]   2> 1572869 INFO  (Simulated OverseerAutoScalingTriggerThread) [    ] o.a.s.c.a.s.TestSimTriggerIntegration TestTriggerAction init
   [junit4]   2> 1572869 DEBUG (Simulated OverseerAutoScalingTriggerThread) [    ] o.a.s.c.a.NodeAddedTrigger NodeAddedTrigger node_added_trigger - Initial livenodes: [127.0.0.1:10278_solr, 127.0.0.1:10277_solr]
   [junit4]   2> 1572869 DEBUG (Simulated OverseerAutoScalingTriggerThread) [    ] o.a.s.c.a.NodeAddedTrigger NodeAddedTrigger node_added_trigger instantiated with properties: {event=nodeAdded, waitFor=1, actions=[{name=test, class=org.apache.solr.cloud.autoscaling.sim.TestSimTriggerIntegration$TestTriggerAction}, {name=test1, class=org.apache.solr.cloud.autoscaling.sim.TestSimTriggerIntegration$TestDummyAction}], enabled=true}
   [junit4]   2> 1572869 DEBUG (Simulated OverseerAutoScalingTriggerThread) [    ] o.a.s.c.a.OverseerTriggerThread -- cleaning old nodeLost / nodeAdded markers
   [junit4]   2> 1572869 DEBUG (Simulated OverseerAutoScalingTriggerThread) [    ] o.a.s.c.a.OverseerTriggerThread Current znodeVersion 3, lastZnodeVersion 3
   [junit4]   2> 1572869 DEBUG (ScheduledTrigger-10273-thread-1) [    ] o.a.s.c.a.NodeAddedTrigger Running NodeAddedTrigger node_added_trigger
   [junit4]   2> 1572869 DEBUG (ScheduledTrigger-10273-thread-1) [    ] o.a.s.c.a.NodeAddedTrigger Found livenodes: 2
   [junit4]   2> 1572870 DEBUG (simCloudManagerPool-10272-thread-4) [    ] o.a.s.c.a.AutoScalingHandler Verified autoscaling configuration
   [junit4]   2> 1572870 DEBUG (simCloudManagerPool-10272-thread-4) [    ] o.a.s.c.a.OverseerTriggerThread Refreshing /autoscaling.json with znode version 4
   [junit4]   2> 1572870 DEBUG (Simulated OverseerAutoScalingTriggerThread) [    ] o.a.s.c.a.OverseerTriggerThread Processed trigger updates upto znodeVersion 4
   [junit4]   2> 1572870 DEBUG (Simulated OverseerAutoScalingTriggerThread) [    ] o.a.s.c.a.OverseerTriggerThread -- cleaning old nodeLost / nodeAdded markers
   [junit4]   2> 1572870 DEBUG (Simulated OverseerAutoScalingTriggerThread) [    ] o.a.s.c.a.OverseerTriggerThread Current znodeVersion 4, lastZnodeVersion 4
   [junit4]   2> 1572874 DEBUG (simCloudManagerPool-10272-thread-5) [    ] o.a.s.c.a.AutoScalingHandler Verified autoscaling configuration
   [junit4]   2> 1572874 DEBUG (simCloudManagerPool-10272-thread-5) [    ] o.a.s.c.a.OverseerTriggerThread Refreshing /autoscaling.json with znode version 5
   [junit4]   2> 1572874 DEBUG (Simulated OverseerAutoScalingTriggerThread) [    ] o.a.s.c.a.OverseerTriggerThread Processed trigger updates upto znodeVersion 5
   [junit4]   2> 1572874 DEBUG (TEST-TestSimTriggerIntegration.testListeners-seed#[89355BF3689E75DE]) [    ] o.a.s.c.a.s.SimClusterStateProvider -- creating marker: /autoscaling/nodeAdded/127.0.0.1:10279_solr
   [junit4]   2> 1572874 DEBUG (Simulated OverseerAutoScalingTriggerThread) [    ] o.a.s.c.a.OverseerTriggerThread -- cleaning old nodeLost / nodeAdded markers
   [junit4]   2> 1572874 DEBUG (Simulated OverseerAutoScalingTriggerThread) [    ] o.a.s.c.a.OverseerTriggerThread Current znodeVersion 5, lastZnodeVersion 5
   [junit4]   2> 1572887 DEBUG (ScheduledTrigger-10273-thread-3) [    ] o.a.s.c.a.NodeLostTrigger Running NodeLostTrigger: .auto_add_replicas with currently live nodes: 3 and last live nodes: 2
   [junit4]   2> 1572890 DEBUG (ScheduledTrigger-10273-thread-2) [    ] o.a.s.c.a.NodeAddedTrigger Running NodeAddedTrigger node_added_trigger
   [junit4]   2> 1572890 DEBUG (ScheduledTrigger-10273-thread-2) [    ] o.a.s.c.a.NodeAddedTrigger Found livenodes: 3
   [junit4]   2> 1572890 DEBUG (ScheduledTrigger-10273-thread-2) [    ] o.a.s.c.a.NodeAddedTrigger Tracking new node: 127.0.0.1:10279_solr at time 1878102362797015
   [junit4]   2> 1572907 DEBUG (ScheduledTrigger-10273-thread-4) [    ] o.a.s.c.a.NodeLostTrigger Running NodeLostTrigger: .auto_add_replicas with currently live nodes: 3 and last live nodes: 3
   [junit4]   2> 1572910 DEBUG (ScheduledTrigger-10273-thread-1) [    ] o.a.s.c.a.NodeAddedTrigger Running NodeAddedTrigger node_added_trigger
   [junit4]   2> 1572910 DEBUG (ScheduledTrigger-10273-thread-1) [    ] o.a.s.c.a.NodeAddedTrigger Found livenodes: 3
   [junit4]   2> 1572910 DEBUG (ScheduledTrigger-10273-thread-1) [    ] o.a.s.c.a.NodeAddedTrigger NodeAddedTrigger node_added_trigger firing registered processor for nodes: [127.0.0.1:10279_solr] added at times [1878102362797015], now=1878103372974815
   [junit4]   2> 1572911 DEBUG (ScheduledTrigger-10273-thread-1) [    ] o.a.s.c.a.SystemLogListener Collection .system missing, skip sending event {
   [junit4]   2>   "id":"6ac1fc82fb3d7T9wi5s1ktn3jjrjn1yj28y3veq",
   [junit4]   2>   "source":"node_added_trigger",
   [junit4]   2>   "eventTime":1878102362797015,
   [junit4]   2>   "eventType":"NODEADDED",
   [junit4]   2>   "properties":{
   [junit4]   2>     "eventTimes":[1878102362797015],
   [junit4]   2>     "preferredOperation":"movereplica",
   [junit4]   2>     "_enqueue_time_":1878103394794115,
   [junit4]   2>     "nodeNames":["127.0.0.1:10279_solr"]}}
   [junit4]   2> 1572916 DEBUG (ScheduledTrigger-10273-thread-1) [    ] o.a.s.c.a.NodeAddedTrigger Removing new node from tracking: 127.0.0.1:10279_solr
   [junit4]   2> 1572918 DEBUG (AutoscalingActionExecutor-10274-thread-1) [    ] o.a.s.c.a.SystemLogListener Collection .system missing, skip sending event {
   [junit4]   2>   "id":"6ac1fc82fb3d7T9wi5s1ktn3jjrjn1yj28y3veq",
   [junit4]   2>   "source":"node_added_trigger",
   [junit4]   2>   "eventTime":1878102362797015,
   [junit4]   2>   "eventType":"NODEADDED",
   [junit4]   2>   "properties":{
   [junit4]   2>     "eventTimes":[1878102362797015],
   [junit4]   2>     "preferredOperation":"movereplica",
   [junit4]   2>     "_enqueue_time_":1878103394794115,
   [junit4]   2>     "nodeNames":["127.0.0.1:10279_solr"]}}
   [junit4]   2> 1572979 DEBUG (TEST-TestSimTriggerIntegration.testListeners-seed#[89355BF3689E75DE]) [    ] o.a.s.c.a.s.SimClusterStateProvider -- creating marker: /autoscaling/nodeAdded/127.0.0.1:10280_solr
   [junit4]   2> 1573018 DEBUG (ScheduledTrigger-10273-thread-2) [    ] o.a.s.c.a.NodeAddedTrigger Running NodeAddedTrigger node_added_trigger
   [junit4]   2> 1573018 DEBUG (ScheduledTrigger-10273-thread-4) [    ] o.a.s.c.a.NodeLostTrigger Running NodeLostTrigger: .auto_add_replicas with currently live nodes: 4 and last live nodes: 3
   [junit4]   2> 1573018 DEBUG (ScheduledTrigger-10273-thread-2) [    ] o.a.s.c.a.NodeAddedTrigger Found livenodes: 4
   [junit4]   2> 1573018 DEBUG (ScheduledTrigger-10273-thread-2) [    ] o.a.s.c.a.NodeAddedTrigger Tracking new node: 127.0.0.1:10280_solr at time 1878108767966965
   [junit4]   2> 1573038 DEBUG (ScheduledTrigger-10273-thread-2) [    ] o.a.s.c.a.NodeAddedTrigger Running NodeAddedTrigger node_added_trigger
   [junit4]   2> 1573038 DEBUG (ScheduledTrigger-10273-thread-3) [    ] o.a.s.c.a.NodeLostTrigger Running NodeLostTrigger: .auto_add_replicas with currently live nodes: 4 and last live nodes: 4
   [junit4]   2> 1573038 DEBUG (ScheduledTrigger-10273-thread-2) [    ] o.a.s.c.a.NodeAddedTrigger Found livenodes: 4
   [junit4]   2> 1573038 DEBUG (ScheduledTrigger-10273-thread-2) [    ] o.a.s.c.a.NodeAddedTrigger NodeAddedTrigger node_added_trigger firing registered processor for nodes: [127.0.0.1:10280_solr] added at times [1878108767966965], now=1878109779944015
   [junit4]   2> 1573039 DEBUG (ScheduledTrigger-10273-thread-2) [    ] o.a.s.c.a.SystemLogListener Collection .system missing, skip sending event {
   [junit4]   2>   "id":"6ac2145f6d6f5T9wi5s1ktn3jjrjn1yj28y3ver",
   [junit4]   2>   "source":"node_added_trigger",
   [junit4]   2>   "eventTime":1878108767966965,
   [junit4]   2>   "eventType":"NODEADDED",
   [junit4]   2>   "properties":{
   [junit4]   2>     "eventTimes":[1878108767966965],
   [junit4]   2>     "preferredOperation":"movereplica",
   [junit4]   2>     "_enqueue_time_":1878109785335215,
   [junit4]   2>     "nodeNames":["127.0.0.1:10280_solr"]}}
   [junit4]   2> 1573039 DEBUG (ScheduledTrigger-10273-thread-2) [    ] o.a.s.c.a.NodeAddedTrigger Removing new node from tracking: 127.0.0.1:10280_solr
   [junit4]   2> 1573039 DEBUG (AutoscalingActionExecutor-10274-thread-1) [    ] o.a.s.c.a.SystemLogListener Collection .system missing, skip sending event {
   [junit4]   2>   "id":"6ac2145f6d6f5T9wi5s1ktn3jjrjn1yj28y3ver",
   [junit4]   2>   "source":"node_added_trigger",
   [junit4]   2>   "eventTime":1878108767966965,
   [junit4]   2>   "eventType":"NODEADDED",
   [junit4]   2>   "properties":{
   [junit4]   2>     "eventTimes":[1878108767966965],
   [junit4]   2>     "preferredOperation":"movereplica",
   [junit4]   2>     "_enqueue_time_":1878109785335215,
   [junit4]   2>     "nodeNames":["127.0.0.1:10280_solr"]}}
   [junit4]   2> 1573039 WARN  (AutoscalingActionExecutor-10274-thread-1) [    ] o.a.s.c.a.ScheduledTriggers Exception executing actions
   [junit4]   2> org.apache.solr.cloud.autoscaling.TriggerActionException: Error processing action for trigger event: {
   [junit4]   2>   "id":"6ac2145f6d6f5T9wi5s1ktn3jjrjn1yj28y3ver",
   [junit4]   2>   "source":"node_added_trigger",
   [junit4]   2>   "eventTime":1878108767966965,
   [junit4]   2>   "eventType":"NODEADDED",
   [junit4]   2>   "properties":{
   [junit4]   2>     "eventTimes":[1878108767966965],
   [junit4]   2>     "preferredOperation":"movereplica",
   [junit4]   2>     "_enqueue_time_":1878109785335215,
   [junit4]   2>     "nodeNames":["127.0.0.1:10280_solr"]}}
   [junit4]   2> at org.apache.solr.cloud.autoscaling.ScheduledTriggers.lambda$null$3(ScheduledTriggers.java:327) ~[java/:?]
   [junit4]   2> at java.util.concurrent.Executors$RunnableAdapter.call(Executors.java:511) ~[?:1.8.0_172]
   [junit4]   2> at java.util.concurrent.FutureTask.run(FutureTask.java:266) ~[?:1.8.0_172]
   [junit4]   2> at org.apache.solr.common.util.ExecutorUtil$MDCAwareThreadPoolExecutor.lambda$execute$0(ExecutorUtil.java:209) ~[java/:?]
   [junit4]   2> at java.util.concurrent.ThreadPoolExecutor.runWorker(ThreadPoolExecutor.java:1149) [?:1.8.0_172]
   [junit4]   2> at java.util.concurrent.ThreadPoolExecutor$Worker.run(ThreadPoolExecutor.java:624) [?:1.8.0_172]
   [junit4]   2> at java.lang.Thread.run(Thread.java:748) [?:1.8.0_172]
   [junit4]   2> Caused by: java.lang.RuntimeException: failure
   [junit4]   2> at org.apache.solr.cloud.autoscaling.sim.TestSimTriggerIntegration$TestDummyAction.process(TestSimTriggerIntegration.java:962) ~[test/:?]
   [junit4]   2> at org.apache.solr.cloud.autoscaling.ScheduledTriggers.lambda$null$3(ScheduledTriggers.java:324) ~[java/:?]
   [junit4]   2> ... 6 more
   [junit4]   2> 1573100 DEBUG (TEST-TestSimTriggerIntegration.testListeners-seed#[89355BF3689E75DE]) [    ] o.a.s.c.a.OverseerTriggerThread OverseerTriggerThread has been closed explicitly
   [junit4]   2> 1573100 INFO  (Simulated OverseerAutoScalingTriggerThread) [    ] o.a.s.c.a.OverseerTriggerThread OverseerTriggerThread woken up but we are closed, exiting.
   [junit4]   2> 1573100 INFO  (TEST-TestSimTriggerIntegration.testListeners-seed#[89355BF3689E75DE]) [    ] o.a.s.SolrTestCaseJ4 ###Ending testListeners
   [junit4]   2> 1573104 INFO  (TEST-TestSimTriggerIntegration.testEventFromRestoredState-seed#[89355BF3689E75DE]) [    ] o.a.s.SolrTestCaseJ4 ###Starting testEventFromRestoredState
   [junit4]   2> 1573109 DEBUG (TEST-TestSimTriggerIntegration.testEventFromRestoredState-seed#[89355BF3689E75DE]) [    ] o.a.s.c.a.s.SimClusterStateProvider --- new Overseer leader: 127.0.0.1:10281_solr
   [junit4]   2> 1573110 DEBUG (Simulated OverseerAutoScalingTriggerThread) [    ] o.a.s.c.a.OverseerTriggerThread Adding .auto_add_replicas and .scheduled_maintenance triggers
   [junit4]   2> 1573110 DEBUG (Simulated OverseerAutoScalingTriggerThread) [    ] o.a.s.c.a.OverseerTriggerThread Refreshing /autoscaling.json with znode version 1
   [junit4]   2> 1573110 DEBUG (Simulated OverseerAutoScalingTriggerThread) [    ] o.a.s.c.a.OverseerTriggerThread Current znodeVersion 1, lastZnodeVersion 0
   [junit4]   2> 1573110 DEBUG (Simulated OverseerAutoScalingTriggerThread) [    ] o.a.s.c.a.OverseerTriggerThread Processed trigger updates upto znodeVersion 1
   [junit4]   2> 1573117 DEBUG (TEST-TestSimTriggerIntegration.testEventFromRestoredState-seed#[89355BF3689E75DE]) [    ] o.a.s.c.a.s.SimClusterStateProvider ** creating new collection states, currentVersion=0
   [junit4]   2> 1573117 DEBUG (TEST-TestSimTriggerIntegration.testEventFromRestoredState-seed#[89355BF3689E75DE]) [    ] o.a.s.c.a.s.SimClusterStateProvider ** saved cluster state version 0
   [junit4]   2> 1573117 INFO  (TEST-TestSimTriggerIntegration.testEventFromRestoredState-seed#[89355BF3689E75DE]) [    ] o.a.s.h.a.MetricsHistoryHandler No .system collection, keeping metrics history in memory.
   [junit4]   2> 1573121 DEBUG (Simulated OverseerAutoScalingTriggerThread) [    ] o.a.s.c.a.NodeLostTrigger NodeLostTrigger .auto_add_replicas - Initial livenodes: [127.0.0.1:10281_solr, 127.0.0.1:10282_solr]
   [junit4]   2> 1573124 DEBUG (Simulated OverseerAutoScalingTriggerThread) [    ] o.a.s.c.a.OverseerTriggerThread -- cleaning old nodeLost / nodeAdded markers
   [junit4]   2> 1573124 DEBUG (Simulated OverseerAutoScalingTriggerThread) [    ] o.a.s.c.a.OverseerTriggerThread Current znodeVersion 1, lastZnodeVersion 1
   [junit4]   2> 1573124 DEBUG (ScheduledTrigger-10279-thread-2) [    ] o.a.s.c.a.NodeLostTrigger Running NodeLostTrigger: .auto_add_replicas with currently live nodes: 2 and last live nodes: 2
   [junit4]   2> 1573146 DEBUG (simCloudManagerPool-10278-thread-2) [    ] o.a.s.c.a.AutoScalingHandler Verified autoscaling configuration
   [junit4]   2> 1573146 DEBUG (simCloudManagerPool-10278-thread-2) [    ] o.a.s.c.a.OverseerTriggerThread Refreshing /autoscaling.json with znode version 2
   [junit4]   2> 1573162 DEBUG (ScheduledTrigger-10279-thread-2) [    ] o.a.s.c.a.NodeLostTrigger Running NodeLostTrigger: .auto_add_replicas with currently live nodes: 2 and last live nodes: 2
   [junit4]   2> 1573166 DEBUG (Simulated OverseerAutoScalingTriggerThread) [    ] o.a.s.c.a.OverseerTriggerThread Processed trigger updates upto znodeVersion 2
   [junit4]   2> 1573166 DEBUG (Simulated OverseerAutoScalingTriggerThread) [    ] o.a.s.c.a.OverseerTriggerThread -- cleaning old nodeLost / nodeAdded markers
   [junit4]   2> 1573166 DEBUG (Simulated OverseerAutoScalingTriggerThread) [    ] o.a.s.c.a.OverseerTriggerThread Current znodeVersion 2, lastZnodeVersion 2
   [junit4]   2> 1573182 DEBUG (ScheduledTrigger-10279-thread-2) [    ] o.a.s.c.a.NodeLostTrigger Running NodeLostTrigger: .auto_add_replicas with currently live nodes: 2 and last live nodes: 2
   [junit4]   2> 1573186 DEBUG (simCloudManagerPool-10278-thread-3) [    ] o.a.s.c.a.AutoScalingHandler Verified autoscaling configuration
   [junit4]   2> 1573192 DEBUG (simCloudManagerPool-10278-thread-3) [    ] o.a.s.c.a.OverseerTriggerThread Refreshing /autoscaling.json with znode version 3
   [junit4]   2> 1573192 DEBUG (Simulated OverseerAutoScalingTriggerThread) [    ] o.a.s.c.a.OverseerTriggerThread Processed trigger updates upto znodeVersion 3
   [junit4]   2> 1573192 INFO  (Simulated OverseerAutoScalingTriggerThread) [    ] o.a.s.c.a.s.TestSimTriggerIntegration TestTriggerAction init
   [junit4]   2> 1573192 DEBUG (TEST-TestSimTriggerIntegration.testEventFromRestoredState-seed#[89355BF3689E75DE]) [    ] o.a.s.c.a.s.SimClusterStateProvider -- creating marker: /autoscaling/nodeAdded/127.0.0.1:10283_solr
   [junit4]   2> 1573192 DEBUG (Simulated OverseerAutoScalingTriggerThread) [    ] o.a.s.c.a.NodeAddedTrigger NodeAddedTrigger node_added_trigger - Initial livenodes: [127.0.0.1:10281_solr, 127.0.0.1:10282_solr, 127.0.0.1:10283_solr]
   [junit4]   2> 1573192 DEBUG (Simulated OverseerAutoScalingTriggerThread) [    ] o.a.s.c.a.NodeAddedTrigger NodeAddedTrigger node_added_trigger instantiated with properties: {event=nodeAdded, waitFor=10, actions=[{name=test, class=org.apache.solr.cloud.autoscaling.sim.TestSimTriggerIntegration$TestTriggerAction}], enabled=true}
   [junit4]   2> 1573193 DEBUG (Simulated OverseerAutoScalingTriggerThread) [    ] o.a.s.c.a.NodeAddedTrigger Adding node from marker path: 127.0.0.1:10283_solr
   [junit4]   2> 1573193 DEBUG (Simulated OverseerAutoScalingTriggerThread) [    ] o.a.s.c.a.OverseerTriggerThread -- cleaning old nodeLost / nodeAdded markers
   [junit4]   2> 1573193 DEBUG (Simulated OverseerAutoScalingTriggerThread) [    ] o.a.s.c.a.OverseerTriggerThread Current znodeVersion 3, lastZnodeVersion 3
   [junit4]   2> 1573193 DEBUG (ScheduledTrigger-10279-thread-3) [    ] o.a.s.c.a.NodeAddedTrigger Running NodeAddedTrigger node_added_trigger
   [junit4]   2> 1573193 DEBUG (ScheduledTrigger-10279-thread-3) [    ] o.a.s.c.a.NodeAddedTrigger Found livenodes: 3
   [junit4]   2> 1573202 DEBUG (ScheduledTrigger-10279-thread-4) [    ] o.a.s.c.a.NodeLostTrigger Running NodeLostTrigger: .auto_add_replicas with currently live nodes: 3 and last live nodes: 2
   [junit4]   2> 1573221 DEBUG (ScheduledTrigger-10279-thread-2) [    ] o.a.s.c.a.NodeAddedTrigger Running NodeAddedTrigger node_added_trigger
   [junit4]   2> 1573221 DEBUG (ScheduledTrigger-10279-thread-2) [    ] o.a.s.c.a.NodeAddedTrigger Found livenodes: 3
   [junit4]   2> 1573222 DEBUG (ScheduledTrigger-10279-thread-4) [    ] o.a.s.c.a.NodeLostTrigger Running NodeLostTrigger: .auto_add_replicas with currently live nodes: 3 and last live nodes: 3
   [junit4]   2> 1573242 DEBUG (ScheduledTrigger-10279-thread-1) [    ] o.a.s.c.a.NodeAddedTrigger Running NodeAddedTrigger node_added_trigger
   [junit4]   2> 1573242 DEBUG (ScheduledTrigger-10279-thread-1) [    ] o.a.s.c.a.NodeAddedTrigger Found livenodes: 3
   [junit4]   2> 1573243 DEBUG (ScheduledTrigger-10279-thread-3) [    ] o.a.s.c.a.NodeLostTrigger Running NodeLostTrigger: .auto_add_replicas with currently live nodes: 3 and last live nodes: 3
   [junit4]   2> 1573262 DEBUG (ScheduledTrigger-10279-thread-1) [    ] o.a.s.c.a.NodeAddedTrigger Running NodeAddedTrigger node_added_trigger
   [junit4]   2> 1573262 DEBUG (ScheduledTrigger-10279-thread-1) [    ] o.a.s.c.a.NodeAddedTrigger Found livenodes: 3
   [junit4]   2> 1573264 DEBUG (ScheduledTrigger-10279-thread-2) [    ] o.a.s.c.a.NodeLostTrigger Running NodeLostTrigger: .auto_add_replicas with currently live nodes: 3 and last live nodes: 3
   [junit4]   2> 1573282 DEBUG (ScheduledTrigger-10279-thread-4) [    ] o.a.s.c.a.NodeAddedTrigger Running NodeAddedTrigger node_added_trigger
   [junit4]   2> 1573282 DEBUG (ScheduledTrigger-10279-thread-4) [    ] o.a.s.c.a.NodeAddedTrigger Found livenodes: 3
   [junit4]   2> 1573285 DEBUG (ScheduledTrigger-10279-thread-3) [    ] o.a.s.c.a.NodeLostTrigger Running NodeLostTrigger: .auto_add_replicas with currently live nodes: 3 and last live nodes: 3
   [junit4]   2> 1573302 DEBUG (ScheduledTrigger-10279-thread-4) [    ] o.a.s.c.a.NodeAddedTrigger Running NodeAddedTrigger node_added_trigger
   [junit4]   2> 1573302 DEBUG (ScheduledTrigger-10279-thread-4) [    ] o.a.s.c.a.NodeAddedTrigger Found livenodes: 3
   [junit4]   2> 1573305 DEBUG (ScheduledTrigger-10279-thread-1) [    ] o.a.s.c.a.NodeLostTrigger Running NodeLostTrigger: .auto_add_replicas with currently live nodes: 3 and last live nodes: 3
   [junit4]   2> 1573322 DEBUG (ScheduledTrigger-10279-thread-2) [    ] o.a.s.c.a.NodeAddedTrigger Running NodeAddedTrigger node_added_trigger
   [junit4]   2> 1573322 DEBUG (ScheduledTrigger-10279-thread-2) [    ] o.a.s.c.a.NodeAddedTrigger Found livenodes: 3
   [junit4]   2> 1573325 DEBUG (ScheduledTrigger-10279-thread-3) [    ] o.a.s.c.a.NodeLostTrigger Running NodeLostTrigger: .auto_add_replicas with currently live nodes: 3 and last live nodes: 3
   [junit4]   2> 1573343 DEBUG (ScheduledTrigger-10279-thread-4) [    ] o.a.s.c.a.NodeAddedTrigger Running NodeAddedTrigger node_added_trigger
   [junit4]   2> 1573343 DEBUG (ScheduledTrigger-10279-thread-4) [    ] o.a.s.c.a.NodeAddedTrigger Found livenodes: 3
   [junit4]   2> 1573345 DEBUG (ScheduledTrigger-10279-thread-1) [    ] o.a.s.c.a.NodeLostTrigger Running NodeLostTrigger: .auto_add_replicas with currently live nodes: 3 and last live nodes: 3
   [junit4]   2> 1573363 DEBUG (ScheduledTrigger-10279-thread-2) [    ] o.a.s.c.a.NodeAddedTrigger Running NodeAddedTrigger node_added_trigger
   [junit4]   2> 1573363 DEBUG (ScheduledTrigger-10279-thread-2) [    ] o.a.s.c.a.NodeAddedTrigger Found livenodes: 3
   [junit4]   2> 1573367 DEBUG (ScheduledTrigger-10279-thread-3) [    ] o.a.s.c.a.NodeLostTrigger Running NodeLostTrigger: .auto_add_replicas with currently live nodes: 3 and last live nodes: 3
   [junit4]   2> 1573383 DEBUG (ScheduledTrigger-10279-thread-3) [    ] o.a.s.c.a.NodeAddedTrigger Running NodeAddedTrigger node_added_trigger
   [junit4]   2> 1573383 DEBUG (ScheduledTrigger-10279-thread-3) [    ] o.a.s.c.a.NodeAddedTrigger Found livenodes: 3
   [junit4]   2> 1573387 DEBUG (ScheduledTrigger-10279-thread-1) [    ] o.a.s.c.a.NodeLostTrigger Running NodeLostTrigger: .auto_add_replicas with currently live nodes: 3 and last live nodes: 3
   [junit4]   2> 1573403 DEBUG (ScheduledTrigger-10279-thread-2) [    ] o.a.s.c.a.NodeAddedTrigger Running NodeAddedTrigger node_added_trigger
   [junit4]   2> 1573403 DEBUG (ScheduledTrigger-10279-thread-2) [    ] o.a.s.c.a.NodeAddedTrigger Found livenodes: 3
   [junit4]   2> 1573403 DEBUG (ScheduledTrigger-10279-thread-2) [    ] o.a.s.c.a.NodeAddedTrigger NodeAddedTrigger node_added_trigger firing registered processor for nodes: [127.0.0.1:10283_solr] added at times [1878117487112965], now=1878128026099465
   [junit4]   2> 1573404 DEBUG (ScheduledTrigger-10279-thread-2) [    ] o.a.s.c.a.SystemLogListener Collection .system missing, skip sending event {
   [junit4]   2>   "id":"6ac234daa7305T9wi5s1ktn3jjrjn1yj28y3vet",
   [junit4]   2>   "source":"node_added_trigger",
   [junit4]   2>   "eventTime":1878117487112965,
   [junit4]   2>   "eventType":"NODEADDED",
   [junit4]   2>   "properties":{
   [junit4]   2>     "eventTimes":[1878117487112965],
   [junit4]   2>     "preferredOperation":"movereplica",
   [junit4]   2>     "_enqueue_time_":1878128051094415,
   [junit4]   2>     "nodeNames":["127.0.0.1:10283_solr"]}}
   [junit4]   2> 1573405 DEBUG (ScheduledTrigger-10279-thread-2) [    ] o.a.s.c.a.NodeAddedTrigger Removing new node from tracking: 127.0.0.1:10283_solr
   [junit4]   2> 1573405 DEBUG (AutoscalingActionExecutor-10280-thread-1) [    ] o.a.s.c.a.SystemLogListener Collection .system missing, skip sending event {
   [junit4]   2>   "id":"6ac234daa7305T9wi5s1ktn3jjrjn1yj28y3vet",
   [junit4]   2>   "source":"node_added_trigger",
   [junit4]   2>   "eventTime":1878117487112965,
   [junit4]   2>   "eventType":"NODEADDED",
   [junit4]   2>   "properties":{
   [junit4]   2>     "eventTimes":[1878117487112965],
   [junit4]   2>     "preferredOperation":"movereplica",
   [junit4]   2>     "_enqueue_time_":1878128051094415,
   [junit4]   2>     "nodeNames":["127.0.0.1:10283_solr"]}}
   [junit4]   2> 1573405 DEBUG (TEST-TestSimTriggerIntegration.testEventFromRestoredState-seed#[89355BF3689E75DE]) [    ] o.a.s.c.a.s.SimClusterStateProvider -- creating marker: /autoscaling/nodeAdded/127.0.0.1:10284_solr
   [junit4]   2> 1573505 DEBUG (ScheduledTrigger-10279-thread-3) [    ] o.a.s.c.a.NodeAddedTrigger Running NodeAddedTrigger node_added_trigger
   [junit4]   2> 1573506 DEBUG (ScheduledTrigger-10279-thread-1) [    ] o.a.s.c.a.NodeLostTrigger Running NodeLostTrigger: .auto_add_replicas with currently live nodes: 4 and last live nodes: 3
   [junit4]   2> 1573506 DEBUG (ScheduledTrigger-10279-thread-3) [    ] o.a.s.c.a.NodeAddedTrigger Found livenodes: 4
   [junit4]   2> 1573506 DEBUG (ScheduledTrigger-10279-thread-3) [    ] o.a.s.c.a.NodeAddedTrigger Tracking new node: 127.0.0.1:10284_solr at time 1878133140419765
   [junit4]   2> 1573526 DEBUG (ScheduledTrigger-10279-thread-4) [    ] o.a.s.c.a.NodeAddedTrigger Running NodeAddedTrigger node_added_trigger
   [junit4]   2> 1573526 DEBUG (ScheduledTrigger-10279-thread-1) [    ] o.a.s.c.a.NodeLostTrigger Running NodeLostTrigger: .auto_add_replicas with currently live nodes: 4 and last live nodes: 4
   [junit4]   2> 1573526 DEBUG (ScheduledTrigger-10279-thread-4) [    ] o.a.s.c.a.NodeAddedTrigger Found livenodes: 4
   [junit4]   2> 1573546 DEBUG (ScheduledTrigger-10279-thread-1) [    ] o.a.s.c.a.NodeLostTrigger Running NodeLostTrigger: .auto_add_replicas with currently live nodes: 4 and last live nodes: 4
   [junit4]   2> 1573546 DEBUG (ScheduledTrigger-10279-thread-2) [    ] o.a.s.c.a.NodeAddedTrigger Running NodeAddedTrigger node_added_trigger
   [junit4]   2> 1573546 DEBUG (ScheduledTrigger-10279-thread-2) [    ] o.a.s.c.a.NodeAddedTrigger Found livenodes: 4
   [junit4]   2> 1573566 DEBUG (ScheduledTrigger-10279-thread-1) [    ] o.a.s.c.a.NodeLostTrigger Running NodeLostTrigger: .auto_add_replicas with currently live nodes: 4 and last live nodes: 4
   [junit4]   2> 1573566 DEBUG (ScheduledTrigger-10279-thread-4) [    ] o.a.s.c.a.NodeAddedTrigger Running NodeAddedTrigger node_added_trigger
   [junit4]   2> 1573566 DEBUG (ScheduledTrigger-10279-thread-4) [    ] o.a.s.c.a.NodeAddedTrigger Found livenodes: 4
   [junit4]   2> 1573587 DEBUG (ScheduledTrigger-10279-thread-2) [    ] o.a.s.c.a.NodeAddedTrigger Running NodeAddedTrigger node_added_trigger
   [junit4]   2> 1573587 DEBUG (ScheduledTrigger-10279-thread-2) [    ] o.a.s.c.a.NodeAddedTrigger Found livenodes: 4
   [junit4]   2> 1573587 DEBUG (ScheduledTrigger-10279-thread-1) [    ] o.a.s.c.a.NodeLostTrigger Running NodeLostTrigger: .auto_add_replicas with currently live nodes: 4 and last live nodes: 4
   [junit4]   2> 1573605 INFO  (TEST-TestSimTriggerIntegration.testEventFromRestoredState-seed#[89355BF3689E75DE]) [    ] o.a.s.c.a.s.SimCloudManager === Restarting OverseerTriggerThread and clearing object cache...
   [junit4]   2> 1573606 INFO  (Simulated OverseerAutoScalingTriggerThread) [    ] o.a.s.c.a.OverseerTriggerThread OverseerTriggerThread woken up but we are closed, exiting.
   [junit4]   2> 1573606 DEBUG (TEST-TestSimTriggerIntegration.testEventFromRestoredState-seed#[89355BF3689E75DE]) [    ] o.a.s.c.a.OverseerTriggerThread OverseerTriggerThread has been closed explicitly
   [junit4]   2> 1573606 DEBUG (Simulated OverseerAutoScalingTriggerThread) [    ] o.a.s.c.a.OverseerTriggerThread Refreshing /autoscaling.json with znode version 3
   [junit4]   2> 1573606 DEBUG (Simulated OverseerAutoScalingTriggerThread) [    ] o.a.s.c.a.OverseerTriggerThread Current znodeVersion 3, lastZnodeVersion 0
   [junit4]   2> 1573606 DEBUG (Simulated OverseerAutoScalingTriggerThread) [    ] o.a.s.c.a.OverseerTriggerThread Processed trigger updates upto znodeVersion 3
   [junit4]   2> 1573606 DEBUG (Simulated OverseerAutoScalingTriggerThread) [    ] o.a.s.c.a.NodeLostTrigger NodeLostTrigger .auto_add_replicas - Initial livenodes: [127.0.0.1:10284_solr, 127.0.0.1:10281_solr, 127.0.0.1:10282_solr, 127.0.0.1:10283_solr]
   [junit4]   2> 1573607 INFO  (Simulated OverseerAutoScalingTriggerThread) [    ] o.a.s.c.a.s.TestSimTriggerIntegration TestTriggerAction init
   [junit4]   2> 1573607 DEBUG (Simulated OverseerAutoScalingTriggerThread) [    ] o.a.s.c.a.NodeAddedTrigger NodeAddedTrigger node_added_trigger - Initial livenodes: [127.0.0.1:10284_solr, 127.0.0.1:10281_solr, 127.0.0.1:10282_solr, 127.0.0.1:10283_solr]
   [junit4]   2> 1573607 DEBUG (Simulated OverseerAutoScalingTriggerThread) [    ] o.a.s.c.a.NodeAddedTrigger NodeAddedTrigger node_added_trigger instantiated with properties: {event=nodeAdded, waitFor=10, actions=[{name=test, class=org.apache.solr.cloud.autoscaling.sim.TestSimTriggerIntegration$TestTriggerAction}], enabled=true}
   [junit4]   2> 1573607 DEBUG (Simulated OverseerAutoScalingTriggerThread) [    ] o.a.s.c.a.NodeAddedTrigger Adding node from marker path: 127.0.0.1:10284_solr
   [junit4]   2> 1573607 DEBUG (ScheduledTrigger-10284-thread-1) [    ] o.a.s.c.a.NodeLostTrigger Running NodeLostTrigger: .auto_add_replicas with currently live nodes: 4 and last live nodes: 4
   [junit4]   2> 1573607 DEBUG (Simulated OverseerAutoScalingTriggerThread) [    ] o.a.s.c.a.OverseerTriggerThread -- cleaning old nodeLost / nodeAdded markers
   [junit4]   2> 1573607 DEBUG (Simulated OverseerAutoScalingTriggerThread) [    ] o.a.s.c.a.OverseerTriggerThread Current znodeVersion 3, lastZnodeVersion 3
   [junit4]   2> 1573608 DEBUG (ScheduledTrigger-10284-thread-2) [    ] o.a.s.c.a.NodeAddedTrigger Running NodeAddedTrigger node_added_trigger
   [junit4]   2> 1573608 DEBUG (ScheduledTrigger-10284-thread-2) [    ] o.a.s.c.a.NodeAddedTrigger Found livenodes: 4
   [junit4]   2> 1573627 DEBUG (ScheduledTrigger-10284-thread-2) [    ] o.a.s.c.a.NodeLostTrigger Running NodeLostTrigger: .auto_add_replicas with currently live nodes: 4 and last live nodes: 4
   [junit4]   2> 1573628 DEBUG (ScheduledTrigger-10284-thread-4) [    ] o.a.s.c.a.NodeAddedTrigger Running NodeAddedTrigger node_added_trigger
   [junit4]   2> 1573628 DEBUG (ScheduledTrigger-10284-thread-4) [    ] o.a.s.c.a.NodeAddedTrigger Found livenodes: 4
   [junit4]   2> 1573647 DEBUG (ScheduledTrigger-10284-thread-1) [    ] o.a.s.c.a.NodeLostTrigger Running NodeLostTrigger: .auto_add_replicas with currently live nodes: 4 and last live nodes: 4
   [junit4]   2> 1573648 DEBUG (ScheduledTrigger-10284-thread-3) [    ] o.a.s.c.a.NodeAddedTrigger Running NodeAddedTrigger node_added_trigger
   [junit4]   2> 1573648 DEBUG (ScheduledTrigger-10284-thread-3) [    ] o.a.s.c.a.NodeAddedTrigger Found livenodes: 4
   [junit4]   2> 1573667 DEBUG (ScheduledTrigger-10284-thread-2) [    ] o.a.s.c.a.NodeLostTrigger Running NodeLostTrigger: .auto_add_replicas with currently live nodes: 4 and last live nodes: 4
   [junit4]   2> 1573668 DEBUG (ScheduledTrigger-10284-thread-4) [    ] o.a.s.c.a.NodeAddedTrigger Running NodeAddedTrigger node_added_trigger
   [junit4]   2> 1573669 DEBUG (ScheduledTrigger-10284-thread-4) [    ] o.a.s.c.a.NodeAddedTrigger Found livenodes: 4
   [junit4]   2> 1573687 DEBUG (ScheduledTrigger-10284-thread-1) [    ] o.a.s.c.a.NodeLostTrigger Running NodeLostTrigger: .auto_add_replicas with currently live nodes: 4 and last live nodes: 4
   [junit4]   2> 1573689 DEBUG (ScheduledTrigger-10284-thread-3) [    ] o.a.s.c.a.NodeAddedTrigger Running NodeAddedTrigger node_added_trigger
   [junit4]   2> 1573689 DEBUG (ScheduledTrigger-10284-thread-3) [    ] o.a.s.c.a.NodeAddedTrigger Found livenodes: 4
   [junit4]   2> 1573708 DEBUG (ScheduledTrigger-10284-thread-2) [    ] o.a.s.c.a.NodeLostTrigger Running NodeLostTrigger: .auto_add_replicas with currently live nodes: 4 and last live nodes: 4
   [junit4]   2> 1573709 DEBUG (ScheduledTrigger-10284-thread-4) [    ] o.a.s.c.a.NodeAddedTrigger Running NodeAddedTrigger node_added_trigger
   [junit4]   2> 1573709 DEBUG (ScheduledTrigger-10284-thread-4) [    ] o.a.s.c.a.NodeAddedTrigger Found livenodes: 4
   [junit4]   2> 1573709 DEBUG (ScheduledTrigger-10284-thread-4) [    ] o.a.s.c.a.NodeAddedTrigger NodeAddedTrigger node_added_trigger firing registered processor for nodes: [127.0.0.1:10284_solr] added at times [1878133140419765], now=1878143309453965
   [junit4]   2> 1573710 DEBUG (ScheduledTrigger-10284-thread-4) [    ] o.a.s.c.a.SystemLogListener Collection .system missing, skip sending event {
   [junit4]   2>   "id":"6ac26f2acf4b5T9wi5s1ktn3jjrjn1yj28y3veu",
   [junit4]   2>   "source":"node_added_trigger",
   [junit4]   2>   "eventTime":1878133140419765,
   [junit4]   2>   "eventType":"NODEADDED",
   [junit4]   2>   "properties":{
   [junit4]   2>     "eventTimes":[1878133140419765],
   [junit4]   2>     "preferredOperation":"movereplica",
   [junit4]   2>     "_enqueue_time_":1878143337166265,
   [junit4]   2>     "nodeNames":["127.0.0.1:10284_solr"]}}
   [junit4]   2> 1573710 DEBUG (ScheduledTrigger-10284-thread-4) [    ] o.a.s.c.a.NodeAddedTrigger Removing new node from tracking: 127.0.0.1:10284_solr
   [junit4]   2> 1573710 DEBUG (AutoscalingActionExecutor-10285-thread-1) [    ] o.a.s.c.a.SystemLogListener Collection .system missing, skip sending event {
   [junit4]   2>   "id":"6ac26f2acf4b5T9wi5s1ktn3jjrjn1yj28y3veu",
   [junit4]   2>   "source":"node_added_trigger",
   [junit4]   2>   "eventTime":1878133140419765,
   [junit4]   2>   "eventType":"NODEADDED",
   [junit4]   2>   "properties":{
   [junit4]   2>     "eventTimes":[1878133140419765],
   [junit4]   2>     "preferredOperation":"movereplica",
   [junit4]   2>     "_enqueue_time_":1878143337166265,
   [junit4]   2>     "nodeNames":["127.0.0.1:10284_solr"]}}
   [junit4]   2> 1573710 DEBUG (TEST-TestSimTriggerIntegration.testEventFromRestoredState-seed#[89355BF3689E75DE]) [    ] o.a.s.c.a.OverseerTriggerThread OverseerTriggerThread has been closed explicitly
   [junit4]   2> 1573713 INFO  (Simulated OverseerAutoScalingTriggerThread) [    ] o.a.s.c.a.OverseerTriggerThread OverseerTriggerThread woken up but we are closed, exiting.
   [junit4]   2> 1573714 INFO  (TEST-TestSimTriggerIntegration.testEventFromRestoredState-seed#[89355BF3689E75DE]) [    ] o.a.s.SolrTestCaseJ4 ###Ending testEventFromRestoredState
   [junit4] IGNOR/A 0.00s J2 | TestSimTriggerIntegration.testSearchRate
   [junit4]    > Assumption #1: 'awaitsfix' test group is disabled (@AwaitsFix(bugUrl=https://issues.apache.org/jira/browse/SOLR-12028))
   [junit4]   2> 1573718 INFO  (TEST-TestSimTriggerIntegration.testNodeAddedTriggerRestoreState-seed#[89355BF3689E75DE]) [    ] o.a.s.SolrTestCaseJ4 ###Starting testNodeAddedTriggerRestoreState
   [junit4]   2> 1573724 DEBUG (TEST-TestSimTriggerIntegration.testNodeAddedTriggerRestoreState-seed#[89355BF3689E75DE]) [    ] o.a.s.c.a.s.SimClusterStateProvider --- new Overseer leader: 127.0.0.1:10285_solr
   [junit4]   2> 1573724 DEBUG (Simulated OverseerAutoScalingTriggerThread) [    ] o.a.s.c.a.OverseerTriggerThread Adding .auto_add_replicas and .scheduled_maintenance triggers
   [junit4]   2> 1573724 DEBUG (Simulated OverseerAutoScalingTriggerThread) [    ] o.a.s.c.a.OverseerTriggerThread Refreshing /autoscaling.json with znode version 1
   [junit4]   2> 1573724 DEBUG (Simulated OverseerAutoScalingTriggerThread) [    ] o.a.s.c.a.OverseerTriggerThread Current znodeVersion 1, lastZnodeVersion 0
   [junit4]   2> 1573724 DEBUG (Simulated OverseerAutoScalingTriggerThread) [    ] o.a.s.c.a.OverseerTriggerThread Processed trigger updates upto znodeVersion 1
   [junit4]   2> 1573725 DEBUG (Simulated OverseerAutoScalingTriggerThread) [    ] o.a.s.c.a.NodeLostTrigger NodeLostTrigger .auto_add_replicas - Initial livenodes: [127.0.0.1:10285_solr]
   [junit4]   2> 1573727 DEBUG (Simulated OverseerAutoScalingTriggerThread) [    ] o.a.s.c.a.OverseerTriggerThread -- cleaning old nodeLost / nodeAdded markers
   [junit4]   2> 1573727 DEBUG (Simulated OverseerAutoScalingTriggerThread) [    ] o.a.s.c.a.OverseerTriggerThread Current znodeVersion 1, lastZnodeVersion 1
   [junit4]   2> 1573729 DEBUG (TEST-TestSimTriggerIntegration.testNodeAddedTriggerRestoreState-seed#[89355BF3689E75DE]) [    ] o.a.s.c.a.s.SimClusterStateProvider ** creating new collection states, currentVersion=0
   [junit4]   2> 1573729 DEBUG (TEST-TestSimTriggerIntegration.testNodeAddedTriggerRestoreState-seed#[89355BF3689E75DE]) [    ] o.a.s.c.a.s.SimClusterStateProvider ** saved cluster state version 0
   [junit4]   2> 1573729 INFO  (TEST-TestSimTriggerIntegration.testNodeAddedTriggerRestoreState-seed#[89355BF3689E75DE]) [    ] o.a.s.h.a.MetricsHistoryHandler No .system collection, keeping metrics history in memory.
   [junit4]   2> 1573731 DEBUG (ScheduledTrigger-10288-thread-2) [    ] o.a.s.c.a.NodeLostTrigger Running NodeLostTrigger: .auto_add_replicas with currently live nodes: 2 and last live nodes: 1
   [junit4]   2> 1573737 DEBUG (simCloudManagerPool-10287-thread-2) [    ] o.a.s.c.a.AutoScalingHandler Verified autoscaling configuration
   [junit4]   2> 1573737 DEBUG (simCloudManagerPool-10287-thread-2) [    ] o.a.s.c.a.OverseerTriggerThread Refreshing /autoscaling.json with znode version 2
   [junit4]   2> 1573741 DEBUG (Simulated OverseerAutoScalingTriggerThread) [    ] o.a.s.c.a.OverseerTriggerThread Processed trigger updates upto znodeVersion 2
   [junit4]   2> 1573741 DEBUG (Simulated OverseerAutoScalingTriggerThread) [    ] o.a.s.c.a.OverseerTriggerThread -- cleaning old nodeLost / nodeAdded markers
   [junit4]   2> 1573741 DEBUG (Simulated OverseerAutoScalingTriggerThread) [    ] o.a.s.c.a.OverseerTriggerThread Current znodeVersion 2, lastZnodeVersion 2
   [junit4]   2> 1573742 DEBUG (simCloudManagerPool-10287-thread-3) [    ] o.a.s.c.a.AutoScalingHandler Verified autoscaling configuration
   [junit4]   2> 1573742 DEBUG (simCloudManagerPool-10287-thread-3) [    ] o.a.s.c.a.OverseerTriggerThread Refreshing /autoscaling.json with znode version 3
   [junit4]   2> 1573742 DEBUG (Simulated OverseerAutoScalingTriggerThread) [    ] o.a.s.c.a.OverseerTriggerThread Processed trigger updates upto znodeVersion 3
   [junit4]   2> 1573742 INFO  (Simulated OverseerAutoScalingTriggerThread) [    ] o.a.s.c.a.s.TestSimTriggerIntegration TestTriggerAction init
   [junit4]   2> 1573742 DEBUG (Simulated OverseerAutoScalingTriggerThread) [    ] o.a.s.c.a.NodeAddedTrigger NodeAddedTrigger node_added_restore_trigger - Initial livenodes: [127.0.0.1:10286_solr, 127.0.0.1:10285_solr]
   [junit4]   2> 1573742 DEBUG (Simulated OverseerAutoScalingTriggerThread) [    ] o.a.s.c.a.NodeAddedTrigger NodeAddedTrigger node_added_restore_trigger instantiated with properties: {event=nodeAdded, waitFor=500000, actions=[{name=test, class=org.apache.solr.cloud.autoscaling.sim.TestSimTriggerIntegration$TestTriggerAction}], enabled=true}
   [junit4]   2> 1573742 DEBUG (Simulated OverseerAutoScalingTriggerThread) [    ] o.a.s.c.a.OverseerTriggerThread -- cleaning old nodeLost / nodeAdded markers
   [junit4]   2> 1573742 DEBUG (ScheduledTrigger-10288-thread-1) [    ] o.a.s.c.a.NodeAddedTrigger Running NodeAddedTrigger node_added_restore_trigger
   [junit4]   2> 1573742 DEBUG (ScheduledTrigger-10288-thread-1) [    ] o.a.s.c.a.NodeAddedTrigger Found livenodes: 2
   [junit4]   2> 1573742 DEBUG (Simulated OverseerAutoScalingTriggerThread) [    ] o.a.s.c.a.OverseerTriggerThread Current znodeVersion 3, lastZnodeVersion 3
   [junit4]   2> 1573742 DEBUG (TEST-TestSimTriggerIntegration.testNodeAddedTriggerRestoreState-seed#[89355BF3689E75DE]) [    ] o.a.s.c.a.s.SimClusterStateProvider -- creating marker: /autoscaling/nodeAdded/127.0.0.1:10287_solr
   [junit4]   2> 1573752 DEBUG (ScheduledTrigger-10288-thread-1) [    ] o.a.s.c.a.NodeLostTrigger Running NodeLostTrigger: .auto_add_replicas with currently live nodes: 3 and last live nodes: 2
   [junit4]   2> 1573764 DEBUG (ScheduledTrigger-10288-thread-2) [    ] o.a.s.c.a.NodeAddedTrigger Running NodeAddedTrigger node_added_restore_trigger
   [junit4]   2> 1573764 DEBUG (ScheduledTrigger-10288-thread-2) [    ] o.a.s.c.a.NodeAddedTrigger Found livenodes: 3
   [junit4]   2> 1573764 DEBUG (ScheduledTrigger-10288-thread-2) [    ] o.a.s.c.a.NodeAddedTrigger Tracking new node: 127.0.0.1:10287_solr at time 1878146076633215
   [junit4]   2> 1573768 DEBUG (simCloudManagerPool-10287-thread-4) [    ] o.a.s.c.a.AutoScalingHandler Verified autoscaling configuration
   [junit4]   2> 1573768 DEBUG (simCloudManagerPool-10287-thread-4) [    ] o.a.s.c.a.OverseerTriggerThread Refreshing /autoscaling.json with znode version 4
   [junit4]   2> 1573768 DEBUG (Simulated OverseerAutoScalingTriggerThread) [    ] o.a.s.c.a.OverseerTriggerThread Processed trigger updates upto znodeVersion 4
   [junit4]   2> 1573768 INFO  (Simulated OverseerAutoScalingTriggerThread) [    ] o.a.s.c.a.s.TestSimTriggerIntegration TestTriggerAction init
   [junit4]   2> 1573768 DEBUG (Simulated OverseerAutoScalingTriggerThread) [    ] o.a.s.c.a.NodeAddedTrigger NodeAddedTrigger node_added_restore_trigger - Initial livenodes: [127.0.0.1:10287_solr, 127.0.0.1:10286_solr, 127.0.0.1:10285_solr]
   [junit4]   2> 1573768 DEBUG (Simulated OverseerAutoScalingTriggerThread) [    ] o.a.s.c.a.NodeAddedTrigger NodeAddedTrigger node_added_restore_trigger instantiated with properties: {event=nodeAdded, waitFor=2, actions=[{name=test, class=org.apache.solr.cloud.autoscaling.sim.TestSimTriggerIntegration$TestTriggerAction}], enabled=true}
   [junit4]   2> 1573769 DEBUG (Simulated OverseerAutoScalingTriggerThread) [    ] o.a.s.c.a.OverseerTriggerThread -- cleaning old nodeLost / nodeAdded markers
   [junit4]   2> 1573769 DEBUG (ScheduledTrigger-10288-thread-3) [    ] o.a.s.c.a.NodeAddedTrigger Running NodeAddedTrigger node_added_restore_trigger
   [junit4]   2> 1573769 DEBUG (ScheduledTrigger-10288-thread-3) [    ] o.a.s.c.a.NodeAddedTrigger Found livenodes: 3
   [junit4]   2> 1573769 DEBUG (Simulated OverseerAutoScalingTriggerThread) [    ] o.a.s.c.a.OverseerTriggerThread Current znodeVersion 4, lastZnodeVersion 4
   [junit4]   2> 1573772 DEBUG (ScheduledTrigger-10288-thread-1) [    ] o.a.s.c.a.NodeLostTrigger Running NodeLostTrigger: .auto_add_replicas with currently live nodes: 3 and last live nodes: 3
   [junit4]   2> 1573789 DEBUG (ScheduledTrigger-10288-thread-4) [    ] o.a.s.c.a.NodeAddedTrigger Running NodeAddedTrigger node_added_restore_trigger
   [junit4]   2> 1573789 DEBUG (ScheduledTrigger-10288-thread-4) [    ] o.a.s.c.a.NodeAddedTrigger Found livenodes: 3
   [junit4]   2> 1573792 DEBUG (ScheduledTrigger-10288-thread-3) [    ] o.a.s.c.a.NodeLostTrigger Running NodeLostTrigger: .auto_add_replicas with currently live nodes: 3 and last live nodes: 3
   [junit4]   2> 1573810 DEBUG (ScheduledTrigger-10288-thread-2) [    ] o.a.s.c.a.NodeAddedTrigger Running NodeAddedTrigger node_added_restore_trigger
   [junit4]   2> 1573810 DEBUG (ScheduledTrigger-10288-thread-2) [    ] o.a.s.c.a.NodeAddedTrigger Found livenodes: 3
   [junit4]   2> 1573810 DEBUG (ScheduledTrigger-10288-thread-2) [    ] o.a.s.c.a.NodeAddedTrigger NodeAddedTrigger node_added_restore_trigger firing registered processor for nodes: [127.0.0.1:10287_solr] added at times [1878146076633215], now=1878148369751965
   [junit4]   2> 1573810 DEBUG (ScheduledTrigger-10288-thread-2) [    ] o.a.s.c.a.SystemLogListener Collection .system missing, skip sending event {
   [junit4]   2>   "id":"6ac29f5bbe87fT9wi5s1ktn3jjrjn1yj28y3vew",
   [junit4]   2>   "source":"node_added_restore_trigger",
   [junit4]   2>   "eventTime":1878146076633215,
   [junit4]   2>   "eventType":"NODEADDED",
   [junit4]   2>   "properties":{
   [junit4]   2>     "eventTimes":[1878146076633215],
   [junit4]   2>     "preferredOperation":"movereplica",
   [junit4]   2>     "_enqueue_time_":1878148376163915,
   [junit4]   2>     "nodeNames":["127.0.0.1:10287_solr"]}}
   [junit4]   2> 1573811 DEBUG (ScheduledTrigger-10288-thread-2) [    ] o.a.s.c.a.NodeAddedTrigger Removing new node from tracking: 127.0.0.1:10287_solr
   [junit4]   2> 1573811 DEBUG (AutoscalingActionExecutor-10289-thread-1) [    ] o.a.s.c.a.SystemLogListener Collection .system missing, skip sending event {
   [junit4]   2>   "id":"6ac29f5bbe87fT9wi5s1ktn3jjrjn1yj28y3vew",
   [junit4]   2>   "source":"node_added_restore_trigger",
   [junit4]   2>   "eventTime":1878146076633215,
   [junit4]   2>   "eventType":"NODEADDED",
   [junit4]   2>   "properties":{
   [junit4]   2>     "eventTimes":[1878146076633215],
   [junit4]   2>     "preferredOperation":"movereplica",
   [junit4]   2>     "_enqueue_time_":1878148376163915,
   [junit4]   2>     "nodeNames":["127.0.0.1:10287_solr"]}}
   [junit4]   2> 1573811 INFO  (Simulated OverseerAutoScalingTriggerThread) [    ] o.a.s.c.a.OverseerTriggerThread OverseerTriggerThread woken up but we are closed, exiting.
   [junit4]   2> 1573813 DEBUG (TEST-TestSimTriggerIntegration.testNodeAddedTriggerRestoreState-seed#[89355BF3689E75DE]) [    ] o.a.s.c.a.OverseerTriggerThread OverseerTriggerThread has been closed explicitly
   [junit4]   2> 1573814 INFO  (TEST-TestSimTriggerIntegration.testNodeAddedTriggerRestoreState-seed#[89355BF3689E75DE]) [    ] o.a.s.SolrTestCaseJ4 ###Ending testNodeAddedTriggerRestoreState
   [junit4]   2> 1573816 INFO  (TEST-TestSimTriggerIntegration.testNodeAddedTrigger-seed#[89355BF3689E75DE]) [    ] o.a.s.SolrTestCaseJ4 ###Starting testNodeAddedTrigger
   [junit4]   2> 1573820 DEBUG (TEST-TestSimTriggerIntegration.testNodeAddedTrigger-seed#[89355BF3689E75DE]) [    ] o.a.s.c.a.s.SimClusterStateProvider --- new Overseer leader: 127.0.0.1:10288_solr
   [junit4]   2> 1573820 DEBUG (Simulated OverseerAutoScalingTriggerThread) [    ] o.a.s.c.a.OverseerTriggerThread Adding .auto_add_replicas and .scheduled_maintenance triggers
   [junit4]   2> 1573820 DEBUG (Simulated OverseerAutoScalingTriggerThread) [    ] o.a.s.c.a.OverseerTriggerThread Refreshing /autoscaling.json with znode version 1
   [junit4]   2> 1573820 DEBUG (Simulated OverseerAutoScalingTriggerThread) [    ] o.a.s.c.a.OverseerTriggerThread Current znodeVersion 1, lastZnodeVersion 0
   [junit4]   2> 1573820 DEBUG (Simulated OverseerAutoScalingTriggerThread) [    ] o.a.s.c.a.OverseerTriggerThread Processed trigger updates upto znodeVersion 1
   [junit4]   2> 1573821 DEBUG (TEST-TestSimTriggerIntegration.testNodeAddedTrigger-seed#[89355BF3689E75DE]) [    ] o.a.s.c.a.s.SimClusterStateProvider ** creating new collection states, currentVersion=0
   [junit4]   2> 1573821 DEBUG (TEST-TestSimTriggerIntegration.testNodeAddedTrigger-seed#[89355BF3689E75DE]) [    ] o.a.s.c.a.s.SimClusterStateProvider ** saved cluster state version 0
   [junit4]   2> 1573821 INFO  (TEST-TestSimTriggerIntegration.testNodeAddedTrigger-seed#[89355BF3689E75DE]) [    ] o.a.s.h.a.MetricsHistoryHandler No .system collection, keeping metrics history in memory.
   [junit4]   2> 1573822 DEBUG (Simulated OverseerAutoScalingTriggerThread) [    ] o.a.s.c.a.NodeLostTrigger NodeLostTrigger .auto_add_replicas - Initial livenodes: [127.0.0.1:10288_solr, 127.0.0.1:10289_solr]
   [junit4]   2> 1573822 DEBUG (Simulated OverseerAutoScalingTriggerThread) [    ] o.a.s.c.a.OverseerTriggerThread -- cleaning old nodeLost / nodeAdded markers
   [junit4]   2> 1573822 DEBUG (Simulated OverseerAutoScalingTriggerThread) [    ] o.a.s.c.a.OverseerTriggerThread Current znodeVersion 1, lastZnodeVersion 1
   [junit4]   2> 1573822 DEBUG (ScheduledTrigger-10294-thread-2) [    ] o.a.s.c.a.NodeLostTrigger Running NodeLostTrigger: .auto_add_replicas with currently live nodes: 2 and last live nodes: 2
   [junit4]   2> 1573822 DEBUG (simCloudManagerPool-10293-thread-2) [    ] o.a.s.c.a.AutoScalingHandler Verified autoscaling configuration
   [junit4]   2> 1573822 DEBUG (simCloudManagerPool-10293-thread-2) [    ] o.a.s.c.a.OverseerTriggerThread Refreshing /autoscaling.json with znode version 2
   [junit4]   2> 1573823 DEBUG (Simulated OverseerAutoScalingTriggerThread) [    ] o.a.s.c.a.OverseerTriggerThread Processed trigger updates upto znodeVersion 2
   [junit4]   2> 1573823 DEBUG (Simulated OverseerAutoScalingTriggerThread) [    ] o.a.s.c.a.OverseerTriggerThread -- cleaning old nodeLost / nodeAdded markers
   [junit4]   2> 1573823 DEBUG (Simulated OverseerAutoScalingTriggerThread) [    ] o.a.s.c.a.OverseerTriggerThread Current znodeVersion 2, lastZnodeVersion 2
   [junit4]   2> 1573826 DEBUG (simCloudManagerPool-10293-thread-3) [    ] o.a.s.c.a.AutoScalingHandler Verified autoscaling configuration
   [junit4]   2> 1573826 DEBUG (simCloudManagerPool-10293-thread-3) [    ] o.a.s.c.a.OverseerTriggerThread Refreshing /autoscaling.json with znode version 3
   [junit4]   2> 1573826 DEBUG (Simulated OverseerAutoScalingTriggerThread) [    ] o.a.s.c.a.OverseerTriggerThread Processed trigger updates upto znodeVersion 3
   [junit4]   2> 1573827 INFO  (Simulated OverseerAutoScalingTriggerThread) [    ] o.a.s.c.a.s.TestSimTriggerIntegration TestTriggerAction init
   [junit4]   2> 1573827 DEBUG (Simulated OverseerAutoScalingTriggerThread) [    ] o.a.s.c.a.NodeAddedTrigger NodeAddedTrigger node_added_trigger - Initial livenodes: [127.0.0.1:10288_solr, 127.0.0.1:10289_solr]
   [junit4]   2> 1573827 DEBUG (Simulated OverseerAutoScalingTriggerThread) [    ] o.a.s.c.a.NodeAddedTrigger NodeAddedTrigger node_added_trigger instantiated with properties: {event=nodeAdded, waitFor=3, actions=[{name=test, class=org.apache.solr.cloud.autoscaling.sim.TestSimTriggerIntegration$TestTriggerAction}], enabled=true}
   [junit4]   2> 1573827 DEBUG (Simulated OverseerAutoScalingTriggerThread) [    ] o.a.s.c.a.OverseerTriggerThread -- cleaning old nodeLost / nodeAdded markers
   [junit4]   2> 1573827 DEBUG (Simulated OverseerAutoScalingTriggerThread) [    ] o.a.s.c.a.OverseerTriggerThread Current znodeVersion 3, lastZnodeVersion 3
   [junit4]   2> 1573827 DEBUG (ScheduledTrigger-10294-thread-1) [    ] o.a.s.c.a.NodeAddedTrigger Running NodeAddedTrigger node_added_trigger
   [junit4]   2> 1573827 DEBUG (ScheduledTrigger-10294-thread-1) [    ] o.a.s.c.a.NodeAddedTrigger Found livenodes: 2
   [junit4]   2> 1573827 DEBUG (TEST-TestSimTriggerIntegration.testNodeAddedTrigger-seed#[89355BF3689E75DE]) [    ] o.a.s.c.a.s.SimClusterStateProvider -- creating marker: /autoscaling/nodeAdded/127.0.0.1:10290_solr
   [junit4]   2> 1573842 DEBUG (ScheduledTrigger-10294-thread-3) [    ] o.a.s.c.a.NodeLostTrigger Running NodeLostTrigger: .auto_add_replicas with currently live nodes: 3 and last live nodes: 2
   [junit4]   2> 1573847 DEBUG (ScheduledTrigger-10294-thread-2) [    ] o.a.s.c.a.NodeAddedTrigger Running NodeAddedTrigger node_added_trigger
   [junit4]   2> 1573847 DEBUG (ScheduledTrigger-10294-thread-2) [    ] o.a.s.c.a.NodeAddedTrigger Found livenodes: 3
   [junit4]   2> 1573847 DEBUG (ScheduledTrigger-10294-thread-2) [    ] o.a.s.c.a.NodeAddedTrigger Tracking new node: 127.0.0.1:10290_solr at time 1878150229336865
   [junit4]   2> 1573862 DEBUG (ScheduledTrigger-10294-thread-4) [    ] o.a.s.c.a.NodeLostTrigger Running NodeLostTrigger: .auto_add_replicas with currently live nodes: 3 and last live nodes: 3
   [junit4]   2> 1573868 DEBUG (ScheduledTrigger-10294-thread-1) [    ] o.a.s.c.a.NodeAddedTrigger Running NodeAddedTrigger node_added_trigger
   [junit4]   2> 1573868 DEBUG (ScheduledTrigger-10294-thread-1) [    ] o.a.s.c.a.NodeAddedTrigger Found livenodes: 3
   [junit4]   2> 1573882 DEBUG (ScheduledTrigger-10294-thread-3) [    ] o.a.s.c.a.NodeLostTrigger Running NodeLostTrigger: .auto_add_replicas with currently live nodes: 3 and last live nodes: 3
   [junit4]   2> 1573888 DEBUG (ScheduledTrigger-10294-thread-2) [    ] o.a.s.c.a.NodeAddedTrigger Running NodeAddedTrigger node_added_trigger
   [junit4]   2> 1573888 DEBUG (ScheduledTrigger-10294-thread-2) [    ] o.a.s.c.a.NodeAddedTrigger Found livenodes: 3
   [junit4]   2> 1573903 DEBUG (ScheduledTrigger-10294-thread-4) [    ] o.a.s.c.a.NodeLostTrigger Running NodeLostTrigger: .auto_add_replicas with currently live nodes: 3 and last live nodes: 3
   [junit4]   2> 1573908 DEBUG (ScheduledTrigger-10294-thread-1) [    ] o.a.s.c.a.NodeAddedTrigger Running NodeAddedTrigger node_added_trigger
   [junit4]   2> 1573908 DEBUG (ScheduledTrigger-10294-thread-1) [    ] o.a.s.c.a.NodeAddedTrigger Found livenodes: 3
   [junit4]   2> 1573908 DEBUG (ScheduledTrigger-10294-thread-1) [    ] o.a.s.c.a.NodeAddedTrigger NodeAddedTrigger node_added_trigger firing registered processor for nodes: [127.0.0.1:10290_solr] added at times [1878150229336865], now=1878153270346715
   [junit4]   2> 1573909 DEBUG (ScheduledTrigger-10294-thread-1) [    ] o.a.s.c.a.SystemLogListener Collection .system missing, skip sending event {
   [junit4]   2>   "id":"6ac2aed412321T9wi5s1ktn3jjrjn1yj28y3vey",
   [junit4]   2>   "source":"node_added_trigger",
   [junit4]   2>   "eventTime":1878150229336865,
   [junit4]   2>   "eventType":"NODEADDED",
   [junit4]   2>   "properties":{
   [junit4]   2>     "eventTimes":[1878150229336865],
   [junit4]   2>     "preferredOperation":"movereplica",
   [junit4]   2>     "_enqueue_time_":1878153304180215,
   [junit4]   2>     "nodeNames":["127.0.0.1:10290_solr"]}}
   [junit4]   2> 1573909 DEBUG (ScheduledTrigger-10294-thread-1) [    ] o.a.s.c.a.NodeAddedTrigger Removing new node from tracking: 127.0.0.1:10290_solr
   [junit4]   2> 1573909 DEBUG (AutoscalingActionExecutor-10295-thread-1) [    ] o.a.s.c.a.SystemLogListener Collection .system missing, skip sending event {
   [junit4]   2>   "id":"6ac2aed412321T9wi5s1ktn3jjrjn1yj28y3vey",
   [junit4]   2>   "source":"node_added_trigger",
   [junit4]   2>   "eventTime":1878150229336865,
   [junit4]   2>   "eventType":"NODEADDED",
   [junit4]   2>   "properties":{
   [junit4]   2>     "eventTimes":[1878150229336865],
   [junit4]   2>     "preferredOperation":"movereplica",
   [junit4]   2>     "_enqueue_time_":1878153304180215,
   [junit4]   2>     "nodeNames":["127.0.0.1:10290_solr"]}}
   [junit4]   2> 1573910 DEBUG (simCloudManagerPool-10293-thread-4) [    ] o.a.s.c.a.AutoScalingHandler Verified autoscaling configuration
   [junit4]   2> 1573910 DEBUG (simCloudManagerPool-10293-thread-4) [    ] o.a.s.c.a.OverseerTriggerThread Refreshing /autoscaling.json with znode version 4
   [junit4]   2> 1573910 DEBUG (Simulated OverseerAutoScalingTriggerThread) [    ] o.a.s.c.a.OverseerTriggerThread Processed trigger updates upto znodeVersion 4
   [junit4]   2> 1573910 DEBUG (Simulated OverseerAutoScalingTriggerThread) [    ] o.a.s.c.a.OverseerTriggerThread -- cleaning old nodeLost / nodeAdded markers
   [junit4]   2> 1573911 DEBUG (Simulated OverseerAutoScalingTriggerThread) [    ] o.a.s.c.a.OverseerTriggerThread Current znodeVersion 4, lastZnodeVersion 4
   [junit4]   2> 1573950 INFO  (Simulated OverseerAutoScalingTriggerThread) [    ] o.a.s.c.a.OverseerTriggerThread OverseerTriggerThread woken up but we are closed, exiting.
   [junit4]   2> 1573951 DEBUG (TEST-TestSimTriggerIntegration.testNodeAddedTrigger-seed#[89355BF3689E75DE]) [    ] o.a.s.c.a.OverseerTriggerThread OverseerTriggerThread has been closed explicitly
   [junit4]   2> 1573951 INFO  (TEST-TestSimTriggerIntegration.testNodeAddedTrigger-seed#[89355BF3689E75DE]) [    ] o.a.s.SolrTestCaseJ4 ###Ending testNodeAddedTrigger
   [junit4]   2> 1573954 INFO  (TEST-TestSimTriggerIntegration.testTriggerThrottling-seed#[89355BF3689E75DE]) [    ] o.a.s.SolrTestCaseJ4 ###Starting testTriggerThrottling
   [junit4]   2> 1573956 DEBUG (TEST-TestSimTriggerIntegration.testTriggerThrottling-seed#[89355BF3689E75DE]) [    ] o.a.s.c.a.s.SimClusterStateProvider --- new Overseer leader: 127.0.0.1:10291_solr
   [junit4]   2> 1573956 DEBUG (Simulated OverseerAutoScalingTriggerThread) [    ] o.a.s.c.a.OverseerTriggerThread Adding .auto_add_replicas and .scheduled_maintenance triggers
   [junit4]   2> 1573956 DEBUG (TEST-TestSimTriggerIntegration.testTriggerThrottling-seed#[89355BF3689E75DE]) [    ] o.a.s.c.a.s.SimClusterStateProvider ** creating new collection states, currentVersion=0
   [junit4]   2> 1573956 DEBUG (Simulated OverseerAutoScalingTriggerThread) [    ] o.a.s.c.a.OverseerTriggerThread Refreshing /autoscaling.json with znode version 1
   [junit4]   2> 1573956 DEBUG (TEST-TestSimTriggerIntegration.testTriggerThrottling-seed#[89355BF3689E75DE]) [    ] o.a.s.c.a.s.SimClusterStateProvider ** saved cluster state version 0
   [junit4]   2> 1573956 INFO  (TEST-TestSimTriggerIntegration.testTriggerThrottling-seed#[89355BF3689E75DE]) [    ] o.a.s.h.a.MetricsHistoryHandler No .system collection, keeping metrics history in memory.
   [junit4]   2> 1573956 DEBUG (Simulated OverseerAutoScalingTriggerThread) [    ] o.a.s.c.a.OverseerTriggerThread Current znodeVersion 1, lastZnodeVersion 0
   [junit4]   2> 1573956 DEBUG (Simulated OverseerAutoScalingTriggerThread) [    ] o.a.s.c.a.OverseerTriggerThread Processed trigger updates upto znodeVersion 1
   [junit4]   2> 1573957 DEBUG (Simulated OverseerAutoScalingTriggerThread) [    ] o.a.s.c.a.NodeLostTrigger NodeLostTrigger .auto_add_replicas - Initial livenodes: [127.0.0.1:10291_solr, 127.0.0.1:10292_solr]
   [junit4]   2> 1573957 DEBUG (Simulated OverseerAutoScalingTriggerThread) [    ] o.a.s.c.a.OverseerTriggerThread -- cleaning old nodeLost / nodeAdded markers
   [junit4]   2> 1573957 DEBUG (Simulated OverseerAutoScalingTriggerThread) [    ] o.a.s.c.a.OverseerTriggerThread Current znodeVersion 1, lastZnodeVersion 1
   [junit4]   2> 1573957 DEBUG (ScheduledTrigger-10300-thread-2) [    ] o.a.s.c.a.NodeLostTrigger Running NodeLostTrigger: .auto_add_replicas with currently live nodes: 2 and last live nodes: 2
   [junit4]   2> 1573957 DEBUG (simCloudManagerPool-10299-thread-2) [    ] o.a.s.c.a.AutoScalingHandler Verified autoscaling configuration
   [junit4]   2> 1573957 DEBUG (simCloudManagerPool-10299-thread-2) [    ] o.a.s.c.a.OverseerTriggerThread Refreshing /autoscaling.json with znode version 2
   [junit4]   2> 1573958 DEBUG (Simulated OverseerAutoScalingTriggerThread) [    ] o.a.s.c.a.OverseerTriggerThread Processed trigger updates upto znodeVersion 2
   [junit4]   2> 1573958 DEBUG (Simulated OverseerAutoScalingTriggerThread) [    ] o.a.s.c.a.OverseerTriggerThread -- cleaning old nodeLost / nodeAdded markers
   [junit4]   2> 1573958 DEBUG (Simulated OverseerAutoScalingTriggerThread) [    ] o.a.s.c.a.OverseerTriggerThread Current znodeVersion 2, lastZnodeVersion 2
   [junit4]   2> 1573958 DEBUG (simCloudManagerPool-10299-thread-3) [    ] o.a.s.c.a.AutoScalingHandler Verified autoscaling configuration
   [junit4]   2> 1573958 DEBUG (simCloudManagerPool-10299-thread-3) [    ] o.a.s.c.a.OverseerTriggerThread Refreshing /autoscaling.json with znode version 3
   [junit4]   2> 1573959 DEBUG (Simulated OverseerAutoScalingTriggerThread) [    ] o.a.s.c.a.OverseerTriggerThread Processed trigger updates upto znodeVersion 3
   [junit4]   2> 1573959 INFO  (Simulated OverseerAutoScalingTriggerThread) [    ] o.a.s.c.a.s.TestSimTriggerIntegration TestTriggerAction init
   [junit4]   2> 1573959 DEBUG (Simulated OverseerAutoScalingTriggerThread) [    ] o.a.s.c.a.NodeAddedTrigger NodeAddedTrigger node_added_trigger1 - Initial livenodes: [127.0.0.1:10291_solr, 127.0.0.1:10292_solr]
   [junit4]   2> 1573959 DEBUG (Simulated OverseerAutoScalingTriggerThread) [    ] o.a.s.c.a.NodeAddedTrigger NodeAddedTrigger node_added_trigger1 instantiated with properties: {event=nodeAdded, waitFor=0, actions=[{name=test, class=org.apache.solr.cloud.autoscaling.sim.TestSimTriggerIntegration$ThrottlingTesterAction}], enabled=true}
   [junit4]   2> 1573959 DEBUG (Simulated OverseerAutoScalingTriggerThread) [    ] o.a.s.c.a.OverseerTriggerThread -- cleaning old nodeLost / nodeAdded markers
   [junit4]   2> 1573959 DEBUG (Simulated OverseerAutoScalingTriggerThread)

[...truncated too long message...]

[junit4]   2> 10232 DEBUG (ScheduledTrigger-108-thread-1) [    ] o.a.s.c.a.NodeLostTrigger Running NodeLostTrigger: node_lost_restore_trigger with currently live nodes: 2 and last live nodes: 3
   [junit4]   2> 10232 DEBUG (ScheduledTrigger-108-thread-1) [    ] o.a.s.c.a.NodeLostTrigger Tracking lost node: 127.0.0.1:10055_solr
   [junit4]   2> 10233 DEBUG (simCloudManagerPool-107-thread-4) [    ] o.a.s.c.a.AutoScalingHandler Verified autoscaling configuration
   [junit4]   2> 10234 DEBUG (simCloudManagerPool-107-thread-4) [    ] o.a.s.c.a.OverseerTriggerThread Refreshing /autoscaling.json with znode version 4
   [junit4]   2> 10234 DEBUG (Simulated OverseerAutoScalingTriggerThread) [    ] o.a.s.c.a.OverseerTriggerThread Processed trigger updates upto znodeVersion 4
   [junit4]   2> 10234 INFO  (Simulated OverseerAutoScalingTriggerThread) [    ] o.a.s.c.a.s.TestSimTriggerIntegration TestTriggerAction init
   [junit4]   2> 10234 DEBUG (Simulated OverseerAutoScalingTriggerThread) [    ] o.a.s.c.a.NodeLostTrigger NodeLostTrigger node_lost_restore_trigger - Initial livenodes: [127.0.0.1:10054_solr, 127.0.0.1:10053_solr]
   [junit4]   2> 10234 DEBUG (Simulated OverseerAutoScalingTriggerThread) [    ] o.a.s.c.a.OverseerTriggerThread -- cleaning old nodeLost / nodeAdded markers
   [junit4]   2> 10234 DEBUG (ScheduledTrigger-108-thread-4) [    ] o.a.s.c.a.NodeLostTrigger Running NodeLostTrigger: node_lost_restore_trigger with currently live nodes: 2 and last live nodes: 2
   [junit4]   2> 10234 DEBUG (Simulated OverseerAutoScalingTriggerThread) [    ] o.a.s.c.a.OverseerTriggerThread Current znodeVersion 4, lastZnodeVersion 4
   [junit4]   2> 10234 DEBUG (ScheduledTrigger-108-thread-4) [    ] o.a.s.c.a.NodeLostTrigger NodeLostTrigger firing registered processor for lost nodes: [127.0.0.1:10055_solr]
   [junit4]   2> 10235 DEBUG (ScheduledTrigger-108-thread-4) [    ] o.a.s.c.a.ScheduledTriggers ++++++++ Cooldown inactive - processing event: {
   [junit4]   2>   "id":"698e64af78404T9wi5s1ktn3jjrjn1yj28y3oir",
   [junit4]   2>   "source":"node_lost_restore_trigger",
   [junit4]   2>   "eventTime":1856964727899140,
   [junit4]   2>   "eventType":"NODELOST",
   [junit4]   2>   "properties":{
   [junit4]   2>     "eventTimes":[1856964727899140],
   [junit4]   2>     "preferredOperation":"movereplica",
   [junit4]   2>     "nodeNames":["127.0.0.1:10055_solr"]}}
   [junit4]   2> 10235 DEBUG (ScheduledTrigger-108-thread-4) [    ] o.a.s.c.a.ScheduledTriggers Pausing all triggers: [.auto_add_replicas, node_lost_restore_trigger]
   [junit4]   2> 10235 DEBUG (ScheduledTrigger-108-thread-4) [    ] o.a.s.c.a.SystemLogListener Collection .system missing, skip sending event {
   [junit4]   2>   "id":"698e64af78404T9wi5s1ktn3jjrjn1yj28y3oir",
   [junit4]   2>   "source":"node_lost_restore_trigger",
   [junit4]   2>   "eventTime":1856964727899140,
   [junit4]   2>   "eventType":"NODELOST",
   [junit4]   2>   "properties":{
   [junit4]   2>     "eventTimes":[1856964727899140],
   [junit4]   2>     "preferredOperation":"movereplica",
   [junit4]   2>     "_enqueue_time_":1856964860051740,
   [junit4]   2>     "nodeNames":["127.0.0.1:10055_solr"]}}
   [junit4]   2> 10235 DEBUG (AutoscalingActionExecutor-109-thread-1) [    ] o.a.s.c.a.ScheduledTriggers -- processing actions for {
   [junit4]   2>   "id":"698e64af78404T9wi5s1ktn3jjrjn1yj28y3oir",
   [junit4]   2>   "source":"node_lost_restore_trigger",
   [junit4]   2>   "eventTime":1856964727899140,
   [junit4]   2>   "eventType":"NODELOST",
   [junit4]   2>   "properties":{
   [junit4]   2>     "eventTimes":[1856964727899140],
   [junit4]   2>     "preferredOperation":"movereplica",
   [junit4]   2>     "_enqueue_time_":1856964860051740,
   [junit4]   2>     "nodeNames":["127.0.0.1:10055_solr"]}}
   [junit4]   2> 10235 DEBUG (AutoscalingActionExecutor-109-thread-1) [    ] o.a.s.c.a.SystemLogListener Collection .system missing, skip sending event {
   [junit4]   2>   "id":"698e64af78404T9wi5s1ktn3jjrjn1yj28y3oir",
   [junit4]   2>   "source":"node_lost_restore_trigger",
   [junit4]   2>   "eventTime":1856964727899140,
   [junit4]   2>   "eventType":"NODELOST",
   [junit4]   2>   "properties":{
   [junit4]   2>     "eventTimes":[1856964727899140],
   [junit4]   2>     "preferredOperation":"movereplica",
   [junit4]   2>     "_enqueue_time_":1856964860051740,
   [junit4]   2>     "nodeNames":["127.0.0.1:10055_solr"]}}
   [junit4]   2> 10235 DEBUG (AutoscalingActionExecutor-109-thread-1) [    ] o.a.s.c.a.ScheduledTriggers Resuming trigger: node_lost_restore_trigger after 100ms
   [junit4]   2> 10235 DEBUG (AutoscalingActionExecutor-109-thread-1) [    ] o.a.s.c.a.ScheduledTriggers Resuming trigger: .auto_add_replicas after 100ms
   [junit4]   2> 10235 DEBUG (AutoscalingActionExecutor-109-thread-1) [    ] o.a.s.c.a.ScheduledTriggers -- processing took 14 ms for event id=698e64af78404T9wi5s1ktn3jjrjn1yj28y3oir
   [junit4]   2> 10236 INFO  (Simulated OverseerAutoScalingTriggerThread) [    ] o.a.s.c.a.OverseerTriggerThread OverseerTriggerThread woken up but we are closed, exiting.
   [junit4]   2> 10236 DEBUG (TEST-TestSimTriggerIntegration.testNodeLostTriggerRestoreState-seed#[89355BF3689E75DE]) [    ] o.a.s.c.a.ScheduledTriggers Shutting down scheduled thread pool executor now
   [junit4]   2> 10236 DEBUG (TEST-TestSimTriggerIntegration.testNodeLostTriggerRestoreState-seed#[89355BF3689E75DE]) [    ] o.a.s.c.a.ScheduledTriggers Shutting down action executor now
   [junit4]   2> 10236 DEBUG (TEST-TestSimTriggerIntegration.testNodeLostTriggerRestoreState-seed#[89355BF3689E75DE]) [    ] o.a.s.c.a.ScheduledTriggers Awaiting termination for action executor
   [junit4]   2> 10236 DEBUG (TEST-TestSimTriggerIntegration.testNodeLostTriggerRestoreState-seed#[89355BF3689E75DE]) [    ] o.a.s.c.a.ScheduledTriggers Awaiting termination for scheduled thread pool executor
   [junit4]   2> 10236 DEBUG (TEST-TestSimTriggerIntegration.testNodeLostTriggerRestoreState-seed#[89355BF3689E75DE]) [    ] o.a.s.c.a.ScheduledTriggers ScheduledTriggers closed completely
   [junit4]   2> 10236 DEBUG (TEST-TestSimTriggerIntegration.testNodeLostTriggerRestoreState-seed#[89355BF3689E75DE]) [    ] o.a.s.c.a.OverseerTriggerThread OverseerTriggerThread has been closed explicitly
   [junit4]   2> 10237 INFO  (TEST-TestSimTriggerIntegration.testNodeLostTriggerRestoreState-seed#[89355BF3689E75DE]) [    ] o.a.s.SolrTestCaseJ4 ###Ending testNodeLostTriggerRestoreState
   [junit4] OK      0.06s J2 | TestSimTriggerIntegration.testNodeLostTriggerRestoreState
   [junit4]   2> NOTE: leaving temporary files on disk at: /home/jenkins/workspace/Lucene-Solr-BadApples-master-Linux/solr/build/solr-core/test/J2/temp/solr.cloud.autoscaling.sim.TestSimTriggerIntegration_89355BF3689E75DE-001
   [junit4]   2> NOTE: test params are: codec=Asserting(Lucene80): {}, docValues:{}, maxPointsInLeafNode=1997, maxMBSortInHeap=7.724307600575459, sim=Asserting(org.apache.lucene.search.similarities.AssertingSimilarity@119ffa39), locale=de-LU, timezone=America/Ojinaga
   [junit4]   2> NOTE: Linux 4.15.0-42-generic amd64/Oracle Corporation 1.8.0_172 (64-bit)/cpus=8,threads=1,free=249457944,total=394264576
   [junit4]   2> NOTE: All tests run in this JVM: [TestSimTriggerIntegration, TestSimTriggerIntegration]
   [junit4] Completed [5/5 (2!)] on J2 in 3.02s, 11 tests, 1 failure, 3 skipped <<< FAILURES!
   [junit4]
   [junit4]
   [junit4] Tests with failures [seed: 89355BF3689E75DE]:
   [junit4]   - org.apache.solr.cloud.autoscaling.sim.TestSimTriggerIntegration.testNodeMarkersRegistration
   [junit4]   - org.apache.solr.cloud.autoscaling.sim.TestSimTriggerIntegration.testNodeMarkersRegistration
   [junit4]
   [junit4]
   [junit4] JVM J0:     0.58 ..     9.83 =     9.25s
   [junit4] JVM J1:     0.59 ..     7.68 =     7.08s
   [junit4] JVM J2:     0.58 ..    11.21 =    10.63s
   [junit4] Execution time total: 11 seconds
   [junit4] Tests summary: 5 suites, 55 tests, 2 failures, 15 ignored (15 assumptions)

BUILD FAILED
/home/jenkins/workspace/Lucene-Solr-BadApples-master-Linux/lucene/common-build.xml:1572: The following error occurred while executing this line:
/home/jenkins/workspace/Lucene-Solr-BadApples-master-Linux/lucene/common-build.xml:1099: There were test failures: 5 suites, 55 tests, 2 failures, 15 ignored (15 assumptions) [seed: 89355BF3689E75DE]

Total time: 13 seconds

[repro] Setting last failure code to 256

[repro] Failures:
[repro]   2/5 failed: org.apache.solr.cloud.autoscaling.sim.TestSimTriggerIntegration
[repro] Exiting with code 256
+ mv lucene/build lucene/build.repro
+ mv solr/build solr/build.repro
+ mv lucene/build.orig lucene/build
+ mv solr/build.orig solr/build
Archiving artifacts
Setting ANT_1_8_2_HOME=/var/lib/jenkins/tools/hudson.tasks.Ant_AntInstallation/ANT_1.8.2
[WARNINGS] Parsing warnings in console log with parser Java Compiler (javac)
Setting ANT_1_8_2_HOME=/var/lib/jenkins/tools/hudson.tasks.Ant_AntInstallation/ANT_1.8.2
Setting ANT_1_8_2_HOME=/var/lib/jenkins/tools/hudson.tasks.Ant_AntInstallation/ANT_1.8.2
<Git Blamer> Using GitBlamer to create author and commit information for all warnings.
<Git Blamer> GIT_COMMIT=5a513fab8345cd0397435e7ce830268cd3763651, workspace=/var/lib/jenkins/workspace/Lucene-Solr-BadApples-master-Linux
[WARNINGS] Computing warning deltas based on reference build #143
Recording test results
Setting ANT_1_8_2_HOME=/var/lib/jenkins/tools/hudson.tasks.Ant_AntInstallation/ANT_1.8.2
Build step 'Publish JUnit test result report' changed build result to UNSTABLE
Email was triggered for: Unstable (Test Failures)
Sending email for trigger: Unstable (Test Failures)
Setting ANT_1_8_2_HOME=/var/lib/jenkins/tools/hudson.tasks.Ant_AntInstallation/ANT_1.8.2
Setting ANT_1_8_2_HOME=/var/lib/jenkins/tools/hudson.tasks.Ant_AntInstallation/ANT_1.8.2
Setting ANT_1_8_2_HOME=/var/lib/jenkins/tools/hudson.tasks.Ant_AntInstallation/ANT_1.8.2
Setting ANT_1_8_2_HOME=/var/lib/jenkins/tools/hudson.tasks.Ant_AntInstallation/ANT_1.8.2


---------------------------------------------------------------------
To unsubscribe, e-mail: [hidden email]
For additional commands, e-mail: [hidden email]
Reply | Threaded
Open this post in threaded view
|

[JENKINS] Lucene-Solr-BadApples-master-Linux (32bit/jdk1.8.0_172) - Build # 146 - Failure!

Policeman Jenkins Server-2
Build: https://jenkins.thetaphi.de/job/Lucene-Solr-BadApples-master-Linux/146/
Java: 32bit/jdk1.8.0_172 -server -XX:+UseParallelGC

All tests passed

Build Log:
[...truncated 59550 lines...]
-ecj-javadoc-lint-src:
    [mkdir] Created dir: /tmp/ecj23501574
 [ecj-lint] Compiling 1241 source files to /tmp/ecj23501574
 [ecj-lint] Processing annotations
 [ecj-lint] Annotations processed
 [ecj-lint] Processing annotations
 [ecj-lint] No elements to process
 [ecj-lint] invalid Class-Path header in manifest of jar file: /home/jenkins/.ivy2/cache/org.restlet.jee/org.restlet/jars/org.restlet-2.3.0.jar
 [ecj-lint] invalid Class-Path header in manifest of jar file: /home/jenkins/.ivy2/cache/org.restlet.jee/org.restlet.ext.servlet/jars/org.restlet.ext.servlet-2.3.0.jar
 [ecj-lint] ----------
 [ecj-lint] 1. WARNING in /home/jenkins/workspace/Lucene-Solr-BadApples-master-Linux/solr/core/src/java/org/apache/solr/client/solrj/embedded/EmbeddedSolrServer.java (at line 219)
 [ecj-lint] return (NamedList<Object>) new JavaBinCodec(resolver).unmarshal(in);
 [ecj-lint]                           ^^^^^^^^^^^^^^^^^^^^^^^^^^
 [ecj-lint] Resource leak: '<unassigned Closeable value>' is never closed
 [ecj-lint] ----------
 [ecj-lint] ----------
 [ecj-lint] 2. WARNING in /home/jenkins/workspace/Lucene-Solr-BadApples-master-Linux/solr/core/src/java/org/apache/solr/cloud/api/collections/RestoreCmd.java (at line 257)
 [ecj-lint] throw new SolrException(ErrorCode.BAD_REQUEST, "Unexpected number of replicas, replicationFactor, " +
 [ecj-lint]               Replica.Type.NRT + " or " + Replica.Type.TLOG + " must be greater than 0");
 [ecj-lint] ^^^^^^^^^^^^^^^^^^^^^^^^^^^^^^^^^^^^^^^^^^^^^^^^^^^^^^^^^^^^^^^^^^^^^^^^^^^^^^^^^^^^^^^^^^^^^^^^^^^^^^^^^^^^^^^^^^^^^^^^^^^^^^^^^^^^^^^^^^^^^^^^^^^^^^^^^^^^^^^^^^^^^^^^^^^^^^^^^^^^^^^^^^^^^^^
 [ecj-lint] Resource leak: 'repository' is not closed at this location
 [ecj-lint] ----------
 [ecj-lint] ----------
 [ecj-lint] 3. WARNING in /home/jenkins/workspace/Lucene-Solr-BadApples-master-Linux/solr/core/src/java/org/apache/solr/handler/loader/JavabinLoader.java (at line 137)
 [ecj-lint] new JavaBinCodec() {
 [ecj-lint]       SolrParams params;
 [ecj-lint]       AddUpdateCommand addCmd = null;
 [ecj-lint]
 [ecj-lint]       @Override
 [ecj-lint]       public List<Object> readIterator(DataInputInputStream fis) throws IOException {
 [ecj-lint]         while (true) {
 [ecj-lint]           Object o = readVal(fis);
 [ecj-lint]           if (o == END_OBJ) break;
 [ecj-lint]           if (o instanceof NamedList) {
 [ecj-lint]             params = ((NamedList) o).toSolrParams();
 [ecj-lint]           } else {
 [ecj-lint]             try {
 [ecj-lint]               if (o instanceof byte[]) {
 [ecj-lint]                 if (params != null) req.setParams(params);
 [ecj-lint]                 byte[] buf = (byte[]) o;
 [ecj-lint]                 contentStreamLoader.load(req, rsp, new ContentStreamBase.ByteArrayStream(buf, null), processor);
 [ecj-lint]               } else {
 [ecj-lint]                 throw new RuntimeException("unsupported type ");
 [ecj-lint]               }
 [ecj-lint]             } catch (Exception e) {
 [ecj-lint]               throw new RuntimeException(e);
 [ecj-lint]             } finally {
 [ecj-lint]               params = null;
 [ecj-lint]               req.setParams(old);
 [ecj-lint]             }
 [ecj-lint]           }
 [ecj-lint]         }
 [ecj-lint]         return Collections.emptyList();
 [ecj-lint]       }
 [ecj-lint]
 [ecj-lint]     }.unmarshal(in);
 [ecj-lint] ^^^^^^^^^^^^^^^^^^^^^^^^^^^^^^^^^^^^^^^^^^^^^^^^^^^^^^^^^^^^^^^^^^^^^^^^^^^^^^^^^^^^^^^^^^^^^^^^^^^^^^^^^^^^^^^^^^^^^^^^^^^^^^^^^^^^^^^^^^^^^^^^^^^^^^^^^^^^^^^^^^^^^^^^^^^^^^^^^^^^^^^^^^^^^^^^^^^^^^^^^^^^^^^^^^^^^^^^^^^^^^^^^^^^^^^^^^^^^^^^^^^^^^^^^^^^^^^^^^^^^^^^^^^^^^^^^^^^^^^^^^^^^^^^^^^^^^^^^^^^^^^^^^^^^^^^^^^^^^^^^^^^^^^^^^^^^^^^^^^^^^^^^^^^^^^^^^^^^^^^^^^^^^^^^^^^^^^^^^^^^^^^^^^^^^^^^^^^^^^^^^^^^^^^^^^^^^^^^^^^^^^^^^^^^^^^^^^^^^^^^^^^^^^^^^^^^^^^^^^^^^^^^^^^^^^^^^^^^^^^^^^^^^^^^^^^^^^^^^^^^^^^^^^^^^^^^^^^^^^^^^^^^^^^^^^^^^^^^^^^^^^^^^^^^^^^^^^^^^^^^^^^^^^^^^^^^^^^^^^^^^^^^^^^^^^^^^^^^^^^^^^^^^^^^^^^^^^^^^^^^^^^^^^^^^^^^^^^^^^^^^^^^^^^^^^^^^^^^^^^^^^^^^^^^^^^^^^^^^^^^^^^^^^^^^^^^^^^^^^^^^^^^^^^^^^^^^^^^^^^^^^^^^^^^^^^^^^^^^^^^^^^^^^^^^^^^^^^^^^^^^^^^^^^^^^^^^^^^^^^^^^^^^^^^^^^^^^^^^^^^^^^^^^^^^^^^^^^^^^^^^^^^^^^^^^^^^^^^^^^^^^^^^^^^^^^^^^^^^^^^^^^^^^^^^^^^^^^^^^^^^^^^^^^^^^^^^^^^^^^^^^^^^^^^^^^^^^^^^^^^^^^^^^^^^^^^^^^^^^^^^^^^^^^^^^^^^^^^^^^^^^^^^^^^^^^^^^^^^^^^^^^^^^^^^^^^^^^^^^^^^^^^^^^^^^^^^^^^^^^^^^^^^
 [ecj-lint] Resource leak: '<unassigned Closeable value>' is never closed
 [ecj-lint] ----------
 [ecj-lint] ----------
 [ecj-lint] 4. ERROR in /home/jenkins/workspace/Lucene-Solr-BadApples-master-Linux/solr/core/src/java/org/apache/solr/update/DocumentBuilder.java (at line 32)
 [ecj-lint] import org.apache.solr.common.util.ByteArrayUtf8CharSequence;
 [ecj-lint]       ^^^^^^^^^^^^^^^^^^^^^^^^^^^^^^^^^^^^^^^^^^^^^^^^^^^^^
 [ecj-lint] The import org.apache.solr.common.util.ByteArrayUtf8CharSequence is never used
 [ecj-lint] ----------
 [ecj-lint] ----------
 [ecj-lint] 5. WARNING in /home/jenkins/workspace/Lucene-Solr-BadApples-master-Linux/solr/core/src/java/org/apache/solr/update/UpdateLog.java (at line 1867)
 [ecj-lint] if (exceptionOnExecuteUpdate.get() != null) throw exceptionOnExecuteUpdate.get();
 [ecj-lint]                                            ^^^^^^^^^^^^^^^^^^^^^^^^^^^^^^^^^^^^^
 [ecj-lint] Resource leak: 'proc' is not closed at this location
 [ecj-lint] ----------
 [ecj-lint] ----------
 [ecj-lint] 6. WARNING in /home/jenkins/workspace/Lucene-Solr-BadApples-master-Linux/solr/core/src/java/org/apache/solr/util/FileUtils.java (at line 50)
 [ecj-lint] in = new FileInputStream(src).getChannel();
 [ecj-lint]     ^^^^^^^^^^^^^^^^^^^^^^^^
 [ecj-lint] Resource leak: '<unassigned Closeable value>' is never closed
 [ecj-lint] ----------
 [ecj-lint] 7. WARNING in /home/jenkins/workspace/Lucene-Solr-BadApples-master-Linux/solr/core/src/java/org/apache/solr/util/FileUtils.java (at line 51)
 [ecj-lint] out = new FileOutputStream(destination).getChannel();
 [ecj-lint]      ^^^^^^^^^^^^^^^^^^^^^^^^^^^^^^^^^
 [ecj-lint] Resource leak: '<unassigned Closeable value>' is never closed
 [ecj-lint] ----------
 [ecj-lint] 7 problems (1 error, 6 warnings)

BUILD FAILED
/home/jenkins/workspace/Lucene-Solr-BadApples-master-Linux/build.xml:642: The following error occurred while executing this line:
/home/jenkins/workspace/Lucene-Solr-BadApples-master-Linux/build.xml:101: The following error occurred while executing this line:
/home/jenkins/workspace/Lucene-Solr-BadApples-master-Linux/solr/build.xml:680: The following error occurred while executing this line:
/home/jenkins/workspace/Lucene-Solr-BadApples-master-Linux/lucene/common-build.xml:2093: The following error occurred while executing this line:
/home/jenkins/workspace/Lucene-Solr-BadApples-master-Linux/lucene/common-build.xml:2132: Compile failed; see the compiler error output for details.

Total time: 86 minutes 59 seconds
Build step 'Invoke Ant' marked build as failure
Archiving artifacts
Setting ANT_1_8_2_HOME=/home/jenkins/tools/hudson.tasks.Ant_AntInstallation/ANT_1.8.2
[WARNINGS] Skipping publisher since build result is FAILURE
Recording test results
Setting ANT_1_8_2_HOME=/home/jenkins/tools/hudson.tasks.Ant_AntInstallation/ANT_1.8.2
Email was triggered for: Failure - Any
Sending email for trigger: Failure - Any
Setting ANT_1_8_2_HOME=/home/jenkins/tools/hudson.tasks.Ant_AntInstallation/ANT_1.8.2
Setting ANT_1_8_2_HOME=/home/jenkins/tools/hudson.tasks.Ant_AntInstallation/ANT_1.8.2
Setting ANT_1_8_2_HOME=/home/jenkins/tools/hudson.tasks.Ant_AntInstallation/ANT_1.8.2
Setting ANT_1_8_2_HOME=/home/jenkins/tools/hudson.tasks.Ant_AntInstallation/ANT_1.8.2


---------------------------------------------------------------------
To unsubscribe, e-mail: [hidden email]
For additional commands, e-mail: [hidden email]