[JENKINS] Lucene-Solr-BadApples-master-Linux (64bit/jdk-9.0.4) - Build # 50 - Unstable!

Previous Topic Next Topic
 
classic Classic list List threaded Threaded
1 message Options
Reply | Threaded
Open this post in threaded view
|

[JENKINS] Lucene-Solr-BadApples-master-Linux (64bit/jdk-9.0.4) - Build # 50 - Unstable!

Policeman Jenkins Server-2
Build: https://jenkins.thetaphi.de/job/Lucene-Solr-BadApples-master-Linux/50/
Java: 64bit/jdk-9.0.4 -XX:+UseCompressedOops -XX:+UseParallelGC

5 tests failed.
FAILED:  org.apache.solr.cloud.ReplicationFactorTest.test

Error Message:
Didn't see all replicas for shard shard1 in repfacttest_c8n_1x3 come up within 30000 ms! ClusterState: {   "control_collection":{     "pullReplicas":"0",     "replicationFactor":"1",     "shards":{"shard1":{         "range":"80000000-7fffffff",         "state":"active",         "replicas":{"core_node2":{             "core":"control_collection_shard1_replica_n1",             "base_url":"http://127.0.0.1:36311",             "node_name":"127.0.0.1:36311_",             "state":"active",             "type":"NRT",             "leader":"true"}}}},     "router":{"name":"compositeId"},     "maxShardsPerNode":"1",     "autoAddReplicas":"false",     "nrtReplicas":"1",     "tlogReplicas":"0"},   "repfacttest_c8n_1x3":{     "pullReplicas":"0",     "replicationFactor":"1",     "shards":{"shard1":{         "range":"80000000-7fffffff",         "state":"active",         "replicas":{           "core_node4":{             "core":"repfacttest_c8n_1x3_shard1_replica_n1",             "base_url":"http://127.0.0.1:36311",             "node_name":"127.0.0.1:36311_",             "state":"active",             "type":"NRT",             "leader":"true"},           "core_node5":{             "core":"repfacttest_c8n_1x3_shard1_replica_n3",             "base_url":"http://127.0.0.1:46273",             "node_name":"127.0.0.1:46273_",             "state":"active",             "type":"NRT"},           "core_node6":{             "core":"repfacttest_c8n_1x3_shard1_replica_n2",             "base_url":"http://127.0.0.1:39175",             "node_name":"127.0.0.1:39175_",             "state":"recovering",             "type":"NRT"}}}},     "router":{"name":"compositeId"},     "maxShardsPerNode":"1",     "autoAddReplicas":"false",     "nrtReplicas":"3",     "tlogReplicas":"0"},   "collection1":{     "pullReplicas":"0",     "replicationFactor":"1",     "shards":{       "shard1":{         "range":"80000000-d554ffff",         "state":"active",         "replicas":{"core_node66":{             "core":"collection1_shard1_replica_n65",             "base_url":"http://127.0.0.1:36437",             "node_name":"127.0.0.1:36437_",             "state":"active",             "type":"NRT",             "leader":"true"}}},       "shard2":{         "range":"d5550000-2aa9ffff",         "state":"active",         "replicas":{"core_node62":{             "core":"collection1_shard2_replica_n61",             "base_url":"http://127.0.0.1:46273",             "node_name":"127.0.0.1:46273_",             "state":"active",             "type":"NRT",             "leader":"true"}}},       "shard3":{         "range":"2aaa0000-7fffffff",         "state":"active",         "replicas":{"core_node64":{             "core":"collection1_shard3_replica_n63",             "base_url":"http://127.0.0.1:39175",             "node_name":"127.0.0.1:39175_",             "state":"active",             "type":"NRT",             "leader":"true"}}}},     "router":{"name":"compositeId"},     "maxShardsPerNode":"1",     "autoAddReplicas":"false",     "nrtReplicas":"1",     "tlogReplicas":"0"}}

Stack Trace:
java.lang.AssertionError: Didn't see all replicas for shard shard1 in repfacttest_c8n_1x3 come up within 30000 ms! ClusterState: {
  "control_collection":{
    "pullReplicas":"0",
    "replicationFactor":"1",
    "shards":{"shard1":{
        "range":"80000000-7fffffff",
        "state":"active",
        "replicas":{"core_node2":{
            "core":"control_collection_shard1_replica_n1",
            "base_url":"http://127.0.0.1:36311",
            "node_name":"127.0.0.1:36311_",
            "state":"active",
            "type":"NRT",
            "leader":"true"}}}},
    "router":{"name":"compositeId"},
    "maxShardsPerNode":"1",
    "autoAddReplicas":"false",
    "nrtReplicas":"1",
    "tlogReplicas":"0"},
  "repfacttest_c8n_1x3":{
    "pullReplicas":"0",
    "replicationFactor":"1",
    "shards":{"shard1":{
        "range":"80000000-7fffffff",
        "state":"active",
        "replicas":{
          "core_node4":{
            "core":"repfacttest_c8n_1x3_shard1_replica_n1",
            "base_url":"http://127.0.0.1:36311",
            "node_name":"127.0.0.1:36311_",
            "state":"active",
            "type":"NRT",
            "leader":"true"},
          "core_node5":{
            "core":"repfacttest_c8n_1x3_shard1_replica_n3",
            "base_url":"http://127.0.0.1:46273",
            "node_name":"127.0.0.1:46273_",
            "state":"active",
            "type":"NRT"},
          "core_node6":{
            "core":"repfacttest_c8n_1x3_shard1_replica_n2",
            "base_url":"http://127.0.0.1:39175",
            "node_name":"127.0.0.1:39175_",
            "state":"recovering",
            "type":"NRT"}}}},
    "router":{"name":"compositeId"},
    "maxShardsPerNode":"1",
    "autoAddReplicas":"false",
    "nrtReplicas":"3",
    "tlogReplicas":"0"},
  "collection1":{
    "pullReplicas":"0",
    "replicationFactor":"1",
    "shards":{
      "shard1":{
        "range":"80000000-d554ffff",
        "state":"active",
        "replicas":{"core_node66":{
            "core":"collection1_shard1_replica_n65",
            "base_url":"http://127.0.0.1:36437",
            "node_name":"127.0.0.1:36437_",
            "state":"active",
            "type":"NRT",
            "leader":"true"}}},
      "shard2":{
        "range":"d5550000-2aa9ffff",
        "state":"active",
        "replicas":{"core_node62":{
            "core":"collection1_shard2_replica_n61",
            "base_url":"http://127.0.0.1:46273",
            "node_name":"127.0.0.1:46273_",
            "state":"active",
            "type":"NRT",
            "leader":"true"}}},
      "shard3":{
        "range":"2aaa0000-7fffffff",
        "state":"active",
        "replicas":{"core_node64":{
            "core":"collection1_shard3_replica_n63",
            "base_url":"http://127.0.0.1:39175",
            "node_name":"127.0.0.1:39175_",
            "state":"active",
            "type":"NRT",
            "leader":"true"}}}},
    "router":{"name":"compositeId"},
    "maxShardsPerNode":"1",
    "autoAddReplicas":"false",
    "nrtReplicas":"1",
    "tlogReplicas":"0"}}
        at __randomizedtesting.SeedInfo.seed([628B9E945DF2941B:EADFA14EF30EF9E3]:0)
        at org.junit.Assert.fail(Assert.java:93)
        at org.apache.solr.cloud.AbstractFullDistribZkTestBase.ensureAllReplicasAreActive(AbstractFullDistribZkTestBase.java:2005)
        at org.apache.solr.cloud.ReplicationFactorTest.testRf3(ReplicationFactorTest.java:376)
        at org.apache.solr.cloud.ReplicationFactorTest.test(ReplicationFactorTest.java:86)
        at java.base/jdk.internal.reflect.NativeMethodAccessorImpl.invoke0(Native Method)
        at java.base/jdk.internal.reflect.NativeMethodAccessorImpl.invoke(NativeMethodAccessorImpl.java:62)
        at java.base/jdk.internal.reflect.DelegatingMethodAccessorImpl.invoke(DelegatingMethodAccessorImpl.java:43)
        at java.base/java.lang.reflect.Method.invoke(Method.java:564)
        at com.carrotsearch.randomizedtesting.RandomizedRunner.invoke(RandomizedRunner.java:1737)
        at com.carrotsearch.randomizedtesting.RandomizedRunner$8.evaluate(RandomizedRunner.java:934)
        at com.carrotsearch.randomizedtesting.RandomizedRunner$9.evaluate(RandomizedRunner.java:970)
        at com.carrotsearch.randomizedtesting.RandomizedRunner$10.evaluate(RandomizedRunner.java:984)
        at org.apache.solr.BaseDistributedSearchTestCase$ShardsRepeatRule$ShardsFixedStatement.callStatement(BaseDistributedSearchTestCase.java:993)
        at org.apache.solr.BaseDistributedSearchTestCase$ShardsRepeatRule$ShardsStatement.evaluate(BaseDistributedSearchTestCase.java:968)
        at com.carrotsearch.randomizedtesting.rules.SystemPropertiesRestoreRule$1.evaluate(SystemPropertiesRestoreRule.java:57)
        at org.apache.lucene.util.TestRuleSetupTeardownChained$1.evaluate(TestRuleSetupTeardownChained.java:49)
        at org.apache.lucene.util.AbstractBeforeAfterRule$1.evaluate(AbstractBeforeAfterRule.java:45)
        at org.apache.lucene.util.TestRuleThreadAndTestName$1.evaluate(TestRuleThreadAndTestName.java:48)
        at org.apache.lucene.util.TestRuleIgnoreAfterMaxFailures$1.evaluate(TestRuleIgnoreAfterMaxFailures.java:64)
        at org.apache.lucene.util.TestRuleMarkFailure$1.evaluate(TestRuleMarkFailure.java:47)
        at com.carrotsearch.randomizedtesting.rules.StatementAdapter.evaluate(StatementAdapter.java:36)
        at com.carrotsearch.randomizedtesting.ThreadLeakControl$StatementRunner.run(ThreadLeakControl.java:368)
        at com.carrotsearch.randomizedtesting.ThreadLeakControl.forkTimeoutingTask(ThreadLeakControl.java:817)
        at com.carrotsearch.randomizedtesting.ThreadLeakControl$3.evaluate(ThreadLeakControl.java:468)
        at com.carrotsearch.randomizedtesting.RandomizedRunner.runSingleTest(RandomizedRunner.java:943)
        at com.carrotsearch.randomizedtesting.RandomizedRunner$5.evaluate(RandomizedRunner.java:829)
        at com.carrotsearch.randomizedtesting.RandomizedRunner$6.evaluate(RandomizedRunner.java:879)
        at com.carrotsearch.randomizedtesting.RandomizedRunner$7.evaluate(RandomizedRunner.java:890)
        at com.carrotsearch.randomizedtesting.rules.StatementAdapter.evaluate(StatementAdapter.java:36)
        at com.carrotsearch.randomizedtesting.rules.SystemPropertiesRestoreRule$1.evaluate(SystemPropertiesRestoreRule.java:57)
        at org.apache.lucene.util.AbstractBeforeAfterRule$1.evaluate(AbstractBeforeAfterRule.java:45)
        at com.carrotsearch.randomizedtesting.rules.StatementAdapter.evaluate(StatementAdapter.java:36)
        at org.apache.lucene.util.TestRuleStoreClassName$1.evaluate(TestRuleStoreClassName.java:41)
        at com.carrotsearch.randomizedtesting.rules.NoShadowingOrOverridesOnMethodsRule$1.evaluate(NoShadowingOrOverridesOnMethodsRule.java:40)
        at com.carrotsearch.randomizedtesting.rules.NoShadowingOrOverridesOnMethodsRule$1.evaluate(NoShadowingOrOverridesOnMethodsRule.java:40)
        at com.carrotsearch.randomizedtesting.rules.StatementAdapter.evaluate(StatementAdapter.java:36)
        at com.carrotsearch.randomizedtesting.rules.StatementAdapter.evaluate(StatementAdapter.java:36)
        at org.apache.lucene.util.TestRuleAssertionsRequired$1.evaluate(TestRuleAssertionsRequired.java:53)
        at org.apache.lucene.util.TestRuleMarkFailure$1.evaluate(TestRuleMarkFailure.java:47)
        at org.apache.lucene.util.TestRuleIgnoreAfterMaxFailures$1.evaluate(TestRuleIgnoreAfterMaxFailures.java:64)
        at org.apache.lucene.util.TestRuleIgnoreTestSuites$1.evaluate(TestRuleIgnoreTestSuites.java:54)
        at com.carrotsearch.randomizedtesting.rules.StatementAdapter.evaluate(StatementAdapter.java:36)
        at com.carrotsearch.randomizedtesting.ThreadLeakControl$StatementRunner.run(ThreadLeakControl.java:368)
        at java.base/java.lang.Thread.run(Thread.java:844)


FAILED:  org.apache.solr.cloud.ReplicationFactorTest.test

Error Message:
Didn't see all replicas for shard shard1 in repfacttest_c8n_1x3 come up within 30000 ms! ClusterState: {   "control_collection":{     "pullReplicas":"0",     "replicationFactor":"1",     "shards":{"shard1":{         "range":"80000000-7fffffff",         "state":"active",         "replicas":{"core_node2":{             "core":"control_collection_shard1_replica_n1",             "base_url":"http://127.0.0.1:45083",             "node_name":"127.0.0.1:45083_",             "state":"active",             "type":"NRT",             "leader":"true"}}}},     "router":{"name":"compositeId"},     "maxShardsPerNode":"1",     "autoAddReplicas":"false",     "nrtReplicas":"1",     "tlogReplicas":"0"},   "repfacttest_c8n_1x3":{     "pullReplicas":"0",     "replicationFactor":"1",     "shards":{"shard1":{         "range":"80000000-7fffffff",         "state":"active",         "replicas":{           "core_node4":{             "core":"repfacttest_c8n_1x3_shard1_replica_n1",             "base_url":"http://127.0.0.1:33611",             "node_name":"127.0.0.1:33611_",             "state":"recovering",             "type":"NRT"},           "core_node5":{             "core":"repfacttest_c8n_1x3_shard1_replica_n2",             "base_url":"http://127.0.0.1:36691",             "node_name":"127.0.0.1:36691_",             "state":"active",             "type":"NRT"},           "core_node6":{             "core":"repfacttest_c8n_1x3_shard1_replica_n3",             "base_url":"http://127.0.0.1:45083",             "node_name":"127.0.0.1:45083_",             "state":"active",             "type":"NRT",             "leader":"true"}}}},     "router":{"name":"compositeId"},     "maxShardsPerNode":"1",     "autoAddReplicas":"false",     "nrtReplicas":"3",     "tlogReplicas":"0"},   "collection1":{     "pullReplicas":"0",     "replicationFactor":"1",     "shards":{       "shard1":{         "range":"80000000-d554ffff",         "state":"active",         "replicas":{"core_node66":{             "core":"collection1_shard1_replica_n65",             "base_url":"http://127.0.0.1:34297",             "node_name":"127.0.0.1:34297_",             "state":"active",             "type":"NRT",             "leader":"true"}}},       "shard2":{         "range":"d5550000-2aa9ffff",         "state":"active",         "replicas":{"core_node62":{             "core":"collection1_shard2_replica_n61",             "base_url":"http://127.0.0.1:33611",             "node_name":"127.0.0.1:33611_",             "state":"active",             "type":"NRT",             "leader":"true"}}},       "shard3":{         "range":"2aaa0000-7fffffff",         "state":"active",         "replicas":{"core_node64":{             "core":"collection1_shard3_replica_n63",             "base_url":"http://127.0.0.1:36691",             "node_name":"127.0.0.1:36691_",             "state":"active",             "type":"NRT",             "leader":"true"}}}},     "router":{"name":"compositeId"},     "maxShardsPerNode":"1",     "autoAddReplicas":"false",     "nrtReplicas":"1",     "tlogReplicas":"0"}}

Stack Trace:
java.lang.AssertionError: Didn't see all replicas for shard shard1 in repfacttest_c8n_1x3 come up within 30000 ms! ClusterState: {
  "control_collection":{
    "pullReplicas":"0",
    "replicationFactor":"1",
    "shards":{"shard1":{
        "range":"80000000-7fffffff",
        "state":"active",
        "replicas":{"core_node2":{
            "core":"control_collection_shard1_replica_n1",
            "base_url":"http://127.0.0.1:45083",
            "node_name":"127.0.0.1:45083_",
            "state":"active",
            "type":"NRT",
            "leader":"true"}}}},
    "router":{"name":"compositeId"},
    "maxShardsPerNode":"1",
    "autoAddReplicas":"false",
    "nrtReplicas":"1",
    "tlogReplicas":"0"},
  "repfacttest_c8n_1x3":{
    "pullReplicas":"0",
    "replicationFactor":"1",
    "shards":{"shard1":{
        "range":"80000000-7fffffff",
        "state":"active",
        "replicas":{
          "core_node4":{
            "core":"repfacttest_c8n_1x3_shard1_replica_n1",
            "base_url":"http://127.0.0.1:33611",
            "node_name":"127.0.0.1:33611_",
            "state":"recovering",
            "type":"NRT"},
          "core_node5":{
            "core":"repfacttest_c8n_1x3_shard1_replica_n2",
            "base_url":"http://127.0.0.1:36691",
            "node_name":"127.0.0.1:36691_",
            "state":"active",
            "type":"NRT"},
          "core_node6":{
            "core":"repfacttest_c8n_1x3_shard1_replica_n3",
            "base_url":"http://127.0.0.1:45083",
            "node_name":"127.0.0.1:45083_",
            "state":"active",
            "type":"NRT",
            "leader":"true"}}}},
    "router":{"name":"compositeId"},
    "maxShardsPerNode":"1",
    "autoAddReplicas":"false",
    "nrtReplicas":"3",
    "tlogReplicas":"0"},
  "collection1":{
    "pullReplicas":"0",
    "replicationFactor":"1",
    "shards":{
      "shard1":{
        "range":"80000000-d554ffff",
        "state":"active",
        "replicas":{"core_node66":{
            "core":"collection1_shard1_replica_n65",
            "base_url":"http://127.0.0.1:34297",
            "node_name":"127.0.0.1:34297_",
            "state":"active",
            "type":"NRT",
            "leader":"true"}}},
      "shard2":{
        "range":"d5550000-2aa9ffff",
        "state":"active",
        "replicas":{"core_node62":{
            "core":"collection1_shard2_replica_n61",
            "base_url":"http://127.0.0.1:33611",
            "node_name":"127.0.0.1:33611_",
            "state":"active",
            "type":"NRT",
            "leader":"true"}}},
      "shard3":{
        "range":"2aaa0000-7fffffff",
        "state":"active",
        "replicas":{"core_node64":{
            "core":"collection1_shard3_replica_n63",
            "base_url":"http://127.0.0.1:36691",
            "node_name":"127.0.0.1:36691_",
            "state":"active",
            "type":"NRT",
            "leader":"true"}}}},
    "router":{"name":"compositeId"},
    "maxShardsPerNode":"1",
    "autoAddReplicas":"false",
    "nrtReplicas":"1",
    "tlogReplicas":"0"}}
        at __randomizedtesting.SeedInfo.seed([628B9E945DF2941B:EADFA14EF30EF9E3]:0)
        at org.junit.Assert.fail(Assert.java:93)
        at org.apache.solr.cloud.AbstractFullDistribZkTestBase.ensureAllReplicasAreActive(AbstractFullDistribZkTestBase.java:2005)
        at org.apache.solr.cloud.ReplicationFactorTest.testRf3(ReplicationFactorTest.java:376)
        at org.apache.solr.cloud.ReplicationFactorTest.test(ReplicationFactorTest.java:86)
        at java.base/jdk.internal.reflect.NativeMethodAccessorImpl.invoke0(Native Method)
        at java.base/jdk.internal.reflect.NativeMethodAccessorImpl.invoke(NativeMethodAccessorImpl.java:62)
        at java.base/jdk.internal.reflect.DelegatingMethodAccessorImpl.invoke(DelegatingMethodAccessorImpl.java:43)
        at java.base/java.lang.reflect.Method.invoke(Method.java:564)
        at com.carrotsearch.randomizedtesting.RandomizedRunner.invoke(RandomizedRunner.java:1737)
        at com.carrotsearch.randomizedtesting.RandomizedRunner$8.evaluate(RandomizedRunner.java:934)
        at com.carrotsearch.randomizedtesting.RandomizedRunner$9.evaluate(RandomizedRunner.java:970)
        at com.carrotsearch.randomizedtesting.RandomizedRunner$10.evaluate(RandomizedRunner.java:984)
        at org.apache.solr.BaseDistributedSearchTestCase$ShardsRepeatRule$ShardsFixedStatement.callStatement(BaseDistributedSearchTestCase.java:993)
        at org.apache.solr.BaseDistributedSearchTestCase$ShardsRepeatRule$ShardsStatement.evaluate(BaseDistributedSearchTestCase.java:968)
        at com.carrotsearch.randomizedtesting.rules.SystemPropertiesRestoreRule$1.evaluate(SystemPropertiesRestoreRule.java:57)
        at org.apache.lucene.util.TestRuleSetupTeardownChained$1.evaluate(TestRuleSetupTeardownChained.java:49)
        at org.apache.lucene.util.AbstractBeforeAfterRule$1.evaluate(AbstractBeforeAfterRule.java:45)
        at org.apache.lucene.util.TestRuleThreadAndTestName$1.evaluate(TestRuleThreadAndTestName.java:48)
        at org.apache.lucene.util.TestRuleIgnoreAfterMaxFailures$1.evaluate(TestRuleIgnoreAfterMaxFailures.java:64)
        at org.apache.lucene.util.TestRuleMarkFailure$1.evaluate(TestRuleMarkFailure.java:47)
        at com.carrotsearch.randomizedtesting.rules.StatementAdapter.evaluate(StatementAdapter.java:36)
        at com.carrotsearch.randomizedtesting.ThreadLeakControl$StatementRunner.run(ThreadLeakControl.java:368)
        at com.carrotsearch.randomizedtesting.ThreadLeakControl.forkTimeoutingTask(ThreadLeakControl.java:817)
        at com.carrotsearch.randomizedtesting.ThreadLeakControl$3.evaluate(ThreadLeakControl.java:468)
        at com.carrotsearch.randomizedtesting.RandomizedRunner.runSingleTest(RandomizedRunner.java:943)
        at com.carrotsearch.randomizedtesting.RandomizedRunner$5.evaluate(RandomizedRunner.java:829)
        at com.carrotsearch.randomizedtesting.RandomizedRunner$6.evaluate(RandomizedRunner.java:879)
        at com.carrotsearch.randomizedtesting.RandomizedRunner$7.evaluate(RandomizedRunner.java:890)
        at com.carrotsearch.randomizedtesting.rules.StatementAdapter.evaluate(StatementAdapter.java:36)
        at com.carrotsearch.randomizedtesting.rules.SystemPropertiesRestoreRule$1.evaluate(SystemPropertiesRestoreRule.java:57)
        at org.apache.lucene.util.AbstractBeforeAfterRule$1.evaluate(AbstractBeforeAfterRule.java:45)
        at com.carrotsearch.randomizedtesting.rules.StatementAdapter.evaluate(StatementAdapter.java:36)
        at org.apache.lucene.util.TestRuleStoreClassName$1.evaluate(TestRuleStoreClassName.java:41)
        at com.carrotsearch.randomizedtesting.rules.NoShadowingOrOverridesOnMethodsRule$1.evaluate(NoShadowingOrOverridesOnMethodsRule.java:40)
        at com.carrotsearch.randomizedtesting.rules.NoShadowingOrOverridesOnMethodsRule$1.evaluate(NoShadowingOrOverridesOnMethodsRule.java:40)
        at com.carrotsearch.randomizedtesting.rules.StatementAdapter.evaluate(StatementAdapter.java:36)
        at com.carrotsearch.randomizedtesting.rules.StatementAdapter.evaluate(StatementAdapter.java:36)
        at org.apache.lucene.util.TestRuleAssertionsRequired$1.evaluate(TestRuleAssertionsRequired.java:53)
        at org.apache.lucene.util.TestRuleMarkFailure$1.evaluate(TestRuleMarkFailure.java:47)
        at org.apache.lucene.util.TestRuleIgnoreAfterMaxFailures$1.evaluate(TestRuleIgnoreAfterMaxFailures.java:64)
        at org.apache.lucene.util.TestRuleIgnoreTestSuites$1.evaluate(TestRuleIgnoreTestSuites.java:54)
        at com.carrotsearch.randomizedtesting.rules.StatementAdapter.evaluate(StatementAdapter.java:36)
        at com.carrotsearch.randomizedtesting.ThreadLeakControl$StatementRunner.run(ThreadLeakControl.java:368)
        at java.base/java.lang.Thread.run(Thread.java:844)


FAILED:  org.apache.solr.cloud.ReplicationFactorTest.test

Error Message:
Didn't see all replicas for shard shard1 in repfacttest_c8n_1x3 come up within 30000 ms! ClusterState: {   "control_collection":{     "pullReplicas":"0",     "replicationFactor":"1",     "shards":{"shard1":{         "range":"80000000-7fffffff",         "state":"active",         "replicas":{"core_node2":{             "core":"control_collection_shard1_replica_n1",             "base_url":"http://127.0.0.1:45835",             "node_name":"127.0.0.1:45835_",             "state":"active",             "type":"NRT",             "leader":"true"}}}},     "router":{"name":"compositeId"},     "maxShardsPerNode":"1",     "autoAddReplicas":"false",     "nrtReplicas":"1",     "tlogReplicas":"0"},   "repfacttest_c8n_1x3":{     "pullReplicas":"0",     "replicationFactor":"1",     "shards":{"shard1":{         "range":"80000000-7fffffff",         "state":"active",         "replicas":{           "core_node4":{             "core":"repfacttest_c8n_1x3_shard1_replica_n1",             "base_url":"http://127.0.0.1:35887",             "node_name":"127.0.0.1:35887_",             "state":"active",             "type":"NRT",             "leader":"true"},           "core_node5":{             "core":"repfacttest_c8n_1x3_shard1_replica_n2",             "base_url":"http://127.0.0.1:45835",             "node_name":"127.0.0.1:45835_",             "state":"active",             "type":"NRT"},           "core_node6":{             "core":"repfacttest_c8n_1x3_shard1_replica_n3",             "base_url":"http://127.0.0.1:45043",             "node_name":"127.0.0.1:45043_",             "state":"recovering",             "type":"NRT"}}}},     "router":{"name":"compositeId"},     "maxShardsPerNode":"1",     "autoAddReplicas":"false",     "nrtReplicas":"3",     "tlogReplicas":"0"},   "collection1":{     "pullReplicas":"0",     "replicationFactor":"1",     "shards":{       "shard1":{         "range":"80000000-d554ffff",         "state":"active",         "replicas":{"core_node66":{             "core":"collection1_shard1_replica_n65",             "base_url":"http://127.0.0.1:35887",             "node_name":"127.0.0.1:35887_",             "state":"active",             "type":"NRT",             "leader":"true"}}},       "shard2":{         "range":"d5550000-2aa9ffff",         "state":"active",         "replicas":{"core_node62":{             "core":"collection1_shard2_replica_n61",             "base_url":"http://127.0.0.1:45043",             "node_name":"127.0.0.1:45043_",             "state":"active",             "type":"NRT",             "leader":"true"}}},       "shard3":{         "range":"2aaa0000-7fffffff",         "state":"active",         "replicas":{"core_node64":{             "core":"collection1_shard3_replica_n63",             "base_url":"http://127.0.0.1:41625",             "node_name":"127.0.0.1:41625_",             "state":"active",             "type":"NRT",             "leader":"true"}}}},     "router":{"name":"compositeId"},     "maxShardsPerNode":"1",     "autoAddReplicas":"false",     "nrtReplicas":"1",     "tlogReplicas":"0"}}

Stack Trace:
java.lang.AssertionError: Didn't see all replicas for shard shard1 in repfacttest_c8n_1x3 come up within 30000 ms! ClusterState: {
  "control_collection":{
    "pullReplicas":"0",
    "replicationFactor":"1",
    "shards":{"shard1":{
        "range":"80000000-7fffffff",
        "state":"active",
        "replicas":{"core_node2":{
            "core":"control_collection_shard1_replica_n1",
            "base_url":"http://127.0.0.1:45835",
            "node_name":"127.0.0.1:45835_",
            "state":"active",
            "type":"NRT",
            "leader":"true"}}}},
    "router":{"name":"compositeId"},
    "maxShardsPerNode":"1",
    "autoAddReplicas":"false",
    "nrtReplicas":"1",
    "tlogReplicas":"0"},
  "repfacttest_c8n_1x3":{
    "pullReplicas":"0",
    "replicationFactor":"1",
    "shards":{"shard1":{
        "range":"80000000-7fffffff",
        "state":"active",
        "replicas":{
          "core_node4":{
            "core":"repfacttest_c8n_1x3_shard1_replica_n1",
            "base_url":"http://127.0.0.1:35887",
            "node_name":"127.0.0.1:35887_",
            "state":"active",
            "type":"NRT",
            "leader":"true"},
          "core_node5":{
            "core":"repfacttest_c8n_1x3_shard1_replica_n2",
            "base_url":"http://127.0.0.1:45835",
            "node_name":"127.0.0.1:45835_",
            "state":"active",
            "type":"NRT"},
          "core_node6":{
            "core":"repfacttest_c8n_1x3_shard1_replica_n3",
            "base_url":"http://127.0.0.1:45043",
            "node_name":"127.0.0.1:45043_",
            "state":"recovering",
            "type":"NRT"}}}},
    "router":{"name":"compositeId"},
    "maxShardsPerNode":"1",
    "autoAddReplicas":"false",
    "nrtReplicas":"3",
    "tlogReplicas":"0"},
  "collection1":{
    "pullReplicas":"0",
    "replicationFactor":"1",
    "shards":{
      "shard1":{
        "range":"80000000-d554ffff",
        "state":"active",
        "replicas":{"core_node66":{
            "core":"collection1_shard1_replica_n65",
            "base_url":"http://127.0.0.1:35887",
            "node_name":"127.0.0.1:35887_",
            "state":"active",
            "type":"NRT",
            "leader":"true"}}},
      "shard2":{
        "range":"d5550000-2aa9ffff",
        "state":"active",
        "replicas":{"core_node62":{
            "core":"collection1_shard2_replica_n61",
            "base_url":"http://127.0.0.1:45043",
            "node_name":"127.0.0.1:45043_",
            "state":"active",
            "type":"NRT",
            "leader":"true"}}},
      "shard3":{
        "range":"2aaa0000-7fffffff",
        "state":"active",
        "replicas":{"core_node64":{
            "core":"collection1_shard3_replica_n63",
            "base_url":"http://127.0.0.1:41625",
            "node_name":"127.0.0.1:41625_",
            "state":"active",
            "type":"NRT",
            "leader":"true"}}}},
    "router":{"name":"compositeId"},
    "maxShardsPerNode":"1",
    "autoAddReplicas":"false",
    "nrtReplicas":"1",
    "tlogReplicas":"0"}}
        at __randomizedtesting.SeedInfo.seed([628B9E945DF2941B:EADFA14EF30EF9E3]:0)
        at org.junit.Assert.fail(Assert.java:93)
        at org.apache.solr.cloud.AbstractFullDistribZkTestBase.ensureAllReplicasAreActive(AbstractFullDistribZkTestBase.java:2005)
        at org.apache.solr.cloud.ReplicationFactorTest.testRf3(ReplicationFactorTest.java:376)
        at org.apache.solr.cloud.ReplicationFactorTest.test(ReplicationFactorTest.java:86)
        at java.base/jdk.internal.reflect.NativeMethodAccessorImpl.invoke0(Native Method)
        at java.base/jdk.internal.reflect.NativeMethodAccessorImpl.invoke(NativeMethodAccessorImpl.java:62)
        at java.base/jdk.internal.reflect.DelegatingMethodAccessorImpl.invoke(DelegatingMethodAccessorImpl.java:43)
        at java.base/java.lang.reflect.Method.invoke(Method.java:564)
        at com.carrotsearch.randomizedtesting.RandomizedRunner.invoke(RandomizedRunner.java:1737)
        at com.carrotsearch.randomizedtesting.RandomizedRunner$8.evaluate(RandomizedRunner.java:934)
        at com.carrotsearch.randomizedtesting.RandomizedRunner$9.evaluate(RandomizedRunner.java:970)
        at com.carrotsearch.randomizedtesting.RandomizedRunner$10.evaluate(RandomizedRunner.java:984)
        at org.apache.solr.BaseDistributedSearchTestCase$ShardsRepeatRule$ShardsFixedStatement.callStatement(BaseDistributedSearchTestCase.java:993)
        at org.apache.solr.BaseDistributedSearchTestCase$ShardsRepeatRule$ShardsStatement.evaluate(BaseDistributedSearchTestCase.java:968)
        at com.carrotsearch.randomizedtesting.rules.SystemPropertiesRestoreRule$1.evaluate(SystemPropertiesRestoreRule.java:57)
        at org.apache.lucene.util.TestRuleSetupTeardownChained$1.evaluate(TestRuleSetupTeardownChained.java:49)
        at org.apache.lucene.util.AbstractBeforeAfterRule$1.evaluate(AbstractBeforeAfterRule.java:45)
        at org.apache.lucene.util.TestRuleThreadAndTestName$1.evaluate(TestRuleThreadAndTestName.java:48)
        at org.apache.lucene.util.TestRuleIgnoreAfterMaxFailures$1.evaluate(TestRuleIgnoreAfterMaxFailures.java:64)
        at org.apache.lucene.util.TestRuleMarkFailure$1.evaluate(TestRuleMarkFailure.java:47)
        at com.carrotsearch.randomizedtesting.rules.StatementAdapter.evaluate(StatementAdapter.java:36)
        at com.carrotsearch.randomizedtesting.ThreadLeakControl$StatementRunner.run(ThreadLeakControl.java:368)
        at com.carrotsearch.randomizedtesting.ThreadLeakControl.forkTimeoutingTask(ThreadLeakControl.java:817)
        at com.carrotsearch.randomizedtesting.ThreadLeakControl$3.evaluate(ThreadLeakControl.java:468)
        at com.carrotsearch.randomizedtesting.RandomizedRunner.runSingleTest(RandomizedRunner.java:943)
        at com.carrotsearch.randomizedtesting.RandomizedRunner$5.evaluate(RandomizedRunner.java:829)
        at com.carrotsearch.randomizedtesting.RandomizedRunner$6.evaluate(RandomizedRunner.java:879)
        at com.carrotsearch.randomizedtesting.RandomizedRunner$7.evaluate(RandomizedRunner.java:890)
        at com.carrotsearch.randomizedtesting.rules.StatementAdapter.evaluate(StatementAdapter.java:36)
        at com.carrotsearch.randomizedtesting.rules.SystemPropertiesRestoreRule$1.evaluate(SystemPropertiesRestoreRule.java:57)
        at org.apache.lucene.util.AbstractBeforeAfterRule$1.evaluate(AbstractBeforeAfterRule.java:45)
        at com.carrotsearch.randomizedtesting.rules.StatementAdapter.evaluate(StatementAdapter.java:36)
        at org.apache.lucene.util.TestRuleStoreClassName$1.evaluate(TestRuleStoreClassName.java:41)
        at com.carrotsearch.randomizedtesting.rules.NoShadowingOrOverridesOnMethodsRule$1.evaluate(NoShadowingOrOverridesOnMethodsRule.java:40)
        at com.carrotsearch.randomizedtesting.rules.NoShadowingOrOverridesOnMethodsRule$1.evaluate(NoShadowingOrOverridesOnMethodsRule.java:40)
        at com.carrotsearch.randomizedtesting.rules.StatementAdapter.evaluate(StatementAdapter.java:36)
        at com.carrotsearch.randomizedtesting.rules.StatementAdapter.evaluate(StatementAdapter.java:36)
        at org.apache.lucene.util.TestRuleAssertionsRequired$1.evaluate(TestRuleAssertionsRequired.java:53)
        at org.apache.lucene.util.TestRuleMarkFailure$1.evaluate(TestRuleMarkFailure.java:47)
        at org.apache.lucene.util.TestRuleIgnoreAfterMaxFailures$1.evaluate(TestRuleIgnoreAfterMaxFailures.java:64)
        at org.apache.lucene.util.TestRuleIgnoreTestSuites$1.evaluate(TestRuleIgnoreTestSuites.java:54)
        at com.carrotsearch.randomizedtesting.rules.StatementAdapter.evaluate(StatementAdapter.java:36)
        at com.carrotsearch.randomizedtesting.ThreadLeakControl$StatementRunner.run(ThreadLeakControl.java:368)
        at java.base/java.lang.Thread.run(Thread.java:844)


FAILED:  org.apache.solr.cloud.ReplicationFactorTest.test

Error Message:
Didn't see all replicas for shard shard1 in repfacttest_c8n_1x3 come up within 30000 ms! ClusterState: {   "control_collection":{     "pullReplicas":"0",     "replicationFactor":"1",     "shards":{"shard1":{         "range":"80000000-7fffffff",         "state":"active",         "replicas":{"core_node2":{             "core":"control_collection_shard1_replica_n1",             "base_url":"http://127.0.0.1:39167",             "node_name":"127.0.0.1:39167_",             "state":"active",             "type":"NRT",             "leader":"true"}}}},     "router":{"name":"compositeId"},     "maxShardsPerNode":"1",     "autoAddReplicas":"false",     "nrtReplicas":"1",     "tlogReplicas":"0"},   "repfacttest_c8n_1x3":{     "pullReplicas":"0",     "replicationFactor":"1",     "shards":{"shard1":{         "range":"80000000-7fffffff",         "state":"active",         "replicas":{           "core_node4":{             "core":"repfacttest_c8n_1x3_shard1_replica_n1",             "base_url":"http://127.0.0.1:33565",             "node_name":"127.0.0.1:33565_",             "state":"active",             "type":"NRT"},           "core_node5":{             "core":"repfacttest_c8n_1x3_shard1_replica_n2",             "base_url":"http://127.0.0.1:43211",             "node_name":"127.0.0.1:43211_",             "state":"active",             "type":"NRT",             "leader":"true"},           "core_node6":{             "core":"repfacttest_c8n_1x3_shard1_replica_n3",             "base_url":"http://127.0.0.1:42765",             "node_name":"127.0.0.1:42765_",             "state":"recovering",             "type":"NRT"}}}},     "router":{"name":"compositeId"},     "maxShardsPerNode":"1",     "autoAddReplicas":"false",     "nrtReplicas":"3",     "tlogReplicas":"0"},   "collection1":{     "pullReplicas":"0",     "replicationFactor":"1",     "shards":{       "shard1":{         "range":"80000000-d554ffff",         "state":"active",         "replicas":{"core_node66":{             "core":"collection1_shard1_replica_n65",             "base_url":"http://127.0.0.1:43211",             "node_name":"127.0.0.1:43211_",             "state":"active",             "type":"NRT",             "leader":"true"}}},       "shard2":{         "range":"d5550000-2aa9ffff",         "state":"active",         "replicas":{"core_node62":{             "core":"collection1_shard2_replica_n61",             "base_url":"http://127.0.0.1:33565",             "node_name":"127.0.0.1:33565_",             "state":"active",             "type":"NRT",             "leader":"true"}}},       "shard3":{         "range":"2aaa0000-7fffffff",         "state":"active",         "replicas":{"core_node64":{             "core":"collection1_shard3_replica_n63",             "base_url":"http://127.0.0.1:42765",             "node_name":"127.0.0.1:42765_",             "state":"active",             "type":"NRT",             "leader":"true"}}}},     "router":{"name":"compositeId"},     "maxShardsPerNode":"1",     "autoAddReplicas":"false",     "nrtReplicas":"1",     "tlogReplicas":"0"}}

Stack Trace:
java.lang.AssertionError: Didn't see all replicas for shard shard1 in repfacttest_c8n_1x3 come up within 30000 ms! ClusterState: {
  "control_collection":{
    "pullReplicas":"0",
    "replicationFactor":"1",
    "shards":{"shard1":{
        "range":"80000000-7fffffff",
        "state":"active",
        "replicas":{"core_node2":{
            "core":"control_collection_shard1_replica_n1",
            "base_url":"http://127.0.0.1:39167",
            "node_name":"127.0.0.1:39167_",
            "state":"active",
            "type":"NRT",
            "leader":"true"}}}},
    "router":{"name":"compositeId"},
    "maxShardsPerNode":"1",
    "autoAddReplicas":"false",
    "nrtReplicas":"1",
    "tlogReplicas":"0"},
  "repfacttest_c8n_1x3":{
    "pullReplicas":"0",
    "replicationFactor":"1",
    "shards":{"shard1":{
        "range":"80000000-7fffffff",
        "state":"active",
        "replicas":{
          "core_node4":{
            "core":"repfacttest_c8n_1x3_shard1_replica_n1",
            "base_url":"http://127.0.0.1:33565",
            "node_name":"127.0.0.1:33565_",
            "state":"active",
            "type":"NRT"},
          "core_node5":{
            "core":"repfacttest_c8n_1x3_shard1_replica_n2",
            "base_url":"http://127.0.0.1:43211",
            "node_name":"127.0.0.1:43211_",
            "state":"active",
            "type":"NRT",
            "leader":"true"},
          "core_node6":{
            "core":"repfacttest_c8n_1x3_shard1_replica_n3",
            "base_url":"http://127.0.0.1:42765",
            "node_name":"127.0.0.1:42765_",
            "state":"recovering",
            "type":"NRT"}}}},
    "router":{"name":"compositeId"},
    "maxShardsPerNode":"1",
    "autoAddReplicas":"false",
    "nrtReplicas":"3",
    "tlogReplicas":"0"},
  "collection1":{
    "pullReplicas":"0",
    "replicationFactor":"1",
    "shards":{
      "shard1":{
        "range":"80000000-d554ffff",
        "state":"active",
        "replicas":{"core_node66":{
            "core":"collection1_shard1_replica_n65",
            "base_url":"http://127.0.0.1:43211",
            "node_name":"127.0.0.1:43211_",
            "state":"active",
            "type":"NRT",
            "leader":"true"}}},
      "shard2":{
        "range":"d5550000-2aa9ffff",
        "state":"active",
        "replicas":{"core_node62":{
            "core":"collection1_shard2_replica_n61",
            "base_url":"http://127.0.0.1:33565",
            "node_name":"127.0.0.1:33565_",
            "state":"active",
            "type":"NRT",
            "leader":"true"}}},
      "shard3":{
        "range":"2aaa0000-7fffffff",
        "state":"active",
        "replicas":{"core_node64":{
            "core":"collection1_shard3_replica_n63",
            "base_url":"http://127.0.0.1:42765",
            "node_name":"127.0.0.1:42765_",
            "state":"active",
            "type":"NRT",
            "leader":"true"}}}},
    "router":{"name":"compositeId"},
    "maxShardsPerNode":"1",
    "autoAddReplicas":"false",
    "nrtReplicas":"1",
    "tlogReplicas":"0"}}
        at __randomizedtesting.SeedInfo.seed([628B9E945DF2941B:EADFA14EF30EF9E3]:0)
        at org.junit.Assert.fail(Assert.java:93)
        at org.apache.solr.cloud.AbstractFullDistribZkTestBase.ensureAllReplicasAreActive(AbstractFullDistribZkTestBase.java:2005)
        at org.apache.solr.cloud.ReplicationFactorTest.testRf3(ReplicationFactorTest.java:376)
        at org.apache.solr.cloud.ReplicationFactorTest.test(ReplicationFactorTest.java:86)
        at java.base/jdk.internal.reflect.NativeMethodAccessorImpl.invoke0(Native Method)
        at java.base/jdk.internal.reflect.NativeMethodAccessorImpl.invoke(NativeMethodAccessorImpl.java:62)
        at java.base/jdk.internal.reflect.DelegatingMethodAccessorImpl.invoke(DelegatingMethodAccessorImpl.java:43)
        at java.base/java.lang.reflect.Method.invoke(Method.java:564)
        at com.carrotsearch.randomizedtesting.RandomizedRunner.invoke(RandomizedRunner.java:1737)
        at com.carrotsearch.randomizedtesting.RandomizedRunner$8.evaluate(RandomizedRunner.java:934)
        at com.carrotsearch.randomizedtesting.RandomizedRunner$9.evaluate(RandomizedRunner.java:970)
        at com.carrotsearch.randomizedtesting.RandomizedRunner$10.evaluate(RandomizedRunner.java:984)
        at org.apache.solr.BaseDistributedSearchTestCase$ShardsRepeatRule$ShardsFixedStatement.callStatement(BaseDistributedSearchTestCase.java:993)
        at org.apache.solr.BaseDistributedSearchTestCase$ShardsRepeatRule$ShardsStatement.evaluate(BaseDistributedSearchTestCase.java:968)
        at com.carrotsearch.randomizedtesting.rules.SystemPropertiesRestoreRule$1.evaluate(SystemPropertiesRestoreRule.java:57)
        at org.apache.lucene.util.TestRuleSetupTeardownChained$1.evaluate(TestRuleSetupTeardownChained.java:49)
        at org.apache.lucene.util.AbstractBeforeAfterRule$1.evaluate(AbstractBeforeAfterRule.java:45)
        at org.apache.lucene.util.TestRuleThreadAndTestName$1.evaluate(TestRuleThreadAndTestName.java:48)
        at org.apache.lucene.util.TestRuleIgnoreAfterMaxFailures$1.evaluate(TestRuleIgnoreAfterMaxFailures.java:64)
        at org.apache.lucene.util.TestRuleMarkFailure$1.evaluate(TestRuleMarkFailure.java:47)
        at com.carrotsearch.randomizedtesting.rules.StatementAdapter.evaluate(StatementAdapter.java:36)
        at com.carrotsearch.randomizedtesting.ThreadLeakControl$StatementRunner.run(ThreadLeakControl.java:368)
        at com.carrotsearch.randomizedtesting.ThreadLeakControl.forkTimeoutingTask(ThreadLeakControl.java:817)
        at com.carrotsearch.randomizedtesting.ThreadLeakControl$3.evaluate(ThreadLeakControl.java:468)
        at com.carrotsearch.randomizedtesting.RandomizedRunner.runSingleTest(RandomizedRunner.java:943)
        at com.carrotsearch.randomizedtesting.RandomizedRunner$5.evaluate(RandomizedRunner.java:829)
        at com.carrotsearch.randomizedtesting.RandomizedRunner$6.evaluate(RandomizedRunner.java:879)
        at com.carrotsearch.randomizedtesting.RandomizedRunner$7.evaluate(RandomizedRunner.java:890)
        at com.carrotsearch.randomizedtesting.rules.StatementAdapter.evaluate(StatementAdapter.java:36)
        at com.carrotsearch.randomizedtesting.rules.SystemPropertiesRestoreRule$1.evaluate(SystemPropertiesRestoreRule.java:57)
        at org.apache.lucene.util.AbstractBeforeAfterRule$1.evaluate(AbstractBeforeAfterRule.java:45)
        at com.carrotsearch.randomizedtesting.rules.StatementAdapter.evaluate(StatementAdapter.java:36)
        at org.apache.lucene.util.TestRuleStoreClassName$1.evaluate(TestRuleStoreClassName.java:41)
        at com.carrotsearch.randomizedtesting.rules.NoShadowingOrOverridesOnMethodsRule$1.evaluate(NoShadowingOrOverridesOnMethodsRule.java:40)
        at com.carrotsearch.randomizedtesting.rules.NoShadowingOrOverridesOnMethodsRule$1.evaluate(NoShadowingOrOverridesOnMethodsRule.java:40)
        at com.carrotsearch.randomizedtesting.rules.StatementAdapter.evaluate(StatementAdapter.java:36)
        at com.carrotsearch.randomizedtesting.rules.StatementAdapter.evaluate(StatementAdapter.java:36)
        at org.apache.lucene.util.TestRuleAssertionsRequired$1.evaluate(TestRuleAssertionsRequired.java:53)
        at org.apache.lucene.util.TestRuleMarkFailure$1.evaluate(TestRuleMarkFailure.java:47)
        at org.apache.lucene.util.TestRuleIgnoreAfterMaxFailures$1.evaluate(TestRuleIgnoreAfterMaxFailures.java:64)
        at org.apache.lucene.util.TestRuleIgnoreTestSuites$1.evaluate(TestRuleIgnoreTestSuites.java:54)
        at com.carrotsearch.randomizedtesting.rules.StatementAdapter.evaluate(StatementAdapter.java:36)
        at com.carrotsearch.randomizedtesting.ThreadLeakControl$StatementRunner.run(ThreadLeakControl.java:368)
        at java.base/java.lang.Thread.run(Thread.java:844)


FAILED:  org.apache.solr.cloud.ReplicationFactorTest.test

Error Message:
Didn't see all replicas for shard shard1 in repfacttest_c8n_1x3 come up within 30000 ms! ClusterState: {   "control_collection":{     "pullReplicas":"0",     "replicationFactor":"1",     "shards":{"shard1":{         "range":"80000000-7fffffff",         "state":"active",         "replicas":{"core_node2":{             "core":"control_collection_shard1_replica_n1",             "base_url":"http://127.0.0.1:33491",             "node_name":"127.0.0.1:33491_",             "state":"active",             "type":"NRT",             "leader":"true"}}}},     "router":{"name":"compositeId"},     "maxShardsPerNode":"1",     "autoAddReplicas":"false",     "nrtReplicas":"1",     "tlogReplicas":"0"},   "repfacttest_c8n_1x3":{     "pullReplicas":"0",     "replicationFactor":"1",     "shards":{"shard1":{         "range":"80000000-7fffffff",         "state":"active",         "replicas":{           "core_node4":{             "core":"repfacttest_c8n_1x3_shard1_replica_n1",             "base_url":"http://127.0.0.1:46105",             "node_name":"127.0.0.1:46105_",             "state":"active",             "type":"NRT",             "leader":"true"},           "core_node5":{             "core":"repfacttest_c8n_1x3_shard1_replica_n2",             "base_url":"http://127.0.0.1:33491",             "node_name":"127.0.0.1:33491_",             "state":"active",             "type":"NRT"},           "core_node6":{             "core":"repfacttest_c8n_1x3_shard1_replica_n3",             "base_url":"http://127.0.0.1:45049",             "node_name":"127.0.0.1:45049_",             "state":"recovering",             "type":"NRT"}}}},     "router":{"name":"compositeId"},     "maxShardsPerNode":"1",     "autoAddReplicas":"false",     "nrtReplicas":"3",     "tlogReplicas":"0"},   "collection1":{     "pullReplicas":"0",     "replicationFactor":"1",     "shards":{       "shard1":{         "range":"80000000-d554ffff",         "state":"active",         "replicas":{"core_node66":{             "core":"collection1_shard1_replica_n65",             "base_url":"http://127.0.0.1:39823",             "node_name":"127.0.0.1:39823_",             "state":"active",             "type":"NRT",             "leader":"true"}}},       "shard2":{         "range":"d5550000-2aa9ffff",         "state":"active",         "replicas":{"core_node62":{             "core":"collection1_shard2_replica_n61",             "base_url":"http://127.0.0.1:45049",             "node_name":"127.0.0.1:45049_",             "state":"active",             "type":"NRT",             "leader":"true"}}},       "shard3":{         "range":"2aaa0000-7fffffff",         "state":"active",         "replicas":{"core_node64":{             "core":"collection1_shard3_replica_n63",             "base_url":"http://127.0.0.1:46105",             "node_name":"127.0.0.1:46105_",             "state":"active",             "type":"NRT",             "leader":"true"}}}},     "router":{"name":"compositeId"},     "maxShardsPerNode":"1",     "autoAddReplicas":"false",     "nrtReplicas":"1",     "tlogReplicas":"0"}}

Stack Trace:
java.lang.AssertionError: Didn't see all replicas for shard shard1 in repfacttest_c8n_1x3 come up within 30000 ms! ClusterState: {
  "control_collection":{
    "pullReplicas":"0",
    "replicationFactor":"1",
    "shards":{"shard1":{
        "range":"80000000-7fffffff",
        "state":"active",
        "replicas":{"core_node2":{
            "core":"control_collection_shard1_replica_n1",
            "base_url":"http://127.0.0.1:33491",
            "node_name":"127.0.0.1:33491_",
            "state":"active",
            "type":"NRT",
            "leader":"true"}}}},
    "router":{"name":"compositeId"},
    "maxShardsPerNode":"1",
    "autoAddReplicas":"false",
    "nrtReplicas":"1",
    "tlogReplicas":"0"},
  "repfacttest_c8n_1x3":{
    "pullReplicas":"0",
    "replicationFactor":"1",
    "shards":{"shard1":{
        "range":"80000000-7fffffff",
        "state":"active",
        "replicas":{
          "core_node4":{
            "core":"repfacttest_c8n_1x3_shard1_replica_n1",
            "base_url":"http://127.0.0.1:46105",
            "node_name":"127.0.0.1:46105_",
            "state":"active",
            "type":"NRT",
            "leader":"true"},
          "core_node5":{
            "core":"repfacttest_c8n_1x3_shard1_replica_n2",
            "base_url":"http://127.0.0.1:33491",
            "node_name":"127.0.0.1:33491_",
            "state":"active",
            "type":"NRT"},
          "core_node6":{
            "core":"repfacttest_c8n_1x3_shard1_replica_n3",
            "base_url":"http://127.0.0.1:45049",
            "node_name":"127.0.0.1:45049_",
            "state":"recovering",
            "type":"NRT"}}}},
    "router":{"name":"compositeId"},
    "maxShardsPerNode":"1",
    "autoAddReplicas":"false",
    "nrtReplicas":"3",
    "tlogReplicas":"0"},
  "collection1":{
    "pullReplicas":"0",
    "replicationFactor":"1",
    "shards":{
      "shard1":{
        "range":"80000000-d554ffff",
        "state":"active",
        "replicas":{"core_node66":{
            "core":"collection1_shard1_replica_n65",
            "base_url":"http://127.0.0.1:39823",
            "node_name":"127.0.0.1:39823_",
            "state":"active",
            "type":"NRT",
            "leader":"true"}}},
      "shard2":{
        "range":"d5550000-2aa9ffff",
        "state":"active",
        "replicas":{"core_node62":{
            "core":"collection1_shard2_replica_n61",
            "base_url":"http://127.0.0.1:45049",
            "node_name":"127.0.0.1:45049_",
            "state":"active",
            "type":"NRT",
            "leader":"true"}}},
      "shard3":{
        "range":"2aaa0000-7fffffff",
        "state":"active",
        "replicas":{"core_node64":{
            "core":"collection1_shard3_replica_n63",
            "base_url":"http://127.0.0.1:46105",
            "node_name":"127.0.0.1:46105_",
            "state":"active",
            "type":"NRT",
            "leader":"true"}}}},
    "router":{"name":"compositeId"},
    "maxShardsPerNode":"1",
    "autoAddReplicas":"false",
    "nrtReplicas":"1",
    "tlogReplicas":"0"}}
        at __randomizedtesting.SeedInfo.seed([628B9E945DF2941B:EADFA14EF30EF9E3]:0)
        at org.junit.Assert.fail(Assert.java:93)
        at org.apache.solr.cloud.AbstractFullDistribZkTestBase.ensureAllReplicasAreActive(AbstractFullDistribZkTestBase.java:2005)
        at org.apache.solr.cloud.ReplicationFactorTest.testRf3(ReplicationFactorTest.java:376)
        at org.apache.solr.cloud.ReplicationFactorTest.test(ReplicationFactorTest.java:86)
        at java.base/jdk.internal.reflect.NativeMethodAccessorImpl.invoke0(Native Method)
        at java.base/jdk.internal.reflect.NativeMethodAccessorImpl.invoke(NativeMethodAccessorImpl.java:62)
        at java.base/jdk.internal.reflect.DelegatingMethodAccessorImpl.invoke(DelegatingMethodAccessorImpl.java:43)
        at java.base/java.lang.reflect.Method.invoke(Method.java:564)
        at com.carrotsearch.randomizedtesting.RandomizedRunner.invoke(RandomizedRunner.java:1737)
        at com.carrotsearch.randomizedtesting.RandomizedRunner$8.evaluate(RandomizedRunner.java:934)
        at com.carrotsearch.randomizedtesting.RandomizedRunner$9.evaluate(RandomizedRunner.java:970)
        at com.carrotsearch.randomizedtesting.RandomizedRunner$10.evaluate(RandomizedRunner.java:984)
        at org.apache.solr.BaseDistributedSearchTestCase$ShardsRepeatRule$ShardsFixedStatement.callStatement(BaseDistributedSearchTestCase.java:993)
        at org.apache.solr.BaseDistributedSearchTestCase$ShardsRepeatRule$ShardsStatement.evaluate(BaseDistributedSearchTestCase.java:968)
        at com.carrotsearch.randomizedtesting.rules.SystemPropertiesRestoreRule$1.evaluate(SystemPropertiesRestoreRule.java:57)
        at org.apache.lucene.util.TestRuleSetupTeardownChained$1.evaluate(TestRuleSetupTeardownChained.java:49)
        at org.apache.lucene.util.AbstractBeforeAfterRule$1.evaluate(AbstractBeforeAfterRule.java:45)
        at org.apache.lucene.util.TestRuleThreadAndTestName$1.evaluate(TestRuleThreadAndTestName.java:48)
        at org.apache.lucene.util.TestRuleIgnoreAfterMaxFailures$1.evaluate(TestRuleIgnoreAfterMaxFailures.java:64)
        at org.apache.lucene.util.TestRuleMarkFailure$1.evaluate(TestRuleMarkFailure.java:47)
        at com.carrotsearch.randomizedtesting.rules.StatementAdapter.evaluate(StatementAdapter.java:36)
        at com.carrotsearch.randomizedtesting.ThreadLeakControl$StatementRunner.run(ThreadLeakControl.java:368)
        at com.carrotsearch.randomizedtesting.ThreadLeakControl.forkTimeoutingTask(ThreadLeakControl.java:817)
        at com.carrotsearch.randomizedtesting.ThreadLeakControl$3.evaluate(ThreadLeakControl.java:468)
        at com.carrotsearch.randomizedtesting.RandomizedRunner.runSingleTest(RandomizedRunner.java:943)
        at com.carrotsearch.randomizedtesting.RandomizedRunner$5.evaluate(RandomizedRunner.java:829)
        at com.carrotsearch.randomizedtesting.RandomizedRunner$6.evaluate(RandomizedRunner.java:879)
        at com.carrotsearch.randomizedtesting.RandomizedRunner$7.evaluate(RandomizedRunner.java:890)
        at com.carrotsearch.randomizedtesting.rules.StatementAdapter.evaluate(StatementAdapter.java:36)
        at com.carrotsearch.randomizedtesting.rules.SystemPropertiesRestoreRule$1.evaluate(SystemPropertiesRestoreRule.java:57)
        at org.apache.lucene.util.AbstractBeforeAfterRule$1.evaluate(AbstractBeforeAfterRule.java:45)
        at com.carrotsearch.randomizedtesting.rules.StatementAdapter.evaluate(StatementAdapter.java:36)
        at org.apache.lucene.util.TestRuleStoreClassName$1.evaluate(TestRuleStoreClassName.java:41)
        at com.carrotsearch.randomizedtesting.rules.NoShadowingOrOverridesOnMethodsRule$1.evaluate(NoShadowingOrOverridesOnMethodsRule.java:40)
        at com.carrotsearch.randomizedtesting.rules.NoShadowingOrOverridesOnMethodsRule$1.evaluate(NoShadowingOrOverridesOnMethodsRule.java:40)
        at com.carrotsearch.randomizedtesting.rules.StatementAdapter.evaluate(StatementAdapter.java:36)
        at com.carrotsearch.randomizedtesting.rules.StatementAdapter.evaluate(StatementAdapter.java:36)
        at org.apache.lucene.util.TestRuleAssertionsRequired$1.evaluate(TestRuleAssertionsRequired.java:53)
        at org.apache.lucene.util.TestRuleMarkFailure$1.evaluate(TestRuleMarkFailure.java:47)
        at org.apache.lucene.util.TestRuleIgnoreAfterMaxFailures$1.evaluate(TestRuleIgnoreAfterMaxFailures.java:64)
        at org.apache.lucene.util.TestRuleIgnoreTestSuites$1.evaluate(TestRuleIgnoreTestSuites.java:54)
        at com.carrotsearch.randomizedtesting.rules.StatementAdapter.evaluate(StatementAdapter.java:36)
        at com.carrotsearch.randomizedtesting.ThreadLeakControl$StatementRunner.run(ThreadLeakControl.java:368)
        at java.base/java.lang.Thread.run(Thread.java:844)




Build Log:
[...truncated 13517 lines...]
   [junit4] Suite: org.apache.solr.cloud.ReplicationFactorTest
   [junit4]   2> Creating dataDir: /home/jenkins/workspace/Lucene-Solr-BadApples-master-Linux/solr/build/solr-core/test/J1/temp/solr.cloud.ReplicationFactorTest_628B9E945DF2941B-001/init-core-data-001
   [junit4]   2> 1244096 INFO  (SUITE-ReplicationFactorTest-seed#[628B9E945DF2941B]-worker) [    ] o.a.s.SolrTestCaseJ4 Using PointFields (NUMERIC_POINTS_SYSPROP=true) w/NUMERIC_DOCVALUES_SYSPROP=true
   [junit4]   2> 1244096 INFO  (SUITE-ReplicationFactorTest-seed#[628B9E945DF2941B]-worker) [    ] o.a.s.SolrTestCaseJ4 Randomized ssl (false) and clientAuth (false) via: @org.apache.solr.SolrTestCaseJ4$SuppressSSL(bugUrl="https://issues.apache.org/jira/browse/SOLR-5776")
   [junit4]   2> 1244096 INFO  (SUITE-ReplicationFactorTest-seed#[628B9E945DF2941B]-worker) [    ] o.a.s.SolrTestCaseJ4 SecureRandom sanity checks: test.solr.allowed.securerandom=null & java.security.egd=file:/dev/./urandom
   [junit4]   2> 1244097 INFO  (SUITE-ReplicationFactorTest-seed#[628B9E945DF2941B]-worker) [    ] o.a.s.BaseDistributedSearchTestCase Setting hostContext system property: /
   [junit4]   2> 1244097 INFO  (TEST-ReplicationFactorTest.test-seed#[628B9E945DF2941B]) [    ] o.a.s.c.ZkTestServer STARTING ZK TEST SERVER
   [junit4]   2> 1244097 INFO  (Thread-4299) [    ] o.a.s.c.ZkTestServer client port:0.0.0.0/0.0.0.0:0
   [junit4]   2> 1244097 INFO  (Thread-4299) [    ] o.a.s.c.ZkTestServer Starting server
   [junit4]   2> 1244100 ERROR (Thread-4299) [    ] o.a.z.s.ZooKeeperServer ZKShutdownHandler is not registered, so ZooKeeper server won't take any action on ERROR or SHUTDOWN server state changes
   [junit4]   2> 1244198 INFO  (TEST-ReplicationFactorTest.test-seed#[628B9E945DF2941B]) [    ] o.a.s.c.ZkTestServer start zk server on port:37187
   [junit4]   2> 1244199 INFO  (zkConnectionManagerCallback-3631-thread-1) [    ] o.a.s.c.c.ConnectionManager zkClient has connected
   [junit4]   2> 1244201 INFO  (zkConnectionManagerCallback-3633-thread-1) [    ] o.a.s.c.c.ConnectionManager zkClient has connected
   [junit4]   2> 1244204 INFO  (TEST-ReplicationFactorTest.test-seed#[628B9E945DF2941B]) [    ] o.a.s.c.AbstractZkTestCase put /home/jenkins/workspace/Lucene-Solr-BadApples-master-Linux/solr/core/src/test-files/solr/collection1/conf/solrconfig-tlog.xml to /configs/conf1/solrconfig.xml
   [junit4]   2> 1244205 INFO  (TEST-ReplicationFactorTest.test-seed#[628B9E945DF2941B]) [    ] o.a.s.c.AbstractZkTestCase put /home/jenkins/workspace/Lucene-Solr-BadApples-master-Linux/solr/core/src/test-files/solr/collection1/conf/schema.xml to /configs/conf1/schema.xml
   [junit4]   2> 1244205 INFO  (TEST-ReplicationFactorTest.test-seed#[628B9E945DF2941B]) [    ] o.a.s.c.AbstractZkTestCase put /home/jenkins/workspace/Lucene-Solr-BadApples-master-Linux/solr/core/src/test-files/solr/collection1/conf/solrconfig.snippet.randomindexconfig.xml to /configs/conf1/solrconfig.snippet.randomindexconfig.xml
   [junit4]   2> 1244206 INFO  (TEST-ReplicationFactorTest.test-seed#[628B9E945DF2941B]) [    ] o.a.s.c.AbstractZkTestCase put /home/jenkins/workspace/Lucene-Solr-BadApples-master-Linux/solr/core/src/test-files/solr/collection1/conf/stopwords.txt to /configs/conf1/stopwords.txt
   [junit4]   2> 1244206 INFO  (TEST-ReplicationFactorTest.test-seed#[628B9E945DF2941B]) [    ] o.a.s.c.AbstractZkTestCase put /home/jenkins/workspace/Lucene-Solr-BadApples-master-Linux/solr/core/src/test-files/solr/collection1/conf/protwords.txt to /configs/conf1/protwords.txt
   [junit4]   2> 1244207 INFO  (TEST-ReplicationFactorTest.test-seed#[628B9E945DF2941B]) [    ] o.a.s.c.AbstractZkTestCase put /home/jenkins/workspace/Lucene-Solr-BadApples-master-Linux/solr/core/src/test-files/solr/collection1/conf/currency.xml to /configs/conf1/currency.xml
   [junit4]   2> 1244207 INFO  (TEST-ReplicationFactorTest.test-seed#[628B9E945DF2941B]) [    ] o.a.s.c.AbstractZkTestCase put /home/jenkins/workspace/Lucene-Solr-BadApples-master-Linux/solr/core/src/test-files/solr/collection1/conf/enumsConfig.xml to /configs/conf1/enumsConfig.xml
   [junit4]   2> 1244208 INFO  (TEST-ReplicationFactorTest.test-seed#[628B9E945DF2941B]) [    ] o.a.s.c.AbstractZkTestCase put /home/jenkins/workspace/Lucene-Solr-BadApples-master-Linux/solr/core/src/test-files/solr/collection1/conf/open-exchange-rates.json to /configs/conf1/open-exchange-rates.json
   [junit4]   2> 1244208 INFO  (TEST-ReplicationFactorTest.test-seed#[628B9E945DF2941B]) [    ] o.a.s.c.AbstractZkTestCase put /home/jenkins/workspace/Lucene-Solr-BadApples-master-Linux/solr/core/src/test-files/solr/collection1/conf/mapping-ISOLatin1Accent.txt to /configs/conf1/mapping-ISOLatin1Accent.txt
   [junit4]   2> 1244209 INFO  (TEST-ReplicationFactorTest.test-seed#[628B9E945DF2941B]) [    ] o.a.s.c.AbstractZkTestCase put /home/jenkins/workspace/Lucene-Solr-BadApples-master-Linux/solr/core/src/test-files/solr/collection1/conf/old_synonyms.txt to /configs/conf1/old_synonyms.txt
   [junit4]   2> 1244209 INFO  (TEST-ReplicationFactorTest.test-seed#[628B9E945DF2941B]) [    ] o.a.s.c.AbstractZkTestCase put /home/jenkins/workspace/Lucene-Solr-BadApples-master-Linux/solr/core/src/test-files/solr/collection1/conf/synonyms.txt to /configs/conf1/synonyms.txt
   [junit4]   2> 1244210 INFO  (TEST-ReplicationFactorTest.test-seed#[628B9E945DF2941B]) [    ] o.a.s.c.AbstractFullDistribZkTestBase Will use NRT replicas unless explicitly asked otherwise
   [junit4]   2> 1244270 INFO  (TEST-ReplicationFactorTest.test-seed#[628B9E945DF2941B]) [    ] o.e.j.s.Server jetty-9.4.10.v20180503; built: 2018-05-03T15:56:21.710Z; git: daa59876e6f384329b122929e70a80934569428c; jvm 9.0.4+11
   [junit4]   2> 1244271 INFO  (TEST-ReplicationFactorTest.test-seed#[628B9E945DF2941B]) [    ] o.e.j.s.session DefaultSessionIdManager workerName=node0
   [junit4]   2> 1244271 INFO  (TEST-ReplicationFactorTest.test-seed#[628B9E945DF2941B]) [    ] o.e.j.s.session No SessionScavenger set, using defaults
   [junit4]   2> 1244271 INFO  (TEST-ReplicationFactorTest.test-seed#[628B9E945DF2941B]) [    ] o.e.j.s.session node0 Scavenging every 600000ms
   [junit4]   2> 1244271 INFO  (TEST-ReplicationFactorTest.test-seed#[628B9E945DF2941B]) [    ] o.e.j.s.h.ContextHandler Started o.e.j.s.ServletContextHandler@37cd3f24{/,null,AVAILABLE}
   [junit4]   2> 1244272 INFO  (TEST-ReplicationFactorTest.test-seed#[628B9E945DF2941B]) [    ] o.e.j.s.AbstractConnector Started ServerConnector@5a668e17{HTTP/1.1,[http/1.1]}{127.0.0.1:45901}
   [junit4]   2> 1244272 INFO  (TEST-ReplicationFactorTest.test-seed#[628B9E945DF2941B]) [    ] o.e.j.s.Server Started @1244306ms
   [junit4]   2> 1244272 INFO  (TEST-ReplicationFactorTest.test-seed#[628B9E945DF2941B]) [    ] o.a.s.c.s.e.JettySolrRunner Jetty properties: {hostContext=/, solr.data.dir=/home/jenkins/workspace/Lucene-Solr-BadApples-master-Linux/solr/build/solr-core/test/J1/temp/solr.cloud.ReplicationFactorTest_628B9E945DF2941B-001/tempDir-001/control/data, hostPort=33491, coreRootDirectory=/home/jenkins/workspace/Lucene-Solr-BadApples-master-Linux/solr/build/solr-core/test/J1/temp/solr.cloud.ReplicationFactorTest_628B9E945DF2941B-001/control-001/cores, replicaType=NRT}
   [junit4]   2> 1244273 ERROR (TEST-ReplicationFactorTest.test-seed#[628B9E945DF2941B]) [    ] o.a.s.u.StartupLoggingUtils Missing Java Option solr.log.dir. Logging may be missing or incomplete.
   [junit4]   2> 1244273 INFO  (TEST-ReplicationFactorTest.test-seed#[628B9E945DF2941B]) [    ] o.a.s.s.SolrDispatchFilter Using logger factory org.apache.logging.slf4j.Log4jLoggerFactory
   [junit4]   2> 1244273 INFO  (TEST-ReplicationFactorTest.test-seed#[628B9E945DF2941B]) [    ] o.a.s.s.SolrDispatchFilter  ___      _       Welcome to Apache Solr™ version 8.0.0
   [junit4]   2> 1244273 INFO  (TEST-ReplicationFactorTest.test-seed#[628B9E945DF2941B]) [    ] o.a.s.s.SolrDispatchFilter / __| ___| |_ _   Starting in cloud mode on port null
   [junit4]   2> 1244273 INFO  (TEST-ReplicationFactorTest.test-seed#[628B9E945DF2941B]) [    ] o.a.s.s.SolrDispatchFilter \__ \/ _ \ | '_|  Install dir: null
   [junit4]   2> 1244273 INFO  (TEST-ReplicationFactorTest.test-seed#[628B9E945DF2941B]) [    ] o.a.s.s.SolrDispatchFilter |___/\___/_|_|    Start time: 2018-06-14T03:30:47.071234Z
   [junit4]   2> 1244274 INFO  (zkConnectionManagerCallback-3635-thread-1) [    ] o.a.s.c.c.ConnectionManager zkClient has connected
   [junit4]   2> 1244274 INFO  (TEST-ReplicationFactorTest.test-seed#[628B9E945DF2941B]) [    ] o.a.s.s.SolrDispatchFilter Loading solr.xml from SolrHome (not found in ZooKeeper)
   [junit4]   2> 1244274 INFO  (TEST-ReplicationFactorTest.test-seed#[628B9E945DF2941B]) [    ] o.a.s.c.SolrXmlConfig Loading container configuration from /home/jenkins/workspace/Lucene-Solr-BadApples-master-Linux/solr/build/solr-core/test/J1/temp/solr.cloud.ReplicationFactorTest_628B9E945DF2941B-001/control-001/solr.xml
   [junit4]   2> 1244276 INFO  (TEST-ReplicationFactorTest.test-seed#[628B9E945DF2941B]) [    ] o.a.s.c.SolrXmlConfig Configuration parameter autoReplicaFailoverWorkLoopDelay is ignored
   [junit4]   2> 1244276 INFO  (TEST-ReplicationFactorTest.test-seed#[628B9E945DF2941B]) [    ] o.a.s.c.SolrXmlConfig Configuration parameter autoReplicaFailoverBadNodeExpiration is ignored
   [junit4]   2> 1244276 INFO  (TEST-ReplicationFactorTest.test-seed#[628B9E945DF2941B]) [    ] o.a.s.c.SolrXmlConfig MBean server found: com.sun.jmx.mbeanserver.JmxMBeanServer@5528b8bc, but no JMX reporters were configured - adding default JMX reporter.
   [junit4]   2> 1244354 INFO  (TEST-ReplicationFactorTest.test-seed#[628B9E945DF2941B]) [    ] o.a.s.c.ZkContainer Zookeeper client=127.0.0.1:37187/solr
   [junit4]   2> 1244355 INFO  (zkConnectionManagerCallback-3639-thread-1) [    ] o.a.s.c.c.ConnectionManager zkClient has connected
   [junit4]   2> 1244356 INFO  (zkConnectionManagerCallback-3641-thread-1) [    ] o.a.s.c.c.ConnectionManager zkClient has connected
   [junit4]   2> 1244390 INFO  (TEST-ReplicationFactorTest.test-seed#[628B9E945DF2941B]) [n:127.0.0.1:33491_    ] o.a.s.c.Overseer Overseer (id=null) closing
   [junit4]   2> 1244391 INFO  (TEST-ReplicationFactorTest.test-seed#[628B9E945DF2941B]) [n:127.0.0.1:33491_    ] o.a.s.c.OverseerElectionContext I am going to be the leader 127.0.0.1:33491_
   [junit4]   2> 1244391 INFO  (TEST-ReplicationFactorTest.test-seed#[628B9E945DF2941B]) [n:127.0.0.1:33491_    ] o.a.s.c.Overseer Overseer (id=72197065038692356-127.0.0.1:33491_-n_0000000000) starting
   [junit4]   2> 1244395 INFO  (zkConnectionManagerCallback-3648-thread-1) [    ] o.a.s.c.c.ConnectionManager zkClient has connected
   [junit4]   2> 1244396 INFO  (TEST-ReplicationFactorTest.test-seed#[628B9E945DF2941B]) [n:127.0.0.1:33491_    ] o.a.s.c.s.i.ZkClientClusterStateProvider Cluster at 127.0.0.1:37187/solr ready
   [junit4]   2> 1244412 INFO  (TEST-ReplicationFactorTest.test-seed#[628B9E945DF2941B]) [n:127.0.0.1:33491_    ] o.a.s.c.ZkController Register node as live in ZooKeeper:/live_nodes/127.0.0.1:33491_
   [junit4]   2> 1244413 INFO  (zkCallback-3640-thread-1) [    ] o.a.s.c.c.ZkStateReader Updated live nodes from ZooKeeper... (0) -> (1)
   [junit4]   2> 1244418 INFO  (zkCallback-3647-thread-1) [    ] o.a.s.c.c.ZkStateReader Updated live nodes from ZooKeeper... (0) -> (1)
   [junit4]   2> 1244429 INFO  (TEST-ReplicationFactorTest.test-seed#[628B9E945DF2941B]) [n:127.0.0.1:33491_    ] o.a.s.h.a.MetricsHistoryHandler No .system collection, keeping metrics history in memory.
   [junit4]   2> 1244439 INFO  (TEST-ReplicationFactorTest.test-seed#[628B9E945DF2941B]) [n:127.0.0.1:33491_    ] o.a.s.m.r.SolrJmxReporter JMX monitoring for 'solr.node' (registry 'solr.node') enabled at server: com.sun.jmx.mbeanserver.JmxMBeanServer@5528b8bc
   [junit4]   2> 1244445 INFO  (TEST-ReplicationFactorTest.test-seed#[628B9E945DF2941B]) [n:127.0.0.1:33491_    ] o.a.s.m.r.SolrJmxReporter JMX monitoring for 'solr.jvm' (registry 'solr.jvm') enabled at server: com.sun.jmx.mbeanserver.JmxMBeanServer@5528b8bc
   [junit4]   2> 1244445 INFO  (TEST-ReplicationFactorTest.test-seed#[628B9E945DF2941B]) [n:127.0.0.1:33491_    ] o.a.s.m.r.SolrJmxReporter JMX monitoring for 'solr.jetty' (registry 'solr.jetty') enabled at server: com.sun.jmx.mbeanserver.JmxMBeanServer@5528b8bc
   [junit4]   2> 1244446 INFO  (TEST-ReplicationFactorTest.test-seed#[628B9E945DF2941B]) [n:127.0.0.1:33491_    ] o.a.s.c.CorePropertiesLocator Found 0 core definitions underneath /home/jenkins/workspace/Lucene-Solr-BadApples-master-Linux/solr/build/solr-core/test/J1/temp/solr.cloud.ReplicationFactorTest_628B9E945DF2941B-001/control-001/cores
   [junit4]   2> 1244469 INFO  (zkConnectionManagerCallback-3654-thread-1) [    ] o.a.s.c.c.ConnectionManager zkClient has connected
   [junit4]   2> 1244470 INFO  (TEST-ReplicationFactorTest.test-seed#[628B9E945DF2941B]) [    ] o.a.s.c.c.ZkStateReader Updated live nodes from ZooKeeper... (0) -> (1)
   [junit4]   2> 1244470 INFO  (TEST-ReplicationFactorTest.test-seed#[628B9E945DF2941B]) [    ] o.a.s.c.s.i.ZkClientClusterStateProvider Cluster at 127.0.0.1:37187/solr ready
   [junit4]   2> 1244471 INFO  (SocketProxy-Acceptor-33491) [    ] o.a.s.c.SocketProxy accepted Socket[addr=/127.0.0.1,port=37552,localport=33491], receiveBufferSize:531000
   [junit4]   2> 1244474 INFO  (SocketProxy-Acceptor-33491) [    ] o.a.s.c.SocketProxy proxy connection Socket[addr=/127.0.0.1,port=45901,localport=53380], receiveBufferSize=530904
   [junit4]   2> 1244475 INFO  (qtp1893075256-14615) [n:127.0.0.1:33491_    ] o.a.s.h.a.CollectionsHandler Invoked Collection Action :create with params replicationFactor=1&collection.configName=conf1&name=control_collection&nrtReplicas=1&action=CREATE&numShards=1&createNodeSet=127.0.0.1:33491_&wt=javabin&version=2 and sendToOCPQueue=true
   [junit4]   2> 1244477 INFO  (OverseerThreadFactory-5788-thread-1) [    ] o.a.s.c.a.c.CreateCollectionCmd Create collection control_collection
   [junit4]   2> 1244580 INFO  (SocketProxy-Acceptor-33491) [    ] o.a.s.c.SocketProxy accepted Socket[addr=/127.0.0.1,port=37556,localport=33491], receiveBufferSize:531000
   [junit4]   2> 1244582 INFO  (SocketProxy-Acceptor-33491) [    ] o.a.s.c.SocketProxy proxy connection Socket[addr=/127.0.0.1,port=45901,localport=53384], receiveBufferSize=530904
   [junit4]   2> 1244582 INFO  (qtp1893075256-14610) [n:127.0.0.1:33491_    x:control_collection_shard1_replica_n1] o.a.s.h.a.CoreAdminOperation core create command qt=/admin/cores&collection.configName=conf1&newCollection=true&name=control_collection_shard1_replica_n1&action=CREATE&numShards=1&collection=control_collection&shard=shard1&wt=javabin&version=2&replicaType=NRT
   [junit4]   2> 1244582 INFO  (qtp1893075256-14610) [n:127.0.0.1:33491_    x:control_collection_shard1_replica_n1] o.a.s.c.TransientSolrCoreCacheDefault Allocating transient cache for 4 transient cores
   [junit4]   2> 1245618 INFO  (qtp1893075256-14610) [n:127.0.0.1:33491_ c:control_collection s:shard1  x:control_collection_shard1_replica_n1] o.a.s.c.SolrConfig Using Lucene MatchVersion: 8.0.0
   [junit4]   2> 1245630 INFO  (qtp1893075256-14610) [n:127.0.0.1:33491_ c:control_collection s:shard1  x:control_collection_shard1_replica_n1] o.a.s.s.IndexSchema [control_collection_shard1_replica_n1] Schema name=test
   [junit4]   2> 1245675 INFO  (qtp1893075256-14610) [n:127.0.0.1:33491_ c:control_collection s:shard1  x:control_collection_shard1_replica_n1] o.a.s.s.IndexSchema Loaded schema test/1.0 with uniqueid field id
   [junit4]   2> 1245686 INFO  (qtp1893075256-14610) [n:127.0.0.1:33491_ c:control_collection s:shard1  x:control_collection_shard1_replica_n1] o.a.s.c.CoreContainer Creating SolrCore 'control_collection_shard1_replica_n1' using configuration from collection control_collection, trusted=true
   [junit4]   2> 1245686 INFO  (qtp1893075256-14610) [n:127.0.0.1:33491_ c:control_collection s:shard1  x:control_collection_shard1_replica_n1] o.a.s.m.r.SolrJmxReporter JMX monitoring for 'solr.core.control_collection.shard1.replica_n1' (registry 'solr.core.control_collection.shard1.replica_n1') enabled at server: com.sun.jmx.mbeanserver.JmxMBeanServer@5528b8bc
   [junit4]   2> 1245687 INFO  (qtp1893075256-14610) [n:127.0.0.1:33491_ c:control_collection s:shard1  x:control_collection_shard1_replica_n1] o.a.s.c.SolrCore solr.RecoveryStrategy.Builder
   [junit4]   2> 1245687 INFO  (qtp1893075256-14610) [n:127.0.0.1:33491_ c:control_collection s:shard1  x:control_collection_shard1_replica_n1] o.a.s.c.SolrCore [[control_collection_shard1_replica_n1] ] Opening new SolrCore at [/home/jenkins/workspace/Lucene-Solr-BadApples-master-Linux/solr/build/solr-core/test/J1/temp/solr.cloud.ReplicationFactorTest_628B9E945DF2941B-001/control-001/cores/control_collection_shard1_replica_n1], dataDir=[/home/jenkins/workspace/Lucene-Solr-BadApples-master-Linux/solr/build/solr-core/test/J1/temp/solr.cloud.ReplicationFactorTest_628B9E945DF2941B-001/control-001/cores/control_collection_shard1_replica_n1/data/]
   [junit4]   2> 1245688 INFO  (qtp1893075256-14610) [n:127.0.0.1:33491_ c:control_collection s:shard1  x:control_collection_shard1_replica_n1] o.a.s.u.RandomMergePolicy RandomMergePolicy wrapping class org.apache.lucene.index.MockRandomMergePolicy: org.apache.lucene.index.MockRandomMergePolicy@1184e05b
   [junit4]   2> 1245689 WARN  (qtp1893075256-14610) [n:127.0.0.1:33491_ c:control_collection s:shard1  x:control_collection_shard1_replica_n1] o.a.s.c.RequestHandlers INVALID paramSet a in requestHandler {type = requestHandler,name = /dump,class = DumpRequestHandler,attributes = {initParams=a, name=/dump, class=DumpRequestHandler},args = {defaults={a=A,b=B}}}
   [junit4]   2> 1245715 INFO  (qtp1893075256-14610) [n:127.0.0.1:33491_ c:control_collection s:shard1  x:control_collection_shard1_replica_n1] o.a.s.u.UpdateHandler Using UpdateLog implementation: org.apache.solr.update.UpdateLog
   [junit4]   2> 1245715 INFO  (qtp1893075256-14610) [n:127.0.0.1:33491_ c:control_collection s:shard1  x:control_collection_shard1_replica_n1] o.a.s.u.UpdateLog Initializing UpdateLog: dataDir= defaultSyncLevel=FLUSH numRecordsToKeep=100 maxNumLogsToKeep=10 numVersionBuckets=65536
   [junit4]   2> 1245716 INFO  (qtp1893075256-14610) [n:127.0.0.1:33491_ c:control_collection s:shard1  x:control_collection_shard1_replica_n1] o.a.s.u.CommitTracker Hard AutoCommit: disabled
   [junit4]   2> 1245716 INFO  (qtp1893075256-14610) [n:127.0.0.1:33491_ c:control_collection s:shard1  x:control_collection_shard1_replica_n1] o.a.s.u.CommitTracker Soft AutoCommit: disabled
   [junit4]   2> 1245717 INFO  (qtp1893075256-14610) [n:127.0.0.1:33491_ c:control_collection s:shard1  x:control_collection_shard1_replica_n1] o.a.s.u.RandomMergePolicy RandomMergePolicy wrapping class org.apache.lucene.index.TieredMergePolicy: [TieredMergePolicy: maxMergeAtOnce=30, maxMergeAtOnceExplicit=24, maxMergedSegmentMB=35.0556640625, floorSegmentMB=1.166015625, forceMergeDeletesPctAllowed=8.343927138097007, segmentsPerTier=36.0, maxCFSSegmentSizeMB=8.796093022207999E12, noCFSRatio=0.5707444435897532
   [junit4]   2> 1245717 INFO  (qtp1893075256-14610) [n:127.0.0.1:33491_ c:control_collection s:shard1  x:control_collection_shard1_replica_n1] o.a.s.s.SolrIndexSearcher Opening [Searcher@7b4caab[control_collection_shard1_replica_n1] main]
   [junit4]   2> 1245718 INFO  (qtp1893075256-14610) [n:127.0.0.1:33491_ c:control_collection s:shard1  x:control_collection_shard1_replica_n1] o.a.s.r.ManagedResourceStorage Configured ZooKeeperStorageIO with znodeBase: /configs/conf1
   [junit4]   2> 1245718 INFO  (qtp1893075256-14610) [n:127.0.0.1:33491_ c:control_collection s:shard1  x:control_collection_shard1_replica_n1] o.a.s.r.ManagedResourceStorage Loaded null at path _rest_managed.json using ZooKeeperStorageIO:path=/configs/conf1
   [junit4]   2> 1245718 INFO  (qtp1893075256-14610) [n:127.0.0.1:33491_ c:control_collection s:shard1  x:control_collection_shard1_replica_n1] o.a.s.h.ReplicationHandler Commits will be reserved for 10000ms.
   [junit4]   2> 1245718 INFO  (qtp1893075256-14610) [n:127.0.0.1:33491_ c:control_collection s:shard1  x:control_collection_shard1_replica_n1] o.a.s.u.UpdateLog Could not find max version in index or recent updates, using new clock 1603217180344713216
   [junit4]   2> 1245719 INFO  (searcherExecutor-5793-thread-1-processing-n:127.0.0.1:33491_ x:control_collection_shard1_replica_n1 c:control_collection s:shard1) [n:127.0.0.1:33491_ c:control_collection s:shard1  x:control_collection_shard1_replica_n1] o.a.s.c.SolrCore [control_collection_shard1_replica_n1] Registered new searcher Searcher@7b4caab[control_collection_shard1_replica_n1] main{ExitableDirectoryReader(UninvertingDirectoryReader())}
   [junit4]   2> 1245722 INFO  (qtp1893075256-14610) [n:127.0.0.1:33491_ c:control_collection s:shard1  x:control_collection_shard1_replica_n1] o.a.s.c.ZkShardTerms Successful update of terms at /collections/control_collection/terms/shard1 to Terms{values={core_node2=0}, version=0}
   [junit4]   2> 1245723 INFO  (qtp1893075256-14610) [n:127.0.0.1:33491_ c:control_collection s:shard1  x:control_collection_shard1_replica_n1] o.a.s.c.ShardLeaderElectionContext Enough replicas found to continue.
   [junit4]   2> 1245723 INFO  (qtp1893075256-14610) [n:127.0.0.1:33491_ c:control_collection s:shard1  x:control_collection_shard1_replica_n1] o.a.s.c.ShardLeaderElectionContext I may be the new leader - try and sync
   [junit4]   2> 1245723 INFO  (qtp1893075256-14610) [n:127.0.0.1:33491_ c:control_collection s:shard1  x:control_collection_shard1_replica_n1] o.a.s.c.SyncStrategy Sync replicas to http://127.0.0.1:33491/control_collection_shard1_replica_n1/
   [junit4]   2> 1245723 INFO  (qtp1893075256-14610) [n:127.0.0.1:33491_ c:control_collection s:shard1  x:control_collection_shard1_replica_n1] o.a.s.c.SyncStrategy Sync Success - now sync replicas to me
   [junit4]   2> 1245724 INFO  (qtp1893075256-14610) [n:127.0.0.1:33491_ c:control_collection s:shard1  x:control_collection_shard1_replica_n1] o.a.s.c.SyncStrategy http://127.0.0.1:33491/control_collection_shard1_replica_n1/ has no replicas
   [junit4]   2> 1245724 INFO  (qtp1893075256-14610) [n:127.0.0.1:33491_ c:control_collection s:shard1  x:control_collection_shard1_replica_n1] o.a.s.c.ShardLeaderElectionContext Found all replicas participating in election, clear LIR
   [junit4]   2> 1245725 INFO  (qtp1893075256-14610) [n:127.0.0.1:33491_ c:control_collection s:shard1  x:control_collection_shard1_replica_n1] o.a.s.c.ShardLeaderElectionContext I am the new leader: http://127.0.0.1:33491/control_collection_shard1_replica_n1/ shard1
   [junit4]   2> 1245827 INFO  (qtp1893075256-14610) [n:127.0.0.1:33491_ c:control_collection s:shard1  x:control_collection_shard1_replica_n1] o.a.s.c.ZkController I am the leader, no recovery necessary
   [junit4]   2> 1245828 INFO  (qtp1893075256-14610) [n:127.0.0.1:33491_ c:control_collection s:shard1  x:control_collection_shard1_replica_n1] o.a.s.s.HttpSolrCall [admin] webapp=null path=/admin/cores params={qt=/admin/cores&collection.configName=conf1&newCollection=true&name=control_collection_shard1_replica_n1&action=CREATE&numShards=1&collection=control_collection&shard=shard1&wt=javabin&version=2&replicaType=NRT} status=0 QTime=1245
   [junit4]   2> 1245829 INFO  (qtp1893075256-14615) [n:127.0.0.1:33491_    ] o.a.s.h.a.CollectionsHandler Wait for new collection to be active for at most 30 seconds. Check all shard replicas
   [junit4]   2> 1245927 INFO  (zkCallback-3640-thread-1) [    ] o.a.s.c.c.ZkStateReader A cluster state change: [WatchedEvent state:SyncConnected type:NodeDataChanged path:/collections/control_collection/state.json] for collection [control_collection] has occurred - updating... (live nodes size: [1])
   [junit4]   2> 1246478 INFO  (OverseerCollectionConfigSetProcessor-72197065038692356-127.0.0.1:33491_-n_0000000000) [    ] o.a.s.c.OverseerTaskQueue Response ZK path: /overseer/collection-queue-work/qnr-0000000000 doesn't exist.  Requestor may have disconnected from ZooKeeper
   [junit4]   2> 1246829 INFO  (qtp1893075256-14615) [n:127.0.0.1:33491_    ] o.a.s.s.HttpSolrCall [admin] webapp=null path=/admin/collections params={replicationFactor=1&collection.configName=conf1&name=control_collection&nrtReplicas=1&action=CREATE&numShards=1&createNodeSet=127.0.0.1:33491_&wt=javabin&version=2} status=0 QTime=2354
   [junit4]   2> 1246831 INFO  (zkConnectionManagerCallback-3659-thread-1) [    ] o.a.s.c.c.ConnectionManager zkClient has connected
   [junit4]   2> 1246832 INFO  (TEST-ReplicationFactorTest.test-seed#[628B9E945DF2941B]) [    ] o.a.s.c.c.ZkStateReader Updated live nodes from ZooKeeper... (0) -> (1)
   [junit4]   2> 1246832 INFO  (TEST-ReplicationFactorTest.test-seed#[628B9E945DF2941B]) [    ] o.a.s.c.s.i.ZkClientClusterStateProvider Cluster at 127.0.0.1:37187/solr ready
   [junit4]   2> 1246832 INFO  (TEST-ReplicationFactorTest.test-seed#[628B9E945DF2941B]) [    ] o.a.s.c.ChaosMonkey monkey: init - expire sessions:false cause connection loss:false
   [junit4]   2> 1246833 INFO  (SocketProxy-Acceptor-33491) [    ] o.a.s.c.SocketProxy accepted Socket[addr=/127.0.0.1,port=37578,localport=33491], receiveBufferSize:531000
   [junit4]   2> 1246833 INFO  (SocketProxy-Acceptor-33491) [    ] o.a.s.c.SocketProxy proxy connection Socket[addr=/127.0.0.1,port=45901,localport=53406], receiveBufferSize=530904
   [junit4]   2> 1246833 INFO  (qtp1893075256-14611) [n:127.0.0.1:33491_    ] o.a.s.h.a.CollectionsHandler Invoked Collection Action :create with params replicationFactor=1&collection.configName=conf1&name=collection1&nrtReplicas=1&action=CREATE&numShards=3&createNodeSet=&stateFormat=2&wt=javabin&version=2 and sendToOCPQueue=true
   [junit4]   2> 1246834 INFO  (OverseerThreadFactory-5788-thread-2) [    ] o.a.s.c.a.c.CreateCollectionCmd Create collection collection1
   [junit4]   2> 1246835 WARN  (OverseerThreadFactory-5788-thread-2) [    ] o.a.s.c.a.c.CreateCollectionCmd It is unusual to create a collection (collection1) without cores.
   [junit4]   2> 1247037 INFO  (qtp1893075256-14611) [n:127.0.0.1:33491_    ] o.a.s.h.a.CollectionsHandler Wait for new collection to be active for at most 30 seconds. Check all shard replicas
   [junit4]   2> 1247038 INFO  (qtp1893075256-14611) [n:127.0.0.1:33491_    ] o.a.s.s.HttpSolrCall [admin] webapp=null path=/admin/collections params={replicationFactor=1&collection.configName=conf1&name=collection1&nrtReplicas=1&action=CREATE&numShards=3&createNodeSet=&stateFormat=2&wt=javabin&version=2} status=0 QTime=204
   [junit4]   2> 1247096 INFO  (TEST-ReplicationFactorTest.test-seed#[628B9E945DF2941B]) [    ] o.a.s.c.AbstractFullDistribZkTestBase create jetty 1 in directory /home/jenkins/workspace/Lucene-Solr-BadApples-master-Linux/solr/build/solr-core/test/J1/temp/solr.cloud.ReplicationFactorTest_628B9E945DF2941B-001/shard-1-001 of type NRT
   [junit4]   2> 1247097 INFO  (TEST-ReplicationFactorTest.test-seed#[628B9E945DF2941B]) [    ] o.e.j.s.Server jetty-9.4.10.v20180503; built: 2018-05-03T15:56:21.710Z; git: daa59876e6f384329b122929e70a80934569428c; jvm 9.0.4+11
   [junit4]   2> 1247097 INFO  (TEST-ReplicationFactorTest.test-seed#[628B9E945DF2941B]) [    ] o.e.j.s.session DefaultSessionIdManager workerName=node0
   [junit4]   2> 1247097 INFO  (TEST-ReplicationFactorTest.test-seed#[628B9E945DF2941B]) [    ] o.e.j.s.session No SessionScavenger set, using defaults
   [junit4]   2> 1247097 INFO  (TEST-ReplicationFactorTest.test-seed#[628B9E945DF2941B]) [    ] o.e.j.s.session node0 Scavenging every 600000ms
   [junit4]   2> 1247098 INFO  (TEST-ReplicationFactorTest.test-seed#[628B9E945DF2941B]) [    ] o.e.j.s.h.ContextHandler Started o.e.j.s.ServletContextHandler@463d4924{/,null,AVAILABLE}
   [junit4]   2> 1247098 INFO  (TEST-ReplicationFactorTest.test-seed#[628B9E945DF2941B]) [    ] o.e.j.s.AbstractConnector Started ServerConnector@83532b2{HTTP/1.1,[http/1.1]}{127.0.0.1:39129}
   [junit4]   2> 1247098 INFO  (TEST-ReplicationFactorTest.test-seed#[628B9E945DF2941B]) [    ] o.e.j.s.Server Started @1247131ms
   [junit4]   2> 1247098 INFO  (TEST-ReplicationFactorTest.test-seed#[628B9E945DF2941B]) [    ] o.a.s.c.s.e.JettySolrRunner Jetty properties: {hostContext=/, solrconfig=solrconfig.xml, solr.data.dir=/home/jenkins/workspace/Lucene-Solr-BadApples-master-Linux/solr/build/solr-core/test/J1/temp/solr.cloud.ReplicationFactorTest_628B9E945DF2941B-001/tempDir-001/jetty1, hostPort=45049, coreRootDirectory=/home/jenkins/workspace/Lucene-Solr-BadApples-master-Linux/solr/build/solr-core/test/J1/temp/solr.cloud.ReplicationFactorTest_628B9E945DF2941B-001/shard-1-001/cores}
   [junit4]   2> 1247098 ERROR (TEST-ReplicationFactorTest.test-seed#[628B9E945DF2941B]) [    ] o.a.s.u.StartupLoggingUtils Missing Java Option solr.log.dir. Logging may be missing or incomplete.
   [junit4]   2> 1247098 INFO  (TEST-ReplicationFactorTest.test-seed#[628B9E945DF2941B]) [    ] o.a.s.s.SolrDispatchFilter Using logger factory org.apache.logging.slf4j.Log4jLoggerFactory
   [junit4]   2> 1247098 INFO  (TEST-ReplicationFactorTest.test-seed#[628B9E945DF2941B]) [    ] o.a.s.s.SolrDispatchFilter  ___      _       Welcome to Apache Solr™ version 8.0.0
   [junit4]   2> 1247098 INFO  (TEST-ReplicationFactorTest.test-seed#[628B9E945DF2941B]) [    ] o.a.s.s.SolrDispatchFilter / __| ___| |_ _   Starting in cloud mode on port null
   [junit4]   2> 1247098 INFO  (TEST-ReplicationFactorTest.test-seed#[628B9E945DF2941B]) [    ] o.a.s.s.SolrDispatchFilter \__ \/ _ \ | '_|  Install dir: null
   [junit4]   2> 1247098 INFO  (TEST-ReplicationFactorTest.test-seed#[628B9E945DF2941B]) [    ] o.a.s.s.SolrDispatchFilter |___/\___/_|_|    Start time: 2018-06-14T03:30:49.896530Z
   [junit4]   2> 1247099 INFO  (zkConnectionManagerCallback-3661-thread-1) [    ] o.a.s.c.c.ConnectionManager zkClient has connected
   [junit4]   2> 1247099 INFO  (TEST-ReplicationFactorTest.test-seed#[628B9E945DF2941B]) [    ] o.a.s.s.SolrDispatchFilter Loading solr.xml from SolrHome (not found in ZooKeeper)
   [junit4]   2> 1247099 INFO  (TEST-ReplicationFactorTest.test-seed#[628B9E945DF2941B]) [    ] o.a.s.c.SolrXmlConfig Loading container configuration from /home/jenkins/workspace/Lucene-Solr-BadApples-master-Linux/solr/build/solr-core/test/J1/temp/solr.cloud.ReplicationFactorTest_628B9E945DF2941B-001/shard-1-001/solr.xml
   [junit4]   2> 1247101 INFO  (TEST-ReplicationFactorTest.test-seed#[628B9E945DF2941B]) [    ] o.a.s.c.SolrXmlConfig Configuration parameter autoReplicaFailoverWorkLoopDelay is ignored
   [junit4]   2> 1247101 INFO  (TEST-ReplicationFactorTest.test-seed#[628B9E945DF2941B]) [    ] o.a.s.c.SolrXmlConfig Configuration parameter autoReplicaFailoverBadNodeExpiration is ignored
   [junit4]   2> 1247102 INFO  (TEST-ReplicationFactorTest.test-seed#[628B9E945DF2941B]) [    ] o.a.s.c.SolrXmlConfig MBean server found: com.sun.jmx.mbeanserver.JmxMBeanServer@5528b8bc, but no JMX reporters were configured - adding default JMX reporter.
   [junit4]   2> 1247166 INFO  (TEST-ReplicationFactorTest.test-seed#[628B9E945DF2941B]) [    ] o.a.s.c.ZkContainer Zookeeper client=127.0.0.1:37187/solr
   [junit4]   2> 1247167 INFO  (zkConnectionManagerCallback-3665-thread-1) [    ] o.a.s.c.c.ConnectionManager zkClient has connected
   [junit4]   2> 1247169 INFO  (zkConnectionManagerCallback-3667-thread-1) [    ] o.a.s.c.c.ConnectionManager zkClient has connected
   [junit4]   2> 1247171 INFO  (TEST-ReplicationFactorTest.test-seed#[628B9E945DF2941B]) [n:127.0.0.1:45049_    ] o.a.s.c.c.ZkStateReader Updated live nodes from ZooKeeper... (0) -> (1)
   [junit4]   2> 1247172 INFO  (TEST-ReplicationFactorTest.test-seed#[628B9E945DF2941B]) [n:127.0.0.1:45049_    ] o.a.s.c.Overseer Overseer (id=null) closing
   [junit4]   2> 1247172 INFO  (TEST-ReplicationFactorTest.test-seed#[628B9E945DF2941B]) [n:127.0.0.1:45049_    ] o.a.s.c.TransientSolrCoreCacheDefault Allocating transient cache for 4 transient cores
   [junit4]   2> 1247173 INFO  (TEST-ReplicationFactorTest.test-seed#[628B9E945DF2941B]) [n:127.0.0.1:45049_    ] o.a.s.c.ZkController Register node as live in ZooKeeper:/live_nodes/127.0.0.1:45049_
   [junit4]   2> 1247173 INFO  (zkCallback-3640-thread-2) [    ] o.a.s.c.c.ZkStateReader Updated live nodes from ZooKeeper... (1) -> (2)
   [junit4]   2> 1247176 INFO  (zkCallback-3647-thread-1) [    ] o.a.s.c.c.ZkStateReader Updated live nodes from ZooKeeper... (1) -> (2)
   [junit4]   2> 1247176 INFO  (zkCallback-3666-thread-1) [    ] o.a.s.c.c.ZkStateReader Updated live nodes from ZooKeeper... (1) -> (2)
   [junit4]   2> 1247176 INFO  (zkCallback-3658-thread-1) [    ] o.a.s.c.c.ZkStateReader Updated live nodes from ZooKeeper... (1) -> (2)
   [junit4]   2> 1247187 INFO  (zkConnectionManagerCallback-3674-thread-1) [    ] o.a.s.c.c.ConnectionManager zkClient has connected
   [junit4]   2> 1247187 INFO  (TEST-ReplicationFactorTest.test-seed#[628B9E945DF2941B]) [n:127.0.0.1:45049_    ] o.a.s.c.c.ZkStateReader Updated live nodes from ZooKeeper... (0) -> (2)
   [junit4]   2> 1247188 INFO  (TEST-ReplicationFactorTest.test-seed#[628B9E945DF2941B]) [n:127.0.0.1:45049_    ] o.a.s.c.s.i.ZkClientClusterStateProvider Cluster at 127.0.0.1:37187/solr ready
   [junit4]   2> 1247188 INFO  (TEST-ReplicationFactorTest.test-seed#[628B9E945DF2941B]) [n:127.0.0.1:45049_    ] o.a.s.h.a.MetricsHistoryHandler No .system collection, keeping metrics history in memory.
   [junit4]   2> 1247203 INFO  (TEST-ReplicationFactorTest.test-seed#[628B9E945DF2941B]) [n:127.0.0.1:45049_    ] o.a.s.m.r.SolrJmxReporter JMX monitoring for 'solr.node' (registry 'solr.node') enabled at server: com.sun.jmx.mbeanserver.JmxMBeanServer@5528b8bc
   [junit4]   2> 1247212 INFO  (TEST-ReplicationFactorTest.test-seed#[628B9E945DF2941B]) [n:127.0.0.1:45049_    ] o.a.s.m.r.SolrJmxReporter JMX monitoring for 'solr.jvm' (registry 'solr.jvm') enabled at server: com.sun.jmx.mbeanserver.JmxMBeanServer@5528b8bc
   [junit4]   2> 1247213 INFO  (TEST-ReplicationFactorTest.test-seed#[628B9E945DF2941B]) [n:127.0.0.1:45049_    ] o.a.s.m.r.SolrJmxReporter JMX monitoring for 'solr.jetty' (registry 'solr.jetty') enabled at server: com.sun.jmx.mbeanserver.JmxMBeanServer@5528b8bc
   [junit4]   2> 1247214 INFO  (TEST-ReplicationFactorTest.test-seed#[628B9E945DF2941B]) [n:127.0.0.1:45049_    ] o.a.s.c.CorePropertiesLocator Found 0 core definitions underneath /home/jenkins/workspace/Lucene-Solr-BadApples-master-Linux/solr/build/solr-core/test/J1/temp/solr.cloud.ReplicationFactorTest_628B9E945DF2941B-001/shard-1-001/cores
   [junit4]   2> 1247228 INFO  (qtp1893075256-14659) [n:127.0.0.1:33491_    ] o.a.s.h.a.CollectionsHandler Invoked Collection Action :addreplica with params node=127.0.0.1:45049_&action=ADDREPLICA&collection=collection1&shard=shard2&type=NRT&wt=javabin&version=2 and sendToOCPQueue=true
   [junit4]   2> 1247230 INFO  (OverseerCollectionConfigSetProcessor-72197065038692356-127.0.0.1:33491_-n_0000000000) [    ] o.a.s.c.OverseerTaskQueue Response ZK path: /overseer/collection-queue-work/qnr-0000000002 doesn't exist.  Requestor may have disconnected from ZooKeeper
   [junit4]   2> 1247230 INFO  (OverseerThreadFactory-5788-thread-3) [ c:collection1 s:shard2  ] o.a.s.c.a.c.AddReplicaCmd Node Identified 127.0.0.1:45049_ for creating new replica
   [junit4]   2> 1247231 INFO  (SocketProxy-Acceptor-45049) [    ] o.a.s.c.SocketProxy accepted Socket[addr=/127.0.0.1,port=56742,localport=45049], receiveBufferSize:531000
   [junit4]   2> 1247232 INFO  (SocketProxy-Acceptor-45049) [    ] o.a.s.c.SocketProxy proxy connection Socket[addr=/127.0.0.1,port=39129,localport=45588], receiveBufferSize=530904
   [junit4]   2> 1247232 INFO  (qtp2008946290-14679) [n:127.0.0.1:45049_    x:collection1_shard2_replica_n61] o.a.s.h.a.CoreAdminOperation core create command qt=/admin/cores&collection.configName=conf1&name=collection1_shard2_replica_n61&action=CREATE&collection=collection1&shard=shard2&wt=javabin&version=2&replicaType=NRT
   [junit4]   2> 1248246 INFO  (qtp2008946290-14679) [n:127.0.0.1:45049_ c:collection1 s:shard2  x:collection1_shard2_replica_n61] o.a.s.c.SolrConfig Using Lucene MatchVersion: 8.0.0
   [junit4]   2> 1248252 INFO  (qtp2008946290-14679) [n:127.0.0.1:45049_ c:collection1 s:shard2  x:collection1_shard2_replica_n61] o.a.s.s.IndexSchema [collection1_shard2_replica_n61] Schema name=test
   [junit4]   2> 1248301 INFO  (qtp2008946290-14679) [n:127.0.0.1:45049_ c:collection1 s:shard2  x:collection1_shard2_replica_n61] o.a.s.s.IndexSchema Loaded schema test/1.0 with uniqueid field id
   [junit

[...truncated too long message...]

ctorTest.test-seed#[628B9E945DF2941B]) [    ] o.a.s.c.SocketProxy Closing 1 connections to: http://127.0.0.1:42765/, target: http://127.0.0.1:41313/
   [junit4]   2> 147347 WARN  (TEST-ReplicationFactorTest.test-seed#[628B9E945DF2941B]) [    ] o.a.s.c.SocketProxy Closing 1 connections to: http://127.0.0.1:33565/, target: http://127.0.0.1:37239/
   [junit4]   2> NOTE: reproduce with: ant test  -Dtestcase=ReplicationFactorTest -Dtests.method=test -Dtests.seed=628B9E945DF2941B -Dtests.multiplier=3 -Dtests.slow=true -Dtests.badapples=true -Dtests.locale=ha-GH -Dtests.timezone=ACT -Dtests.asserts=true -Dtests.file.encoding=UTF-8
   [junit4] FAILURE 69.1s J2 | ReplicationFactorTest.test <<<
   [junit4]    > Throwable #1: java.lang.AssertionError: Didn't see all replicas for shard shard1 in repfacttest_c8n_1x3 come up within 30000 ms! ClusterState: {
   [junit4]    >   "control_collection":{
   [junit4]    >     "pullReplicas":"0",
   [junit4]    >     "replicationFactor":"1",
   [junit4]    >     "shards":{"shard1":{
   [junit4]    >         "range":"80000000-7fffffff",
   [junit4]    >         "state":"active",
   [junit4]    >         "replicas":{"core_node2":{
   [junit4]    >             "core":"control_collection_shard1_replica_n1",
   [junit4]    >             "base_url":"http://127.0.0.1:39167",
   [junit4]    >             "node_name":"127.0.0.1:39167_",
   [junit4]    >             "state":"active",
   [junit4]    >             "type":"NRT",
   [junit4]    >             "leader":"true"}}}},
   [junit4]    >     "router":{"name":"compositeId"},
   [junit4]    >     "maxShardsPerNode":"1",
   [junit4]    >     "autoAddReplicas":"false",
   [junit4]    >     "nrtReplicas":"1",
   [junit4]    >     "tlogReplicas":"0"},
   [junit4]    >   "repfacttest_c8n_1x3":{
   [junit4]    >     "pullReplicas":"0",
   [junit4]    >     "replicationFactor":"1",
   [junit4]    >     "shards":{"shard1":{
   [junit4]    >         "range":"80000000-7fffffff",
   [junit4]    >         "state":"active",
   [junit4]    >         "replicas":{
   [junit4]    >           "core_node4":{
   [junit4]    >             "core":"repfacttest_c8n_1x3_shard1_replica_n1",
   [junit4]    >             "base_url":"http://127.0.0.1:33565",
   [junit4]    >             "node_name":"127.0.0.1:33565_",
   [junit4]    >             "state":"active",
   [junit4]    >             "type":"NRT"},
   [junit4]    >           "core_node5":{
   [junit4]    >             "core":"repfacttest_c8n_1x3_shard1_replica_n2",
   [junit4]    >             "base_url":"http://127.0.0.1:43211",
   [junit4]    >             "node_name":"127.0.0.1:43211_",
   [junit4]    >             "state":"active",
   [junit4]    >             "type":"NRT",
   [junit4]    >             "leader":"true"},
   [junit4]    >           "core_node6":{
   [junit4]    >             "core":"repfacttest_c8n_1x3_shard1_replica_n3",
   [junit4]    >             "base_url":"http://127.0.0.1:42765",
   [junit4]    >             "node_name":"127.0.0.1:42765_",
   [junit4]    >             "state":"recovering",
   [junit4]    >             "type":"NRT"}}}},
   [junit4]    >     "router":{"name":"compositeId"},
   [junit4]    >     "maxShardsPerNode":"1",
   [junit4]    >     "autoAddReplicas":"false",
   [junit4]    >     "nrtReplicas":"3",
   [junit4]    >     "tlogReplicas":"0"},
   [junit4]    >   "collection1":{
   [junit4]    >     "pullReplicas":"0",
   [junit4]    >     "replicationFactor":"1",
   [junit4]    >     "shards":{
   [junit4]    >       "shard1":{
   [junit4]    >         "range":"80000000-d554ffff",
   [junit4]    >         "state":"active",
   [junit4]    >         "replicas":{"core_node66":{
   [junit4]    >             "core":"collection1_shard1_replica_n65",
   [junit4]    >             "base_url":"http://127.0.0.1:43211",
   [junit4]    >             "node_name":"127.0.0.1:43211_",
   [junit4]    >             "state":"active",
   [junit4]    >             "type":"NRT",
   [junit4]    >             "leader":"true"}}},
   [junit4]    >       "shard2":{
   [junit4]    >         "range":"d5550000-2aa9ffff",
   [junit4]    >         "state":"active",
   [junit4]    >         "replicas":{"core_node62":{
   [junit4]    >             "core":"collection1_shard2_replica_n61",
   [junit4]    >             "base_url":"http://127.0.0.1:33565",
   [junit4]    >             "node_name":"127.0.0.1:33565_",
   [junit4]    >             "state":"active",
   [junit4]    >             "type":"NRT",
   [junit4]    >             "leader":"true"}}},
   [junit4]    >       "shard3":{
   [junit4]    >         "range":"2aaa0000-7fffffff",
   [junit4]    >         "state":"active",
   [junit4]    >         "replicas":{"core_node64":{
   [junit4]    >             "core":"collection1_shard3_replica_n63",
   [junit4]    >             "base_url":"http://127.0.0.1:42765",
   [junit4]    >             "node_name":"127.0.0.1:42765_",
   [junit4]    >             "state":"active",
   [junit4]    >             "type":"NRT",
   [junit4]    >             "leader":"true"}}}},
   [junit4]    >     "router":{"name":"compositeId"},
   [junit4]    >     "maxShardsPerNode":"1",
   [junit4]    >     "autoAddReplicas":"false",
   [junit4]    >     "nrtReplicas":"1",
   [junit4]    >     "tlogReplicas":"0"}}
   [junit4]    > at __randomizedtesting.SeedInfo.seed([628B9E945DF2941B:EADFA14EF30EF9E3]:0)
   [junit4]    > at org.apache.solr.cloud.AbstractFullDistribZkTestBase.ensureAllReplicasAreActive(AbstractFullDistribZkTestBase.java:2005)
   [junit4]    > at org.apache.solr.cloud.ReplicationFactorTest.testRf3(ReplicationFactorTest.java:376)
   [junit4]    > at org.apache.solr.cloud.ReplicationFactorTest.test(ReplicationFactorTest.java:86)
   [junit4]    > at java.base/jdk.internal.reflect.NativeMethodAccessorImpl.invoke0(Native Method)
   [junit4]    > at java.base/jdk.internal.reflect.NativeMethodAccessorImpl.invoke(NativeMethodAccessorImpl.java:62)
   [junit4]    > at java.base/jdk.internal.reflect.DelegatingMethodAccessorImpl.invoke(DelegatingMethodAccessorImpl.java:43)
   [junit4]    > at java.base/java.lang.reflect.Method.invoke(Method.java:564)
   [junit4]    > at org.apache.solr.BaseDistributedSearchTestCase$ShardsRepeatRule$ShardsFixedStatement.callStatement(BaseDistributedSearchTestCase.java:993)
   [junit4]    > at org.apache.solr.BaseDistributedSearchTestCase$ShardsRepeatRule$ShardsStatement.evaluate(BaseDistributedSearchTestCase.java:968)
   [junit4]    > at java.base/java.lang.Thread.run(Thread.java:844)
   [junit4]   2> NOTE: leaving temporary files on disk at: /home/jenkins/workspace/Lucene-Solr-BadApples-master-Linux/solr/build/solr-core/test/J2/temp/solr.cloud.ReplicationFactorTest_628B9E945DF2941B-002
   [junit4]   2> Jun 14, 2018 4:08:19 AM com.carrotsearch.randomizedtesting.ThreadLeakControl checkThreadLeaks
   [junit4]   2> WARNING: Will linger awaiting termination of 1 leaked thread(s).
   [junit4]   2> NOTE: test params are: codec=Asserting(Lucene70): {multiDefault=PostingsFormat(name=LuceneVarGapFixedInterval), a_t=PostingsFormat(name=LuceneVarGapFixedInterval), id=PostingsFormat(name=MockRandom), text=FST50}, docValues:{range_facet_l_dv=DocValuesFormat(name=Direct), _version_=DocValuesFormat(name=Asserting), intDefault=DocValuesFormat(name=Asserting), id_i1=DocValuesFormat(name=Asserting), range_facet_i_dv=DocValuesFormat(name=Lucene70), intDvoDefault=DocValuesFormat(name=Direct), range_facet_l=DocValuesFormat(name=Lucene70), timestamp=DocValuesFormat(name=Lucene70)}, maxPointsInLeafNode=1666, maxMBSortInHeap=5.58052646776058, sim=Asserting(org.apache.lucene.search.similarities.AssertingSimilarity@63acf9ef), locale=ha-GH, timezone=ACT
   [junit4]   2> NOTE: Linux 4.13.0-41-generic amd64/Oracle Corporation 9.0.4 (64-bit)/cpus=8,threads=1,free=414589088,total=536870912
   [junit4]   2> NOTE: All tests run in this JVM: [ReplicationFactorTest, ReplicationFactorTest]
   [junit4] Completed [5/5 (5!)] on J2 in 69.39s, 1 test, 1 failure <<< FAILURES!

[...truncated 15 lines...]
BUILD FAILED
/home/jenkins/workspace/Lucene-Solr-BadApples-master-Linux/lucene/common-build.xml:1568: The following error occurred while executing this line:
/home/jenkins/workspace/Lucene-Solr-BadApples-master-Linux/lucene/common-build.xml:1092: There were test failures: 5 suites, 5 tests, 5 failures [seed: 628B9E945DF2941B]

Total time: 2 minutes 29 seconds

[repro] Setting last failure code to 256

[repro] Failures:
[repro]   5/5 failed: org.apache.solr.cloud.ReplicationFactorTest
[repro] Exiting with code 256
+ mv lucene/build lucene/build.repro
+ mv solr/build solr/build.repro
+ mv lucene/build.orig lucene/build
+ mv solr/build.orig solr/build
Archiving artifacts
Setting ANT_1_8_2_HOME=/var/lib/jenkins/tools/hudson.tasks.Ant_AntInstallation/ANT_1.8.2
[WARNINGS] Parsing warnings in console log with parser Java Compiler (javac)
Setting ANT_1_8_2_HOME=/var/lib/jenkins/tools/hudson.tasks.Ant_AntInstallation/ANT_1.8.2
Setting ANT_1_8_2_HOME=/var/lib/jenkins/tools/hudson.tasks.Ant_AntInstallation/ANT_1.8.2
<Git Blamer> Using GitBlamer to create author and commit information for all warnings.
<Git Blamer> GIT_COMMIT=eea4197a3aa3b1fffa31a2708e0947aabd7e727b, workspace=/var/lib/jenkins/workspace/Lucene-Solr-BadApples-master-Linux
[WARNINGS] Computing warning deltas based on reference build #49
Recording test results
Setting ANT_1_8_2_HOME=/var/lib/jenkins/tools/hudson.tasks.Ant_AntInstallation/ANT_1.8.2
Build step 'Publish JUnit test result report' changed build result to UNSTABLE
Email was triggered for: Unstable (Test Failures)
Sending email for trigger: Unstable (Test Failures)
Setting ANT_1_8_2_HOME=/var/lib/jenkins/tools/hudson.tasks.Ant_AntInstallation/ANT_1.8.2
Setting ANT_1_8_2_HOME=/var/lib/jenkins/tools/hudson.tasks.Ant_AntInstallation/ANT_1.8.2
Setting ANT_1_8_2_HOME=/var/lib/jenkins/tools/hudson.tasks.Ant_AntInstallation/ANT_1.8.2
Setting ANT_1_8_2_HOME=/var/lib/jenkins/tools/hudson.tasks.Ant_AntInstallation/ANT_1.8.2


---------------------------------------------------------------------
To unsubscribe, e-mail: [hidden email]
For additional commands, e-mail: [hidden email]