Quantcast

[JENKINS] Lucene-Solr-NightlyTests-6.x - Build # 313 - Unstable

Previous Topic Next Topic
 
classic Classic list List threaded Threaded
1 message Options
Reply | Threaded
Open this post in threaded view
|  
Report Content as Inappropriate

[JENKINS] Lucene-Solr-NightlyTests-6.x - Build # 313 - Unstable

Apache Jenkins Server-2
Build: https://builds.apache.org/job/Lucene-Solr-NightlyTests-6.x/313/

2 tests failed.
FAILED:  org.apache.lucene.index.TestIndexSorting.testRandom3

Error Message:
Test abandoned because suite timeout was reached.

Stack Trace:
java.lang.Exception: Test abandoned because suite timeout was reached.
        at __randomizedtesting.SeedInfo.seed([F793A635E9E1F98D]:0)


FAILED:  junit.framework.TestSuite.org.apache.lucene.index.TestIndexSorting

Error Message:
Suite timeout exceeded (>= 7200000 msec).

Stack Trace:
java.lang.Exception: Suite timeout exceeded (>= 7200000 msec).
        at __randomizedtesting.SeedInfo.seed([F793A635E9E1F98D]:0)




Build Log:
[...truncated 1849 lines...]
   [junit4] Suite: org.apache.lucene.index.TestIndexSorting
   [junit4]   2> mrt 19, 2017 3:40:41 AM com.carrotsearch.randomizedtesting.ThreadLeakControl$2 evaluate
   [junit4]   2> WARNING: Suite execution timed out: org.apache.lucene.index.TestIndexSorting
   [junit4]   2>    1) Thread[id=1, name=main, state=WAITING, group=main]
   [junit4]   2>         at java.lang.Object.wait(Native Method)
   [junit4]   2>         at java.lang.Thread.join(Thread.java:1249)
   [junit4]   2>         at java.lang.Thread.join(Thread.java:1323)
   [junit4]   2>         at com.carrotsearch.randomizedtesting.RandomizedRunner.runSuite(RandomizedRunner.java:608)
   [junit4]   2>         at com.carrotsearch.randomizedtesting.RandomizedRunner.run(RandomizedRunner.java:457)
   [junit4]   2>         at com.carrotsearch.ant.tasks.junit4.slave.SlaveMain.execute(SlaveMain.java:244)
   [junit4]   2>         at com.carrotsearch.ant.tasks.junit4.slave.SlaveMain.main(SlaveMain.java:355)
   [junit4]   2>         at com.carrotsearch.ant.tasks.junit4.slave.SlaveMainSafe.main(SlaveMainSafe.java:13)
   [junit4]   2>    2) Thread[id=5711, name=TEST-TestIndexSorting.testRandom3-seed#[F793A635E9E1F98D], state=RUNNABLE, group=TGRP-TestIndexSorting]
   [junit4]   2>         at sun.nio.ch.FileChannelImpl.position0(Native Method)
   [junit4]   2>         at sun.nio.ch.FileChannelImpl.position(FileChannelImpl.java:288)
   [junit4]   2>         at sun.nio.ch.FileChannelImpl.position(FileChannelImpl.java:50)
   [junit4]   2>         at org.apache.lucene.mockfile.FilterSeekableByteChannel.position(FilterSeekableByteChannel.java:74)
   [junit4]   2>         at org.apache.lucene.mockfile.FilterSeekableByteChannel.position(FilterSeekableByteChannel.java:74)
   [junit4]   2>         at org.apache.lucene.store.SimpleFSDirectory$SimpleFSIndexInput.readInternal(SimpleFSDirectory.java:171)
   [junit4]   2>         at org.apache.lucene.store.BufferedIndexInput.refill(BufferedIndexInput.java:342)
   [junit4]   2>         at org.apache.lucene.store.BufferedIndexInput.readBytes(BufferedIndexInput.java:140)
   [junit4]   2>         at org.apache.lucene.store.BufferedIndexInput.readBytes(BufferedIndexInput.java:116)
   [junit4]   2>         at org.apache.lucene.store.MockIndexInputWrapper.readBytes(MockIndexInputWrapper.java:146)
   [junit4]   2>         at org.apache.lucene.store.BufferedChecksumIndexInput.readBytes(BufferedChecksumIndexInput.java:49)
   [junit4]   2>         at org.apache.lucene.store.DataInput.readBytes(DataInput.java:87)
   [junit4]   2>         at org.apache.lucene.store.DataInput.skipBytes(DataInput.java:350)
   [junit4]   2>         at org.apache.lucene.store.ChecksumIndexInput.seek(ChecksumIndexInput.java:52)
   [junit4]   2>         at org.apache.lucene.codecs.CodecUtil.checksumEntireFile(CodecUtil.java:519)
   [junit4]   2>         at org.apache.lucene.codecs.memory.DirectDocValuesProducer.checkIntegrity(DirectDocValuesProducer.java:281)
   [junit4]   2>         at org.apache.lucene.codecs.perfield.PerFieldDocValuesFormat$FieldsReader.checkIntegrity(PerFieldDocValuesFormat.java:366)
   [junit4]   2>         at org.apache.lucene.codecs.DocValuesConsumer.merge(DocValuesConsumer.java:137)
   [junit4]   2>         at org.apache.lucene.codecs.perfield.PerFieldDocValuesFormat$FieldsWriter.merge(PerFieldDocValuesFormat.java:153)
   [junit4]   2>         at org.apache.lucene.index.SegmentMerger.mergeDocValues(SegmentMerger.java:167)
   [junit4]   2>         at org.apache.lucene.index.SegmentMerger.merge(SegmentMerger.java:111)
   [junit4]   2>         at org.apache.lucene.index.IndexWriter.mergeMiddle(IndexWriter.java:4353)
   [junit4]   2>         at org.apache.lucene.index.IndexWriter.merge(IndexWriter.java:3928)
   [junit4]   2>         at org.apache.lucene.index.SerialMergeScheduler.merge(SerialMergeScheduler.java:40)
   [junit4]   2>         at org.apache.lucene.index.IndexWriter.maybeMerge(IndexWriter.java:2081)
   [junit4]   2>         at org.apache.lucene.index.IndexWriter.doAfterSegmentFlushed(IndexWriter.java:5002)
   [junit4]   2>         at org.apache.lucene.index.DocumentsWriter$MergePendingEvent.process(DocumentsWriter.java:731)
   [junit4]   2>         at org.apache.lucene.index.IndexWriter.processEvents(IndexWriter.java:5040)
   [junit4]   2>         at org.apache.lucene.index.IndexWriter.processEvents(IndexWriter.java:5031)
   [junit4]   2>         at org.apache.lucene.index.IndexWriter.updateDocument(IndexWriter.java:1572)
   [junit4]   2>         at org.apache.lucene.index.IndexWriter.addDocument(IndexWriter.java:1314)
   [junit4]   2>         at org.apache.lucene.index.TestIndexSorting.testRandom3(TestIndexSorting.java:2229)
   [junit4]   2>         at sun.reflect.NativeMethodAccessorImpl.invoke0(Native Method)
   [junit4]   2>         at sun.reflect.NativeMethodAccessorImpl.invoke(NativeMethodAccessorImpl.java:62)
   [junit4]   2>         at sun.reflect.DelegatingMethodAccessorImpl.invoke(DelegatingMethodAccessorImpl.java:43)
   [junit4]   2>         at java.lang.reflect.Method.invoke(Method.java:498)
   [junit4]   2>         at com.carrotsearch.randomizedtesting.RandomizedRunner.invoke(RandomizedRunner.java:1713)
   [junit4]   2>         at com.carrotsearch.randomizedtesting.RandomizedRunner$8.evaluate(RandomizedRunner.java:907)
   [junit4]   2>         at com.carrotsearch.randomizedtesting.RandomizedRunner$9.evaluate(RandomizedRunner.java:943)
   [junit4]   2>         at com.carrotsearch.randomizedtesting.RandomizedRunner$10.evaluate(RandomizedRunner.java:957)
   [junit4]   2>         at org.apache.lucene.util.TestRuleSetupTeardownChained$1.evaluate(TestRuleSetupTeardownChained.java:49)
   [junit4]   2>         at org.apache.lucene.util.AbstractBeforeAfterRule$1.evaluate(AbstractBeforeAfterRule.java:45)
   [junit4]   2>         at org.apache.lucene.util.TestRuleThreadAndTestName$1.evaluate(TestRuleThreadAndTestName.java:48)
   [junit4]   2>         at org.apache.lucene.util.TestRuleIgnoreAfterMaxFailures$1.evaluate(TestRuleIgnoreAfterMaxFailures.java:64)
   [junit4]   2>         at org.apache.lucene.util.TestRuleMarkFailure$1.evaluate(TestRuleMarkFailure.java:47)
   [junit4]   2>         at com.carrotsearch.randomizedtesting.rules.StatementAdapter.evaluate(StatementAdapter.java:36)
   [junit4]   2>         at com.carrotsearch.randomizedtesting.ThreadLeakControl$StatementRunner.run(ThreadLeakControl.java:368)
   [junit4]   2>         at com.carrotsearch.randomizedtesting.ThreadLeakControl.forkTimeoutingTask(ThreadLeakControl.java:817)
   [junit4]   2>         at com.carrotsearch.randomizedtesting.ThreadLeakControl$3.evaluate(ThreadLeakControl.java:468)
   [junit4]   2>         at com.carrotsearch.randomizedtesting.RandomizedRunner.runSingleTest(RandomizedRunner.java:916)
   [junit4]   2>         at com.carrotsearch.randomizedtesting.RandomizedRunner$5.evaluate(RandomizedRunner.java:802)
   [junit4]   2>         at com.carrotsearch.randomizedtesting.RandomizedRunner$6.evaluate(RandomizedRunner.java:852)
   [junit4]   2>         at com.carrotsearch.randomizedtesting.RandomizedRunner$7.evaluate(RandomizedRunner.java:863)
   [junit4]   2>         at org.apache.lucene.util.AbstractBeforeAfterRule$1.evaluate(AbstractBeforeAfterRule.java:45)
   [junit4]   2>         at com.carrotsearch.randomizedtesting.rules.StatementAdapter.evaluate(StatementAdapter.java:36)
   [junit4]   2>         at org.apache.lucene.util.TestRuleStoreClassName$1.evaluate(TestRuleStoreClassName.java:41)
   [junit4]   2>         at com.carrotsearch.randomizedtesting.rules.NoShadowingOrOverridesOnMethodsRule$1.evaluate(NoShadowingOrOverridesOnMethodsRule.java:40)
   [junit4]   2>         at com.carrotsearch.randomizedtesting.rules.NoShadowingOrOverridesOnMethodsRule$1.evaluate(NoShadowingOrOverridesOnMethodsRule.java:40)
   [junit4]   2>         at com.carrotsearch.randomizedtesting.rules.StatementAdapter.evaluate(StatementAdapter.java:36)
   [junit4]   2>         at com.carrotsearch.randomizedtesting.rules.StatementAdapter.evaluate(StatementAdapter.java:36)
   [junit4]   2>         at com.carrotsearch.randomizedtesting.rules.StatementAdapter.evaluate(StatementAdapter.java:36)
   [junit4]   2>         at org.apache.lucene.util.TestRuleAssertionsRequired$1.evaluate(TestRuleAssertionsRequired.java:53)
   [junit4]   2>         at org.apache.lucene.util.TestRuleMarkFailure$1.evaluate(TestRuleMarkFailure.java:47)
   [junit4]   2>         at org.apache.lucene.util.TestRuleIgnoreAfterMaxFailures$1.evaluate(TestRuleIgnoreAfterMaxFailures.java:64)
   [junit4]   2>         at org.apache.lucene.util.TestRuleIgnoreTestSuites$1.evaluate(TestRuleIgnoreTestSuites.java:54)
   [junit4]   2>         at com.carrotsearch.randomizedtesting.rules.StatementAdapter.evaluate(StatementAdapter.java:36)
   [junit4]   2>         at com.carrotsearch.randomizedtesting.ThreadLeakControl$StatementRunner.run(ThreadLeakControl.java:368)
   [junit4]   2>         at java.lang.Thread.run(Thread.java:745)
   [junit4]   2>    3) Thread[id=9, name=JUnit4-serializer-daemon, state=TIMED_WAITING, group=main]
   [junit4]   2>         at java.lang.Thread.sleep(Native Method)
   [junit4]   2>         at com.carrotsearch.ant.tasks.junit4.events.Serializer$1.run(Serializer.java:50)
   [junit4]   2>    4) Thread[id=5710, name=SUITE-TestIndexSorting-seed#[F793A635E9E1F98D], state=RUNNABLE, group=TGRP-TestIndexSorting]
   [junit4]   2>         at java.lang.Thread.getStackTrace(Thread.java:1556)
   [junit4]   2>         at com.carrotsearch.randomizedtesting.ThreadLeakControl$4.run(ThreadLeakControl.java:696)
   [junit4]   2>         at com.carrotsearch.randomizedtesting.ThreadLeakControl$4.run(ThreadLeakControl.java:693)
   [junit4]   2>         at java.security.AccessController.doPrivileged(Native Method)
   [junit4]   2>         at com.carrotsearch.randomizedtesting.ThreadLeakControl.getStackTrace(ThreadLeakControl.java:693)
   [junit4]   2>         at com.carrotsearch.randomizedtesting.ThreadLeakControl.getThreadsWithTraces(ThreadLeakControl.java:709)
   [junit4]   2>         at com.carrotsearch.randomizedtesting.ThreadLeakControl.formatThreadStacksFull(ThreadLeakControl.java:689)
   [junit4]   2>         at com.carrotsearch.randomizedtesting.ThreadLeakControl.access$1000(ThreadLeakControl.java:65)
   [junit4]   2>         at com.carrotsearch.randomizedtesting.ThreadLeakControl$2.evaluate(ThreadLeakControl.java:415)
   [junit4]   2>         at com.carrotsearch.randomizedtesting.RandomizedRunner.runSuite(RandomizedRunner.java:678)
   [junit4]   2>         at com.carrotsearch.randomizedtesting.RandomizedRunner.access$200(RandomizedRunner.java:140)
   [junit4]   2>         at com.carrotsearch.randomizedtesting.RandomizedRunner$2.run(RandomizedRunner.java:598)
   [junit4]   2> NOTE: download the large Jenkins line-docs file by running 'ant get-jenkins-line-docs' in the lucene directory.
   [junit4]   2> NOTE: reproduce with: ant test  -Dtestcase=TestIndexSorting -Dtests.method=testRandom3 -Dtests.seed=F793A635E9E1F98D -Dtests.multiplier=2 -Dtests.nightly=true -Dtests.slow=true -Dtests.linedocsfile=/home/jenkins/jenkins-slave/workspace/Lucene-Solr-NightlyTests-6.x/test-data/enwiki.random.lines.txt -Dtests.locale=nl-NL -Dtests.timezone=America/Atka -Dtests.asserts=true -Dtests.file.encoding=ISO-8859-1
   [junit4] ERROR   7195s J0 | TestIndexSorting.testRandom3 <<<
   [junit4]    > Throwable #1: java.lang.Exception: Test abandoned because suite timeout was reached.
   [junit4]    > at __randomizedtesting.SeedInfo.seed([F793A635E9E1F98D]:0)
   [junit4]   2> mrt 19, 2017 3:40:41 AM com.carrotsearch.randomizedtesting.ThreadLeakControl checkThreadLeaks
   [junit4]   2> WARNING: Will linger awaiting termination of 1 leaked thread(s).
   [junit4]   2> mrt 19, 2017 3:41:01 AM com.carrotsearch.randomizedtesting.ThreadLeakControl checkThreadLeaks
   [junit4]   2> SEVERE: 1 thread leaked from SUITE scope at org.apache.lucene.index.TestIndexSorting:
   [junit4]   2>    1) Thread[id=5711, name=TEST-TestIndexSorting.testRandom3-seed#[F793A635E9E1F98D], state=RUNNABLE, group=TGRP-TestIndexSorting]
   [junit4]   2>         at org.apache.lucene.codecs.DocValuesConsumer$4$1.hasNext(DocValuesConsumer.java:545)
   [junit4]   2>         at org.apache.lucene.codecs.asserting.AssertingDocValuesFormat$AssertingDocValuesConsumer.addSortedNumericField(AssertingDocValuesFormat.java:148)
   [junit4]   2>         at org.apache.lucene.codecs.DocValuesConsumer.mergeSortedNumericField(DocValuesConsumer.java:470)
   [junit4]   2>         at org.apache.lucene.codecs.DocValuesConsumer.merge(DocValuesConsumer.java:243)
   [junit4]   2>         at org.apache.lucene.codecs.perfield.PerFieldDocValuesFormat$FieldsWriter.merge(PerFieldDocValuesFormat.java:153)
   [junit4]   2>         at org.apache.lucene.index.SegmentMerger.mergeDocValues(SegmentMerger.java:167)
   [junit4]   2>         at org.apache.lucene.index.SegmentMerger.merge(SegmentMerger.java:111)
   [junit4]   2>         at org.apache.lucene.index.IndexWriter.mergeMiddle(IndexWriter.java:4353)
   [junit4]   2>         at org.apache.lucene.index.IndexWriter.merge(IndexWriter.java:3928)
   [junit4]   2>         at org.apache.lucene.index.SerialMergeScheduler.merge(SerialMergeScheduler.java:40)
   [junit4]   2>         at org.apache.lucene.index.IndexWriter.maybeMerge(IndexWriter.java:2081)
   [junit4]   2>         at org.apache.lucene.index.IndexWriter.doAfterSegmentFlushed(IndexWriter.java:5002)
   [junit4]   2>         at org.apache.lucene.index.DocumentsWriter$MergePendingEvent.process(DocumentsWriter.java:731)
   [junit4]   2>         at org.apache.lucene.index.IndexWriter.processEvents(IndexWriter.java:5040)
   [junit4]   2>         at org.apache.lucene.index.IndexWriter.processEvents(IndexWriter.java:5031)
   [junit4]   2>         at org.apache.lucene.index.IndexWriter.updateDocument(IndexWriter.java:1572)
   [junit4]   2>         at org.apache.lucene.index.IndexWriter.addDocument(IndexWriter.java:1314)
   [junit4]   2>         at org.apache.lucene.index.TestIndexSorting.testRandom3(TestIndexSorting.java:2229)
   [junit4]   2>         at sun.reflect.NativeMethodAccessorImpl.invoke0(Native Method)
   [junit4]   2>         at sun.reflect.NativeMethodAccessorImpl.invoke(NativeMethodAccessorImpl.java:62)
   [junit4]   2>         at sun.reflect.DelegatingMethodAccessorImpl.invoke(DelegatingMethodAccessorImpl.java:43)
   [junit4]   2>         at java.lang.reflect.Method.invoke(Method.java:498)
   [junit4]   2>         at com.carrotsearch.randomizedtesting.RandomizedRunner.invoke(RandomizedRunner.java:1713)
   [junit4]   2>         at com.carrotsearch.randomizedtesting.RandomizedRunner$8.evaluate(RandomizedRunner.java:907)
   [junit4]   2>         at com.carrotsearch.randomizedtesting.RandomizedRunner$9.evaluate(RandomizedRunner.java:943)
   [junit4]   2>         at com.carrotsearch.randomizedtesting.RandomizedRunner$10.evaluate(RandomizedRunner.java:957)
   [junit4]   2>         at org.apache.lucene.util.TestRuleSetupTeardownChained$1.evaluate(TestRuleSetupTeardownChained.java:49)
   [junit4]   2>         at org.apache.lucene.util.AbstractBeforeAfterRule$1.evaluate(AbstractBeforeAfterRule.java:45)
   [junit4]   2>         at org.apache.lucene.util.TestRuleThreadAndTestName$1.evaluate(TestRuleThreadAndTestName.java:48)
   [junit4]   2>         at org.apache.lucene.util.TestRuleIgnoreAfterMaxFailures$1.evaluate(TestRuleIgnoreAfterMaxFailures.java:64)
   [junit4]   2>         at org.apache.lucene.util.TestRuleMarkFailure$1.evaluate(TestRuleMarkFailure.java:47)
   [junit4]   2>         at com.carrotsearch.randomizedtesting.rules.StatementAdapter.evaluate(StatementAdapter.java:36)
   [junit4]   2>         at com.carrotsearch.randomizedtesting.ThreadLeakControl$StatementRunner.run(ThreadLeakControl.java:368)
   [junit4]   2>         at com.carrotsearch.randomizedtesting.ThreadLeakControl.forkTimeoutingTask(ThreadLeakControl.java:817)
   [junit4]   2>         at com.carrotsearch.randomizedtesting.ThreadLeakControl$3.evaluate(ThreadLeakControl.java:468)
   [junit4]   2>         at com.carrotsearch.randomizedtesting.RandomizedRunner.runSingleTest(RandomizedRunner.java:916)
   [junit4]   2>         at com.carrotsearch.randomizedtesting.RandomizedRunner$5.evaluate(RandomizedRunner.java:802)
   [junit4]   2>         at com.carrotsearch.randomizedtesting.RandomizedRunner$6.evaluate(RandomizedRunner.java:852)
   [junit4]   2>         at com.carrotsearch.randomizedtesting.RandomizedRunner$7.evaluate(RandomizedRunner.java:863)
   [junit4]   2>         at org.apache.lucene.util.AbstractBeforeAfterRule$1.evaluate(AbstractBeforeAfterRule.java:45)
   [junit4]   2>         at com.carrotsearch.randomizedtesting.rules.StatementAdapter.evaluate(StatementAdapter.java:36)
   [junit4]   2>         at org.apache.lucene.util.TestRuleStoreClassName$1.evaluate(TestRuleStoreClassName.java:41)
   [junit4]   2>         at com.carrotsearch.randomizedtesting.rules.NoShadowingOrOverridesOnMethodsRule$1.evaluate(NoShadowingOrOverridesOnMethodsRule.java:40)
   [junit4]   2>         at com.carrotsearch.randomizedtesting.rules.NoShadowingOrOverridesOnMethodsRule$1.evaluate(NoShadowingOrOverridesOnMethodsRule.java:40)
   [junit4]   2>         at com.carrotsearch.randomizedtesting.rules.StatementAdapter.evaluate(StatementAdapter.java:36)
   [junit4]   2>         at com.carrotsearch.randomizedtesting.rules.StatementAdapter.evaluate(StatementAdapter.java:36)
   [junit4]   2>         at com.carrotsearch.randomizedtesting.rules.StatementAdapter.evaluate(StatementAdapter.java:36)
   [junit4]   2>         at org.apache.lucene.util.TestRuleAssertionsRequired$1.evaluate(TestRuleAssertionsRequired.java:53)
   [junit4]   2>         at org.apache.lucene.util.TestRuleMarkFailure$1.evaluate(TestRuleMarkFailure.java:47)
   [junit4]   2>         at org.apache.lucene.util.TestRuleIgnoreAfterMaxFailures$1.evaluate(TestRuleIgnoreAfterMaxFailures.java:64)
   [junit4]   2>         at org.apache.lucene.util.TestRuleIgnoreTestSuites$1.evaluate(TestRuleIgnoreTestSuites.java:54)
   [junit4]   2>         at com.carrotsearch.randomizedtesting.rules.StatementAdapter.evaluate(StatementAdapter.java:36)
   [junit4]   2>         at com.carrotsearch.randomizedtesting.ThreadLeakControl$StatementRunner.run(ThreadLeakControl.java:368)
   [junit4]   2>         at java.lang.Thread.run(Thread.java:745)
   [junit4]   2> mrt 19, 2017 3:41:01 AM com.carrotsearch.randomizedtesting.ThreadLeakControl tryToInterruptAll
   [junit4]   2> INFO: Starting to interrupt leaked threads:
   [junit4]   2>    1) Thread[id=5711, name=TEST-TestIndexSorting.testRandom3-seed#[F793A635E9E1F98D], state=RUNNABLE, group=TGRP-TestIndexSorting]
   [junit4]   2> NOTE: leaving temporary files on disk at: /x1/jenkins/jenkins-slave/workspace/Lucene-Solr-NightlyTests-6.x/checkout/lucene/build/core/test/J0/temp/lucene.index.TestIndexSorting_F793A635E9E1F98D-001
   [junit4]   2> Mar 19, 2017 12:41:01 PM com.carrotsearch.randomizedtesting.ThreadLeakControl tryToInterruptAll
   [junit4]   2> INFO: All leaked threads terminated.
   [junit4]   2> NOTE: test params are: codec=Asserting(Lucene62): {docs=FSTOrd50, norms=FSTOrd50, positions=TestBloomFilteredLucenePostings(BloomFilteringPostingsFormat(Lucene50(blocksize=128))), id=FSTOrd50, term_vectors=FSTOrd50}, docValues:{multi_valued_long=DocValuesFormat(name=Lucene54), double=DocValuesFormat(name=Asserting), foo=DocValuesFormat(name=Lucene54), numeric=DocValuesFormat(name=Asserting), positions=DocValuesFormat(name=Lucene54), multi_valued_numeric=DocValuesFormat(name=Asserting), float=DocValuesFormat(name=Memory), int=DocValuesFormat(name=Asserting), long=DocValuesFormat(name=Memory), points=DocValuesFormat(name=Direct), sorted=DocValuesFormat(name=Asserting), bar=DocValuesFormat(name=Asserting), multi_valued_double=DocValuesFormat(name=Asserting), docs=DocValuesFormat(name=Asserting), multi_valued_string=DocValuesFormat(name=Asserting), norms=DocValuesFormat(name=Asserting), bytes=DocValuesFormat(name=Asserting), binary=DocValuesFormat(name=Asserting), id=DocValuesFormat(name=Asserting), multi_valued_int=DocValuesFormat(name=Direct), multi_valued_bytes=DocValuesFormat(name=Asserting), multi_valued_float=DocValuesFormat(name=Lucene54), term_vectors=DocValuesFormat(name=Asserting)}, maxPointsInLeafNode=1210, maxMBSortInHeap=5.491916718874035, sim=RandomSimilarity(queryNorm=false,coord=crazy): {positions=DFR I(n)L1, id=DFR G1, term_vectors=DFR GL2}, locale=nl-NL, timezone=America/Atka
   [junit4]   2> NOTE: Linux 3.13.0-85-generic amd64/Oracle Corporation 1.8.0_121 (64-bit)/cpus=4,threads=1,free=87931544,total=393216000
   [junit4]   2> NOTE: All tests run in this JVM: [TestCustomNorms, TestBoolean2ScorerSupplier, TestFilterSpans, TestIndexCommit, TestSearch, TestPointQueries, TestTryDelete, TestDemoParallelLeafReader, TestDocValuesQueries, TestCrashCausesCorruptIndex, TestSimilarityBase, TestSpanFirstQuery, TestTieredMergePolicy, TestDocValuesScoring, TestCachingCollector, TestFieldType, TestDocIdsWriter, TestParallelReaderEmptyIndex, TestExitableDirectoryReader, TestField, TestTransactions, TestNotDocIdSet, TestRegExp, Test2BPositions, TestSortedSetSelector, TestSegmentMerger, TestConjunctions, TestMinimize, TestNRTCachingDirectory, TestIndexWriterWithThreads, TestStressAdvance, TestSearchForDuplicates, TestSimpleExplanationsWithFillerDocs, TestTwoPhaseCommitTool, TestMixedCodecs, TestMSBRadixSorter, TestLazyProxSkipping, TestFixedBitDocIdSet, TestPerSegmentDeletes, TestRateLimiter, TestLogMergePolicy, TestSortedSetDocValues, TestIndexOrDocValuesQuery, TestLRUQueryCache, TestWordlistLoader, TestParallelCompositeReader, TestTermQuery, TestRegexpRandom2, TestMultiPhraseEnum, TestDocumentWriter, TestNearSpansOrdered, TestStandardAnalyzer, TestSingleInstanceLockFactory, TestDemo, TestComplexExplanationsOfNonMatches, TestDirectory, TestCustomSearcherSort, TestBM25Similarity, TestCharArrayMap, TestMatchNoDocsQuery, Test2BBinaryDocValues, TestNot, TestFieldMaskingSpanQuery, TestPerFieldPostingsFormat2, TestMaxTermFrequency, TestMultiTermsEnum, Test2BDocs, TestStressIndexing2, TestBagOfPostings, TestDateTools, TestCharsRef, TestOneMergeWrappingMergePolicy, TestPersistentSnapshotDeletionPolicy, TestIndexWriter, TestMmapDirectory, TestFastCompressionMode, TestIndexWriterMerging, TestNumericRangeQuery64, TestPackedInts, TestGraphTokenizers, TestAddIndexes, TestShardSearching, TestIndexWriterExceptions, TestAtomicUpdate, TestSearchWithThreads, TestNeverDelete, TestLongPostings, TestRollingUpdates, TestIndexWriterUnicode, TestByteSlices, TestBufferedIndexInput, TestTermsEnum, TestFixedBitSet, TestTermsEnum2, TestFlex, TestUTF32ToUTF8, TestSpanExplanations, TestMultiPhraseQuery, TestDeterminism, TestMergeSchedulerExternal, TestTermVectorsWriter, TestCodecs, TestCharTermAttributeImpl, TestOmitPositions, TestThreadedForceMerge, TestIndexInput, TestDisjunctionMaxQuery, TestForceMergeForever, TestOmitTf, TestMultiFields, TestDocumentsWriterDeleteQueue, TestLiveFieldValues, TestSpanSearchEquivalence, TestConstantScoreQuery, TestElevationComparator, TestRecyclingIntBlockAllocator, TestIndexWriterConfig, TestSimilarity, TestSpanExplanationsOfNonMatches, TestVirtualMethod, TestSmallFloat, TestNumericTokenStream, TestSetOnce, TestFilterLeafReader, TestCachingTokenFilter, TestPriorityQueue, Test2BPostings, TestLucene62SegmentInfoFormat, TestGeoEncodingUtils, TestGeoUtils, TestDocIDMerger, TestDocInverterPerFieldErrorInfo, TestDocValues, TestFieldReuse, TestFilterCodecReader, TestFilterDirectoryReader, TestIndexSorting]
   [junit4]   2> NOTE: download the large Jenkins line-docs file by running 'ant get-jenkins-line-docs' in the lucene directory.
   [junit4]   2> NOTE: reproduce with: ant test  -Dtestcase=TestIndexSorting -Dtests.seed=F793A635E9E1F98D -Dtests.multiplier=2 -Dtests.nightly=true -Dtests.slow=true -Dtests.linedocsfile=/home/jenkins/jenkins-slave/workspace/Lucene-Solr-NightlyTests-6.x/test-data/enwiki.random.lines.txt -Dtests.locale=nl-NL -Dtests.timezone=America/Atka -Dtests.asserts=true -Dtests.file.encoding=ISO-8859-1
   [junit4] ERROR   0.00s J0 | TestIndexSorting (suite) <<<
   [junit4]    > Throwable #1: java.lang.Exception: Suite timeout exceeded (>= 7200000 msec).
   [junit4]    > at __randomizedtesting.SeedInfo.seed([F793A635E9E1F98D]:0)
   [junit4] Completed [456/456 (1!)] on J0 in 7220.19s, 22 tests, 2 errors <<< FAILURES!

[...truncated 74579 lines...]




---------------------------------------------------------------------
To unsubscribe, e-mail: [hidden email]
For additional commands, e-mail: [hidden email]
Loading...