[JENKINS] Lucene-Solr-NightlyTests-7.x - Build # 202 - Unstable

Previous Topic Next Topic
 
classic Classic list List threaded Threaded
2 messages Options
Reply | Threaded
Open this post in threaded view
|

[JENKINS] Lucene-Solr-NightlyTests-7.x - Build # 202 - Unstable

Apache Jenkins Server-2
Build: https://builds.apache.org/job/Lucene-Solr-NightlyTests-7.x/202/

3 tests failed.
FAILED:  org.apache.solr.handler.admin.SegmentsInfoRequestHandlerTest.testSegmentInfos

Error Message:


Stack Trace:
java.lang.AssertionError
        at __randomizedtesting.SeedInfo.seed([816D46DF52CEEB5A:CD3AD16098C2330A]:0)
        at org.apache.lucene.index.IndexWriter$ReaderPool.noDups(IndexWriter.java:867)
        at org.apache.lucene.index.IndexWriter$ReaderPool.get(IndexWriter.java:857)
        at org.apache.lucene.index.IndexWriter.numDeletesToMerge(IndexWriter.java:5235)
        at org.apache.lucene.index.LogMergePolicy.sizeDocs(LogMergePolicy.java:153)
        at org.apache.lucene.index.LogDocMergePolicy.size(LogDocMergePolicy.java:44)
        at org.apache.lucene.index.LogMergePolicy.findMerges(LogMergePolicy.java:469)
        at org.apache.solr.handler.admin.SegmentsInfoRequestHandler.getMergeCandidatesNames(SegmentsInfoRequestHandler.java:100)
        at org.apache.solr.handler.admin.SegmentsInfoRequestHandler.getSegmentsInfo(SegmentsInfoRequestHandler.java:59)
        at org.apache.solr.handler.admin.SegmentsInfoRequestHandler.handleRequestBody(SegmentsInfoRequestHandler.java:48)
        at org.apache.solr.handler.RequestHandlerBase.handleRequest(RequestHandlerBase.java:199)
        at org.apache.solr.core.SolrCore.execute(SolrCore.java:2508)
        at org.apache.solr.util.TestHarness.query(TestHarness.java:337)
        at org.apache.solr.util.TestHarness.query(TestHarness.java:319)
        at org.apache.solr.SolrTestCaseJ4.assertQ(SolrTestCaseJ4.java:890)
        at org.apache.solr.handler.admin.SegmentsInfoRequestHandlerTest.testSegmentInfos(SegmentsInfoRequestHandlerTest.java:61)
        at sun.reflect.NativeMethodAccessorImpl.invoke0(Native Method)
        at sun.reflect.NativeMethodAccessorImpl.invoke(NativeMethodAccessorImpl.java:62)
        at sun.reflect.DelegatingMethodAccessorImpl.invoke(DelegatingMethodAccessorImpl.java:43)
        at java.lang.reflect.Method.invoke(Method.java:498)
        at com.carrotsearch.randomizedtesting.RandomizedRunner.invoke(RandomizedRunner.java:1737)
        at com.carrotsearch.randomizedtesting.RandomizedRunner$8.evaluate(RandomizedRunner.java:934)
        at com.carrotsearch.randomizedtesting.RandomizedRunner$9.evaluate(RandomizedRunner.java:970)
        at com.carrotsearch.randomizedtesting.RandomizedRunner$10.evaluate(RandomizedRunner.java:984)
        at com.carrotsearch.randomizedtesting.rules.SystemPropertiesRestoreRule$1.evaluate(SystemPropertiesRestoreRule.java:57)
        at org.apache.lucene.util.TestRuleSetupTeardownChained$1.evaluate(TestRuleSetupTeardownChained.java:49)
        at org.apache.lucene.util.AbstractBeforeAfterRule$1.evaluate(AbstractBeforeAfterRule.java:45)
        at org.apache.lucene.util.TestRuleThreadAndTestName$1.evaluate(TestRuleThreadAndTestName.java:48)
        at org.apache.lucene.util.TestRuleIgnoreAfterMaxFailures$1.evaluate(TestRuleIgnoreAfterMaxFailures.java:64)
        at org.apache.lucene.util.TestRuleMarkFailure$1.evaluate(TestRuleMarkFailure.java:47)
        at com.carrotsearch.randomizedtesting.rules.StatementAdapter.evaluate(StatementAdapter.java:36)
        at com.carrotsearch.randomizedtesting.ThreadLeakControl$StatementRunner.run(ThreadLeakControl.java:368)
        at com.carrotsearch.randomizedtesting.ThreadLeakControl.forkTimeoutingTask(ThreadLeakControl.java:817)
        at com.carrotsearch.randomizedtesting.ThreadLeakControl$3.evaluate(ThreadLeakControl.java:468)
        at com.carrotsearch.randomizedtesting.RandomizedRunner.runSingleTest(RandomizedRunner.java:943)
        at com.carrotsearch.randomizedtesting.RandomizedRunner$5.evaluate(RandomizedRunner.java:829)
        at com.carrotsearch.randomizedtesting.RandomizedRunner$6.evaluate(RandomizedRunner.java:879)
        at com.carrotsearch.randomizedtesting.RandomizedRunner$7.evaluate(RandomizedRunner.java:890)
        at com.carrotsearch.randomizedtesting.rules.StatementAdapter.evaluate(StatementAdapter.java:36)
        at com.carrotsearch.randomizedtesting.rules.SystemPropertiesRestoreRule$1.evaluate(SystemPropertiesRestoreRule.java:57)
        at org.apache.lucene.util.AbstractBeforeAfterRule$1.evaluate(AbstractBeforeAfterRule.java:45)
        at com.carrotsearch.randomizedtesting.rules.StatementAdapter.evaluate(StatementAdapter.java:36)
        at org.apache.lucene.util.TestRuleStoreClassName$1.evaluate(TestRuleStoreClassName.java:41)
        at com.carrotsearch.randomizedtesting.rules.NoShadowingOrOverridesOnMethodsRule$1.evaluate(NoShadowingOrOverridesOnMethodsRule.java:40)
        at com.carrotsearch.randomizedtesting.rules.NoShadowingOrOverridesOnMethodsRule$1.evaluate(NoShadowingOrOverridesOnMethodsRule.java:40)
        at com.carrotsearch.randomizedtesting.rules.StatementAdapter.evaluate(StatementAdapter.java:36)
        at com.carrotsearch.randomizedtesting.rules.StatementAdapter.evaluate(StatementAdapter.java:36)
        at com.carrotsearch.randomizedtesting.rules.StatementAdapter.evaluate(StatementAdapter.java:36)
        at org.apache.lucene.util.TestRuleAssertionsRequired$1.evaluate(TestRuleAssertionsRequired.java:53)
        at org.apache.lucene.util.TestRuleMarkFailure$1.evaluate(TestRuleMarkFailure.java:47)
        at org.apache.lucene.util.TestRuleIgnoreAfterMaxFailures$1.evaluate(TestRuleIgnoreAfterMaxFailures.java:64)
        at org.apache.lucene.util.TestRuleIgnoreTestSuites$1.evaluate(TestRuleIgnoreTestSuites.java:54)
        at com.carrotsearch.randomizedtesting.rules.StatementAdapter.evaluate(StatementAdapter.java:36)
        at com.carrotsearch.randomizedtesting.ThreadLeakControl$StatementRunner.run(ThreadLeakControl.java:368)
        at java.lang.Thread.run(Thread.java:748)


FAILED:  org.apache.solr.handler.admin.SegmentsInfoRequestHandlerTest.testSegmentInfosData

Error Message:


Stack Trace:
java.lang.AssertionError
        at __randomizedtesting.SeedInfo.seed([816D46DF52CEEB5A:FDC46484E4265CC5]:0)
        at org.apache.lucene.index.IndexWriter$ReaderPool.noDups(IndexWriter.java:867)
        at org.apache.lucene.index.IndexWriter$ReaderPool.get(IndexWriter.java:857)
        at org.apache.lucene.index.IndexWriter.numDeletesToMerge(IndexWriter.java:5235)
        at org.apache.lucene.index.LogMergePolicy.sizeDocs(LogMergePolicy.java:153)
        at org.apache.lucene.index.LogDocMergePolicy.size(LogDocMergePolicy.java:44)
        at org.apache.lucene.index.LogMergePolicy.findMerges(LogMergePolicy.java:469)
        at org.apache.solr.handler.admin.SegmentsInfoRequestHandler.getMergeCandidatesNames(SegmentsInfoRequestHandler.java:100)
        at org.apache.solr.handler.admin.SegmentsInfoRequestHandler.getSegmentsInfo(SegmentsInfoRequestHandler.java:59)
        at org.apache.solr.handler.admin.SegmentsInfoRequestHandler.handleRequestBody(SegmentsInfoRequestHandler.java:48)
        at org.apache.solr.handler.RequestHandlerBase.handleRequest(RequestHandlerBase.java:199)
        at org.apache.solr.core.SolrCore.execute(SolrCore.java:2508)
        at org.apache.solr.util.TestHarness.query(TestHarness.java:337)
        at org.apache.solr.util.TestHarness.query(TestHarness.java:319)
        at org.apache.solr.SolrTestCaseJ4.assertQ(SolrTestCaseJ4.java:890)
        at org.apache.solr.handler.admin.SegmentsInfoRequestHandlerTest.testSegmentInfosData(SegmentsInfoRequestHandlerTest.java:75)
        at sun.reflect.NativeMethodAccessorImpl.invoke0(Native Method)
        at sun.reflect.NativeMethodAccessorImpl.invoke(NativeMethodAccessorImpl.java:62)
        at sun.reflect.DelegatingMethodAccessorImpl.invoke(DelegatingMethodAccessorImpl.java:43)
        at java.lang.reflect.Method.invoke(Method.java:498)
        at com.carrotsearch.randomizedtesting.RandomizedRunner.invoke(RandomizedRunner.java:1737)
        at com.carrotsearch.randomizedtesting.RandomizedRunner$8.evaluate(RandomizedRunner.java:934)
        at com.carrotsearch.randomizedtesting.RandomizedRunner$9.evaluate(RandomizedRunner.java:970)
        at com.carrotsearch.randomizedtesting.RandomizedRunner$10.evaluate(RandomizedRunner.java:984)
        at com.carrotsearch.randomizedtesting.rules.SystemPropertiesRestoreRule$1.evaluate(SystemPropertiesRestoreRule.java:57)
        at org.apache.lucene.util.TestRuleSetupTeardownChained$1.evaluate(TestRuleSetupTeardownChained.java:49)
        at org.apache.lucene.util.AbstractBeforeAfterRule$1.evaluate(AbstractBeforeAfterRule.java:45)
        at org.apache.lucene.util.TestRuleThreadAndTestName$1.evaluate(TestRuleThreadAndTestName.java:48)
        at org.apache.lucene.util.TestRuleIgnoreAfterMaxFailures$1.evaluate(TestRuleIgnoreAfterMaxFailures.java:64)
        at org.apache.lucene.util.TestRuleMarkFailure$1.evaluate(TestRuleMarkFailure.java:47)
        at com.carrotsearch.randomizedtesting.rules.StatementAdapter.evaluate(StatementAdapter.java:36)
        at com.carrotsearch.randomizedtesting.ThreadLeakControl$StatementRunner.run(ThreadLeakControl.java:368)
        at com.carrotsearch.randomizedtesting.ThreadLeakControl.forkTimeoutingTask(ThreadLeakControl.java:817)
        at com.carrotsearch.randomizedtesting.ThreadLeakControl$3.evaluate(ThreadLeakControl.java:468)
        at com.carrotsearch.randomizedtesting.RandomizedRunner.runSingleTest(RandomizedRunner.java:943)
        at com.carrotsearch.randomizedtesting.RandomizedRunner$5.evaluate(RandomizedRunner.java:829)
        at com.carrotsearch.randomizedtesting.RandomizedRunner$6.evaluate(RandomizedRunner.java:879)
        at com.carrotsearch.randomizedtesting.RandomizedRunner$7.evaluate(RandomizedRunner.java:890)
        at com.carrotsearch.randomizedtesting.rules.StatementAdapter.evaluate(StatementAdapter.java:36)
        at com.carrotsearch.randomizedtesting.rules.SystemPropertiesRestoreRule$1.evaluate(SystemPropertiesRestoreRule.java:57)
        at org.apache.lucene.util.AbstractBeforeAfterRule$1.evaluate(AbstractBeforeAfterRule.java:45)
        at com.carrotsearch.randomizedtesting.rules.StatementAdapter.evaluate(StatementAdapter.java:36)
        at org.apache.lucene.util.TestRuleStoreClassName$1.evaluate(TestRuleStoreClassName.java:41)
        at com.carrotsearch.randomizedtesting.rules.NoShadowingOrOverridesOnMethodsRule$1.evaluate(NoShadowingOrOverridesOnMethodsRule.java:40)
        at com.carrotsearch.randomizedtesting.rules.NoShadowingOrOverridesOnMethodsRule$1.evaluate(NoShadowingOrOverridesOnMethodsRule.java:40)
        at com.carrotsearch.randomizedtesting.rules.StatementAdapter.evaluate(StatementAdapter.java:36)
        at com.carrotsearch.randomizedtesting.rules.StatementAdapter.evaluate(StatementAdapter.java:36)
        at com.carrotsearch.randomizedtesting.rules.StatementAdapter.evaluate(StatementAdapter.java:36)
        at org.apache.lucene.util.TestRuleAssertionsRequired$1.evaluate(TestRuleAssertionsRequired.java:53)
        at org.apache.lucene.util.TestRuleMarkFailure$1.evaluate(TestRuleMarkFailure.java:47)
        at org.apache.lucene.util.TestRuleIgnoreAfterMaxFailures$1.evaluate(TestRuleIgnoreAfterMaxFailures.java:64)
        at org.apache.lucene.util.TestRuleIgnoreTestSuites$1.evaluate(TestRuleIgnoreTestSuites.java:54)
        at com.carrotsearch.randomizedtesting.rules.StatementAdapter.evaluate(StatementAdapter.java:36)
        at com.carrotsearch.randomizedtesting.ThreadLeakControl$StatementRunner.run(ThreadLeakControl.java:368)
        at java.lang.Thread.run(Thread.java:748)


FAILED:  org.apache.solr.handler.admin.SegmentsInfoRequestHandlerTest.testSegmentInfosVersion

Error Message:


Stack Trace:
java.lang.AssertionError
        at __randomizedtesting.SeedInfo.seed([816D46DF52CEEB5A:79B3D3372AA23A09]:0)
        at org.apache.lucene.index.IndexWriter$ReaderPool.noDups(IndexWriter.java:867)
        at org.apache.lucene.index.IndexWriter$ReaderPool.get(IndexWriter.java:857)
        at org.apache.lucene.index.IndexWriter.numDeletesToMerge(IndexWriter.java:5235)
        at org.apache.lucene.index.LogMergePolicy.sizeDocs(LogMergePolicy.java:153)
        at org.apache.lucene.index.LogDocMergePolicy.size(LogDocMergePolicy.java:44)
        at org.apache.lucene.index.LogMergePolicy.findMerges(LogMergePolicy.java:469)
        at org.apache.solr.handler.admin.SegmentsInfoRequestHandler.getMergeCandidatesNames(SegmentsInfoRequestHandler.java:100)
        at org.apache.solr.handler.admin.SegmentsInfoRequestHandler.getSegmentsInfo(SegmentsInfoRequestHandler.java:59)
        at org.apache.solr.handler.admin.SegmentsInfoRequestHandler.handleRequestBody(SegmentsInfoRequestHandler.java:48)
        at org.apache.solr.handler.RequestHandlerBase.handleRequest(RequestHandlerBase.java:199)
        at org.apache.solr.core.SolrCore.execute(SolrCore.java:2508)
        at org.apache.solr.util.TestHarness.query(TestHarness.java:337)
        at org.apache.solr.util.TestHarness.query(TestHarness.java:319)
        at org.apache.solr.SolrTestCaseJ4.assertQ(SolrTestCaseJ4.java:890)
        at org.apache.solr.handler.admin.SegmentsInfoRequestHandlerTest.testSegmentInfosVersion(SegmentsInfoRequestHandlerTest.java:68)
        at sun.reflect.NativeMethodAccessorImpl.invoke0(Native Method)
        at sun.reflect.NativeMethodAccessorImpl.invoke(NativeMethodAccessorImpl.java:62)
        at sun.reflect.DelegatingMethodAccessorImpl.invoke(DelegatingMethodAccessorImpl.java:43)
        at java.lang.reflect.Method.invoke(Method.java:498)
        at com.carrotsearch.randomizedtesting.RandomizedRunner.invoke(RandomizedRunner.java:1737)
        at com.carrotsearch.randomizedtesting.RandomizedRunner$8.evaluate(RandomizedRunner.java:934)
        at com.carrotsearch.randomizedtesting.RandomizedRunner$9.evaluate(RandomizedRunner.java:970)
        at com.carrotsearch.randomizedtesting.RandomizedRunner$10.evaluate(RandomizedRunner.java:984)
        at com.carrotsearch.randomizedtesting.rules.SystemPropertiesRestoreRule$1.evaluate(SystemPropertiesRestoreRule.java:57)
        at org.apache.lucene.util.TestRuleSetupTeardownChained$1.evaluate(TestRuleSetupTeardownChained.java:49)
        at org.apache.lucene.util.AbstractBeforeAfterRule$1.evaluate(AbstractBeforeAfterRule.java:45)
        at org.apache.lucene.util.TestRuleThreadAndTestName$1.evaluate(TestRuleThreadAndTestName.java:48)
        at org.apache.lucene.util.TestRuleIgnoreAfterMaxFailures$1.evaluate(TestRuleIgnoreAfterMaxFailures.java:64)
        at org.apache.lucene.util.TestRuleMarkFailure$1.evaluate(TestRuleMarkFailure.java:47)
        at com.carrotsearch.randomizedtesting.rules.StatementAdapter.evaluate(StatementAdapter.java:36)
        at com.carrotsearch.randomizedtesting.ThreadLeakControl$StatementRunner.run(ThreadLeakControl.java:368)
        at com.carrotsearch.randomizedtesting.ThreadLeakControl.forkTimeoutingTask(ThreadLeakControl.java:817)
        at com.carrotsearch.randomizedtesting.ThreadLeakControl$3.evaluate(ThreadLeakControl.java:468)
        at com.carrotsearch.randomizedtesting.RandomizedRunner.runSingleTest(RandomizedRunner.java:943)
        at com.carrotsearch.randomizedtesting.RandomizedRunner$5.evaluate(RandomizedRunner.java:829)
        at com.carrotsearch.randomizedtesting.RandomizedRunner$6.evaluate(RandomizedRunner.java:879)
        at com.carrotsearch.randomizedtesting.RandomizedRunner$7.evaluate(RandomizedRunner.java:890)
        at com.carrotsearch.randomizedtesting.rules.StatementAdapter.evaluate(StatementAdapter.java:36)
        at com.carrotsearch.randomizedtesting.rules.SystemPropertiesRestoreRule$1.evaluate(SystemPropertiesRestoreRule.java:57)
        at org.apache.lucene.util.AbstractBeforeAfterRule$1.evaluate(AbstractBeforeAfterRule.java:45)
        at com.carrotsearch.randomizedtesting.rules.StatementAdapter.evaluate(StatementAdapter.java:36)
        at org.apache.lucene.util.TestRuleStoreClassName$1.evaluate(TestRuleStoreClassName.java:41)
        at com.carrotsearch.randomizedtesting.rules.NoShadowingOrOverridesOnMethodsRule$1.evaluate(NoShadowingOrOverridesOnMethodsRule.java:40)
        at com.carrotsearch.randomizedtesting.rules.NoShadowingOrOverridesOnMethodsRule$1.evaluate(NoShadowingOrOverridesOnMethodsRule.java:40)
        at com.carrotsearch.randomizedtesting.rules.StatementAdapter.evaluate(StatementAdapter.java:36)
        at com.carrotsearch.randomizedtesting.rules.StatementAdapter.evaluate(StatementAdapter.java:36)
        at com.carrotsearch.randomizedtesting.rules.StatementAdapter.evaluate(StatementAdapter.java:36)
        at org.apache.lucene.util.TestRuleAssertionsRequired$1.evaluate(TestRuleAssertionsRequired.java:53)
        at org.apache.lucene.util.TestRuleMarkFailure$1.evaluate(TestRuleMarkFailure.java:47)
        at org.apache.lucene.util.TestRuleIgnoreAfterMaxFailures$1.evaluate(TestRuleIgnoreAfterMaxFailures.java:64)
        at org.apache.lucene.util.TestRuleIgnoreTestSuites$1.evaluate(TestRuleIgnoreTestSuites.java:54)
        at com.carrotsearch.randomizedtesting.rules.StatementAdapter.evaluate(StatementAdapter.java:36)
        at com.carrotsearch.randomizedtesting.ThreadLeakControl$StatementRunner.run(ThreadLeakControl.java:368)
        at java.lang.Thread.run(Thread.java:748)




Build Log:
[...truncated 15175 lines...]
   [junit4] Suite: org.apache.solr.handler.admin.SegmentsInfoRequestHandlerTest
   [junit4]   2> 4170284 INFO  (SUITE-SegmentsInfoRequestHandlerTest-seed#[816D46DF52CEEB5A]-worker) [    ] o.a.s.SolrTestCaseJ4 SecureRandom sanity checks: test.solr.allowed.securerandom=null & java.security.egd=file:/dev/./urandom
   [junit4]   2> Creating dataDir: /x1/jenkins/jenkins-slave/workspace/Lucene-Solr-NightlyTests-7.x/checkout/solr/build/solr-core/test/J1/temp/solr.handler.admin.SegmentsInfoRequestHandlerTest_816D46DF52CEEB5A-001/init-core-data-001
   [junit4]   2> 4170285 WARN  (SUITE-SegmentsInfoRequestHandlerTest-seed#[816D46DF52CEEB5A]-worker) [    ] o.a.s.SolrTestCaseJ4 startTrackingSearchers: numOpens=1 numCloses=1
   [junit4]   2> 4170285 INFO  (SUITE-SegmentsInfoRequestHandlerTest-seed#[816D46DF52CEEB5A]-worker) [    ] o.a.s.SolrTestCaseJ4 Using PointFields (NUMERIC_POINTS_SYSPROP=true) w/NUMERIC_DOCVALUES_SYSPROP=true
   [junit4]   2> 4170287 INFO  (SUITE-SegmentsInfoRequestHandlerTest-seed#[816D46DF52CEEB5A]-worker) [    ] o.a.s.SolrTestCaseJ4 Randomized ssl (true) and clientAuth (true) via: @org.apache.solr.util.RandomizeSSL(reason=, ssl=NaN, value=NaN, clientAuth=NaN)
   [junit4]   2> 4170288 INFO  (SUITE-SegmentsInfoRequestHandlerTest-seed#[816D46DF52CEEB5A]-worker) [    ] o.a.s.SolrTestCaseJ4 ####initCore
   [junit4]   2> 4170288 INFO  (SUITE-SegmentsInfoRequestHandlerTest-seed#[816D46DF52CEEB5A]-worker) [    ] o.a.s.c.SolrResourceLoader [null] Added 2 libs to classloader, from paths: [/x1/jenkins/jenkins-slave/workspace/Lucene-Solr-NightlyTests-7.x/checkout/solr/core/src/test-files/solr/collection1/lib, /x1/jenkins/jenkins-slave/workspace/Lucene-Solr-NightlyTests-7.x/checkout/solr/core/src/test-files/solr/collection1/lib/classes]
   [junit4]   2> 4170321 INFO  (SUITE-SegmentsInfoRequestHandlerTest-seed#[816D46DF52CEEB5A]-worker) [    ] o.a.s.c.SolrConfig Using Lucene MatchVersion: 7.4.0
   [junit4]   2> 4170349 INFO  (SUITE-SegmentsInfoRequestHandlerTest-seed#[816D46DF52CEEB5A]-worker) [    ] o.a.s.s.IndexSchema [null] Schema name=test
   [junit4]   2> 4170503 WARN  (SUITE-SegmentsInfoRequestHandlerTest-seed#[816D46DF52CEEB5A]-worker) [    ] o.a.s.s.IndexSchema Field text is not multivalued and destination for multiple copyFields (2)
   [junit4]   2> 4170503 INFO  (SUITE-SegmentsInfoRequestHandlerTest-seed#[816D46DF52CEEB5A]-worker) [    ] o.a.s.s.IndexSchema Loaded schema test/1.4 with uniqueid field id
   [junit4]   2> 4170558 INFO  (SUITE-SegmentsInfoRequestHandlerTest-seed#[816D46DF52CEEB5A]-worker) [    ] o.a.s.m.r.SolrJmxReporter JMX monitoring for 'solr.node' (registry 'solr.node') enabled at server: com.sun.jmx.mbeanserver.JmxMBeanServer@be75487
   [junit4]   2> 4170570 INFO  (SUITE-SegmentsInfoRequestHandlerTest-seed#[816D46DF52CEEB5A]-worker) [    ] o.a.s.m.r.SolrJmxReporter JMX monitoring for 'solr.jvm' (registry 'solr.jvm') enabled at server: com.sun.jmx.mbeanserver.JmxMBeanServer@be75487
   [junit4]   2> 4170570 INFO  (SUITE-SegmentsInfoRequestHandlerTest-seed#[816D46DF52CEEB5A]-worker) [    ] o.a.s.m.r.SolrJmxReporter JMX monitoring for 'solr.jetty' (registry 'solr.jetty') enabled at server: com.sun.jmx.mbeanserver.JmxMBeanServer@be75487
   [junit4]   2> 4170572 INFO  (coreLoadExecutor-11631-thread-1) [    ] o.a.s.c.TransientSolrCoreCacheDefault Allocating transient cache for 2147483647 transient cores
   [junit4]   2> 4170572 INFO  (coreLoadExecutor-11631-thread-1) [    x:collection1] o.a.s.c.SolrResourceLoader [null] Added 2 libs to classloader, from paths: [/x1/jenkins/jenkins-slave/workspace/Lucene-Solr-NightlyTests-7.x/checkout/solr/core/src/test-files/solr/collection1/lib, /x1/jenkins/jenkins-slave/workspace/Lucene-Solr-NightlyTests-7.x/checkout/solr/core/src/test-files/solr/collection1/lib/classes]
   [junit4]   2> 4170641 INFO  (coreLoadExecutor-11631-thread-1) [    x:collection1] o.a.s.c.SolrConfig Using Lucene MatchVersion: 7.4.0
   [junit4]   2> 4170665 INFO  (coreLoadExecutor-11631-thread-1) [    x:collection1] o.a.s.s.IndexSchema [collection1] Schema name=test
   [junit4]   2> 4170779 WARN  (coreLoadExecutor-11631-thread-1) [    x:collection1] o.a.s.s.IndexSchema Field text is not multivalued and destination for multiple copyFields (2)
   [junit4]   2> 4170780 INFO  (coreLoadExecutor-11631-thread-1) [    x:collection1] o.a.s.s.IndexSchema Loaded schema test/1.4 with uniqueid field id
   [junit4]   2> 4170798 INFO  (coreLoadExecutor-11631-thread-1) [    x:collection1] o.a.s.c.CoreContainer Creating SolrCore 'collection1' using configuration from instancedir /x1/jenkins/jenkins-slave/workspace/Lucene-Solr-NightlyTests-7.x/checkout/solr/core/src/test-files/solr/collection1, trusted=true
   [junit4]   2> 4170799 INFO  (coreLoadExecutor-11631-thread-1) [    x:collection1] o.a.s.m.r.SolrJmxReporter JMX monitoring for 'solr.core.collection1' (registry 'solr.core.collection1') enabled at server: com.sun.jmx.mbeanserver.JmxMBeanServer@be75487
   [junit4]   2> 4170799 INFO  (coreLoadExecutor-11631-thread-1) [    x:collection1] o.a.s.c.SolrCore solr.RecoveryStrategy.Builder
   [junit4]   2> 4170799 INFO  (coreLoadExecutor-11631-thread-1) [    x:collection1] o.a.s.c.SolrCore [[collection1] ] Opening new SolrCore at [/x1/jenkins/jenkins-slave/workspace/Lucene-Solr-NightlyTests-7.x/checkout/solr/core/src/test-files/solr/collection1], dataDir=[/x1/jenkins/jenkins-slave/workspace/Lucene-Solr-NightlyTests-7.x/checkout/solr/build/solr-core/test/J1/temp/solr.handler.admin.SegmentsInfoRequestHandlerTest_816D46DF52CEEB5A-001/init-core-data-001/]
   [junit4]   2> 4170869 INFO  (coreLoadExecutor-11631-thread-1) [    x:collection1] o.a.s.u.CommitTracker Hard AutoCommit: disabled
   [junit4]   2> 4170869 INFO  (coreLoadExecutor-11631-thread-1) [    x:collection1] o.a.s.u.CommitTracker Soft AutoCommit: disabled
   [junit4]   2> 4170870 INFO  (coreLoadExecutor-11631-thread-1) [    x:collection1] o.a.s.s.SolrIndexSearcher Opening [Searcher@545291d[collection1] main]
   [junit4]   2> 4170871 INFO  (coreLoadExecutor-11631-thread-1) [    x:collection1] o.a.s.h.c.SpellCheckComponent Initializing spell checkers
   [junit4]   2> 4171114 INFO  (coreLoadExecutor-11631-thread-1) [    x:collection1] o.a.s.s.DirectSolrSpellChecker init: {name=direct,classname=DirectSolrSpellChecker,field=lowerfilt,minQueryLength=3}
   [junit4]   2> 4171145 INFO  (coreLoadExecutor-11631-thread-1) [    x:collection1] o.a.s.h.ReplicationHandler Commits will be reserved for 10000ms.
   [junit4]   2> 4171145 INFO  (searcherExecutor-11632-thread-1-processing-x:collection1) [    x:collection1] o.a.s.h.c.SpellCheckComponent Loading spell index for spellchecker: default
   [junit4]   2> 4171145 INFO  (searcherExecutor-11632-thread-1-processing-x:collection1) [    x:collection1] o.a.s.h.c.SpellCheckComponent Loading spell index for spellchecker: direct
   [junit4]   2> 4171145 INFO  (searcherExecutor-11632-thread-1-processing-x:collection1) [    x:collection1] o.a.s.h.c.SpellCheckComponent Loading spell index for spellchecker: wordbreak
   [junit4]   2> 4171145 INFO  (searcherExecutor-11632-thread-1-processing-x:collection1) [    x:collection1] o.a.s.h.c.SpellCheckComponent Loading spell index for spellchecker: multipleFields
   [junit4]   2> 4171146 INFO  (searcherExecutor-11632-thread-1-processing-x:collection1) [    x:collection1] o.a.s.h.c.SpellCheckComponent Loading spell index for spellchecker: jarowinkler
   [junit4]   2> 4171146 INFO  (searcherExecutor-11632-thread-1-processing-x:collection1) [    x:collection1] o.a.s.h.c.SpellCheckComponent Loading spell index for spellchecker: external
   [junit4]   2> 4171146 INFO  (searcherExecutor-11632-thread-1-processing-x:collection1) [    x:collection1] o.a.s.h.c.SpellCheckComponent Loading spell index for spellchecker: freq
   [junit4]   2> 4171146 INFO  (searcherExecutor-11632-thread-1-processing-x:collection1) [    x:collection1] o.a.s.h.c.SpellCheckComponent Loading spell index for spellchecker: fqcn
   [junit4]   2> 4171147 INFO  (searcherExecutor-11632-thread-1-processing-x:collection1) [    x:collection1] o.a.s.h.c.SpellCheckComponent Loading spell index for spellchecker: perDict
   [junit4]   2> 4171147 INFO  (SUITE-SegmentsInfoRequestHandlerTest-seed#[816D46DF52CEEB5A]-worker) [    ] o.a.s.SolrTestCaseJ4 ####initCore end
   [junit4]   2> 4171148 INFO  (searcherExecutor-11632-thread-1-processing-x:collection1) [    x:collection1] o.a.s.c.SolrCore [collection1] Registered new searcher Searcher@545291d[collection1] main{ExitableDirectoryReader(UninvertingDirectoryReader())}
   [junit4]   2> 4171148 INFO  (SUITE-SegmentsInfoRequestHandlerTest-seed#[816D46DF52CEEB5A]-worker) [    ] o.a.s.u.p.LogUpdateProcessorFactory [collection1]  webapp=null path=null params={}{add=[SOLR1000]} 0 0
   [junit4]   2> 4171150 INFO  (SUITE-SegmentsInfoRequestHandlerTest-seed#[816D46DF52CEEB5A]-worker) [    ] o.a.s.u.p.LogUpdateProcessorFactory [collection1]  webapp=null path=null params={}{add=[SOLR1001]} 0 0
   [junit4]   2> 4171150 INFO  (SUITE-SegmentsInfoRequestHandlerTest-seed#[816D46DF52CEEB5A]-worker) [    ] o.a.s.u.p.LogUpdateProcessorFactory [collection1]  webapp=null path=null params={}{add=[SOLR1002]} 0 0
   [junit4]   2> 4171151 INFO  (SUITE-SegmentsInfoRequestHandlerTest-seed#[816D46DF52CEEB5A]-worker) [    ] o.a.s.u.p.LogUpdateProcessorFactory [collection1]  webapp=null path=null params={}{add=[SOLR1003]} 0 0
   [junit4]   2> 4171151 INFO  (SUITE-SegmentsInfoRequestHandlerTest-seed#[816D46DF52CEEB5A]-worker) [    ] o.a.s.u.p.LogUpdateProcessorFactory [collection1]  webapp=null path=null params={}{add=[SOLR1004]} 0 0
   [junit4]   2> 4171151 INFO  (SUITE-SegmentsInfoRequestHandlerTest-seed#[816D46DF52CEEB5A]-worker) [    ] o.a.s.u.p.LogUpdateProcessorFactory [collection1]  webapp=null path=null params={}{delete=[SOLR1000]} 0 0
   [junit4]   2> 4171151 INFO  (SUITE-SegmentsInfoRequestHandlerTest-seed#[816D46DF52CEEB5A]-worker) [    ] o.a.s.u.DirectUpdateHandler2 start commit{,optimize=false,openSearcher=true,waitSearcher=true,expungeDeletes=false,softCommit=false,prepareCommit=false}
   [junit4]   2> 4171152 INFO  (SUITE-SegmentsInfoRequestHandlerTest-seed#[816D46DF52CEEB5A]-worker) [    ] o.a.s.u.SolrIndexWriter Calling setCommitData with IW:org.apache.solr.update.SolrIndexWriter@34e618ca commitCommandVersion:0
   [junit4]   2> 4171153 INFO  (SUITE-SegmentsInfoRequestHandlerTest-seed#[816D46DF52CEEB5A]-worker) [    ] o.a.s.s.SolrIndexSearcher Opening [Searcher@3ca24189[collection1] main]
   [junit4]   2> 4171153 INFO  (SUITE-SegmentsInfoRequestHandlerTest-seed#[816D46DF52CEEB5A]-worker) [    ] o.a.s.u.DirectUpdateHandler2 end_commit_flush
   [junit4]   2> 4171155 INFO  (searcherExecutor-11632-thread-1) [    ] o.a.s.c.SolrCore [collection1] Registered new searcher Searcher@3ca24189[collection1] main{ExitableDirectoryReader(UninvertingDirectoryReader(Uninverting(_0(7.4.0):C5/1:delGen=1)))}
   [junit4]   2> 4171155 INFO  (SUITE-SegmentsInfoRequestHandlerTest-seed#[816D46DF52CEEB5A]-worker) [    ] o.a.s.u.p.LogUpdateProcessorFactory [collection1]  webapp=null path=null params={}{commit=} 0 3
   [junit4]   2> 4171155 INFO  (SUITE-SegmentsInfoRequestHandlerTest-seed#[816D46DF52CEEB5A]-worker) [    ] o.a.s.u.p.LogUpdateProcessorFactory [collection1]  webapp=null path=null params={}{add=[SOLR2000]} 0 0
   [junit4]   2> 4171156 INFO  (SUITE-SegmentsInfoRequestHandlerTest-seed#[816D46DF52CEEB5A]-worker) [    ] o.a.s.u.p.LogUpdateProcessorFactory [collection1]  webapp=null path=null params={}{add=[SOLR2001]} 0 0
   [junit4]   2> 4171156 INFO  (SUITE-SegmentsInfoRequestHandlerTest-seed#[816D46DF52CEEB5A]-worker) [    ] o.a.s.u.p.LogUpdateProcessorFactory [collection1]  webapp=null path=null params={}{add=[SOLR2002]} 0 0
   [junit4]   2> 4171156 INFO  (SUITE-SegmentsInfoRequestHandlerTest-seed#[816D46DF52CEEB5A]-worker) [    ] o.a.s.u.p.LogUpdateProcessorFactory [collection1]  webapp=null path=null params={}{add=[SOLR2003]} 0 0
   [junit4]   2> 4171156 INFO  (SUITE-SegmentsInfoRequestHandlerTest-seed#[816D46DF52CEEB5A]-worker) [    ] o.a.s.u.p.LogUpdateProcessorFactory [collection1]  webapp=null path=null params={}{add=[SOLR2004]} 0 0
   [junit4]   2> 4171157 INFO  (SUITE-SegmentsInfoRequestHandlerTest-seed#[816D46DF52CEEB5A]-worker) [    ] o.a.s.u.DirectUpdateHandler2 start commit{,optimize=false,openSearcher=true,waitSearcher=true,expungeDeletes=false,softCommit=false,prepareCommit=false}
   [junit4]   2> 4171157 INFO  (SUITE-SegmentsInfoRequestHandlerTest-seed#[816D46DF52CEEB5A]-worker) [    ] o.a.s.u.SolrIndexWriter Calling setCommitData with IW:org.apache.solr.update.SolrIndexWriter@34e618ca commitCommandVersion:0
   [junit4]   2> 4171157 INFO  (SUITE-SegmentsInfoRequestHandlerTest-seed#[816D46DF52CEEB5A]-worker) [    ] o.a.s.s.SolrIndexSearcher Opening [Searcher@19807bab[collection1] main]
   [junit4]   2> 4171158 INFO  (SUITE-SegmentsInfoRequestHandlerTest-seed#[816D46DF52CEEB5A]-worker) [    ] o.a.s.u.DirectUpdateHandler2 end_commit_flush
   [junit4]   2> 4171159 INFO  (searcherExecutor-11632-thread-1) [    ] o.a.s.c.SolrCore [collection1] Registered new searcher Searcher@19807bab[collection1] main{ExitableDirectoryReader(UninvertingDirectoryReader(Uninverting(_0(7.4.0):C5/1:delGen=1) Uninverting(_1(7.4.0):C5)))}
   [junit4]   2> 4171159 INFO  (SUITE-SegmentsInfoRequestHandlerTest-seed#[816D46DF52CEEB5A]-worker) [    ] o.a.s.u.p.LogUpdateProcessorFactory [collection1]  webapp=null path=null params={}{commit=} 0 2
   [junit4]   2> 4171164 INFO  (TEST-SegmentsInfoRequestHandlerTest.testSegmentInfos-seed#[816D46DF52CEEB5A]) [    ] o.a.s.SolrTestCaseJ4 ###Starting testSegmentInfos
   [junit4]   2> 4171165 INFO  (TEST-SegmentsInfoRequestHandlerTest.testSegmentInfos-seed#[816D46DF52CEEB5A]) [    ] o.a.s.SolrTestCaseJ4 ###Ending testSegmentInfos
   [junit4]   2> NOTE: download the large Jenkins line-docs file by running 'ant get-jenkins-line-docs' in the lucene directory.
   [junit4]   2> NOTE: reproduce with: ant test  -Dtestcase=SegmentsInfoRequestHandlerTest -Dtests.method=testSegmentInfos -Dtests.seed=816D46DF52CEEB5A -Dtests.multiplier=2 -Dtests.nightly=true -Dtests.slow=true -Dtests.linedocsfile=/home/jenkins/jenkins-slave/workspace/Lucene-Solr-NightlyTests-7.x/test-data/enwiki.random.lines.txt -Dtests.locale=ja-JP-u-ca-japanese-x-lvariant-JP -Dtests.timezone=Pacific/Norfolk -Dtests.asserts=true -Dtests.file.encoding=US-ASCII
   [junit4] FAILURE 0.01s J1 | SegmentsInfoRequestHandlerTest.testSegmentInfos <<<
   [junit4]    > Throwable #1: java.lang.AssertionError
   [junit4]    > at __randomizedtesting.SeedInfo.seed([816D46DF52CEEB5A:CD3AD16098C2330A]:0)
   [junit4]    > at org.apache.lucene.index.IndexWriter$ReaderPool.noDups(IndexWriter.java:867)
   [junit4]    > at org.apache.lucene.index.IndexWriter$ReaderPool.get(IndexWriter.java:857)
   [junit4]    > at org.apache.lucene.index.IndexWriter.numDeletesToMerge(IndexWriter.java:5235)
   [junit4]    > at org.apache.lucene.index.LogMergePolicy.sizeDocs(LogMergePolicy.java:153)
   [junit4]    > at org.apache.lucene.index.LogDocMergePolicy.size(LogDocMergePolicy.java:44)
   [junit4]    > at org.apache.lucene.index.LogMergePolicy.findMerges(LogMergePolicy.java:469)
   [junit4]    > at org.apache.solr.handler.admin.SegmentsInfoRequestHandler.getMergeCandidatesNames(SegmentsInfoRequestHandler.java:100)
   [junit4]    > at org.apache.solr.handler.admin.SegmentsInfoRequestHandler.getSegmentsInfo(SegmentsInfoRequestHandler.java:59)
   [junit4]    > at org.apache.solr.handler.admin.SegmentsInfoRequestHandler.handleRequestBody(SegmentsInfoRequestHandler.java:48)
   [junit4]    > at org.apache.solr.handler.RequestHandlerBase.handleRequest(RequestHandlerBase.java:199)
   [junit4]    > at org.apache.solr.core.SolrCore.execute(SolrCore.java:2508)
   [junit4]    > at org.apache.solr.util.TestHarness.query(TestHarness.java:337)
   [junit4]    > at org.apache.solr.util.TestHarness.query(TestHarness.java:319)
   [junit4]    > at org.apache.solr.SolrTestCaseJ4.assertQ(SolrTestCaseJ4.java:890)
   [junit4]    > at org.apache.solr.handler.admin.SegmentsInfoRequestHandlerTest.testSegmentInfos(SegmentsInfoRequestHandlerTest.java:61)
   [junit4]    > at java.lang.Thread.run(Thread.java:748)
   [junit4]   2> 4171171 INFO  (TEST-SegmentsInfoRequestHandlerTest.testSegmentInfosData-seed#[816D46DF52CEEB5A]) [    ] o.a.s.SolrTestCaseJ4 ###Starting testSegmentInfosData
   [junit4]   2> 4171172 INFO  (TEST-SegmentsInfoRequestHandlerTest.testSegmentInfosData-seed#[816D46DF52CEEB5A]) [    ] o.a.s.SolrTestCaseJ4 ###Ending testSegmentInfosData
   [junit4]   2> NOTE: download the large Jenkins line-docs file by running 'ant get-jenkins-line-docs' in the lucene directory.
   [junit4]   2> NOTE: reproduce with: ant test  -Dtestcase=SegmentsInfoRequestHandlerTest -Dtests.method=testSegmentInfosData -Dtests.seed=816D46DF52CEEB5A -Dtests.multiplier=2 -Dtests.nightly=true -Dtests.slow=true -Dtests.linedocsfile=/home/jenkins/jenkins-slave/workspace/Lucene-Solr-NightlyTests-7.x/test-data/enwiki.random.lines.txt -Dtests.locale=ja-JP-u-ca-japanese-x-lvariant-JP -Dtests.timezone=Pacific/Norfolk -Dtests.asserts=true -Dtests.file.encoding=US-ASCII
   [junit4] FAILURE 0.01s J1 | SegmentsInfoRequestHandlerTest.testSegmentInfosData <<<
   [junit4]    > Throwable #1: java.lang.AssertionError
   [junit4]    > at __randomizedtesting.SeedInfo.seed([816D46DF52CEEB5A:FDC46484E4265CC5]:0)
   [junit4]    > at org.apache.lucene.index.IndexWriter$ReaderPool.noDups(IndexWriter.java:867)
   [junit4]    > at org.apache.lucene.index.IndexWriter$ReaderPool.get(IndexWriter.java:857)
   [junit4]    > at org.apache.lucene.index.IndexWriter.numDeletesToMerge(IndexWriter.java:5235)
   [junit4]    > at org.apache.lucene.index.LogMergePolicy.sizeDocs(LogMergePolicy.java:153)
   [junit4]    > at org.apache.lucene.index.LogDocMergePolicy.size(LogDocMergePolicy.java:44)
   [junit4]    > at org.apache.lucene.index.LogMergePolicy.findMerges(LogMergePolicy.java:469)
   [junit4]    > at org.apache.solr.handler.admin.SegmentsInfoRequestHandler.getMergeCandidatesNames(SegmentsInfoRequestHandler.java:100)
   [junit4]    > at org.apache.solr.handler.admin.SegmentsInfoRequestHandler.getSegmentsInfo(SegmentsInfoRequestHandler.java:59)
   [junit4]    > at org.apache.solr.handler.admin.SegmentsInfoRequestHandler.handleRequestBody(SegmentsInfoRequestHandler.java:48)
   [junit4]    > at org.apache.solr.handler.RequestHandlerBase.handleRequest(RequestHandlerBase.java:199)
   [junit4]    > at org.apache.solr.core.SolrCore.execute(SolrCore.java:2508)
   [junit4]    > at org.apache.solr.util.TestHarness.query(TestHarness.java:337)
   [junit4]    > at org.apache.solr.util.TestHarness.query(TestHarness.java:319)
   [junit4]    > at org.apache.solr.SolrTestCaseJ4.assertQ(SolrTestCaseJ4.java:890)
   [junit4]    > at org.apache.solr.handler.admin.SegmentsInfoRequestHandlerTest.testSegmentInfosData(SegmentsInfoRequestHandlerTest.java:75)
   [junit4]    > at java.lang.Thread.run(Thread.java:748)
   [junit4]   2> 4171180 INFO  (TEST-SegmentsInfoRequestHandlerTest.testSegmentInfosVersion-seed#[816D46DF52CEEB5A]) [    ] o.a.s.SolrTestCaseJ4 ###Starting testSegmentInfosVersion
   [junit4]   2> 4171181 INFO  (TEST-SegmentsInfoRequestHandlerTest.testSegmentInfosVersion-seed#[816D46DF52CEEB5A]) [    ] o.a.s.SolrTestCaseJ4 ###Ending testSegmentInfosVersion
   [junit4]   2> NOTE: download the large Jenkins line-docs file by running 'ant get-jenkins-line-docs' in the lucene directory.
   [junit4]   2> NOTE: reproduce with: ant test  -Dtestcase=SegmentsInfoRequestHandlerTest -Dtests.method=testSegmentInfosVersion -Dtests.seed=816D46DF52CEEB5A -Dtests.multiplier=2 -Dtests.nightly=true -Dtests.slow=true -Dtests.linedocsfile=/home/jenkins/jenkins-slave/workspace/Lucene-Solr-NightlyTests-7.x/test-data/enwiki.random.lines.txt -Dtests.locale=ja-JP-u-ca-japanese-x-lvariant-JP -Dtests.timezone=Pacific/Norfolk -Dtests.asserts=true -Dtests.file.encoding=US-ASCII
   [junit4] FAILURE 0.01s J1 | SegmentsInfoRequestHandlerTest.testSegmentInfosVersion <<<
   [junit4]    > Throwable #1: java.lang.AssertionError
   [junit4]    > at __randomizedtesting.SeedInfo.seed([816D46DF52CEEB5A:79B3D3372AA23A09]:0)
   [junit4]    > at org.apache.lucene.index.IndexWriter$ReaderPool.noDups(IndexWriter.java:867)
   [junit4]    > at org.apache.lucene.index.IndexWriter$ReaderPool.get(IndexWriter.java:857)
   [junit4]    > at org.apache.lucene.index.IndexWriter.numDeletesToMerge(IndexWriter.java:5235)
   [junit4]    > at org.apache.lucene.index.LogMergePolicy.sizeDocs(LogMergePolicy.java:153)
   [junit4]    > at org.apache.lucene.index.LogDocMergePolicy.size(LogDocMergePolicy.java:44)
   [junit4]    > at org.apache.lucene.index.LogMergePolicy.findMerges(LogMergePolicy.java:469)
   [junit4]    > at org.apache.solr.handler.admin.SegmentsInfoRequestHandler.getMergeCandidatesNames(SegmentsInfoRequestHandler.java:100)
   [junit4]    > at org.apache.solr.handler.admin.SegmentsInfoRequestHandler.getSegmentsInfo(SegmentsInfoRequestHandler.java:59)
   [junit4]    > at org.apache.solr.handler.admin.SegmentsInfoRequestHandler.handleRequestBody(SegmentsInfoRequestHandler.java:48)
   [junit4]    > at org.apache.solr.handler.RequestHandlerBase.handleRequest(RequestHandlerBase.java:199)
   [junit4]    > at org.apache.solr.core.SolrCore.execute(SolrCore.java:2508)
   [junit4]    > at org.apache.solr.util.TestHarness.query(TestHarness.java:337)
   [junit4]    > at org.apache.solr.util.TestHarness.query(TestHarness.java:319)
   [junit4]    > at org.apache.solr.SolrTestCaseJ4.assertQ(SolrTestCaseJ4.java:890)
   [junit4]    > at org.apache.solr.handler.admin.SegmentsInfoRequestHandlerTest.testSegmentInfosVersion(SegmentsInfoRequestHandlerTest.java:68)
   [junit4]    > at java.lang.Thread.run(Thread.java:748)
   [junit4]   2> 4171182 INFO  (SUITE-SegmentsInfoRequestHandlerTest-seed#[816D46DF52CEEB5A]-worker) [    ] o.a.s.SolrTestCaseJ4 ###deleteCore
   [junit4]   2> 4171182 INFO  (SUITE-SegmentsInfoRequestHandlerTest-seed#[816D46DF52CEEB5A]-worker) [    ] o.a.s.c.CoreContainer Shutting down CoreContainer instance=217436039
   [junit4]   2> 4171182 INFO  (SUITE-SegmentsInfoRequestHandlerTest-seed#[816D46DF52CEEB5A]-worker) [    ] o.a.s.m.SolrMetricManager Closing metric reporters for registry=solr.node, tag=null
   [junit4]   2> 4171182 INFO  (SUITE-SegmentsInfoRequestHandlerTest-seed#[816D46DF52CEEB5A]-worker) [    ] o.a.s.m.r.SolrJmxReporter Closing reporter [org.apache.solr.metrics.reporters.SolrJmxReporter@6e414d75: rootName = null, domain = solr.node, service url = null, agent id = null] for registry solr.node / com.codahale.metrics.MetricRegistry@48e6d71d
   [junit4]   2> 4171188 INFO  (SUITE-SegmentsInfoRequestHandlerTest-seed#[816D46DF52CEEB5A]-worker) [    ] o.a.s.m.SolrMetricManager Closing metric reporters for registry=solr.jvm, tag=null
   [junit4]   2> 4171188 INFO  (SUITE-SegmentsInfoRequestHandlerTest-seed#[816D46DF52CEEB5A]-worker) [    ] o.a.s.m.r.SolrJmxReporter Closing reporter [org.apache.solr.metrics.reporters.SolrJmxReporter@228d44ff: rootName = null, domain = solr.jvm, service url = null, agent id = null] for registry solr.jvm / com.codahale.metrics.MetricRegistry@33729724
   [junit4]   2> 4171191 INFO  (SUITE-SegmentsInfoRequestHandlerTest-seed#[816D46DF52CEEB5A]-worker) [    ] o.a.s.m.SolrMetricManager Closing metric reporters for registry=solr.jetty, tag=null
   [junit4]   2> 4171191 INFO  (SUITE-SegmentsInfoRequestHandlerTest-seed#[816D46DF52CEEB5A]-worker) [    ] o.a.s.m.r.SolrJmxReporter Closing reporter [org.apache.solr.metrics.reporters.SolrJmxReporter@7f0300d5: rootName = null, domain = solr.jetty, service url = null, agent id = null] for registry solr.jetty / com.codahale.metrics.MetricRegistry@19d36710
   [junit4]   2> 4171191 INFO  (coreCloseExecutor-11636-thread-1) [    x:collection1] o.a.s.c.SolrCore [collection1]  CLOSING SolrCore org.apache.solr.core.SolrCore@50d5449
   [junit4]   2> 4171191 INFO  (coreCloseExecutor-11636-thread-1) [    x:collection1] o.a.s.m.SolrMetricManager Closing metric reporters for registry=solr.core.collection1, tag=50d5449
   [junit4]   2> 4171191 INFO  (coreCloseExecutor-11636-thread-1) [    x:collection1] o.a.s.m.r.SolrJmxReporter Closing reporter [org.apache.solr.metrics.reporters.SolrJmxReporter@18e16d42: rootName = null, domain = solr.core.collection1, service url = null, agent id = null] for registry solr.core.collection1 / com.codahale.metrics.MetricRegistry@2a77451d
   [junit4]   2> NOTE: leaving temporary files on disk at: /x1/jenkins/jenkins-slave/workspace/Lucene-Solr-NightlyTests-7.x/checkout/solr/build/solr-core/test/J1/temp/solr.handler.admin.SegmentsInfoRequestHandlerTest_816D46DF52CEEB5A-001
   [junit4]   2> NOTE: test params are: codec=Asserting(Lucene70), sim=RandomSimilarity(queryNorm=true): {}, locale=ja-JP-u-ca-japanese-x-lvariant-JP, timezone=Pacific/Norfolk
   [junit4]   2> NOTE: Linux 3.13.0-88-generic amd64/Oracle Corporation 1.8.0_152 (64-bit)/cpus=4,threads=1,free=155956592,total=530055168
   [junit4]   2> NOTE: All tests run in this JVM: [DistributedMLTComponentTest, NodeAddedTriggerIntegrationTest, TestGraphTermsQParserPlugin, GraphQueryTest, ZkControllerTest, TestPolicyCloud, TestReversedWildcardFilterFactory, TestCustomDocTransformer, TestFieldCacheSortRandom, TestOrdValues, TestHdfsUpdateLog, AtomicUpdateProcessorFactoryTest, TestRawResponseWriter, CoreAdminCreateDiscoverTest, RequiredFieldsTest, TestSurroundQueryParser, UninvertDocValuesMergePolicyTest, SolrInfoBeanTest, TestPayloadCheckQParserPlugin, TestCloudSchemaless, TestSolrConfigHandlerCloud, DirectoryFactoryTest, HdfsBasicDistributedZkTest, TestAuthenticationFramework, FullHLLTest, TestMultiWordSynonyms, TestPullReplicaErrorHandling, SliceStateTest, TestDynamicLoading, TestConfigSetsAPIZkFailure, MultiSolrCloudTestCaseTest, TestGraphMLResponseWriter, ConnectionManagerTest, TestTrie, TestConfigSetImmutable, QueryElevationComponentTest, TestUnInvertedFieldException, BasicZkTest, TestShardHandlerFactory, SpatialRPTFieldTypeTest, TestSimpleTrackingShardHandler, SolrMetricManagerTest, QueryParsingTest, DistributedQueryComponentOptimizationTest, TestBlobHandler, TermsComponentTest, CoreMergeIndexesAdminHandlerTest, XsltUpdateRequestHandlerTest, TestLegacyNumericRangeQueryBuilder, FileUtilsTest, ConcurrentDeleteAndCreateCollectionTest, SystemInfoHandlerTest, TestLegacyFieldCache, IndexSchemaTest, TestStressRecovery, TestManagedResourceStorage, BasicAuthIntegrationTest, HighlighterMaxOffsetTest, TestConfigsApi, TestPivotHelperCode, AutoAddReplicasPlanActionTest, TestCursorMarkWithoutUniqueKey, DistribCursorPagingTest, HdfsLockFactoryTest, ExecutePlanActionTest, CdcrUpdateLogTest, TestZkChroot, TestSortableTextField, AlternateDirectoryTest, SyncSliceTest, TestRandomCollapseQParserPlugin, SampleTest, TestLuceneIndexBackCompat, TestAnalyzeInfixSuggestions, TestSkipOverseerOperations, TestRecovery, TestSegmentSorting, TestSolrCLIRunExample, ClassificationUpdateProcessorIntegrationTest, TestCharFilters, SolrShardReporterTest, TestOnReconnectListenerSupport, TestPolicyCloud, TestSearchPerf, TestDistribStateManager, TestLeaderInitiatedRecoveryThread, TestPointFields, ResponseHeaderTest, SuggesterFSTTest, SortByFunctionTest, TestSolrCloudWithSecureImpersonation, LegacyCloudClusterPropTest, FastVectorHighlighterTest, BlockDirectoryTest, ShardSplitTest, CollectionsAPISolrJTest, TestScoreJoinQPNoScore, LIROnShardRestartTest, CloudMLTQParserTest, TestPostingsSolrHighlighter, JvmMetricsTest, FieldMutatingUpdateProcessorTest, ScheduledMaintenanceTriggerTest, TestSchemaSimilarityResource, TestFunctionQuery, ChaosMonkeySafeLeaderTest, TestCopyFieldCollectionResource, TestDFISimilarityFactory, DistributedIntervalFacetingTest, SOLR749Test, TestSystemIdResolver, ForceLeaderTest, DistributedDebugComponentTest, SSLMigrationTest, TestRecoveryHdfs, TestSha256AuthenticationProvider, TestStressUserVersions, TestQueryUtils, DistributedFacetPivotSmallTest, DeleteInactiveReplicaTest, JsonLoaderTest, RequestLoggingTest, TestCustomSort, TestReplicationHandler, DistributedQueueTest, CloudExitableDirectoryReaderTest, TestHdfsBackupRestoreCore, TestSolr4Spatial, StatsReloadRaceTest, TestManagedSchema, TestRestoreCore, MoveReplicaTest, OutOfBoxZkACLAndCredentialsProvidersTest, OverriddenZkACLAndCredentialsProvidersTest, OverseerCollectionConfigSetProcessorTest, OverseerStatusTest, PeerSyncReplicationTest, RemoteQueryErrorTest, ReplaceNodeTest, SolrCLIZkUtilsTest, TestCloudInspectUtil, TestCloudPivotFacet, TestDistribDocBasedVersion, TestExclusionRuleCollectionAccess, TestLeaderElectionZkExpiry, TestMiniSolrCloudClusterSSL, TestRandomRequestDistribution, TestRebalanceLeaders, TestSolrCloudWithDelegationTokens, TestTolerantUpdateProcessorCloud, TestTolerantUpdateProcessorRandomCloud, TriLevelCompositeIdRoutingTest, VMParamsZkACLAndCredentialsProvidersTest, ZkShardTermsTest, CollectionTooManyReplicasTest, SimpleCollectionCreateDeleteTest, TestCollectionAPI, TestCollectionsAPIViaSolrCloudCluster, TestHdfsCloudBackupRestore, TestReplicaProperties, HdfsAutoAddReplicasIntegrationTest, HttpTriggerListenerTest, IndexSizeTriggerTest, MetricTriggerIntegrationTest, NodeMarkersRegistrationTest, ScheduledTriggerIntegrationTest, ScheduledTriggerTest, SearchRateTriggerIntegrationTest, SearchRateTriggerTest, TriggerCooldownIntegrationTest, TriggerSetPropertiesIntegrationTest, TestComputePlanAction, TestExecutePlanAction, TestLargeCluster, TestNodeAddedTrigger, TestNodeLostTrigger, TestSimDistributedQueue, TestTriggerIntegration, BaseCdcrDistributedZkTest, CdcrBidirectionalTest, CdcrRequestHandlerTest, CdcrVersionReplicationTest, HdfsRecoverLeaseTest, HdfsRecoveryZkTest, HdfsRestartWhileUpdatingTest, HdfsTlogReplayBufferedWhileIndexingTest, HdfsUnloadDistributedZkTest, ImplicitSnitchTest, RulesTest, ConfigureRecoveryStrategyTest, CoreSorterTest, ExitableDirectoryReaderTest, HdfsDirectoryFactoryTest, QueryResultKeyTest, TestBackupRepositoryFactory, TestConfigOverlay, TestConfigSetProperties, TestCorePropertiesReload, TestImplicitCoreProperties, TestInitParams, TestNRTOpen, TestReloadAndDeleteDocs, TestSQLHandlerNonCloud, V2ApiIntegrationTest, AutoscalingHistoryHandlerTest, CoreAdminRequestStatusTest, PropertiesRequestHandlerTest, SegmentsInfoRequestHandlerTest]
   [junit4] Completed [663/802 (1!)] on J1 in 0.95s, 3 tests, 3 failures <<< FAILURES!

[...truncated 50726 lines...]
[asciidoctor:convert] asciidoctor: ERROR: about-this-guide.adoc: line 1: invalid part, must have at least one section (e.g., chapter, appendix, etc.)
[asciidoctor:convert] asciidoctor: ERROR: solr-glossary.adoc: line 1: invalid part, must have at least one section (e.g., chapter, appendix, etc.)
     [java] Processed 2186 links (1742 relative) to 2894 anchors in 228 files
     [echo] Validated Links & Anchors via: /x1/jenkins/jenkins-slave/workspace/Lucene-Solr-NightlyTests-7.x/checkout/solr/build/solr-ref-guide/bare-bones-html/

-documentation-lint:
    [jtidy] Checking for broken html (such as invalid tags)...
   [delete] Deleting directory /x1/jenkins/jenkins-slave/workspace/Lucene-Solr-NightlyTests-7.x/checkout/lucene/build/jtidy_tmp
     [echo] Checking for broken links...
     [exec]
     [exec] Crawl/parse...
     [exec]
     [exec] Verify...
     [echo] Checking for malformed docs...

jar-checksums:

resolve:

ivy-availability-check:
[loadresource] Do not set property disallowed.ivy.jars.list as its length is 0.

-ivy-fail-disallowed-ivy-version:

ivy-fail:

ivy-configure:
[ivy:configure] :: loading settings :: file = /x1/jenkins/jenkins-slave/workspace/Lucene-Solr-NightlyTests-7.x/checkout/lucene/top-level-ivy-settings.xml

resolve:

ivy-availability-check:
[loadresource] Do not set property disallowed.ivy.jars.list as its length is 0.

-ivy-fail-disallowed-ivy-version:

ivy-fail:

ivy-configure:
[ivy:configure] :: loading settings :: file = /x1/jenkins/jenkins-slave/workspace/Lucene-Solr-NightlyTests-7.x/checkout/lucene/top-level-ivy-settings.xml

resolve:

resolve:

ivy-availability-check:
[loadresource] Do not set property disallowed.ivy.jars.list as its length is 0.

-ivy-fail-disallowed-ivy-version:

ivy-fail:

ivy-configure:
[ivy:configure] :: loading settings :: file = /x1/jenkins/jenkins-slave/workspace/Lucene-Solr-NightlyTests-7.x/checkout/lucene/top-level-ivy-settings.xml

resolve:

ivy-availability-check:
[loadresource] Do not set property disallowed.ivy.jars.list as its length is 0.

-ivy-fail-disallowed-ivy-version:

ivy-fail:

ivy-configure:
[ivy:configure] :: loading settings :: file = /x1/jenkins/jenkins-slave/workspace/Lucene-Solr-NightlyTests-7.x/checkout/lucene/top-level-ivy-settings.xml

resolve:

ivy-availability-check:
[loadresource] Do not set property disallowed.ivy.jars.list as its length is 0.

-ivy-fail-disallowed-ivy-version:

ivy-fail:

ivy-configure:
[ivy:configure] :: loading settings :: file = /x1/jenkins/jenkins-slave/workspace/Lucene-Solr-NightlyTests-7.x/checkout/lucene/top-level-ivy-settings.xml

resolve:

ivy-availability-check:
[loadresource] Do not set property disallowed.ivy.jars.list as its length is 0.

-ivy-fail-disallowed-ivy-version:

ivy-fail:

ivy-configure:
[ivy:configure] :: loading settings :: file = /x1/jenkins/jenkins-slave/workspace/Lucene-Solr-NightlyTests-7.x/checkout/lucene/top-level-ivy-settings.xml

resolve:

ivy-availability-check:
[loadresource] Do not set property disallowed.ivy.jars.list as its length is 0.

-ivy-fail-disallowed-ivy-version:

ivy-fail:

ivy-configure:
[ivy:configure] :: loading settings :: file = /x1/jenkins/jenkins-slave/workspace/Lucene-Solr-NightlyTests-7.x/checkout/lucene/top-level-ivy-settings.xml

resolve:

ivy-availability-check:
[loadresource] Do not set property disallowed.ivy.jars.list as its length is 0.

-ivy-fail-disallowed-ivy-version:

ivy-fail:

ivy-configure:
[ivy:configure] :: loading settings :: file = /x1/jenkins/jenkins-slave/workspace/Lucene-Solr-NightlyTests-7.x/checkout/lucene/top-level-ivy-settings.xml

resolve:

ivy-availability-check:
[loadresource] Do not set property disallowed.ivy.jars.list as its length is 0.

-ivy-fail-disallowed-ivy-version:

ivy-fail:

ivy-configure:
[ivy:configure] :: loading settings :: file = /x1/jenkins/jenkins-slave/workspace/Lucene-Solr-NightlyTests-7.x/checkout/lucene/top-level-ivy-settings.xml

resolve:

ivy-availability-check:
[loadresource] Do not set property disallowed.ivy.jars.list as its length is 0.

-ivy-fail-disallowed-ivy-version:

ivy-fail:

ivy-configure:
[ivy:configure] :: loading settings :: file = /x1/jenkins/jenkins-slave/workspace/Lucene-Solr-NightlyTests-7.x/checkout/lucene/top-level-ivy-settings.xml

resolve:

ivy-availability-check:
[loadresource] Do not set property disallowed.ivy.jars.list as its length is 0.

-ivy-fail-disallowed-ivy-version:

ivy-fail:

ivy-configure:
[ivy:configure] :: loading settings :: file = /x1/jenkins/jenkins-slave/workspace/Lucene-Solr-NightlyTests-7.x/checkout/lucene/top-level-ivy-settings.xml

resolve:

ivy-availability-check:
[loadresource] Do not set property disallowed.ivy.jars.list as its length is 0.

-ivy-fail-disallowed-ivy-version:

ivy-fail:

ivy-configure:
[ivy:configure] :: loading settings :: file = /x1/jenkins/jenkins-slave/workspace/Lucene-Solr-NightlyTests-7.x/checkout/lucene/top-level-ivy-settings.xml

resolve:

ivy-availability-check:
[loadresource] Do not set property disallowed.ivy.jars.list as its length is 0.

-ivy-fail-disallowed-ivy-version:

ivy-fail:

ivy-configure:
[ivy:configure] :: loading settings :: file = /x1/jenkins/jenkins-slave/workspace/Lucene-Solr-NightlyTests-7.x/checkout/lucene/top-level-ivy-settings.xml

resolve:

ivy-availability-check:
[loadresource] Do not set property disallowed.ivy.jars.list as its length is 0.

-ivy-fail-disallowed-ivy-version:

ivy-fail:

ivy-configure:
[ivy:configure] :: loading settings :: file = /x1/jenkins/jenkins-slave/workspace/Lucene-Solr-NightlyTests-7.x/checkout/lucene/top-level-ivy-settings.xml

resolve:

ivy-availability-check:
[loadresource] Do not set property disallowed.ivy.jars.list as its length is 0.

-ivy-fail-disallowed-ivy-version:

ivy-fail:

ivy-configure:
[ivy:configure] :: loading settings :: file = /x1/jenkins/jenkins-slave/workspace/Lucene-Solr-NightlyTests-7.x/checkout/lucene/top-level-ivy-settings.xml

resolve:

ivy-availability-check:
[loadresource] Do not set property disallowed.ivy.jars.list as its length is 0.

-ivy-fail-disallowed-ivy-version:

ivy-fail:

ivy-configure:
[ivy:configure] :: loading settings :: file = /x1/jenkins/jenkins-slave/workspace/Lucene-Solr-NightlyTests-7.x/checkout/lucene/top-level-ivy-settings.xml

resolve:

ivy-availability-check:
[loadresource] Do not set property disallowed.ivy.jars.list as its length is 0.

-ivy-fail-disallowed-ivy-version:

ivy-fail:

ivy-configure:
[ivy:configure] :: loading settings :: file = /x1/jenkins/jenkins-slave/workspace/Lucene-Solr-NightlyTests-7.x/checkout/lucene/top-level-ivy-settings.xml

resolve:

ivy-availability-check:
[loadresource] Do not set property disallowed.ivy.jars.list as its length is 0.

-ivy-fail-disallowed-ivy-version:

ivy-fail:

ivy-configure:
[ivy:configure] :: loading settings :: file = /x1/jenkins/jenkins-slave/workspace/Lucene-Solr-NightlyTests-7.x/checkout/lucene/top-level-ivy-settings.xml

resolve:

ivy-availability-check:
[loadresource] Do not set property disallowed.ivy.jars.list as its length is 0.

-ivy-fail-disallowed-ivy-version:

ivy-fail:

ivy-configure:
[ivy:configure] :: loading settings :: file = /x1/jenkins/jenkins-slave/workspace/Lucene-Solr-NightlyTests-7.x/checkout/lucene/top-level-ivy-settings.xml

resolve:

ivy-availability-check:
[loadresource] Do not set property disallowed.ivy.jars.list as its length is 0.

-ivy-fail-disallowed-ivy-version:

ivy-fail:

ivy-configure:
[ivy:configure] :: loading settings :: file = /x1/jenkins/jenkins-slave/workspace/Lucene-Solr-NightlyTests-7.x/checkout/lucene/top-level-ivy-settings.xml

resolve:

ivy-availability-check:
[loadresource] Do not set property disallowed.ivy.jars.list as its length is 0.

-ivy-fail-disallowed-ivy-version:

ivy-fail:

ivy-configure:
[ivy:configure] :: loading settings :: file = /x1/jenkins/jenkins-slave/workspace/Lucene-Solr-NightlyTests-7.x/checkout/lucene/top-level-ivy-settings.xml

resolve:

ivy-availability-check:
[loadresource] Do not set property disallowed.ivy.jars.list as its length is 0.

-ivy-fail-disallowed-ivy-version:

ivy-fail:

ivy-configure:
[ivy:configure] :: loading settings :: file = /x1/jenkins/jenkins-slave/workspace/Lucene-Solr-NightlyTests-7.x/checkout/lucene/top-level-ivy-settings.xml

resolve:

ivy-availability-check:
[loadresource] Do not set property disallowed.ivy.jars.list as its length is 0.

-ivy-fail-disallowed-ivy-version:

ivy-fail:

ivy-configure:
[ivy:configure] :: loading settings :: file = /x1/jenkins/jenkins-slave/workspace/Lucene-Solr-NightlyTests-7.x/checkout/lucene/top-level-ivy-settings.xml

resolve:

ivy-availability-check:
[loadresource] Do not set property disallowed.ivy.jars.list as its length is 0.

-ivy-fail-disallowed-ivy-version:

ivy-fail:

ivy-configure:
[ivy:configure] :: loading settings :: file = /x1/jenkins/jenkins-slave/workspace/Lucene-Solr-NightlyTests-7.x/checkout/lucene/top-level-ivy-settings.xml

resolve:

ivy-availability-check:
[loadresource] Do not set property disallowed.ivy.jars.list as its length is 0.

-ivy-fail-disallowed-ivy-version:

ivy-fail:

ivy-configure:
[ivy:configure] :: loading settings :: file = /x1/jenkins/jenkins-slave/workspace/Lucene-Solr-NightlyTests-7.x/checkout/lucene/top-level-ivy-settings.xml

resolve:

ivy-availability-check:
[loadresource] Do not set property disallowed.ivy.jars.list as its length is 0.

-ivy-fail-disallowed-ivy-version:

ivy-fail:

ivy-configure:
[ivy:configure] :: loading settings :: file = /x1/jenkins/jenkins-slave/workspace/Lucene-Solr-NightlyTests-7.x/checkout/lucene/top-level-ivy-settings.xml

resolve:

ivy-availability-check:
[loadresource] Do not set property disallowed.ivy.jars.list as its length is 0.

-ivy-fail-disallowed-ivy-version:

ivy-fail:

ivy-configure:
[ivy:configure] :: loading settings :: file = /x1/jenkins/jenkins-slave/workspace/Lucene-Solr-NightlyTests-7.x/checkout/lucene/top-level-ivy-settings.xml

common.resolve:

resolve:

ivy-availability-check:
[loadresource] Do not set property disallowed.ivy.jars.list as its length is 0.

-ivy-fail-disallowed-ivy-version:

ivy-fail:

ivy-configure:
[ivy:configure] :: loading settings :: file = /x1/jenkins/jenkins-slave/workspace/Lucene-Solr-NightlyTests-7.x/checkout/lucene/top-level-ivy-settings.xml

resolve:

ivy-availability-check:
[loadresource] Do not set property disallowed.ivy.jars.list as its length is 0.

-ivy-fail-disallowed-ivy-version:

ivy-fail:

ivy-configure:
[ivy:configure] :: loading settings :: file = /x1/jenkins/jenkins-slave/workspace/Lucene-Solr-NightlyTests-7.x/checkout/lucene/top-level-ivy-settings.xml

resolve:

ivy-availability-check:
[loadresource] Do not set property disallowed.ivy.jars.list as its length is 0.

-ivy-fail-disallowed-ivy-version:

ivy-fail:

ivy-configure:
[ivy:configure] :: loading settings :: file = /x1/jenkins/jenkins-slave/workspace/Lucene-Solr-NightlyTests-7.x/checkout/lucene/top-level-ivy-settings.xml

resolve:

ivy-availability-check:
[loadresource] Do not set property disallowed.ivy.jars.list as its length is 0.

-ivy-fail-disallowed-ivy-version:

ivy-fail:

ivy-configure:
[ivy:configure] :: loading settings :: file = /x1/jenkins/jenkins-slave/workspace/Lucene-Solr-NightlyTests-7.x/checkout/lucene/top-level-ivy-settings.xml

resolve:

ivy-availability-check:
[loadresource] Do not set property disallowed.ivy.jars.list as its length is 0.

-ivy-fail-disallowed-ivy-version:

ivy-fail:

ivy-configure:
[ivy:configure] :: loading settings :: file = /x1/jenkins/jenkins-slave/workspace/Lucene-Solr-NightlyTests-7.x/checkout/lucene/top-level-ivy-settings.xml

resolve:

jar-checksums:
    [mkdir] Created dir: /x1/jenkins/jenkins-slave/workspace/Lucene-Solr-NightlyTests-7.x/checkout/lucene/null1741157570
     [copy] Copying 40 files to /x1/jenkins/jenkins-slave/workspace/Lucene-Solr-NightlyTests-7.x/checkout/lucene/null1741157570
   [delete] Deleting directory /x1/jenkins/jenkins-slave/workspace/Lucene-Solr-NightlyTests-7.x/checkout/lucene/null1741157570

resolve-example:

ivy-availability-check:
[loadresource] Do not set property disallowed.ivy.jars.list as its length is 0.

-ivy-fail-disallowed-ivy-version:

ivy-fail:

ivy-configure:
[ivy:configure] :: loading settings :: file = /x1/jenkins/jenkins-slave/workspace/Lucene-Solr-NightlyTests-7.x/checkout/lucene/top-level-ivy-settings.xml

resolve:

resolve-server:

ivy-availability-check:
[loadresource] Do not set property disallowed.ivy.jars.list as its length is 0.

-ivy-fail-disallowed-ivy-version:

ivy-fail:

ivy-fail:

ivy-configure:
[ivy:configure] :: loading settings :: file = /x1/jenkins/jenkins-slave/workspace/Lucene-Solr-NightlyTests-7.x/checkout/lucene/top-level-ivy-settings.xml

resolve:

resolve:

ivy-availability-check:
[loadresource] Do not set property disallowed.ivy.jars.list as its length is 0.

-ivy-fail-disallowed-ivy-version:

ivy-fail:

ivy-fail:

ivy-configure:
[ivy:configure] :: loading settings :: file = /x1/jenkins/jenkins-slave/workspace/Lucene-Solr-NightlyTests-7.x/checkout/lucene/top-level-ivy-settings.xml

resolve:

ivy-availability-check:
[loadresource] Do not set property disallowed.ivy.jars.list as its length is 0.

-ivy-fail-disallowed-ivy-version:

ivy-fail:

ivy-fail:

ivy-configure:
[ivy:configure] :: loading settings :: file = /x1/jenkins/jenkins-slave/workspace/Lucene-Solr-NightlyTests-7.x/checkout/lucene/top-level-ivy-settings.xml

resolve:

ivy-availability-check:
[loadresource] Do not set property disallowed.ivy.jars.list as its length is 0.

-ivy-fail-disallowed-ivy-version:

ivy-fail:

ivy-configure:
[ivy:configure] :: loading settings :: file = /x1/jenkins/jenkins-slave/workspace/Lucene-Solr-NightlyTests-7.x/checkout/lucene/top-level-ivy-settings.xml

resolve:

ivy-availability-check:
[loadresource] Do not set property disallowed.ivy.jars.list as its length is 0.

-ivy-fail-disallowed-ivy-version:

ivy-fail:

ivy-fail:

ivy-configure:
[ivy:configure] :: loading settings :: file = /x1/jenkins/jenkins-slave/workspace/Lucene-Solr-NightlyTests-7.x/checkout/lucene/top-level-ivy-settings.xml

resolve:

ivy-availability-check:
[loadresource] Do not set property disallowed.ivy.jars.list as its length is 0.

-ivy-fail-disallowed-ivy-version:

ivy-fail:

ivy-configure:
[ivy:configure] :: loading settings :: file = /x1/jenkins/jenkins-slave/workspace/Lucene-Solr-NightlyTests-7.x/checkout/lucene/top-level-ivy-settings.xml

resolve:

ivy-availability-check:
[loadresource] Do not set property disallowed.ivy.jars.list as its length is 0.

-ivy-fail-disallowed-ivy-version:

ivy-fail:

ivy-fail:

ivy-configure:
[ivy:configure] :: loading settings :: file = /x1/jenkins/jenkins-slave/workspace/Lucene-Solr-NightlyTests-7.x/checkout/lucene/top-level-ivy-settings.xml

resolve:

ivy-availability-check:
[loadresource] Do not set property disallowed.ivy.jars.list as its length is 0.

-ivy-fail-disallowed-ivy-version:

ivy-fail:

ivy-fail:

ivy-configure:
[ivy:configure] :: loading settings :: file = /x1/jenkins/jenkins-slave/workspace/Lucene-Solr-NightlyTests-7.x/checkout/lucene/top-level-ivy-settings.xml

resolve:

ivy-availability-check:
[loadresource] Do not set property disallowed.ivy.jars.list as its length is 0.

-ivy-fail-disallowed-ivy-version:

ivy-fail:

ivy-fail:

ivy-configure:
[ivy:configure] :: loading settings :: file = /x1/jenkins/jenkins-slave/workspace/Lucene-Solr-NightlyTests-7.x/checkout/lucene/top-level-ivy-settings.xml

resolve:

ivy-availability-check:
[loadresource] Do not set property disallowed.ivy.jars.list as its length is 0.

-ivy-fail-disallowed-ivy-version:

ivy-fail:

ivy-fail:

ivy-configure:
[ivy:configure] :: loading settings :: file = /x1/jenkins/jenkins-slave/workspace/Lucene-Solr-NightlyTests-7.x/checkout/lucene/top-level-ivy-settings.xml

resolve:

ivy-availability-check:
[loadresource] Do not set property disallowed.ivy.jars.list as its length is 0.

-ivy-fail-disallowed-ivy-version:

ivy-fail:

ivy-fail:

ivy-configure:
[ivy:configure] :: loading settings :: file = /x1/jenkins/jenkins-slave/workspace/Lucene-Solr-NightlyTests-7.x/checkout/lucene/top-level-ivy-settings.xml

resolve:

ivy-availability-check:
[loadresource] Do not set property disallowed.ivy.jars.list as its length is 0.

-ivy-fail-disallowed-ivy-version:

ivy-fail:

ivy-fail:

ivy-configure:
[ivy:configure] :: loading settings :: file = /x1/jenkins/jenkins-slave/workspace/Lucene-Solr-NightlyTests-7.x/checkout/lucene/top-level-ivy-settings.xml

resolve:

ivy-availability-check:
[loadresource] Do not set property disallowed.ivy.jars.list as its length is 0.

-ivy-fail-disallowed-ivy-version:

ivy-fail:

ivy-fail:

ivy-configure:
[ivy:configure] :: loading settings :: file = /x1/jenkins/jenkins-slave/workspace/Lucene-Solr-NightlyTests-7.x/checkout/lucene/top-level-ivy-settings.xml

resolve:

ivy-availability-check:
[loadresource] Do not set property disallowed.ivy.jars.list as its length is 0.

-ivy-fail-disallowed-ivy-version:

ivy-fail:

ivy-fail:

ivy-configure:
[ivy:configure] :: loading settings :: file = /x1/jenkins/jenkins-slave/workspace/Lucene-Solr-NightlyTests-7.x/checkout/lucene/top-level-ivy-settings.xml

resolve:

ivy-availability-check:
[loadresource] Do not set property disallowed.ivy.jars.list as its length is 0.

-ivy-fail-disallowed-ivy-version:

ivy-fail:

ivy-fail:

ivy-configure:
[ivy:configure] :: loading settings :: file = /x1/jenkins/jenkins-slave/workspace/Lucene-Solr-NightlyTests-7.x/checkout/lucene/top-level-ivy-settings.xml

resolve:

ivy-availability-check:
[loadresource] Do not set property disallowed.ivy.jars.list as its length is 0.

-ivy-fail-disallowed-ivy-version:

ivy-fail:

ivy-fail:

ivy-configure:
[ivy:configure] :: loading settings :: file = /x1/jenkins/jenkins-slave/workspace/Lucene-Solr-NightlyTests-7.x/checkout/lucene/top-level-ivy-settings.xml

resolve:

ivy-availability-check:
[loadresource] Do not set property disallowed.ivy.jars.list as its length is 0.

-ivy-fail-disallowed-ivy-version:

ivy-fail:

ivy-fail:

ivy-configure:
[ivy:configure] :: loading settings :: file = /x1/jenkins/jenkins-slave/workspace/Lucene-Solr-NightlyTests-7.x/checkout/lucene/top-level-ivy-settings.xml

resolve:

jar-checksums:
    [mkdir] Created dir: /x1/jenkins/jenkins-slave/workspace/Lucene-Solr-NightlyTests-7.x/checkout/solr/null1886957229
     [copy] Copying 246 files to /x1/jenkins/jenkins-slave/workspace/Lucene-Solr-NightlyTests-7.x/checkout/solr/null1886957229
   [delete] Deleting directory /x1/jenkins/jenkins-slave/workspace/Lucene-Solr-NightlyTests-7.x/checkout/solr/null1886957229

check-working-copy:
[ivy:cachepath] :: resolving dependencies :: org.eclipse.jgit#org.eclipse.jgit-caller;working
[ivy:cachepath] confs: [default]
[ivy:cachepath] found org.eclipse.jgit#org.eclipse.jgit;4.6.0.201612231935-r in public
[ivy:cachepath] found com.jcraft#jsch;0.1.53 in public
[ivy:cachepath] found com.googlecode.javaewah#JavaEWAH;1.1.6 in public
[ivy:cachepath] found org.apache.httpcomponents#httpclient;4.3.6 in public
[ivy:cachepath] found org.apache.httpcomponents#httpcore;4.3.3 in public
[ivy:cachepath] found commons-logging#commons-logging;1.1.3 in public
[ivy:cachepath] found commons-codec#commons-codec;1.6 in public
[ivy:cachepath] found org.slf4j#slf4j-api;1.7.2 in public
[ivy:cachepath] :: resolution report :: resolve 47ms :: artifacts dl 7ms
        ---------------------------------------------------------------------
        |                  |            modules            ||   artifacts   |
        |       conf       | number| search|dwnlded|evicted|| number|dwnlded|
        ---------------------------------------------------------------------
        |      default     |   8   |   0   |   0   |   0   ||   8   |   0   |
        ---------------------------------------------------------------------
[wc-checker] Initializing working copy...
[wc-checker] SLF4J: Failed to load class "org.slf4j.impl.StaticLoggerBinder".
[wc-checker] SLF4J: Defaulting to no-operation (NOP) logger implementation
[wc-checker] SLF4J: See http://www.slf4j.org/codes.html#StaticLoggerBinder for further details.
[wc-checker] Checking working copy status...

-jenkins-base:

BUILD SUCCESSFUL
Total time: 305 minutes 33 seconds
Archiving artifacts
WARN: No artifacts found that match the file pattern "**/*.events,heapdumps/**,**/hs_err_pid*". Configuration error?
WARN: java.lang.InterruptedException: no matches found within 10000
Recording test results
Build step 'Publish JUnit test result report' changed build result to UNSTABLE
Email was triggered for: Unstable (Test Failures)
Sending email for trigger: Unstable (Test Failures)


---------------------------------------------------------------------
To unsubscribe, e-mail: [hidden email]
For additional commands, e-mail: [hidden email]
Reply | Threaded
Open this post in threaded view
|

[JENKINS] Lucene-Solr-NightlyTests-7.x - Build # 203 - Failure

Apache Jenkins Server-2
Build: https://builds.apache.org/job/Lucene-Solr-NightlyTests-7.x/203/

5 tests failed.
FAILED:  junit.framework.TestSuite.org.apache.solr.cloud.ZkControllerTest

Error Message:
ObjectTracker found 1 object(s) that were not released!!! [Overseer] org.apache.solr.common.util.ObjectReleaseTracker$ObjectTrackerException: org.apache.solr.cloud.Overseer  at org.apache.solr.common.util.ObjectReleaseTracker.track(ObjectReleaseTracker.java:42)  at org.apache.solr.cloud.Overseer.start(Overseer.java:545)  at org.apache.solr.cloud.OverseerElectionContext.runLeaderProcess(ElectionContext.java:851)  at org.apache.solr.cloud.LeaderElector.runIamLeaderProcess(LeaderElector.java:170)  at org.apache.solr.cloud.LeaderElector.checkIfIamLeader(LeaderElector.java:135)  at org.apache.solr.cloud.LeaderElector.joinElection(LeaderElector.java:307)  at org.apache.solr.cloud.LeaderElector.retryElection(LeaderElector.java:393)  at org.apache.solr.cloud.ZkController.rejoinOverseerElection(ZkController.java:2081)  at org.apache.solr.cloud.Overseer$ClusterStateUpdater.checkIfIamStillLeader(Overseer.java:331)  at java.lang.Thread.run(Thread.java:748)  

Stack Trace:
java.lang.AssertionError: ObjectTracker found 1 object(s) that were not released!!! [Overseer]
org.apache.solr.common.util.ObjectReleaseTracker$ObjectTrackerException: org.apache.solr.cloud.Overseer
        at org.apache.solr.common.util.ObjectReleaseTracker.track(ObjectReleaseTracker.java:42)
        at org.apache.solr.cloud.Overseer.start(Overseer.java:545)
        at org.apache.solr.cloud.OverseerElectionContext.runLeaderProcess(ElectionContext.java:851)
        at org.apache.solr.cloud.LeaderElector.runIamLeaderProcess(LeaderElector.java:170)
        at org.apache.solr.cloud.LeaderElector.checkIfIamLeader(LeaderElector.java:135)
        at org.apache.solr.cloud.LeaderElector.joinElection(LeaderElector.java:307)
        at org.apache.solr.cloud.LeaderElector.retryElection(LeaderElector.java:393)
        at org.apache.solr.cloud.ZkController.rejoinOverseerElection(ZkController.java:2081)
        at org.apache.solr.cloud.Overseer$ClusterStateUpdater.checkIfIamStillLeader(Overseer.java:331)
        at java.lang.Thread.run(Thread.java:748)


        at __randomizedtesting.SeedInfo.seed([769471CD20BAB3FF]:0)
        at org.junit.Assert.fail(Assert.java:93)
        at org.junit.Assert.assertTrue(Assert.java:43)
        at org.junit.Assert.assertNull(Assert.java:551)
        at org.apache.solr.SolrTestCaseJ4.teardownTestCases(SolrTestCaseJ4.java:303)
        at sun.reflect.GeneratedMethodAccessor39.invoke(Unknown Source)
        at sun.reflect.DelegatingMethodAccessorImpl.invoke(DelegatingMethodAccessorImpl.java:43)
        at java.lang.reflect.Method.invoke(Method.java:498)
        at com.carrotsearch.randomizedtesting.RandomizedRunner.invoke(RandomizedRunner.java:1737)
        at com.carrotsearch.randomizedtesting.RandomizedRunner$7.evaluate(RandomizedRunner.java:897)
        at com.carrotsearch.randomizedtesting.rules.StatementAdapter.evaluate(StatementAdapter.java:36)
        at com.carrotsearch.randomizedtesting.rules.SystemPropertiesRestoreRule$1.evaluate(SystemPropertiesRestoreRule.java:57)
        at org.apache.lucene.util.AbstractBeforeAfterRule$1.evaluate(AbstractBeforeAfterRule.java:45)
        at com.carrotsearch.randomizedtesting.rules.StatementAdapter.evaluate(StatementAdapter.java:36)
        at org.apache.lucene.util.TestRuleStoreClassName$1.evaluate(TestRuleStoreClassName.java:41)
        at com.carrotsearch.randomizedtesting.rules.NoShadowingOrOverridesOnMethodsRule$1.evaluate(NoShadowingOrOverridesOnMethodsRule.java:40)
        at com.carrotsearch.randomizedtesting.rules.NoShadowingOrOverridesOnMethodsRule$1.evaluate(NoShadowingOrOverridesOnMethodsRule.java:40)
        at com.carrotsearch.randomizedtesting.rules.StatementAdapter.evaluate(StatementAdapter.java:36)
        at com.carrotsearch.randomizedtesting.rules.StatementAdapter.evaluate(StatementAdapter.java:36)
        at com.carrotsearch.randomizedtesting.rules.StatementAdapter.evaluate(StatementAdapter.java:36)
        at org.apache.lucene.util.TestRuleAssertionsRequired$1.evaluate(TestRuleAssertionsRequired.java:53)
        at org.apache.lucene.util.TestRuleMarkFailure$1.evaluate(TestRuleMarkFailure.java:47)
        at org.apache.lucene.util.TestRuleIgnoreAfterMaxFailures$1.evaluate(TestRuleIgnoreAfterMaxFailures.java:64)
        at org.apache.lucene.util.TestRuleIgnoreTestSuites$1.evaluate(TestRuleIgnoreTestSuites.java:54)
        at com.carrotsearch.randomizedtesting.rules.StatementAdapter.evaluate(StatementAdapter.java:36)
        at com.carrotsearch.randomizedtesting.ThreadLeakControl$StatementRunner.run(ThreadLeakControl.java:368)
        at java.lang.Thread.run(Thread.java:748)


FAILED:  junit.framework.TestSuite.org.apache.solr.cloud.ZkControllerTest

Error Message:
1 thread leaked from SUITE scope at org.apache.solr.cloud.ZkControllerTest:     1) Thread[id=16912, name=OverseerAutoScalingTriggerThread-73650673009164290-127.0.0.1:8983_solr-n_0000000001, state=RUNNABLE, group=Overseer autoscaling triggers]         at org.apache.lucene.util.TestRuleLimitSysouts$DelegateStream.write(TestRuleLimitSysouts.java:128)         at java.io.PrintStream.write(PrintStream.java:480)         at org.apache.logging.log4j.core.util.CloseShieldOutputStream.write(CloseShieldOutputStream.java:53)         at org.apache.logging.log4j.core.appender.OutputStreamManager.writeToDestination(OutputStreamManager.java:263)         at org.apache.logging.log4j.core.appender.OutputStreamManager.flushBuffer(OutputStreamManager.java:295)         at org.apache.logging.log4j.core.appender.OutputStreamManager.flush(OutputStreamManager.java:304)         at org.apache.logging.log4j.core.appender.AbstractOutputStreamAppender.directEncodeEvent(AbstractOutputStreamAppender.java:179)         at org.apache.logging.log4j.core.appender.AbstractOutputStreamAppender.tryAppend(AbstractOutputStreamAppender.java:170)         at org.apache.logging.log4j.core.appender.AbstractOutputStreamAppender.append(AbstractOutputStreamAppender.java:161)         at org.apache.logging.log4j.core.config.AppenderControl.tryCallAppender(AppenderControl.java:156)         at org.apache.logging.log4j.core.config.AppenderControl.callAppender0(AppenderControl.java:129)         at org.apache.logging.log4j.core.config.AppenderControl.callAppenderPreventRecursion(AppenderControl.java:120)         at org.apache.logging.log4j.core.config.AppenderControl.callAppender(AppenderControl.java:84)         at org.apache.logging.log4j.core.config.LoggerConfig.callAppenders(LoggerConfig.java:448)         at org.apache.logging.log4j.core.config.LoggerConfig.processLogEvent(LoggerConfig.java:433)         at org.apache.logging.log4j.core.config.LoggerConfig.log(LoggerConfig.java:417)         at org.apache.logging.log4j.core.config.LoggerConfig.logParent(LoggerConfig.java:439)         at org.apache.logging.log4j.core.config.LoggerConfig.processLogEvent(LoggerConfig.java:434)         at org.apache.logging.log4j.core.config.LoggerConfig.log(LoggerConfig.java:417)         at org.apache.logging.log4j.core.config.LoggerConfig.logParent(LoggerConfig.java:439)         at org.apache.logging.log4j.core.config.LoggerConfig.processLogEvent(LoggerConfig.java:434)         at org.apache.logging.log4j.core.config.LoggerConfig.log(LoggerConfig.java:417)         at org.apache.logging.log4j.core.config.LoggerConfig.logParent(LoggerConfig.java:439)         at org.apache.logging.log4j.core.config.LoggerConfig.processLogEvent(LoggerConfig.java:434)         at org.apache.logging.log4j.core.config.LoggerConfig.log(LoggerConfig.java:417)         at org.apache.logging.log4j.core.config.LoggerConfig.log(LoggerConfig.java:403)         at org.apache.logging.log4j.core.config.DefaultReliabilityStrategy.log(DefaultReliabilityStrategy.java:49)         at org.apache.logging.log4j.core.Logger.logMessage(Logger.java:146)         at org.apache.logging.log4j.spi.AbstractLogger.tryLogMessage(AbstractLogger.java:2170)         at org.apache.logging.log4j.spi.AbstractLogger.logMessageTrackRecursion(AbstractLogger.java:2125)         at org.apache.logging.log4j.spi.AbstractLogger.logMessageSafely(AbstractLogger.java:2108)         at org.apache.logging.log4j.spi.AbstractLogger.logMessage(AbstractLogger.java:2002)         at org.apache.logging.log4j.spi.AbstractLogger.logIfEnabled(AbstractLogger.java:1974)         at org.apache.logging.slf4j.Log4jLogger.error(Log4jLogger.java:319)         at org.apache.solr.cloud.autoscaling.OverseerTriggerThread.run(OverseerTriggerThread.java:146)         at java.lang.Thread.run(Thread.java:748)

Stack Trace:
com.carrotsearch.randomizedtesting.ThreadLeakError: 1 thread leaked from SUITE scope at org.apache.solr.cloud.ZkControllerTest:
   1) Thread[id=16912, name=OverseerAutoScalingTriggerThread-73650673009164290-127.0.0.1:8983_solr-n_0000000001, state=RUNNABLE, group=Overseer autoscaling triggers]
        at org.apache.lucene.util.TestRuleLimitSysouts$DelegateStream.write(TestRuleLimitSysouts.java:128)
        at java.io.PrintStream.write(PrintStream.java:480)
        at org.apache.logging.log4j.core.util.CloseShieldOutputStream.write(CloseShieldOutputStream.java:53)
        at org.apache.logging.log4j.core.appender.OutputStreamManager.writeToDestination(OutputStreamManager.java:263)
        at org.apache.logging.log4j.core.appender.OutputStreamManager.flushBuffer(OutputStreamManager.java:295)
        at org.apache.logging.log4j.core.appender.OutputStreamManager.flush(OutputStreamManager.java:304)
        at org.apache.logging.log4j.core.appender.AbstractOutputStreamAppender.directEncodeEvent(AbstractOutputStreamAppender.java:179)
        at org.apache.logging.log4j.core.appender.AbstractOutputStreamAppender.tryAppend(AbstractOutputStreamAppender.java:170)
        at org.apache.logging.log4j.core.appender.AbstractOutputStreamAppender.append(AbstractOutputStreamAppender.java:161)
        at org.apache.logging.log4j.core.config.AppenderControl.tryCallAppender(AppenderControl.java:156)
        at org.apache.logging.log4j.core.config.AppenderControl.callAppender0(AppenderControl.java:129)
        at org.apache.logging.log4j.core.config.AppenderControl.callAppenderPreventRecursion(AppenderControl.java:120)
        at org.apache.logging.log4j.core.config.AppenderControl.callAppender(AppenderControl.java:84)
        at org.apache.logging.log4j.core.config.LoggerConfig.callAppenders(LoggerConfig.java:448)
        at org.apache.logging.log4j.core.config.LoggerConfig.processLogEvent(LoggerConfig.java:433)
        at org.apache.logging.log4j.core.config.LoggerConfig.log(LoggerConfig.java:417)
        at org.apache.logging.log4j.core.config.LoggerConfig.logParent(LoggerConfig.java:439)
        at org.apache.logging.log4j.core.config.LoggerConfig.processLogEvent(LoggerConfig.java:434)
        at org.apache.logging.log4j.core.config.LoggerConfig.log(LoggerConfig.java:417)
        at org.apache.logging.log4j.core.config.LoggerConfig.logParent(LoggerConfig.java:439)
        at org.apache.logging.log4j.core.config.LoggerConfig.processLogEvent(LoggerConfig.java:434)
        at org.apache.logging.log4j.core.config.LoggerConfig.log(LoggerConfig.java:417)
        at org.apache.logging.log4j.core.config.LoggerConfig.logParent(LoggerConfig.java:439)
        at org.apache.logging.log4j.core.config.LoggerConfig.processLogEvent(LoggerConfig.java:434)
        at org.apache.logging.log4j.core.config.LoggerConfig.log(LoggerConfig.java:417)
        at org.apache.logging.log4j.core.config.LoggerConfig.log(LoggerConfig.java:403)
        at org.apache.logging.log4j.core.config.DefaultReliabilityStrategy.log(DefaultReliabilityStrategy.java:49)
        at org.apache.logging.log4j.core.Logger.logMessage(Logger.java:146)
        at org.apache.logging.log4j.spi.AbstractLogger.tryLogMessage(AbstractLogger.java:2170)
        at org.apache.logging.log4j.spi.AbstractLogger.logMessageTrackRecursion(AbstractLogger.java:2125)
        at org.apache.logging.log4j.spi.AbstractLogger.logMessageSafely(AbstractLogger.java:2108)
        at org.apache.logging.log4j.spi.AbstractLogger.logMessage(AbstractLogger.java:2002)
        at org.apache.logging.log4j.spi.AbstractLogger.logIfEnabled(AbstractLogger.java:1974)
        at org.apache.logging.slf4j.Log4jLogger.error(Log4jLogger.java:319)
        at org.apache.solr.cloud.autoscaling.OverseerTriggerThread.run(OverseerTriggerThread.java:146)
        at java.lang.Thread.run(Thread.java:748)
        at __randomizedtesting.SeedInfo.seed([769471CD20BAB3FF]:0)


FAILED:  org.apache.solr.cloud.autoscaling.IndexSizeTriggerTest.testMergeIntegration

Error Message:
did not finish processing in time

Stack Trace:
java.lang.AssertionError: did not finish processing in time
        at __randomizedtesting.SeedInfo.seed([769471CD20BAB3FF:252D337DC2AB2605]:0)
        at org.junit.Assert.fail(Assert.java:93)
        at org.junit.Assert.assertTrue(Assert.java:43)
        at org.apache.solr.cloud.autoscaling.IndexSizeTriggerTest.testMergeIntegration(IndexSizeTriggerTest.java:404)
        at sun.reflect.NativeMethodAccessorImpl.invoke0(Native Method)
        at sun.reflect.NativeMethodAccessorImpl.invoke(NativeMethodAccessorImpl.java:62)
        at sun.reflect.DelegatingMethodAccessorImpl.invoke(DelegatingMethodAccessorImpl.java:43)
        at java.lang.reflect.Method.invoke(Method.java:498)
        at com.carrotsearch.randomizedtesting.RandomizedRunner.invoke(RandomizedRunner.java:1737)
        at com.carrotsearch.randomizedtesting.RandomizedRunner$8.evaluate(RandomizedRunner.java:934)
        at com.carrotsearch.randomizedtesting.RandomizedRunner$9.evaluate(RandomizedRunner.java:970)
        at com.carrotsearch.randomizedtesting.RandomizedRunner$10.evaluate(RandomizedRunner.java:984)
        at com.carrotsearch.randomizedtesting.rules.SystemPropertiesRestoreRule$1.evaluate(SystemPropertiesRestoreRule.java:57)
        at org.apache.lucene.util.TestRuleSetupTeardownChained$1.evaluate(TestRuleSetupTeardownChained.java:49)
        at org.apache.lucene.util.AbstractBeforeAfterRule$1.evaluate(AbstractBeforeAfterRule.java:45)
        at org.apache.lucene.util.TestRuleThreadAndTestName$1.evaluate(TestRuleThreadAndTestName.java:48)
        at org.apache.lucene.util.TestRuleIgnoreAfterMaxFailures$1.evaluate(TestRuleIgnoreAfterMaxFailures.java:64)
        at org.apache.lucene.util.TestRuleMarkFailure$1.evaluate(TestRuleMarkFailure.java:47)
        at com.carrotsearch.randomizedtesting.rules.StatementAdapter.evaluate(StatementAdapter.java:36)
        at com.carrotsearch.randomizedtesting.ThreadLeakControl$StatementRunner.run(ThreadLeakControl.java:368)
        at com.carrotsearch.randomizedtesting.ThreadLeakControl.forkTimeoutingTask(ThreadLeakControl.java:817)
        at com.carrotsearch.randomizedtesting.ThreadLeakControl$3.evaluate(ThreadLeakControl.java:468)
        at com.carrotsearch.randomizedtesting.RandomizedRunner.runSingleTest(RandomizedRunner.java:943)
        at com.carrotsearch.randomizedtesting.RandomizedRunner$5.evaluate(RandomizedRunner.java:829)
        at com.carrotsearch.randomizedtesting.RandomizedRunner$6.evaluate(RandomizedRunner.java:879)
        at com.carrotsearch.randomizedtesting.RandomizedRunner$7.evaluate(RandomizedRunner.java:890)
        at com.carrotsearch.randomizedtesting.rules.StatementAdapter.evaluate(StatementAdapter.java:36)
        at com.carrotsearch.randomizedtesting.rules.SystemPropertiesRestoreRule$1.evaluate(SystemPropertiesRestoreRule.java:57)
        at org.apache.lucene.util.AbstractBeforeAfterRule$1.evaluate(AbstractBeforeAfterRule.java:45)
        at com.carrotsearch.randomizedtesting.rules.StatementAdapter.evaluate(StatementAdapter.java:36)
        at org.apache.lucene.util.TestRuleStoreClassName$1.evaluate(TestRuleStoreClassName.java:41)
        at com.carrotsearch.randomizedtesting.rules.NoShadowingOrOverridesOnMethodsRule$1.evaluate(NoShadowingOrOverridesOnMethodsRule.java:40)
        at com.carrotsearch.randomizedtesting.rules.NoShadowingOrOverridesOnMethodsRule$1.evaluate(NoShadowingOrOverridesOnMethodsRule.java:40)
        at com.carrotsearch.randomizedtesting.rules.StatementAdapter.evaluate(StatementAdapter.java:36)
        at com.carrotsearch.randomizedtesting.rules.StatementAdapter.evaluate(StatementAdapter.java:36)
        at com.carrotsearch.randomizedtesting.rules.StatementAdapter.evaluate(StatementAdapter.java:36)
        at org.apache.lucene.util.TestRuleAssertionsRequired$1.evaluate(TestRuleAssertionsRequired.java:53)
        at org.apache.lucene.util.TestRuleMarkFailure$1.evaluate(TestRuleMarkFailure.java:47)
        at org.apache.lucene.util.TestRuleIgnoreAfterMaxFailures$1.evaluate(TestRuleIgnoreAfterMaxFailures.java:64)
        at org.apache.lucene.util.TestRuleIgnoreTestSuites$1.evaluate(TestRuleIgnoreTestSuites.java:54)
        at com.carrotsearch.randomizedtesting.rules.StatementAdapter.evaluate(StatementAdapter.java:36)
        at com.carrotsearch.randomizedtesting.ThreadLeakControl$StatementRunner.run(ThreadLeakControl.java:368)
        at java.lang.Thread.run(Thread.java:748)


FAILED:  org.apache.solr.cloud.hdfs.StressHdfsTest.test

Error Message:
Could not find collection:delete_data_dir

Stack Trace:
java.lang.AssertionError: Could not find collection:delete_data_dir
        at __randomizedtesting.SeedInfo.seed([769471CD20BAB3FF:FEC04E178E46DE07]:0)
        at org.junit.Assert.fail(Assert.java:93)
        at org.junit.Assert.assertTrue(Assert.java:43)
        at org.junit.Assert.assertNotNull(Assert.java:526)
        at org.apache.solr.cloud.AbstractDistribZkTestBase.waitForRecoveriesToFinish(AbstractDistribZkTestBase.java:155)
        at org.apache.solr.cloud.AbstractDistribZkTestBase.waitForRecoveriesToFinish(AbstractDistribZkTestBase.java:140)
        at org.apache.solr.cloud.AbstractDistribZkTestBase.waitForRecoveriesToFinish(AbstractDistribZkTestBase.java:135)
        at org.apache.solr.cloud.AbstractFullDistribZkTestBase.waitForRecoveriesToFinish(AbstractFullDistribZkTestBase.java:915)
        at org.apache.solr.cloud.hdfs.StressHdfsTest.createAndDeleteCollection(StressHdfsTest.java:161)
        at org.apache.solr.cloud.hdfs.StressHdfsTest.test(StressHdfsTest.java:105)
        at sun.reflect.NativeMethodAccessorImpl.invoke0(Native Method)
        at sun.reflect.NativeMethodAccessorImpl.invoke(NativeMethodAccessorImpl.java:62)
        at sun.reflect.DelegatingMethodAccessorImpl.invoke(DelegatingMethodAccessorImpl.java:43)
        at java.lang.reflect.Method.invoke(Method.java:498)
        at com.carrotsearch.randomizedtesting.RandomizedRunner.invoke(RandomizedRunner.java:1737)
        at com.carrotsearch.randomizedtesting.RandomizedRunner$8.evaluate(RandomizedRunner.java:934)
        at com.carrotsearch.randomizedtesting.RandomizedRunner$9.evaluate(RandomizedRunner.java:970)
        at com.carrotsearch.randomizedtesting.RandomizedRunner$10.evaluate(RandomizedRunner.java:984)
        at org.apache.solr.BaseDistributedSearchTestCase$ShardsRepeatRule$ShardsFixedStatement.callStatement(BaseDistributedSearchTestCase.java:993)
        at org.apache.solr.BaseDistributedSearchTestCase$ShardsRepeatRule$ShardsStatement.evaluate(BaseDistributedSearchTestCase.java:968)
        at com.carrotsearch.randomizedtesting.rules.SystemPropertiesRestoreRule$1.evaluate(SystemPropertiesRestoreRule.java:57)
        at org.apache.lucene.util.TestRuleSetupTeardownChained$1.evaluate(TestRuleSetupTeardownChained.java:49)
        at org.apache.lucene.util.AbstractBeforeAfterRule$1.evaluate(AbstractBeforeAfterRule.java:45)
        at org.apache.lucene.util.TestRuleThreadAndTestName$1.evaluate(TestRuleThreadAndTestName.java:48)
        at org.apache.lucene.util.TestRuleIgnoreAfterMaxFailures$1.evaluate(TestRuleIgnoreAfterMaxFailures.java:64)
        at org.apache.lucene.util.TestRuleMarkFailure$1.evaluate(TestRuleMarkFailure.java:47)
        at com.carrotsearch.randomizedtesting.rules.StatementAdapter.evaluate(StatementAdapter.java:36)
        at com.carrotsearch.randomizedtesting.ThreadLeakControl$StatementRunner.run(ThreadLeakControl.java:368)
        at com.carrotsearch.randomizedtesting.ThreadLeakControl.forkTimeoutingTask(ThreadLeakControl.java:817)
        at com.carrotsearch.randomizedtesting.ThreadLeakControl$3.evaluate(ThreadLeakControl.java:468)
        at com.carrotsearch.randomizedtesting.RandomizedRunner.runSingleTest(RandomizedRunner.java:943)
        at com.carrotsearch.randomizedtesting.RandomizedRunner$5.evaluate(RandomizedRunner.java:829)
        at com.carrotsearch.randomizedtesting.RandomizedRunner$6.evaluate(RandomizedRunner.java:879)
        at com.carrotsearch.randomizedtesting.RandomizedRunner$7.evaluate(RandomizedRunner.java:890)
        at com.carrotsearch.randomizedtesting.rules.StatementAdapter.evaluate(StatementAdapter.java:36)
        at com.carrotsearch.randomizedtesting.rules.SystemPropertiesRestoreRule$1.evaluate(SystemPropertiesRestoreRule.java:57)
        at org.apache.lucene.util.AbstractBeforeAfterRule$1.evaluate(AbstractBeforeAfterRule.java:45)
        at com.carrotsearch.randomizedtesting.rules.StatementAdapter.evaluate(StatementAdapter.java:36)
        at org.apache.lucene.util.TestRuleStoreClassName$1.evaluate(TestRuleStoreClassName.java:41)
        at com.carrotsearch.randomizedtesting.rules.NoShadowingOrOverridesOnMethodsRule$1.evaluate(NoShadowingOrOverridesOnMethodsRule.java:40)
        at com.carrotsearch.randomizedtesting.rules.NoShadowingOrOverridesOnMethodsRule$1.evaluate(NoShadowingOrOverridesOnMethodsRule.java:40)
        at com.carrotsearch.randomizedtesting.rules.StatementAdapter.evaluate(StatementAdapter.java:36)
        at com.carrotsearch.randomizedtesting.rules.StatementAdapter.evaluate(StatementAdapter.java:36)
        at com.carrotsearch.randomizedtesting.rules.StatementAdapter.evaluate(StatementAdapter.java:36)
        at org.apache.lucene.util.TestRuleAssertionsRequired$1.evaluate(TestRuleAssertionsRequired.java:53)
        at org.apache.lucene.util.TestRuleMarkFailure$1.evaluate(TestRuleMarkFailure.java:47)
        at org.apache.lucene.util.TestRuleIgnoreAfterMaxFailures$1.evaluate(TestRuleIgnoreAfterMaxFailures.java:64)
        at org.apache.lucene.util.TestRuleIgnoreTestSuites$1.evaluate(TestRuleIgnoreTestSuites.java:54)
        at com.carrotsearch.randomizedtesting.rules.StatementAdapter.evaluate(StatementAdapter.java:36)
        at com.carrotsearch.randomizedtesting.ThreadLeakControl$StatementRunner.run(ThreadLeakControl.java:368)
        at java.lang.Thread.run(Thread.java:748)


FAILED:  org.apache.solr.handler.TestReplicationHandler.doTestReplicateAfterCoreReload

Error Message:
expected:<[{indexVersion=1524055086647,generation=2,filelist=[_1wk.cfe, _1wk.cfs, _1wk.si, _1wr.fdt, _1wr.fdx, _1wr.fnm, _1wr.nvd, _1wr.nvm, _1wr.si, _1wr_MockRandom_0.doc, _1wr_MockRandom_0.sd, _1wr_MockRandom_0.tim, _1wr_MockRandom_0.tip, _1ws.fdt, _1ws.fdx, _1ws.fnm, _1ws.nvd, _1ws.nvm, _1ws.si, _1ws_MockRandom_0.doc, _1ws_MockRandom_0.sd, _1ws_MockRandom_0.tbk, _1ws_MockRandom_0.tix, _1wx.fdt, _1wx.fdx, _1wx.fnm, _1wx.nvd, _1wx.nvm, _1wx.si, _1wx_MockRandom_0.doc, _1wx_MockRandom_0.sd, _1wx_MockRandom_0.tfp, _1wy.fdt, _1wy.fdx, _1wy.fnm, _1wy.nvd, _1wy.nvm, _1wy.si, _1wy_MockRandom_0.doc, _1wy_MockRandom_0.sd, _1wy_MockRandom_0.tib, _1wy_MockRandom_0.tiv, _1wz.fdt, _1wz.fdx, _1wz.fnm, _1wz.nvd, _1wz.nvm, _1wz.si, _1wz_MockRandom_0.doc, _1wz_MockRandom_0.sd, _1wz_MockRandom_0.tfp, _1x0.fdt, _1x0.fdx, _1x0.fnm, _1x0.nvd, _1x0.nvm, _1x0.si, _1x0_MockRandom_0.doc, _1x0_MockRandom_0.sd, _1x0_MockRandom_0.tio, _1x0_MockRandom_0.tipo, _1x1.fdt, _1x1.fdx, _1x1.fnm, _1x1.nvd, _1x1.nvm, _1x1.si, _1x1_MockRandom_0.doc, _1x1_MockRandom_0.sd, _1x1_MockRandom_0.tib, _1x1_MockRandom_0.tii, _1x2.fdt, _1x2.fdx, _1x2.fnm, _1x2.nvd, _1x2.nvm, _1x2.si, _1x2_MockRandom_0.doc, _1x2_MockRandom_0.sd, _1x2_MockRandom_0.tib, _1x2_MockRandom_0.tii, _1x3.fdt, _1x3.fdx, _1x3.fnm, _1x3.nvd, _1x3.nvm, _1x3.si, _1x3_MockRandom_0.doc, _1x3_MockRandom_0.sd, _1x3_MockRandom_0.tbk, _1x3_MockRandom_0.tix, _1x4.fdt, _1x4.fdx, _1x4.fnm, _1x4.nvd, _1x4.nvm, _1x4.si, _1x4_MockRandom_0.doc, _1x4_MockRandom_0.sd, _1x4_MockRandom_0.tbk, _1x4_MockRandom_0.tix, _1x5.fdt, _1x5.fdx, _1x5.fnm, _1x5.nvd, _1x5.nvm, _1x5.si, _1x5_MockRandom_0.doc, _1x5_MockRandom_0.sd, _1x5_MockRandom_0.tfp, _1x6.fdt, _1x6.fdx, _1x6.fnm, _1x6.nvd, _1x6.nvm, _1x6.si, _1x6_MockRandom_0.doc, _1x6_MockRandom_0.sd, _1x6_MockRandom_0.tio, _1x6_MockRandom_0.tipo, _1x7.fdt, _1x7.fdx, _1x7.fnm, _1x7.nvd, _1x7.nvm, _1x7.si, _1x7_MockRandom_0.doc, _1x7_MockRandom_0.sd, _1x7_MockRandom_0.tib, _1x7_MockRandom_0.tii, _1x8.fdt, _1x8.fdx, _1x8.fnm, _1x8.nvd, _1x8.nvm, _1x8.si, _1x8_MockRandom_0.doc, _1x8_MockRandom_0.sd, _1x8_MockRandom_0.tio, _1x8_MockRandom_0.tipo, _1x9.fdt, _1x9.fdx, _1x9.fnm, _1x9.nvd, _1x9.nvm, _1x9.si, _1x9_MockRandom_0.doc, _1x9_MockRandom_0.sd, _1x9_MockRandom_0.tfp, _1xa.fdt, _1xa.fdx, _1xa.fnm, _1xa.nvd, _1xa.nvm, _1xa.si, _1xa_MockRandom_0.doc, _1xa_MockRandom_0.sd, _1xa_MockRandom_0.tim, _1xa_MockRandom_0.tip, _1xb.fdt, _1xb.fdx, _1xb.fnm, _1xb.nvd, _1xb.nvm, _1xb.si, _1xb_MockRandom_0.doc, _1xb_MockRandom_0.sd, _1xb_MockRandom_0.tbk, _1xb_MockRandom_0.tix, _1xc.fdt, _1xc.fdx, _1xc.fnm, _1xc.nvd, _1xc.nvm, _1xc.si, _1xc_MockRandom_0.doc, _1xc_MockRandom_0.sd, _1xc_MockRandom_0.tfp, _1xd.fdt, _1xd.fdx, _1xd.fnm, _1xd.nvd, _1xd.nvm, _1xd.si, _1xd_MockRandom_0.doc, _1xd_MockRandom_0.sd, _1xd_MockRandom_0.tfp, _1xe.fdt, _1xe.fdx, _1xe.fnm, _1xe.nvd, _1xe.nvm, _1xe.si, _1xe_MockRandom_0.doc, _1xe_MockRandom_0.sd, _1xe_MockRandom_0.tim, _1xe_MockRandom_0.tip, _1xf.fdt, _1xf.fdx, _1xf.fnm, _1xf.nvd, _1xf.nvm, _1xf.si, _1xf_MockRandom_0.doc, _1xf_MockRandom_0.sd, _1xf_MockRandom_0.tfp, _1xg.fdt, _1xg.fdx, _1xg.fnm, _1xg.nvd, _1xg.nvm, _1xg.si, _1xg_MockRandom_0.doc, _1xg_MockRandom_0.sd, _1xg_MockRandom_0.tbk, _1xg_MockRandom_0.tix, _1xh.fdt, _1xh.fdx, _1xh.fnm, _1xh.nvd, _1xh.nvm, _1xh.si, _1xh_MockRandom_0.doc, _1xh_MockRandom_0.sd, _1xh_MockRandom_0.tbk, _1xh_MockRandom_0.tix, _1xi.fdt, _1xi.fdx, _1xi.fnm, _1xi.nvd, _1xi.nvm, _1xi.si, _1xi_MockRandom_0.doc, _1xi_MockRandom_0.sd, _1xi_MockRandom_0.tib, _1xi_MockRandom_0.tiv, _1xk.fdt, _1xk.fdx, _1xk.fnm, _1xk.nvd, _1xk.nvm, _1xk.si, _1xk_MockRandom_0.doc, _1xk_MockRandom_0.sd, _1xk_MockRandom_0.tio, _1xk_MockRandom_0.tipo, _1xl.fdt, _1xl.fdx, _1xl.fnm, _1xl.nvd, _1xl.nvm, _1xl.si, _1xl_MockRandom_0.doc, _1xl_MockRandom_0.sd, _1xl_MockRandom_0.tio, _1xl_MockRandom_0.tipo, _1xm.fdt, _1xm.fdx, _1xm.fnm, _1xm.nvd, _1xm.nvm, _1xm.si, _1xm_MockRandom_0.doc, _1xm_MockRandom_0.sd, _1xm_MockRandom_0.tio, _1xm_MockRandom_0.tipo, segments_2]}]> but was:<[{indexVersion=1524055086647,generation=2,filelist=[_1wk.cfe, _1wk.cfs, _1wk.si, _1wr.fdt, _1wr.fdx, _1wr.fnm, _1wr.nvd, _1wr.nvm, _1wr.si, _1wr_MockRandom_0.doc, _1wr_MockRandom_0.sd, _1wr_MockRandom_0.tim, _1wr_MockRandom_0.tip, _1ws.fdt, _1ws.fdx, _1ws.fnm, _1ws.nvd, _1ws.nvm, _1ws.si, _1ws_MockRandom_0.doc, _1ws_MockRandom_0.sd, _1ws_MockRandom_0.tbk, _1ws_MockRandom_0.tix, _1wx.fdt, _1wx.fdx, _1wx.fnm, _1wx.nvd, _1wx.nvm, _1wx.si, _1wx_MockRandom_0.doc, _1wx_MockRandom_0.sd, _1wx_MockRandom_0.tfp, _1wy.fdt, _1wy.fdx, _1wy.fnm, _1wy.nvd, _1wy.nvm, _1wy.si, _1wy_MockRandom_0.doc, _1wy_MockRandom_0.sd, _1wy_MockRandom_0.tib, _1wy_MockRandom_0.tiv, _1wz.fdt, _1wz.fdx, _1wz.fnm, _1wz.nvd, _1wz.nvm, _1wz.si, _1wz_MockRandom_0.doc, _1wz_MockRandom_0.sd, _1wz_MockRandom_0.tfp, _1x0.fdt, _1x0.fdx, _1x0.fnm, _1x0.nvd, _1x0.nvm, _1x0.si, _1x0_MockRandom_0.doc, _1x0_MockRandom_0.sd, _1x0_MockRandom_0.tio, _1x0_MockRandom_0.tipo, _1x1.fdt, _1x1.fdx, _1x1.fnm, _1x1.nvd, _1x1.nvm, _1x1.si, _1x1_MockRandom_0.doc, _1x1_MockRandom_0.sd, _1x1_MockRandom_0.tib, _1x1_MockRandom_0.tii, _1x2.fdt, _1x2.fdx, _1x2.fnm, _1x2.nvd, _1x2.nvm, _1x2.si, _1x2_MockRandom_0.doc, _1x2_MockRandom_0.sd, _1x2_MockRandom_0.tib, _1x2_MockRandom_0.tii, _1x3.fdt, _1x3.fdx, _1x3.fnm, _1x3.nvd, _1x3.nvm, _1x3.si, _1x3_MockRandom_0.doc, _1x3_MockRandom_0.sd, _1x3_MockRandom_0.tbk, _1x3_MockRandom_0.tix, _1x4.fdt, _1x4.fdx, _1x4.fnm, _1x4.nvd, _1x4.nvm, _1x4.si, _1x4_MockRandom_0.doc, _1x4_MockRandom_0.sd, _1x4_MockRandom_0.tbk, _1x4_MockRandom_0.tix, _1x5.fdt, _1x5.fdx, _1x5.fnm, _1x5.nvd, _1x5.nvm, _1x5.si, _1x5_MockRandom_0.doc, _1x5_MockRandom_0.sd, _1x5_MockRandom_0.tfp, _1x6.fdt, _1x6.fdx, _1x6.fnm, _1x6.nvd, _1x6.nvm, _1x6.si, _1x6_MockRandom_0.doc, _1x6_MockRandom_0.sd, _1x6_MockRandom_0.tio, _1x6_MockRandom_0.tipo, _1x7.fdt, _1x7.fdx, _1x7.fnm, _1x7.nvd, _1x7.nvm, _1x7.si, _1x7_MockRandom_0.doc, _1x7_MockRandom_0.sd, _1x7_MockRandom_0.tib, _1x7_MockRandom_0.tii, _1x8.fdt, _1x8.fdx, _1x8.fnm, _1x8.nvd, _1x8.nvm, _1x8.si, _1x8_MockRandom_0.doc, _1x8_MockRandom_0.sd, _1x8_MockRandom_0.tio, _1x8_MockRandom_0.tipo, _1x9.fdt, _1x9.fdx, _1x9.fnm, _1x9.nvd, _1x9.nvm, _1x9.si, _1x9_MockRandom_0.doc, _1x9_MockRandom_0.sd, _1x9_MockRandom_0.tfp, _1xa.fdt, _1xa.fdx, _1xa.fnm, _1xa.nvd, _1xa.nvm, _1xa.si, _1xa_MockRandom_0.doc, _1xa_MockRandom_0.sd, _1xa_MockRandom_0.tim, _1xa_MockRandom_0.tip, _1xb.fdt, _1xb.fdx, _1xb.fnm, _1xb.nvd, _1xb.nvm, _1xb.si, _1xb_MockRandom_0.doc, _1xb_MockRandom_0.sd, _1xb_MockRandom_0.tbk, _1xb_MockRandom_0.tix, _1xc.fdt, _1xc.fdx, _1xc.fnm, _1xc.nvd, _1xc.nvm, _1xc.si, _1xc_MockRandom_0.doc, _1xc_MockRandom_0.sd, _1xc_MockRandom_0.tfp, _1xd.fdt, _1xd.fdx, _1xd.fnm, _1xd.nvd, _1xd.nvm, _1xd.si, _1xd_MockRandom_0.doc, _1xd_MockRandom_0.sd, _1xd_MockRandom_0.tfp, _1xe.fdt, _1xe.fdx, _1xe.fnm, _1xe.nvd, _1xe.nvm, _1xe.si, _1xe_MockRandom_0.doc, _1xe_MockRandom_0.sd, _1xe_MockRandom_0.tim, _1xe_MockRandom_0.tip, _1xf.fdt, _1xf.fdx, _1xf.fnm, _1xf.nvd, _1xf.nvm, _1xf.si, _1xf_MockRandom_0.doc, _1xf_MockRandom_0.sd, _1xf_MockRandom_0.tfp, _1xg.fdt, _1xg.fdx, _1xg.fnm, _1xg.nvd, _1xg.nvm, _1xg.si, _1xg_MockRandom_0.doc, _1xg_MockRandom_0.sd, _1xg_MockRandom_0.tbk, _1xg_MockRandom_0.tix, _1xh.fdt, _1xh.fdx, _1xh.fnm, _1xh.nvd, _1xh.nvm, _1xh.si, _1xh_MockRandom_0.doc, _1xh_MockRandom_0.sd, _1xh_MockRandom_0.tbk, _1xh_MockRandom_0.tix, _1xi.fdt, _1xi.fdx, _1xi.fnm, _1xi.nvd, _1xi.nvm, _1xi.si, _1xi_MockRandom_0.doc, _1xi_MockRandom_0.sd, _1xi_MockRandom_0.tib, _1xi_MockRandom_0.tiv, _1xk.fdt, _1xk.fdx, _1xk.fnm, _1xk.nvd, _1xk.nvm, _1xk.si, _1xk_MockRandom_0.doc, _1xk_MockRandom_0.sd, _1xk_MockRandom_0.tio, _1xk_MockRandom_0.tipo, _1xl.fdt, _1xl.fdx, _1xl.fnm, _1xl.nvd, _1xl.nvm, _1xl.si, _1xl_MockRandom_0.doc, _1xl_MockRandom_0.sd, _1xl_MockRandom_0.tio, _1xl_MockRandom_0.tipo, _1xm.fdt, _1xm.fdx, _1xm.fnm, _1xm.nvd, _1xm.nvm, _1xm.si, _1xm_MockRandom_0.doc, _1xm_MockRandom_0.sd, _1xm_MockRandom_0.tio, _1xm_MockRandom_0.tipo, segments_2]}, {indexVersion=1524055086647,generation=3,filelist=[_1wy.fdt, _1wy.fdx, _1wy.fnm, _1wy.nvd, _1wy.nvm, _1wy.si, _1wy_MockRandom_0.doc, _1wy_MockRandom_0.sd, _1wy_MockRandom_0.tib, _1wy_MockRandom_0.tiv, _1x1.fdt, _1x1.fdx, _1x1.fnm, _1x1.nvd, _1x1.nvm, _1x1.si, _1x1_MockRandom_0.doc, _1x1_MockRandom_0.sd, _1x1_MockRandom_0.tib, _1x1_MockRandom_0.tii, _1x4.fdt, _1x4.fdx, _1x4.fnm, _1x4.nvd, _1x4.nvm, _1x4.si, _1x4_MockRandom_0.doc, _1x4_MockRandom_0.sd, _1x4_MockRandom_0.tbk, _1x4_MockRandom_0.tix, _1x7.fdt, _1x7.fdx, _1x7.fnm, _1x7.nvd, _1x7.nvm, _1x7.si, _1x7_MockRandom_0.doc, _1x7_MockRandom_0.sd, _1x7_MockRandom_0.tib, _1x7_MockRandom_0.tii, _1x9.fdt, _1x9.fdx, _1x9.fnm, _1x9.nvd, _1x9.nvm, _1x9.si, _1x9_MockRandom_0.doc, _1x9_MockRandom_0.sd, _1x9_MockRandom_0.tfp, _1xc.fdt, _1xc.fdx, _1xc.fnm, _1xc.nvd, _1xc.nvm, _1xc.si, _1xc_MockRandom_0.doc, _1xc_MockRandom_0.sd, _1xc_MockRandom_0.tfp, _1xi.fdt, _1xi.fdx, _1xi.fnm, _1xi.nvd, _1xi.nvm, _1xi.si, _1xi_MockRandom_0.doc, _1xi_MockRandom_0.sd, _1xi_MockRandom_0.tib, _1xi_MockRandom_0.tiv, _1xj.cfe, _1xj.cfs, _1xj.si, _1xk.fdt, _1xk.fdx, _1xk.fnm, _1xk.nvd, _1xk.nvm, _1xk.si, _1xk_MockRandom_0.doc, _1xk_MockRandom_0.sd, _1xk_MockRandom_0.tio, _1xk_MockRandom_0.tipo, _1xl.fdt, _1xl.fdx, _1xl.fnm, _1xl.nvd, _1xl.nvm, _1xl.si, _1xl_MockRandom_0.doc, _1xl_MockRandom_0.sd, _1xl_MockRandom_0.tio, _1xl_MockRandom_0.tipo, _1xm.fdt, _1xm.fdx, _1xm.fnm, _1xm.nvd, _1xm.nvm, _1xm.si, _1xm_MockRandom_0.doc, _1xm_MockRandom_0.sd, _1xm_MockRandom_0.tio, _1xm_MockRandom_0.tipo, segments_3]}]>

Stack Trace:
java.lang.AssertionError: expected:<[{indexVersion=1524055086647,generation=2,filelist=[_1wk.cfe, _1wk.cfs, _1wk.si, _1wr.fdt, _1wr.fdx, _1wr.fnm, _1wr.nvd, _1wr.nvm, _1wr.si, _1wr_MockRandom_0.doc, _1wr_MockRandom_0.sd, _1wr_MockRandom_0.tim, _1wr_MockRandom_0.tip, _1ws.fdt, _1ws.fdx, _1ws.fnm, _1ws.nvd, _1ws.nvm, _1ws.si, _1ws_MockRandom_0.doc, _1ws_MockRandom_0.sd, _1ws_MockRandom_0.tbk, _1ws_MockRandom_0.tix, _1wx.fdt, _1wx.fdx, _1wx.fnm, _1wx.nvd, _1wx.nvm, _1wx.si, _1wx_MockRandom_0.doc, _1wx_MockRandom_0.sd, _1wx_MockRandom_0.tfp, _1wy.fdt, _1wy.fdx, _1wy.fnm, _1wy.nvd, _1wy.nvm, _1wy.si, _1wy_MockRandom_0.doc, _1wy_MockRandom_0.sd, _1wy_MockRandom_0.tib, _1wy_MockRandom_0.tiv, _1wz.fdt, _1wz.fdx, _1wz.fnm, _1wz.nvd, _1wz.nvm, _1wz.si, _1wz_MockRandom_0.doc, _1wz_MockRandom_0.sd, _1wz_MockRandom_0.tfp, _1x0.fdt, _1x0.fdx, _1x0.fnm, _1x0.nvd, _1x0.nvm, _1x0.si, _1x0_MockRandom_0.doc, _1x0_MockRandom_0.sd, _1x0_MockRandom_0.tio, _1x0_MockRandom_0.tipo, _1x1.fdt, _1x1.fdx, _1x1.fnm, _1x1.nvd, _1x1.nvm, _1x1.si, _1x1_MockRandom_0.doc, _1x1_MockRandom_0.sd, _1x1_MockRandom_0.tib, _1x1_MockRandom_0.tii, _1x2.fdt, _1x2.fdx, _1x2.fnm, _1x2.nvd, _1x2.nvm, _1x2.si, _1x2_MockRandom_0.doc, _1x2_MockRandom_0.sd, _1x2_MockRandom_0.tib, _1x2_MockRandom_0.tii, _1x3.fdt, _1x3.fdx, _1x3.fnm, _1x3.nvd, _1x3.nvm, _1x3.si, _1x3_MockRandom_0.doc, _1x3_MockRandom_0.sd, _1x3_MockRandom_0.tbk, _1x3_MockRandom_0.tix, _1x4.fdt, _1x4.fdx, _1x4.fnm, _1x4.nvd, _1x4.nvm, _1x4.si, _1x4_MockRandom_0.doc, _1x4_MockRandom_0.sd, _1x4_MockRandom_0.tbk, _1x4_MockRandom_0.tix, _1x5.fdt, _1x5.fdx, _1x5.fnm, _1x5.nvd, _1x5.nvm, _1x5.si, _1x5_MockRandom_0.doc, _1x5_MockRandom_0.sd, _1x5_MockRandom_0.tfp, _1x6.fdt, _1x6.fdx, _1x6.fnm, _1x6.nvd, _1x6.nvm, _1x6.si, _1x6_MockRandom_0.doc, _1x6_MockRandom_0.sd, _1x6_MockRandom_0.tio, _1x6_MockRandom_0.tipo, _1x7.fdt, _1x7.fdx, _1x7.fnm, _1x7.nvd, _1x7.nvm, _1x7.si, _1x7_MockRandom_0.doc, _1x7_MockRandom_0.sd, _1x7_MockRandom_0.tib, _1x7_MockRandom_0.tii, _1x8.fdt, _1x8.fdx, _1x8.fnm, _1x8.nvd, _1x8.nvm, _1x8.si, _1x8_MockRandom_0.doc, _1x8_MockRandom_0.sd, _1x8_MockRandom_0.tio, _1x8_MockRandom_0.tipo, _1x9.fdt, _1x9.fdx, _1x9.fnm, _1x9.nvd, _1x9.nvm, _1x9.si, _1x9_MockRandom_0.doc, _1x9_MockRandom_0.sd, _1x9_MockRandom_0.tfp, _1xa.fdt, _1xa.fdx, _1xa.fnm, _1xa.nvd, _1xa.nvm, _1xa.si, _1xa_MockRandom_0.doc, _1xa_MockRandom_0.sd, _1xa_MockRandom_0.tim, _1xa_MockRandom_0.tip, _1xb.fdt, _1xb.fdx, _1xb.fnm, _1xb.nvd, _1xb.nvm, _1xb.si, _1xb_MockRandom_0.doc, _1xb_MockRandom_0.sd, _1xb_MockRandom_0.tbk, _1xb_MockRandom_0.tix, _1xc.fdt, _1xc.fdx, _1xc.fnm, _1xc.nvd, _1xc.nvm, _1xc.si, _1xc_MockRandom_0.doc, _1xc_MockRandom_0.sd, _1xc_MockRandom_0.tfp, _1xd.fdt, _1xd.fdx, _1xd.fnm, _1xd.nvd, _1xd.nvm, _1xd.si, _1xd_MockRandom_0.doc, _1xd_MockRandom_0.sd, _1xd_MockRandom_0.tfp, _1xe.fdt, _1xe.fdx, _1xe.fnm, _1xe.nvd, _1xe.nvm, _1xe.si, _1xe_MockRandom_0.doc, _1xe_MockRandom_0.sd, _1xe_MockRandom_0.tim, _1xe_MockRandom_0.tip, _1xf.fdt, _1xf.fdx, _1xf.fnm, _1xf.nvd, _1xf.nvm, _1xf.si, _1xf_MockRandom_0.doc, _1xf_MockRandom_0.sd, _1xf_MockRandom_0.tfp, _1xg.fdt, _1xg.fdx, _1xg.fnm, _1xg.nvd, _1xg.nvm, _1xg.si, _1xg_MockRandom_0.doc, _1xg_MockRandom_0.sd, _1xg_MockRandom_0.tbk, _1xg_MockRandom_0.tix, _1xh.fdt, _1xh.fdx, _1xh.fnm, _1xh.nvd, _1xh.nvm, _1xh.si, _1xh_MockRandom_0.doc, _1xh_MockRandom_0.sd, _1xh_MockRandom_0.tbk, _1xh_MockRandom_0.tix, _1xi.fdt, _1xi.fdx, _1xi.fnm, _1xi.nvd, _1xi.nvm, _1xi.si, _1xi_MockRandom_0.doc, _1xi_MockRandom_0.sd, _1xi_MockRandom_0.tib, _1xi_MockRandom_0.tiv, _1xk.fdt, _1xk.fdx, _1xk.fnm, _1xk.nvd, _1xk.nvm, _1xk.si, _1xk_MockRandom_0.doc, _1xk_MockRandom_0.sd, _1xk_MockRandom_0.tio, _1xk_MockRandom_0.tipo, _1xl.fdt, _1xl.fdx, _1xl.fnm, _1xl.nvd, _1xl.nvm, _1xl.si, _1xl_MockRandom_0.doc, _1xl_MockRandom_0.sd, _1xl_MockRandom_0.tio, _1xl_MockRandom_0.tipo, _1xm.fdt, _1xm.fdx, _1xm.fnm, _1xm.nvd, _1xm.nvm, _1xm.si, _1xm_MockRandom_0.doc, _1xm_MockRandom_0.sd, _1xm_MockRandom_0.tio, _1xm_MockRandom_0.tipo, segments_2]}]> but was:<[{indexVersion=1524055086647,generation=2,filelist=[_1wk.cfe, _1wk.cfs, _1wk.si, _1wr.fdt, _1wr.fdx, _1wr.fnm, _1wr.nvd, _1wr.nvm, _1wr.si, _1wr_MockRandom_0.doc, _1wr_MockRandom_0.sd, _1wr_MockRandom_0.tim, _1wr_MockRandom_0.tip, _1ws.fdt, _1ws.fdx, _1ws.fnm, _1ws.nvd, _1ws.nvm, _1ws.si, _1ws_MockRandom_0.doc, _1ws_MockRandom_0.sd, _1ws_MockRandom_0.tbk, _1ws_MockRandom_0.tix, _1wx.fdt, _1wx.fdx, _1wx.fnm, _1wx.nvd, _1wx.nvm, _1wx.si, _1wx_MockRandom_0.doc, _1wx_MockRandom_0.sd, _1wx_MockRandom_0.tfp, _1wy.fdt, _1wy.fdx, _1wy.fnm, _1wy.nvd, _1wy.nvm, _1wy.si, _1wy_MockRandom_0.doc, _1wy_MockRandom_0.sd, _1wy_MockRandom_0.tib, _1wy_MockRandom_0.tiv, _1wz.fdt, _1wz.fdx, _1wz.fnm, _1wz.nvd, _1wz.nvm, _1wz.si, _1wz_MockRandom_0.doc, _1wz_MockRandom_0.sd, _1wz_MockRandom_0.tfp, _1x0.fdt, _1x0.fdx, _1x0.fnm, _1x0.nvd, _1x0.nvm, _1x0.si, _1x0_MockRandom_0.doc, _1x0_MockRandom_0.sd, _1x0_MockRandom_0.tio, _1x0_MockRandom_0.tipo, _1x1.fdt, _1x1.fdx, _1x1.fnm, _1x1.nvd, _1x1.nvm, _1x1.si, _1x1_MockRandom_0.doc, _1x1_MockRandom_0.sd, _1x1_MockRandom_0.tib, _1x1_MockRandom_0.tii, _1x2.fdt, _1x2.fdx, _1x2.fnm, _1x2.nvd, _1x2.nvm, _1x2.si, _1x2_MockRandom_0.doc, _1x2_MockRandom_0.sd, _1x2_MockRandom_0.tib, _1x2_MockRandom_0.tii, _1x3.fdt, _1x3.fdx, _1x3.fnm, _1x3.nvd, _1x3.nvm, _1x3.si, _1x3_MockRandom_0.doc, _1x3_MockRandom_0.sd, _1x3_MockRandom_0.tbk, _1x3_MockRandom_0.tix, _1x4.fdt, _1x4.fdx, _1x4.fnm, _1x4.nvd, _1x4.nvm, _1x4.si, _1x4_MockRandom_0.doc, _1x4_MockRandom_0.sd, _1x4_MockRandom_0.tbk, _1x4_MockRandom_0.tix, _1x5.fdt, _1x5.fdx, _1x5.fnm, _1x5.nvd, _1x5.nvm, _1x5.si, _1x5_MockRandom_0.doc, _1x5_MockRandom_0.sd, _1x5_MockRandom_0.tfp, _1x6.fdt, _1x6.fdx, _1x6.fnm, _1x6.nvd, _1x6.nvm, _1x6.si, _1x6_MockRandom_0.doc, _1x6_MockRandom_0.sd, _1x6_MockRandom_0.tio, _1x6_MockRandom_0.tipo, _1x7.fdt, _1x7.fdx, _1x7.fnm, _1x7.nvd, _1x7.nvm, _1x7.si, _1x7_MockRandom_0.doc, _1x7_MockRandom_0.sd, _1x7_MockRandom_0.tib, _1x7_MockRandom_0.tii, _1x8.fdt, _1x8.fdx, _1x8.fnm, _1x8.nvd, _1x8.nvm, _1x8.si, _1x8_MockRandom_0.doc, _1x8_MockRandom_0.sd, _1x8_MockRandom_0.tio, _1x8_MockRandom_0.tipo, _1x9.fdt, _1x9.fdx, _1x9.fnm, _1x9.nvd, _1x9.nvm, _1x9.si, _1x9_MockRandom_0.doc, _1x9_MockRandom_0.sd, _1x9_MockRandom_0.tfp, _1xa.fdt, _1xa.fdx, _1xa.fnm, _1xa.nvd, _1xa.nvm, _1xa.si, _1xa_MockRandom_0.doc, _1xa_MockRandom_0.sd, _1xa_MockRandom_0.tim, _1xa_MockRandom_0.tip, _1xb.fdt, _1xb.fdx, _1xb.fnm, _1xb.nvd, _1xb.nvm, _1xb.si, _1xb_MockRandom_0.doc, _1xb_MockRandom_0.sd, _1xb_MockRandom_0.tbk, _1xb_MockRandom_0.tix, _1xc.fdt, _1xc.fdx, _1xc.fnm, _1xc.nvd, _1xc.nvm, _1xc.si, _1xc_MockRandom_0.doc, _1xc_MockRandom_0.sd, _1xc_MockRandom_0.tfp, _1xd.fdt, _1xd.fdx, _1xd.fnm, _1xd.nvd, _1xd.nvm, _1xd.si, _1xd_MockRandom_0.doc, _1xd_MockRandom_0.sd, _1xd_MockRandom_0.tfp, _1xe.fdt, _1xe.fdx, _1xe.fnm, _1xe.nvd, _1xe.nvm, _1xe.si, _1xe_MockRandom_0.doc, _1xe_MockRandom_0.sd, _1xe_MockRandom_0.tim, _1xe_MockRandom_0.tip, _1xf.fdt, _1xf.fdx, _1xf.fnm, _1xf.nvd, _1xf.nvm, _1xf.si, _1xf_MockRandom_0.doc, _1xf_MockRandom_0.sd, _1xf_MockRandom_0.tfp, _1xg.fdt, _1xg.fdx, _1xg.fnm, _1xg.nvd, _1xg.nvm, _1xg.si, _1xg_MockRandom_0.doc, _1xg_MockRandom_0.sd, _1xg_MockRandom_0.tbk, _1xg_MockRandom_0.tix, _1xh.fdt, _1xh.fdx, _1xh.fnm, _1xh.nvd, _1xh.nvm, _1xh.si, _1xh_MockRandom_0.doc, _1xh_MockRandom_0.sd, _1xh_MockRandom_0.tbk, _1xh_MockRandom_0.tix, _1xi.fdt, _1xi.fdx, _1xi.fnm, _1xi.nvd, _1xi.nvm, _1xi.si, _1xi_MockRandom_0.doc, _1xi_MockRandom_0.sd, _1xi_MockRandom_0.tib, _1xi_MockRandom_0.tiv, _1xk.fdt, _1xk.fdx, _1xk.fnm, _1xk.nvd, _1xk.nvm, _1xk.si, _1xk_MockRandom_0.doc, _1xk_MockRandom_0.sd, _1xk_MockRandom_0.tio, _1xk_MockRandom_0.tipo, _1xl.fdt, _1xl.fdx, _1xl.fnm, _1xl.nvd, _1xl.nvm, _1xl.si, _1xl_MockRandom_0.doc, _1xl_MockRandom_0.sd, _1xl_MockRandom_0.tio, _1xl_MockRandom_0.tipo, _1xm.fdt, _1xm.fdx, _1xm.fnm, _1xm.nvd, _1xm.nvm, _1xm.si, _1xm_MockRandom_0.doc, _1xm_MockRandom_0.sd, _1xm_MockRandom_0.tio, _1xm_MockRandom_0.tipo, segments_2]}, {indexVersion=1524055086647,generation=3,filelist=[_1wy.fdt, _1wy.fdx, _1wy.fnm, _1wy.nvd, _1wy.nvm, _1wy.si, _1wy_MockRandom_0.doc, _1wy_MockRandom_0.sd, _1wy_MockRandom_0.tib, _1wy_MockRandom_0.tiv, _1x1.fdt, _1x1.fdx, _1x1.fnm, _1x1.nvd, _1x1.nvm, _1x1.si, _1x1_MockRandom_0.doc, _1x1_MockRandom_0.sd, _1x1_MockRandom_0.tib, _1x1_MockRandom_0.tii, _1x4.fdt, _1x4.fdx, _1x4.fnm, _1x4.nvd, _1x4.nvm, _1x4.si, _1x4_MockRandom_0.doc, _1x4_MockRandom_0.sd, _1x4_MockRandom_0.tbk, _1x4_MockRandom_0.tix, _1x7.fdt, _1x7.fdx, _1x7.fnm, _1x7.nvd, _1x7.nvm, _1x7.si, _1x7_MockRandom_0.doc, _1x7_MockRandom_0.sd, _1x7_MockRandom_0.tib, _1x7_MockRandom_0.tii, _1x9.fdt, _1x9.fdx, _1x9.fnm, _1x9.nvd, _1x9.nvm, _1x9.si, _1x9_MockRandom_0.doc, _1x9_MockRandom_0.sd, _1x9_MockRandom_0.tfp, _1xc.fdt, _1xc.fdx, _1xc.fnm, _1xc.nvd, _1xc.nvm, _1xc.si, _1xc_MockRandom_0.doc, _1xc_MockRandom_0.sd, _1xc_MockRandom_0.tfp, _1xi.fdt, _1xi.fdx, _1xi.fnm, _1xi.nvd, _1xi.nvm, _1xi.si, _1xi_MockRandom_0.doc, _1xi_MockRandom_0.sd, _1xi_MockRandom_0.tib, _1xi_MockRandom_0.tiv, _1xj.cfe, _1xj.cfs, _1xj.si, _1xk.fdt, _1xk.fdx, _1xk.fnm, _1xk.nvd, _1xk.nvm, _1xk.si, _1xk_MockRandom_0.doc, _1xk_MockRandom_0.sd, _1xk_MockRandom_0.tio, _1xk_MockRandom_0.tipo, _1xl.fdt, _1xl.fdx, _1xl.fnm, _1xl.nvd, _1xl.nvm, _1xl.si, _1xl_MockRandom_0.doc, _1xl_MockRandom_0.sd, _1xl_MockRandom_0.tio, _1xl_MockRandom_0.tipo, _1xm.fdt, _1xm.fdx, _1xm.fnm, _1xm.nvd, _1xm.nvm, _1xm.si, _1xm_MockRandom_0.doc, _1xm_MockRandom_0.sd, _1xm_MockRandom_0.tio, _1xm_MockRandom_0.tipo, segments_3]}]>
        at __randomizedtesting.SeedInfo.seed([769471CD20BAB3FF:53436AFD50F2BDFC]:0)
        at org.junit.Assert.fail(Assert.java:93)
        at org.junit.Assert.failNotEquals(Assert.java:647)
        at org.junit.Assert.assertEquals(Assert.java:128)
        at org.junit.Assert.assertEquals(Assert.java:147)
        at org.apache.solr.handler.TestReplicationHandler.doTestReplicateAfterCoreReload(TestReplicationHandler.java:1291)
        at sun.reflect.NativeMethodAccessorImpl.invoke0(Native Method)
        at sun.reflect.NativeMethodAccessorImpl.invoke(NativeMethodAccessorImpl.java:62)
        at sun.reflect.DelegatingMethodAccessorImpl.invoke(DelegatingMethodAccessorImpl.java:43)
        at java.lang.reflect.Method.invoke(Method.java:498)
        at com.carrotsearch.randomizedtesting.RandomizedRunner.invoke(RandomizedRunner.java:1737)
        at com.carrotsearch.randomizedtesting.RandomizedRunner$8.evaluate(RandomizedRunner.java:934)
        at com.carrotsearch.randomizedtesting.RandomizedRunner$9.evaluate(RandomizedRunner.java:970)
        at com.carrotsearch.randomizedtesting.RandomizedRunner$10.evaluate(RandomizedRunner.java:984)
        at com.carrotsearch.randomizedtesting.rules.SystemPropertiesRestoreRule$1.evaluate(SystemPropertiesRestoreRule.java:57)
        at org.apache.lucene.util.TestRuleSetupTeardownChained$1.evaluate(TestRuleSetupTeardownChained.java:49)
        at org.apache.lucene.util.AbstractBeforeAfterRule$1.evaluate(AbstractBeforeAfterRule.java:45)
        at org.apache.lucene.util.TestRuleThreadAndTestName$1.evaluate(TestRuleThreadAndTestName.java:48)
        at org.apache.lucene.util.TestRuleIgnoreAfterMaxFailures$1.evaluate(TestRuleIgnoreAfterMaxFailures.java:64)
        at org.apache.lucene.util.TestRuleMarkFailure$1.evaluate(TestRuleMarkFailure.java:47)
        at com.carrotsearch.randomizedtesting.rules.StatementAdapter.evaluate(StatementAdapter.java:36)
        at com.carrotsearch.randomizedtesting.ThreadLeakControl$StatementRunner.run(ThreadLeakControl.java:368)
        at com.carrotsearch.randomizedtesting.ThreadLeakControl.forkTimeoutingTask(ThreadLeakControl.java:817)
        at com.carrotsearch.randomizedtesting.ThreadLeakControl$3.evaluate(ThreadLeakControl.java:468)
        at com.carrotsearch.randomizedtesting.RandomizedRunner.runSingleTest(RandomizedRunner.java:943)
        at com.carrotsearch.randomizedtesting.RandomizedRunner$5.evaluate(RandomizedRunner.java:829)
        at com.carrotsearch.randomizedtesting.RandomizedRunner$6.evaluate(RandomizedRunner.java:879)
        at com.carrotsearch.randomizedtesting.RandomizedRunner$7.evaluate(RandomizedRunner.java:890)
        at com.carrotsearch.randomizedtesting.rules.StatementAdapter.evaluate(StatementAdapter.java:36)
        at com.carrotsearch.randomizedtesting.rules.SystemPropertiesRestoreRule$1.evaluate(SystemPropertiesRestoreRule.java:57)
        at org.apache.lucene.util.AbstractBeforeAfterRule$1.evaluate(AbstractBeforeAfterRule.java:45)
        at com.carrotsearch.randomizedtesting.rules.StatementAdapter.evaluate(StatementAdapter.java:36)
        at org.apache.lucene.util.TestRuleStoreClassName$1.evaluate(TestRuleStoreClassName.java:41)
        at com.carrotsearch.randomizedtesting.rules.NoShadowingOrOverridesOnMethodsRule$1.evaluate(NoShadowingOrOverridesOnMethodsRule.java:40)
        at com.carrotsearch.randomizedtesting.rules.NoShadowingOrOverridesOnMethodsRule$1.evaluate(NoShadowingOrOverridesOnMethodsRule.java:40)
        at com.carrotsearch.randomizedtesting.rules.StatementAdapter.evaluate(StatementAdapter.java:36)
        at com.carrotsearch.randomizedtesting.rules.StatementAdapter.evaluate(StatementAdapter.java:36)
        at com.carrotsearch.randomizedtesting.rules.StatementAdapter.evaluate(StatementAdapter.java:36)
        at org.apache.lucene.util.TestRuleAssertionsRequired$1.evaluate(TestRuleAssertionsRequired.java:53)
        at org.apache.lucene.util.TestRuleMarkFailure$1.evaluate(TestRuleMarkFailure.java:47)
        at org.apache.lucene.util.TestRuleIgnoreAfterMaxFailures$1.evaluate(TestRuleIgnoreAfterMaxFailures.java:64)
        at org.apache.lucene.util.TestRuleIgnoreTestSuites$1.evaluate(TestRuleIgnoreTestSuites.java:54)
        at com.carrotsearch.randomizedtesting.rules.StatementAdapter.evaluate(StatementAdapter.java:36)
        at com.carrotsearch.randomizedtesting.ThreadLeakControl$StatementRunner.run(ThreadLeakControl.java:368)
        at java.lang.Thread.run(Thread.java:748)




Build Log:
[...truncated 13083 lines...]
   [junit4] Suite: org.apache.solr.handler.TestReplicationHandler
   [junit4]   2> 255669 INFO  (SUITE-TestReplicationHandler-seed#[769471CD20BAB3FF]-worker) [    ] o.a.s.SolrTestCaseJ4 SecureRandom sanity checks: test.solr.allowed.securerandom=null & java.security.egd=file:/dev/./urandom
   [junit4]   2> Creating dataDir: /x1/jenkins/jenkins-slave/workspace/Lucene-Solr-NightlyTests-7.x/checkout/solr/build/solr-core/test/J1/temp/solr.handler.TestReplicationHandler_769471CD20BAB3FF-001/init-core-data-001
   [junit4]   2> 255670 WARN  (SUITE-TestReplicationHandler-seed#[769471CD20BAB3FF]-worker) [    ] o.a.s.SolrTestCaseJ4 startTrackingSearchers: numOpens=3 numCloses=3
   [junit4]   2> 255670 INFO  (SUITE-TestReplicationHandler-seed#[769471CD20BAB3FF]-worker) [    ] o.a.s.SolrTestCaseJ4 Using PointFields (NUMERIC_POINTS_SYSPROP=true) w/NUMERIC_DOCVALUES_SYSPROP=false
   [junit4]   2> 255671 INFO  (SUITE-TestReplicationHandler-seed#[769471CD20BAB3FF]-worker) [    ] o.a.s.SolrTestCaseJ4 Randomized ssl (false) and clientAuth (false) via: @org.apache.solr.SolrTestCaseJ4$SuppressSSL(bugUrl=None)
   [junit4]   2> 255672 INFO  (TEST-TestReplicationHandler.testRateLimitedReplication-seed#[769471CD20BAB3FF]) [    ] o.a.s.SolrTestCaseJ4 ###Starting testRateLimitedReplication
   [junit4]   2> 255672 INFO  (TEST-TestReplicationHandler.testRateLimitedReplication-seed#[769471CD20BAB3FF]) [    ] o.a.s.SolrTestCaseJ4 Writing core.properties file to /x1/jenkins/jenkins-slave/workspace/Lucene-Solr-NightlyTests-7.x/checkout/solr/build/solr-core/test/J1/temp/solr.handler.TestReplicationHandler_769471CD20BAB3FF-001/solr-instance-001/collection1
   [junit4]   2> 255675 INFO  (TEST-TestReplicationHandler.testRateLimitedReplication-seed#[769471CD20BAB3FF]) [    ] o.e.j.s.Server jetty-9.4.8.v20171121, build timestamp: 2017-11-21T18:27:37-03:00, git hash: 82b8fb23f757335bb3329d540ce37a2a2615f0a8
   [junit4]   2> 255682 INFO  (TEST-TestReplicationHandler.testRateLimitedReplication-seed#[769471CD20BAB3FF]) [    ] o.e.j.s.session DefaultSessionIdManager workerName=node0
   [junit4]   2> 255682 INFO  (TEST-TestReplicationHandler.testRateLimitedReplication-seed#[769471CD20BAB3FF]) [    ] o.e.j.s.session No SessionScavenger set, using defaults
   [junit4]   2> 255682 INFO  (TEST-TestReplicationHandler.testRateLimitedReplication-seed#[769471CD20BAB3FF]) [    ] o.e.j.s.session Scavenging every 660000ms
   [junit4]   2> 255683 INFO  (TEST-TestReplicationHandler.testRateLimitedReplication-seed#[769471CD20BAB3FF]) [    ] o.e.j.s.h.ContextHandler Started o.e.j.s.ServletContextHandler@2887474f{/solr,null,AVAILABLE}
   [junit4]   2> 255686 INFO  (TEST-TestReplicationHandler.testRateLimitedReplication-seed#[769471CD20BAB3FF]) [    ] o.e.j.s.AbstractConnector Started ServerConnector@4ade63a{HTTP/1.1,[http/1.1]}{127.0.0.1:44385}
   [junit4]   2> 255686 INFO  (TEST-TestReplicationHandler.testRateLimitedReplication-seed#[769471CD20BAB3FF]) [    ] o.e.j.s.Server Started @255724ms
   [junit4]   2> 255686 INFO  (TEST-TestReplicationHandler.testRateLimitedReplication-seed#[769471CD20BAB3FF]) [    ] o.a.s.c.s.e.JettySolrRunner Jetty properties: {solr.data.dir=/x1/jenkins/jenkins-slave/workspace/Lucene-Solr-NightlyTests-7.x/checkout/solr/build/solr-core/test/J1/temp/solr.handler.TestReplicationHandler_769471CD20BAB3FF-001/solr-instance-001/collection1/data, hostContext=/solr, hostPort=44385}
   [junit4]   2> 255687 ERROR (TEST-TestReplicationHandler.testRateLimitedReplication-seed#[769471CD20BAB3FF]) [    ] o.a.s.u.StartupLoggingUtils Missing Java Option solr.log.dir. Logging may be missing or incomplete.
   [junit4]   2> 255687 INFO  (TEST-TestReplicationHandler.testRateLimitedReplication-seed#[769471CD20BAB3FF]) [    ] o.a.s.s.SolrDispatchFilter Using logger factory org.apache.logging.slf4j.Log4jLoggerFactory
   [junit4]   2> 255687 INFO  (TEST-TestReplicationHandler.testRateLimitedReplication-seed#[769471CD20BAB3FF]) [    ] o.a.s.s.SolrDispatchFilter  ___      _       Welcome to Apache Solr™ version 7.4.0
   [junit4]   2> 255687 INFO  (TEST-TestReplicationHandler.testRateLimitedReplication-seed#[769471CD20BAB3FF]) [    ] o.a.s.s.SolrDispatchFilter / __| ___| |_ _   Starting in standalone mode on port null
   [junit4]   2> 255687 INFO  (TEST-TestReplicationHandler.testRateLimitedReplication-seed#[769471CD20BAB3FF]) [    ] o.a.s.s.SolrDispatchFilter \__ \/ _ \ | '_|  Install dir: null
   [junit4]   2> 255687 INFO  (TEST-TestReplicationHandler.testRateLimitedReplication-seed#[769471CD20BAB3FF]) [    ] o.a.s.s.SolrDispatchFilter |___/\___/_|_|    Start time: 2018-04-18T12:32:42.085Z
   [junit4]   2> 255687 INFO  (TEST-TestReplicationHandler.testRateLimitedReplication-seed#[769471CD20BAB3FF]) [    ] o.a.s.c.SolrXmlConfig Loading container configuration from /x1/jenkins/jenkins-slave/workspace/Lucene-Solr-NightlyTests-7.x/checkout/solr/build/solr-core/test/J1/temp/solr.handler.TestReplicationHandler_769471CD20BAB3FF-001/solr-instance-001/solr.xml
   [junit4]   2> 255691 INFO  (TEST-TestReplicationHandler.testRateLimitedReplication-seed#[769471CD20BAB3FF]) [    ] o.a.s.c.SolrXmlConfig Configuration parameter autoReplicaFailoverWorkLoopDelay is ignored
   [junit4]   2> 255691 INFO  (TEST-TestReplicationHandler.testRateLimitedReplication-seed#[769471CD20BAB3FF]) [    ] o.a.s.c.SolrXmlConfig Configuration parameter autoReplicaFailoverBadNodeExpiration is ignored
   [junit4]   2> 255692 INFO  (TEST-TestReplicationHandler.testRateLimitedReplication-seed#[769471CD20BAB3FF]) [    ] o.a.s.c.SolrXmlConfig MBean server found: com.sun.jmx.mbeanserver.JmxMBeanServer@10493ab3, but no JMX reporters were configured - adding default JMX reporter.
   [junit4]   2> 255719 INFO  (TEST-TestReplicationHandler.testRateLimitedReplication-seed#[769471CD20BAB3FF]) [    ] o.a.s.m.r.SolrJmxReporter JMX monitoring for 'solr.node' (registry 'solr.node') enabled at server: com.sun.jmx.mbeanserver.JmxMBeanServer@10493ab3
   [junit4]   2> 255726 INFO  (TEST-TestReplicationHandler.testRateLimitedReplication-seed#[769471CD20BAB3FF]) [    ] o.a.s.m.r.SolrJmxReporter JMX monitoring for 'solr.jvm' (registry 'solr.jvm') enabled at server: com.sun.jmx.mbeanserver.JmxMBeanServer@10493ab3
   [junit4]   2> 255726 INFO  (TEST-TestReplicationHandler.testRateLimitedReplication-seed#[769471CD20BAB3FF]) [    ] o.a.s.m.r.SolrJmxReporter JMX monitoring for 'solr.jetty' (registry 'solr.jetty') enabled at server: com.sun.jmx.mbeanserver.JmxMBeanServer@10493ab3
   [junit4]   2> 255728 INFO  (TEST-TestReplicationHandler.testRateLimitedReplication-seed#[769471CD20BAB3FF]) [    ] o.a.s.c.CorePropertiesLocator Found 1 core definitions underneath /x1/jenkins/jenkins-slave/workspace/Lucene-Solr-NightlyTests-7.x/checkout/solr/build/solr-core/test/J1/temp/solr.handler.TestReplicationHandler_769471CD20BAB3FF-001/solr-instance-001/.
   [junit4]   2> 255728 INFO  (TEST-TestReplicationHandler.testRateLimitedReplication-seed#[769471CD20BAB3FF]) [    ] o.a.s.c.CorePropertiesLocator Cores are: [collection1]
   [junit4]   2> 255728 INFO  (coreLoadExecutor-637-thread-1) [    ] o.a.s.c.TransientSolrCoreCacheDefault Allocating transient cache for 4 transient cores
   [junit4]   2> 255750 INFO  (coreLoadExecutor-637-thread-1) [    x:collection1] o.a.s.c.SolrConfig Using Lucene MatchVersion: 7.4.0
   [junit4]   2> 255774 INFO  (coreLoadExecutor-637-thread-1) [    x:collection1] o.a.s.s.IndexSchema [collection1] Schema name=test
   [junit4]   2> 255776 INFO  (coreLoadExecutor-637-thread-1) [    x:collection1] o.a.s.s.IndexSchema Loaded schema test/1.2 with uniqueid field id
   [junit4]   2> 255776 INFO  (coreLoadExecutor-637-thread-1) [    x:collection1] o.a.s.c.CoreContainer Creating SolrCore 'collection1' using configuration from instancedir /x1/jenkins/jenkins-slave/workspace/Lucene-Solr-NightlyTests-7.x/checkout/solr/build/solr-core/test/J1/temp/solr.handler.TestReplicationHandler_769471CD20BAB3FF-001/solr-instance-001/./collection1, trusted=true
   [junit4]   2> 255777 INFO  (coreLoadExecutor-637-thread-1) [    x:collection1] o.a.s.m.r.SolrJmxReporter JMX monitoring for 'solr.core.collection1' (registry 'solr.core.collection1') enabled at server: com.sun.jmx.mbeanserver.JmxMBeanServer@10493ab3
   [junit4]   2> 255777 INFO  (coreLoadExecutor-637-thread-1) [    x:collection1] o.a.s.c.SolrCore solr.RecoveryStrategy.Builder
   [junit4]   2> 255777 INFO  (coreLoadExecutor-637-thread-1) [    x:collection1] o.a.s.c.SolrCore [[collection1] ] Opening new SolrCore at [/x1/jenkins/jenkins-slave/workspace/Lucene-Solr-NightlyTests-7.x/checkout/solr/build/solr-core/test/J1/temp/solr.handler.TestReplicationHandler_769471CD20BAB3FF-001/solr-instance-001/collection1], dataDir=[/x1/jenkins/jenkins-slave/workspace/Lucene-Solr-NightlyTests-7.x/checkout/solr/build/solr-core/test/J1/temp/solr.handler.TestReplicationHandler_769471CD20BAB3FF-001/solr-instance-001/./collection1/data/]
   [junit4]   2> 255778 INFO  (coreLoadExecutor-637-thread-1) [    x:collection1] o.a.s.u.RandomMergePolicy RandomMergePolicy wrapping class org.apache.lucene.index.LogDocMergePolicy: [LogDocMergePolicy: minMergeSize=1000, mergeFactor=43, maxMergeSize=9223372036854775807, maxMergeSizeForForcedMerge=9223372036854775807, calibrateSizeByDeletes=true, maxMergeDocs=2147483647, maxCFSSegmentSizeMB=8.796093022207999E12, noCFSRatio=0.5176167496813626]
   [junit4]   2> 255812 INFO  (coreLoadExecutor-637-thread-1) [    x:collection1] o.a.s.u.CommitTracker Hard AutoCommit: disabled
   [junit4]   2> 255812 INFO  (coreLoadExecutor-637-thread-1) [    x:collection1] o.a.s.u.CommitTracker Soft AutoCommit: disabled
   [junit4]   2> 255812 INFO  (coreLoadExecutor-637-thread-1) [    x:collection1] o.a.s.u.RandomMergePolicy RandomMergePolicy wrapping class org.apache.lucene.index.MockRandomMergePolicy: org.apache.lucene.index.MockRandomMergePolicy@56dee47d
   [junit4]   2> 255813 INFO  (coreLoadExecutor-637-thread-1) [    x:collection1] o.a.s.s.SolrIndexSearcher Opening [Searcher@22d916b7[collection1] main]
   [junit4]   2> 255813 INFO  (coreLoadExecutor-637-thread-1) [    x:collection1] o.a.s.r.ManagedResourceStorage File-based storage initialized to use dir: /x1/jenkins/jenkins-slave/workspace/Lucene-Solr-NightlyTests-7.x/checkout/solr/build/solr-core/test/J1/temp/solr.handler.TestReplicationHandler_769471CD20BAB3FF-001/solr-instance-001/collection1/conf
   [junit4]   2> 255814 INFO  (coreLoadExecutor-637-thread-1) [    x:collection1] o.a.s.h.ReplicationHandler Replication enabled for following config files: schema.xml,xslt/dummy.xsl
   [junit4]   2> 255814 INFO  (coreLoadExecutor-637-thread-1) [    x:collection1] o.a.s.h.ReplicationHandler Commits will be reserved for 10000ms.
   [junit4]   2> 255814 INFO  (searcherExecutor-638-thread-1-processing-x:collection1) [    x:collection1] o.a.s.c.SolrCore [collection1] Registered new searcher Searcher@22d916b7[collection1] main{ExitableDirectoryReader(UninvertingDirectoryReader())}
   [junit4]   2> 256316 INFO  (TEST-TestReplicationHandler.testRateLimitedReplication-seed#[769471CD20BAB3FF]) [    ] o.a.s.SolrTestCaseJ4 Writing core.properties file to /x1/jenkins/jenkins-slave/workspace/Lucene-Solr-NightlyTests-7.x/checkout/solr/build/solr-core/test/J1/temp/solr.handler.TestReplicationHandler_769471CD20BAB3FF-001/solr-instance-002/collection1
   [junit4]   2> 256319 INFO  (TEST-TestReplicationHandler.testRateLimitedReplication-seed#[769471CD20BAB3FF]) [    ] o.e.j.s.Server jetty-9.4.8.v20171121, build timestamp: 2017-11-21T18:27:37-03:00, git hash: 82b8fb23f757335bb3329d540ce37a2a2615f0a8
   [junit4]   2> 256319 INFO  (TEST-TestReplicationHandler.testRateLimitedReplication-seed#[769471CD20BAB3FF]) [    ] o.e.j.s.session DefaultSessionIdManager workerName=node0
   [junit4]   2> 256320 INFO  (TEST-TestReplicationHandler.testRateLimitedReplication-seed#[769471CD20BAB3FF]) [    ] o.e.j.s.session No SessionScavenger set, using defaults
   [junit4]   2> 256320 INFO  (TEST-TestReplicationHandler.testRateLimitedReplication-seed#[769471CD20BAB3FF]) [    ] o.e.j.s.session Scavenging every 660000ms
   [junit4]   2> 256320 INFO  (TEST-TestReplicationHandler.testRateLimitedReplication-seed#[769471CD20BAB3FF]) [    ] o.e.j.s.h.ContextHandler Started o.e.j.s.ServletContextHandler@452738dc{/solr,null,AVAILABLE}
   [junit4]   2> 256320 INFO  (TEST-TestReplicationHandler.testRateLimitedReplication-seed#[769471CD20BAB3FF]) [    ] o.e.j.s.AbstractConnector Started ServerConnector@6e00e2b6{HTTP/1.1,[http/1.1]}{127.0.0.1:33303}
   [junit4]   2> 256320 INFO  (TEST-TestReplicationHandler.testRateLimitedReplication-seed#[769471CD20BAB3FF]) [    ] o.e.j.s.Server Started @256358ms
   [junit4]   2> 256320 INFO  (TEST-TestReplicationHandler.testRateLimitedReplication-seed#[769471CD20BAB3FF]) [    ] o.a.s.c.s.e.JettySolrRunner Jetty properties: {solr.data.dir=/x1/jenkins/jenkins-slave/workspace/Lucene-Solr-NightlyTests-7.x/checkout/solr/build/solr-core/test/J1/temp/solr.handler.TestReplicationHandler_769471CD20BAB3FF-001/solr-instance-002/collection1/data, hostContext=/solr, hostPort=33303}
   [junit4]   2> 256321 ERROR (TEST-TestReplicationHandler.testRateLimitedReplication-seed#[769471CD20BAB3FF]) [    ] o.a.s.u.StartupLoggingUtils Missing Java Option solr.log.dir. Logging may be missing or incomplete.
   [junit4]   2> 256321 INFO  (TEST-TestReplicationHandler.testRateLimitedReplication-seed#[769471CD20BAB3FF]) [    ] o.a.s.s.SolrDispatchFilter Using logger factory org.apache.logging.slf4j.Log4jLoggerFactory
   [junit4]   2> 256321 INFO  (TEST-TestReplicationHandler.testRateLimitedReplication-seed#[769471CD20BAB3FF]) [    ] o.a.s.s.SolrDispatchFilter  ___      _       Welcome to Apache Solr™ version 7.4.0
   [junit4]   2> 256321 INFO  (TEST-TestReplicationHandler.testRateLimitedReplication-seed#[769471CD20BAB3FF]) [    ] o.a.s.s.SolrDispatchFilter / __| ___| |_ _   Starting in standalone mode on port null
   [junit4]   2> 256321 INFO  (TEST-TestReplicationHandler.testRateLimitedReplication-seed#[769471CD20BAB3FF]) [    ] o.a.s.s.SolrDispatchFilter \__ \/ _ \ | '_|  Install dir: null
   [junit4]   2> 256321 INFO  (TEST-TestReplicationHandler.testRateLimitedReplication-seed#[769471CD20BAB3FF]) [    ] o.a.s.s.SolrDispatchFilter |___/\___/_|_|    Start time: 2018-04-18T12:32:42.719Z
   [junit4]   2> 256321 INFO  (TEST-TestReplicationHandler.testRateLimitedReplication-seed#[769471CD20BAB3FF]) [    ] o.a.s.c.SolrXmlConfig Loading container configuration from /x1/jenkins/jenkins-slave/workspace/Lucene-Solr-NightlyTests-7.x/checkout/solr/build/solr-core/test/J1/temp/solr.handler.TestReplicationHandler_769471CD20BAB3FF-001/solr-instance-002/solr.xml
   [junit4]   2> 256325 INFO  (TEST-TestReplicationHandler.testRateLimitedReplication-seed#[769471CD20BAB3FF]) [    ] o.a.s.c.SolrXmlConfig Configuration parameter autoReplicaFailoverWorkLoopDelay is ignored
   [junit4]   2> 256325 INFO  (TEST-TestReplicationHandler.testRateLimitedReplication-seed#[769471CD20BAB3FF]) [    ] o.a.s.c.SolrXmlConfig Configuration parameter autoReplicaFailoverBadNodeExpiration is ignored
   [junit4]   2> 256326 INFO  (TEST-TestReplicationHandler.testRateLimitedReplication-seed#[769471CD20BAB3FF]) [    ] o.a.s.c.SolrXmlConfig MBean server found: com.sun.jmx.mbeanserver.JmxMBeanServer@10493ab3, but no JMX reporters were configured - adding default JMX reporter.
   [junit4]   2> 256357 INFO  (TEST-TestReplicationHandler.testRateLimitedReplication-seed#[769471CD20BAB3FF]) [    ] o.a.s.m.r.SolrJmxReporter JMX monitoring for 'solr.node' (registry 'solr.node') enabled at server: com.sun.jmx.mbeanserver.JmxMBeanServer@10493ab3
   [junit4]   2> 256366 INFO  (TEST-TestReplicationHandler.testRateLimitedReplication-seed#[769471CD20BAB3FF]) [    ] o.a.s.m.r.SolrJmxReporter JMX monitoring for 'solr.jvm' (registry 'solr.jvm') enabled at server: com.sun.jmx.mbeanserver.JmxMBeanServer@10493ab3
   [junit4]   2> 256366 INFO  (TEST-TestReplicationHandler.testRateLimitedReplication-seed#[769471CD20BAB3FF]) [    ] o.a.s.m.r.SolrJmxReporter JMX monitoring for 'solr.jetty' (registry 'solr.jetty') enabled at server: com.sun.jmx.mbeanserver.JmxMBeanServer@10493ab3
   [junit4]   2> 256368 INFO  (TEST-TestReplicationHandler.testRateLimitedReplication-seed#[769471CD20BAB3FF]) [    ] o.a.s.c.CorePropertiesLocator Found 1 core definitions underneath /x1/jenkins/jenkins-slave/workspace/Lucene-Solr-NightlyTests-7.x/checkout/solr/build/solr-core/test/J1/temp/solr.handler.TestReplicationHandler_769471CD20BAB3FF-001/solr-instance-002/.
   [junit4]   2> 256368 INFO  (TEST-TestReplicationHandler.testRateLimitedReplication-seed#[769471CD20BAB3FF]) [    ] o.a.s.c.CorePropertiesLocator Cores are: [collection1]
   [junit4]   2> 256369 INFO  (coreLoadExecutor-647-thread-1) [    ] o.a.s.c.TransientSolrCoreCacheDefault Allocating transient cache for 4 transient cores
   [junit4]   2> 256386 INFO  (coreLoadExecutor-647-thread-1) [    x:collection1] o.a.s.c.SolrConfig Using Lucene MatchVersion: 7.4.0
   [junit4]   2> 256395 INFO  (coreLoadExecutor-647-thread-1) [    x:collection1] o.a.s.s.IndexSchema [collection1] Schema name=test
   [junit4]   2> 256397 INFO  (coreLoadExecutor-647-thread-1) [    x:collection1] o.a.s.s.IndexSchema Loaded schema test/1.2 with uniqueid field id
   [junit4]   2> 256397 INFO  (coreLoadExecutor-647-thread-1) [    x:collection1] o.a.s.c.CoreContainer Creating SolrCore 'collection1' using configuration from instancedir /x1/jenkins/jenkins-slave/workspace/Lucene-Solr-NightlyTests-7.x/checkout/solr/build/solr-core/test/J1/temp/solr.handler.TestReplicationHandler_769471CD20BAB3FF-001/solr-instance-002/./collection1, trusted=true
   [junit4]   2> 256397 INFO  (coreLoadExecutor-647-thread-1) [    x:collection1] o.a.s.m.r.SolrJmxReporter JMX monitoring for 'solr.core.collection1' (registry 'solr.core.collection1') enabled at server: com.sun.jmx.mbeanserver.JmxMBeanServer@10493ab3
   [junit4]   2> 256397 INFO  (coreLoadExecutor-647-thread-1) [    x:collection1] o.a.s.c.SolrCore solr.RecoveryStrategy.Builder
   [junit4]   2> 256397 INFO  (coreLoadExecutor-647-thread-1) [    x:collection1] o.a.s.c.SolrCore [[collection1] ] Opening new SolrCore at [/x1/jenkins/jenkins-slave/workspace/Lucene-Solr-NightlyTests-7.x/checkout/solr/build/solr-core/test/J1/temp/solr.handler.TestReplicationHandler_769471CD20BAB3FF-001/solr-instance-002/collection1], dataDir=[/x1/jenkins/jenkins-slave/workspace/Lucene-Solr-NightlyTests-7.x/checkout/solr/build/solr-core/test/J1/temp/solr.handler.TestReplicationHandler_769471CD20BAB3FF-001/solr-instance-002/./collection1/data/]
   [junit4]   2> 256399 INFO  (coreLoadExecutor-647-thread-1) [    x:collection1] o.a.s.u.RandomMergePolicy RandomMergePolicy wrapping class org.apache.lucene.index.LogDocMergePolicy: [LogDocMergePolicy: minMergeSize=1000, mergeFactor=43, maxMergeSize=9223372036854775807, maxMergeSizeForForcedMerge=9223372036854775807, calibrateSizeByDeletes=true, maxMergeDocs=2147483647, maxCFSSegmentSizeMB=8.796093022207999E12, noCFSRatio=0.5176167496813626]
   [junit4]   2> 256438 INFO  (coreLoadExecutor-647-thread-1) [    x:collection1] o.a.s.u.CommitTracker Hard AutoCommit: disabled
   [junit4]   2> 256438 INFO  (coreLoadExecutor-647-thread-1) [    x:collection1] o.a.s.u.CommitTracker Soft AutoCommit: disabled
   [junit4]   2> 256439 INFO  (coreLoadExecutor-647-thread-1) [    x:collection1] o.a.s.u.RandomMergePolicy RandomMergePolicy wrapping class org.apache.lucene.index.MockRandomMergePolicy: org.apache.lucene.index.MockRandomMergePolicy@684390f1
   [junit4]   2> 256440 INFO  (coreLoadExecutor-647-thread-1) [    x:collection1] o.a.s.s.SolrIndexSearcher Opening [Searcher@105592a3[collection1] main]
   [junit4]   2> 256440 INFO  (coreLoadExecutor-647-thread-1) [    x:collection1] o.a.s.r.ManagedResourceStorage File-based storage initialized to use dir: /x1/jenkins/jenkins-slave/workspace/Lucene-Solr-NightlyTests-7.x/checkout/solr/build/solr-core/test/J1/temp/solr.handler.TestReplicationHandler_769471CD20BAB3FF-001/solr-instance-002/collection1/conf
   [junit4]   2> 256456 INFO  (coreLoadExecutor-647-thread-1) [    x:collection1] o.a.s.h.ReplicationHandler Poll scheduled at an interval of 1000ms
   [junit4]   2> 256456 INFO  (coreLoadExecutor-647-thread-1) [    x:collection1] o.a.s.h.ReplicationHandler Commits will be reserved for 10000ms.
   [junit4]   2> 256458 INFO  (searcherExecutor-648-thread-1-processing-x:collection1) [    x:collection1] o.a.s.c.SolrCore [collection1] Registered new searcher Searcher@105592a3[collection1] main{ExitableDirectoryReader(UninvertingDirectoryReader())}
   [junit4]   2> 256462 INFO  (qtp664231407-1369) [    x:collection1] o.a.s.u.DirectUpdateHandler2 [collection1] REMOVING ALL DOCUMENTS FROM INDEX
   [junit4]   2> 256464 INFO  (qtp664231407-1369) [    x:collection1] o.a.s.u.p.LogUpdateProcessorFactory [collection1]  webapp=/solr path=/update params={wt=javabin&version=2}{deleteByQuery=*:*} 0 3
   [junit4]   2> 256470 INFO  (qtp664231407-1373) [    x:collection1] o.a.s.c.S.Request [collection1]  webapp=/solr path=/replication params={qt=/replication&wt=javabin&version=2&command=indexversion} status=0 QTime=0
   [junit4]   2> 256472 INFO  (indexFetcher-652-thread-1) [    ] o.a.s.h.IndexFetcher Master's generation: 1
   [junit4]   2> 256472 INFO  (indexFetcher-652-thread-1) [    ] o.a.s.h.IndexFetcher Master's version: 0
   [junit4]   2> 256473 INFO  (indexFetcher-652-thread-1) [    ] o.a.s.h.IndexFetcher Slave's generation: 1
   [junit4]   2> 256473 INFO  (indexFetcher-652-thread-1) [    ] o.a.s.h.IndexFetcher Slave's version: 0
   [junit4]   2> 256473 INFO  (indexFetcher-652-thread-1) [    ] o.a.s.h.IndexFetcher New index in Master. Deleting mine...
   [junit4]   2> 256473 INFO  (qtp1115282015-1386) [    x:collection1] o.a.s.u.DirectUpdateHandler2 [collection1] REMOVING ALL DOCUMENTS FROM INDEX
   [junit4]   2> 256477 INFO  (qtp1115282015-1386) [    x:collection1] o.a.s.u.p.LogUpdateProcessorFactory [collection1]  webapp=/solr path=/update params={wt=javabin&version=2}{deleteByQuery=*:*} 0 3
   [junit4]   2> 256479 INFO  (indexFetcher-652-thread-1) [    ] o.a.s.s.SolrIndexSearcher Opening [Searcher@1d27720[collection1] main]
   [junit4]   2> 256486 INFO  (qtp664231407-1371) [    x:collection1] o.a.s.u.DirectUpdateHandler2 start commit{,optimize=false,openSearcher=true,waitSearcher=true,expungeDeletes=false,softCommit=false,prepareCommit=false}
   [junit4]   2> 256486 INFO  (qtp664231407-1371) [    x:collection1] o.a.s.u.SolrIndexWriter Calling setCommitData with IW:org.apache.solr.update.SolrIndexWriter@3b4fc6cc commitCommandVersion:0
   [junit4]   2> 256488 INFO  (qtp664231407-1371) [    x:collection1] o.a.s.s.SolrIndexSearcher Opening [Searcher@74b525ee[collection1] main]
   [junit4]   2> 256488 INFO  (qtp664231407-1371) [    x:collection1] o.a.s.u.DirectUpdateHandler2 end_commit_flush
   [junit4]   2> 256489 INFO  (searcherExecutor-638-thread-1-processing-x:collection1) [    x:collection1] o.a.s.c.SolrCore [collection1] Registered new searcher Searcher@74b525ee[collection1] main{ExitableDirectoryReader(UninvertingDirectoryReader())}
   [junit4]   2> 256490 INFO  (qtp664231407-1371) [    x:collection1] o.a.s.u.p.LogUpdateProcessorFactory [collection1]  webapp=/solr path=/update params={waitSearcher=true&commit=true&softCommit=false&wt=javabin&version=2}{commit=} 0 10
   [junit4]   2> 256490 INFO  (searcherExecutor-648-thread-1) [    ] o.a.s.c.SolrCore [collection1] Registered new searcher Searcher@1d27720[collection1] main{ExitableDirectoryReader(UninvertingDirectoryReader())}
   [junit4]   2> 256491 INFO  (qtp1115282015-1388) [    x:collection1] o.a.s.u.DirectUpdateHandler2 start commit{,optimize=false,openSearcher=true,waitSearcher=true,expungeDeletes=false,softCommit=false,prepareCommit=false}
   [junit4]   2> 256491 INFO  (qtp1115282015-1388) [    x:collection1] o.a.s.u.SolrIndexWriter Calling setCommitData with IW:org.apache.solr.update.SolrIndexWriter@e1977dc commitCommandVersion:0
   [junit4]   2> 256492 INFO  (qtp1115282015-1388) [    x:collection1] o.a.s.s.SolrIndexSearcher Opening [Searcher@41e38254[collection1] main]
   [junit4]   2> 256492 INFO  (qtp1115282015-1388) [    x:collection1] o.a.s.u.DirectUpdateHandler2 end_commit_flush
   [junit4]   2> 256493 INFO  (searcherExecutor-648-thread-1-processing-x:collection1) [    x:collection1] o.a.s.c.SolrCore [collection1] Registered new searcher Searcher@41e38254[collection1] main{ExitableDirectoryReader(UninvertingDirectoryReader())}
   [junit4]   2> 256493 INFO  (qtp1115282015-1388) [    x:collection1] o.a.s.u.p.LogUpdateProcessorFactory [collection1]  webapp=/solr path=/update params={waitSearcher=true&commit=true&softCommit=false&wt=javabin&version=2}{commit=} 0 2
   [junit4]   2> 256498 INFO  (TEST-TestReplicationHandler.testRateLimitedReplication-seed#[769471CD20BAB3FF]) [    ] o.e.j.s.AbstractConnector Stopped ServerConnector@4ade63a{HTTP/1.1,[http/1.1]}{127.0.0.1:0}
   [junit4]   2> 256498 INFO  (TEST-TestReplicationHandler.testRateLimitedReplication-seed#[769471CD20BAB3FF]) [    ] o.a.s.c.CoreContainer Shutting down CoreContainer instance=1202216998
   [junit4]   2> 256498 INFO  (TEST-TestReplicationHandler.testRateLimitedReplication-seed#[769471CD20BAB3FF]) [    ] o.a.s.m.SolrMetricManager Closing metric reporters for registry=solr.node, tag=null
   [junit4]   2> 256499 INFO  (TEST-TestReplicationHandler.testRateLimitedReplication-seed#[769471CD20BAB3FF]) [    ] o.a.s.m.r.SolrJmxReporter Closing reporter [org.apache.solr.metrics.reporters.SolrJmxReporter@6cea34e3: rootName = null, domain = solr.node, service url = null, agent id = null] for registry solr.node / com.codahale.metrics.MetricRegistry@1ccecfb
   [junit4]   2> 256502 INFO  (TEST-TestReplicationHandler.testRateLimitedReplication-seed#[769471CD20BAB3FF]) [    ] o.a.s.m.SolrMetricManager Closing metric reporters for registry=solr.jvm, tag=null
   [junit4]   2> 256502 INFO  (TEST-TestReplicationHandler.testRateLimitedReplication-seed#[769471CD20BAB3FF]) [    ] o.a.s.m.r.SolrJmxReporter Closing reporter [org.apache.solr.metrics.reporters.SolrJmxReporter@e0a4796: rootName = null, domain = solr.jvm, service url = null, agent id = null] for registry solr.jvm / com.codahale.metrics.MetricRegistry@7176e47d
   [junit4]   2> 256504 INFO  (TEST-TestReplicationHandler.testRateLimitedReplication-seed#[769471CD20BAB3FF]) [    ] o.a.s.m.SolrMetricManager Closing metric reporters for registry=solr.jetty, tag=null
   [junit4]   2> 256505 INFO  (TEST-TestReplicationHandler.testRateLimitedReplication-seed#[769471CD20BAB3FF]) [    ] o.a.s.m.r.SolrJmxReporter Closing reporter [org.apache.solr.metrics.reporters.SolrJmxReporter@1d23ac8b: rootName = null, domain = solr.jetty, service url = null, agent id = null] for registry solr.jetty / com.codahale.metrics.MetricRegistry@5330276
   [junit4]   2> 256505 INFO  (coreCloseExecutor-653-thread-1) [    x:collection1] o.a.s.c.SolrCore [collection1]  CLOSING SolrCore org.apache.solr.core.SolrCore@47bb616b
   [junit4]   2> 256505 INFO  (coreCloseExecutor-653-thread-1) [    x:collection1] o.a.s.m.SolrMetricManager Closing metric reporters for registry=solr.core.collection1, tag=47bb616b
   [junit4]   2> 256505 INFO  (coreCloseExecutor-653-thread-1) [    x:collection1] o.a.s.m.r.SolrJmxReporter Closing reporter [org.apache.solr.metrics.reporters.SolrJmxReporter@2be60092: rootName = null, domain = solr.core.collection1, service url = null, agent id = null] for registry solr.core.collection1 / com.codahale.metrics.MetricRegistry@46f00f76
   [junit4]   2> 256512 INFO  (TEST-TestReplicationHandler.testRateLimitedReplication-seed#[769471CD20BAB3FF]) [    ] o.e.j.s.h.ContextHandler Stopped o.e.j.s.ServletContextHandler@2887474f{/solr,null,UNAVAILABLE}
   [junit4]   2> 256512 INFO  (TEST-TestReplicationHandler.testRateLimitedReplication-seed#[769471CD20BAB3FF]) [    ] o.e.j.s.session Stopped scavenging
   [junit4]   2> 256513 INFO  (TEST-TestReplicationHandler.testRateLimitedReplication-seed#[769471CD20BAB3FF]) [    ] o.e.j.s.AbstractConnector Stopped ServerConnector@6e00e2b6{HTTP/1.1,[http/1.1]}{127.0.0.1:0}
   [junit4]   2> 256513 INFO  (TEST-TestReplicationHandler.testRateLimitedReplication-seed#[769471CD20BAB3FF]) [    ] o.a.s.c.CoreContainer Shutting down CoreContainer instance=1865908465
   [junit4]   2> 256514 INFO  (TEST-TestReplicationHandler.testRateLimitedReplication-seed#[769471CD20BAB3FF]) [    ] o.a.s.m.SolrMetricManager Closing metric reporters for registry=solr.node, tag=null
   [junit4]   2> 256514 INFO  (TEST-TestReplicationHandler.testRateLimitedReplication-seed#[769471CD20BAB3FF]) [    ] o.a.s.m.r.SolrJmxReporter Closing reporter [org.apache.solr.metrics.reporters.SolrJmxReporter@11834b52: rootName = null, domain = solr.node, service url = null, agent id = null] for registry solr.node / com.codahale.metrics.MetricRegistry@6f48332a
   [junit4]   2> 256520 INFO  (TEST-TestReplicationHandler.testRateLimitedReplication-seed#[769471CD20BAB3FF]) [    ] o.a.s.m.SolrMetricManager Closing metric reporters for registry=solr.jvm, tag=null
   [junit4]   2> 256520 INFO  (TEST-TestReplicationHandler.testRateLimitedReplication-seed#[769471CD20BAB3FF]) [    ] o.a.s.m.r.SolrJmxReporter Closing reporter [org.apache.solr.metrics.reporters.SolrJmxReporter@2dab7f51: rootName = null, domain = solr.jvm, service url = null, agent id = null] for registry solr.jvm / com.codahale.metrics.MetricRegistry@7176e47d
   [junit4]   2> 256524 INFO  (TEST-TestReplicationHandler.testRateLimitedReplication-seed#[769471CD20BAB3FF]) [    ] o.a.s.m.SolrMetricManager Closing metric reporters for registry=solr.jetty, tag=null
   [junit4]   2> 256525 INFO  (TEST-TestReplicationHandler.testRateLimitedReplication-seed#[769471CD20BAB3FF]) [    ] o.a.s.m.r.SolrJmxReporter Closing reporter [org.apache.solr.metrics.reporters.SolrJmxReporter@c27d976: rootName = null, domain = solr.jetty, service url = null, agent id = null] for registry solr.jetty / com.codahale.metrics.MetricRegistry@5330276
   [junit4]   2> 256525 INFO  (coreCloseExecutor-655-thread-1) [    x:collection1] o.a.s.c.SolrCore [collection1]  CLOSING SolrCore org.apache.solr.core.SolrCore@34f3367a
   [junit4]   2> 256525 INFO  (coreCloseExecutor-655-thread-1) [    x:collection1] o.a.s.m.SolrMetricManager Closing metric reporters for registry=solr.core.collection1, tag=34f3367a
   [junit4]   2> 256525 INFO  (coreCloseExecutor-655-thread-1) [    x:collection1] o.a.s.m.r.SolrJmxReporter Closing reporter [org.apache.solr.metrics.reporters.SolrJmxReporter@691c430b: rootName = null, domain = solr.core.collection1, service url = null, agent id = null] for registry solr.core.collection1 / com.codahale.metrics.MetricRegistry@3f2aefec
   [junit4]   2> 256540 INFO  (TEST-TestReplicationHandler.testRateLimitedReplication-seed#[769471CD20BAB3FF]) [    ] o.e.j.s.h.ContextHandler Stopped o.e.j.s.ServletContextHandler@452738dc{/solr,null,UNAVAILABLE}
   [junit4]   2> 256540 INFO  (TEST-TestReplicationHandler.testRateLimitedReplication-seed#[769471CD20BAB3FF]) [    ] o.e.j.s.session Stopped scavenging
   [junit4]   2> 256543 INFO  (TEST-TestReplicationHandler.testRateLimitedReplication-seed#[769471CD20BAB3FF]) [    ] o.e.j.s.Server jetty-9.4.8.v20171121, build timestamp: 2017-11-21T18:27:37-03:00, git hash: 82b8fb23f757335bb3329d540ce37a2a2615f0a8
   [junit4]   2> 256546 INFO  (TEST-TestReplicationHandler.testRateLimitedReplication-seed#[769471CD20BAB3FF]) [    ] o.e.j.s.session DefaultSessionIdManager workerName=node0
   [junit4]   2> 256546 INFO  (TEST-TestReplicationHandler.testRateLimitedReplication-seed#[769471CD20BAB3FF]) [    ] o.e.j.s.session No SessionScavenger set, using defaults
   [junit4]   2> 256546 INFO  (TEST-TestReplicationHandler.testRateLimitedReplication-seed#[769471CD20BAB3FF]) [    ] o.e.j.s.session Scavenging every 660000ms
   [junit4]   2> 256560 INFO  (TEST-TestReplicationHandler.testRateLimitedReplication-seed#[769471CD20BAB3FF]) [    ] o.e.j.s.h.ContextHandler Started o.e.j.s.ServletContextHandler@1b31e876{/solr,null,AVAILABLE}
   [junit4]   2> 256560 INFO  (TEST-TestReplicationHandler.testRateLimitedReplication-seed#[769471CD20BAB3FF]) [    ] o.e.j.s.AbstractConnector Started ServerConnector@6782b6d5{HTTP/1.1,[http/1.1]}{127.0.0.1:60624}
   [junit4]   2> 256560 INFO  (TEST-TestReplicationHandler.testRateLimitedReplication-seed#[769471CD20BAB3FF]) [    ] o.e.j.s.Server Started @256598ms
   [junit4]   2> 256560 INFO  (TEST-TestReplicationHandler.testRateLimitedReplication-seed#[769471CD20BAB3FF]) [    ] o.a.s.c.s.e.JettySolrRunner Jetty properties: {solr.data.dir=/x1/jenkins/jenkins-slave/workspace/Lucene-Solr-NightlyTests-7.x/checkout/solr/build/solr-core/test/J1/temp/solr.handler.TestReplicationHandler_769471CD20BAB3FF-001/solr-instance-001/collection1/data, hostContext=/solr, hostPort=60624}
   [junit4]   2> 256561 ERROR (TEST-TestReplicationHandler.testRateLimitedReplication-seed#[769471CD20BAB3FF]) [    ] o.a.s.u.StartupLoggingUtils Missing Java Option solr.log.dir. Logging may be missing or incomplete.
   [junit4]   2> 256561 INFO  (TEST-TestReplicationHandler.testRateLimitedReplication-seed#[769471CD20BAB3FF]) [    ] o.a.s.s.SolrDispatchFilter Using logger factory org.apache.logging.slf4j.Log4jLoggerFactory
   [junit4]   2> 256561 INFO  (TEST-TestReplicationHandler.testRateLimitedReplication-seed#[769471CD20BAB3FF]) [    ] o.a.s.s.SolrDispatchFilter  ___      _       Welcome to Apache Solr™ version 7.4.0
   [junit4]   2> 256561 INFO  (TEST-TestReplicationHandler.testRateLimitedReplication-seed#[769471CD20BAB3FF]) [    ] o.a.s.s.SolrDispatchFilter / __| ___| |_ _   Starting in standalone mode on port null
   [junit4]   2> 256561 INFO  (TEST-TestReplicationHandler.testRateLimitedReplication-seed#[769471CD20BAB3FF]) [    ] o.a.s.s.SolrDispatchFilter \__ \/ _ \ | '_|  Install dir: null
   [junit4]   2> 256561 INFO  (TEST-TestReplicationHandler.testRateLimitedReplication-seed#[769471CD20BAB3FF]) [    ] o.a.s.s.SolrDispatchFilter |___/\___/_|_|    Start time: 2018-04-18T12:32:42.959Z
   [junit4]   2> 256561 INFO  (TEST-TestReplicationHandler.testRateLimitedReplication-seed#[769471CD20BAB3FF]) [    ] o.a.s.c.SolrXmlConfig Loading container configuration from /x1/jenkins/jenkins-slave/workspace/Lucene-Solr-NightlyTests-7.x/checkout/solr/build/solr-core/test/J1/temp/solr.handler.TestReplicationHandler_769471CD20BAB3FF-001/solr-instance-001/solr.xml
   [junit4]   2> 256565 INFO  (TEST-TestReplicationHandler.testRateLimitedReplication-seed#[769471CD20BAB3FF]) [    ] o.a.s.c.SolrXmlConfig Configuration parameter autoReplicaFailoverWorkLoopDelay is ignored
   [junit4]   2> 256565 INFO  (TEST-TestReplicationHandler.testRateLimitedReplication-seed#[769471CD20BAB3FF]) [    ] o.a.s.c.SolrXmlConfig Configuration parameter autoReplicaFailoverBadNodeExpiration is ignored
   [junit4]   2> 256567 INFO  (TEST-TestReplicationHandler.testRateLimitedReplication-seed#[769471CD20BAB3FF]) [    ] o.a.s.c.SolrXmlConfig MBean server found: com.sun.jmx.mbeanserver.JmxMBeanServer@10493ab3, but no JMX reporters were configured - adding default JMX reporter.
   [junit4]   2> 256608 INFO  (TEST-TestReplicationHandler.testRateLimitedReplication-seed#[769471CD20BAB3FF]) [    ] o.a.s.m.r.SolrJmxReporter JMX monitoring for 'solr.node' (registry 'solr.node') enabled at server: com.sun.jmx.mbeanserver.JmxMBeanServer@10493ab3
   [junit4]   2> 256632 INFO  (TEST-TestReplicationHandler.testRateLimitedReplication-seed#[769471CD20BAB3FF]) [    ] o.a.s.m.r.SolrJmxReporter JMX monitoring for 'solr.jvm' (registry 'solr.jvm') enabled at server: com.sun.jmx.mbeanserver.JmxMBeanServer@10493ab3
   [junit4]   2> 256632 INFO  (TEST-TestReplicationHandler.testRateLimitedReplication-seed#[769471CD20BAB3FF]) [    ] o.a.s.m.r.SolrJmxReporter JMX monitoring for 'solr.jetty' (registry 'solr.jetty') enabled at server: com.sun.jmx.mbeanserver.JmxMBeanServer@10493ab3
   [junit4]   2> 256640 INFO  (TEST-TestReplicationHandler.testRateLimitedReplication-seed#[769471CD20BAB3FF]) [    ] o.a.s.c.CorePropertiesLocator Found 1 core definitions underneath /x1/jenkins/jenkins-slave/workspace/Lucene-Solr-NightlyTests-7.x/checkout/solr/build/solr-core/test/J1/temp/solr.handler.TestReplicationHandler_769471CD20BAB3FF-001/solr-instance-001/.
   [junit4]   2> 256640 INFO  (TEST-TestReplicationHandler.testRateLimitedReplication-seed#[769471CD20BAB3FF]) [    ] o.a.s.c.CorePropertiesLocator Cores are: [collection1]
   [junit4]   2> 256659 INFO  (coreLoadExecutor-662-thread-1) [    ] o.a.s.c.TransientSolrCoreCacheDefault Allocating transient cache for 4 transient cores
   [junit4]   2> 256708 INFO  (coreLoadExecutor-662-thread-1) [    x:collection1] o.a.s.c.SolrConfig Using Lucene MatchVersion: 7.4.0
   [junit4]   2> 256740 INFO  (coreLoadExecutor-662-thread-1) [    x:collection1] o.a.s.s.IndexSchema [collection1] Schema name=test
   [junit4]   2> 256742 INFO  (coreLoadExecutor-662-thread-1) [    x:collection1] o.a.s.s.IndexSchema Loaded schema test/1.2 with uniqueid field id
   [junit4]   2> 256742 INFO  (coreLoadExecutor-662-thread-1) [    x:collection1] o.a.s.c.CoreContainer Creating SolrCore 'collection1' using configuration from instancedir /x1/jenkins/jenkins-slave/workspace/Lucene-Solr-NightlyTests-7.x/checkout/solr/build/solr-core/test/J1/temp/solr.handler.TestReplicationHandler_769471CD20BAB3FF-001/solr-instance-001/./collection1, trusted=true
   [junit4]   2> 256742 INFO  (coreLoadExecutor-662-thread-1) [    x:collection1] o.a.s.m.r.SolrJmxReporter JMX monitoring for 'solr.core.collection1' (registry 'solr.core.collection1') enabled at server: com.sun.jmx.mbeanserver.JmxMBeanServer@10493ab3
   [junit4]   2> 256765 INFO  (coreLoadExecutor-662-thread-1) [    x:collection1] o.a.s.c.SolrCore solr.RecoveryStrategy.Builder
   [junit4]   2> 256765 INFO  (coreLoadExecutor-662-thread-1) [    x:collection1] o.a.s.c.SolrCore [[collection1] ] Opening new SolrCore at [/x1/jenkins/jenkins-slave/workspace/Lucene-Solr-NightlyTests-7.x/checkout/solr/build/solr-core/test/J1/temp/solr.handler.TestReplicationHandler_769471CD20BAB3FF-001/solr-instance-001/collection1], dataDir=[/x1/jenkins/jenkins-slave/workspace/Lucene-Solr-NightlyTests-7.x/checkout/solr/build/solr-core/test/J1/temp/solr.handler.TestReplicationHandler_769471CD20BAB3FF-001/solr-instance-001/./collection1/data/]
   [junit4]   2> 256767 INFO  (coreLoadExecutor-662-thread-1) [    x:collection1] o.a.s.u.RandomMergePolicy RandomMergePolicy wrapping class org.apache.lucene.index.TieredMergePolicy: [TieredMergePolicy: maxMergeAtOnce=4, maxMergeAtOnceExplicit=6, maxMergedSegmentMB=7.87890625, floorSegmentMB=0.666015625, forceMergeDeletesPctAllowed=12.462545704608157, segmentsPerTier=11.0, maxCFSSegmentSizeMB=8.796093022207999E12, noCFSRatio=0.8606517880435762
   [junit4]   2> 256852 INFO  (coreLoadExecutor-662-thread-1) [    x:collection1] o.a.s.u.CommitTracker Hard AutoCommit: disabled
   [junit4]   2> 256852 INFO  (coreLoadExecutor-662-thread-1) [    x:collection1] o.a.s.u.CommitTracker Soft AutoCommit: disabled
   [junit4]   2> 256855 INFO  (coreLoadExecutor-662-thread-1) [    x:collection1] o.a.s.u.RandomMergePolicy RandomMergePolicy wrapping class org.apache.lucene.index.MockRandomMergePolicy: org.apache.lucene.index.MockRandomMergePolicy@1dca2edc
   [junit4]   2> 256861 INFO  (coreLoadExecutor-662-thread-1) [    x:collection1] o.a.s.s.SolrIndexSearcher Opening [Searcher@fd0ae34[collection1] main]
   [junit4]   2> 256861 INFO  (coreLoadExecutor-662-thread-1) [    x:collection1] o.a.s.r.ManagedResourceStorage File-based storage initialized to use dir: /x1/jenkins/jenkins-slave/workspace/Lucene-Solr-NightlyTests-7.x/checkout/solr/build/solr-core/test/J1/temp/solr.handler.TestReplicationHandler_769471CD20BAB3FF-001/solr-instance-001/collection1/conf
   [junit4]   2> 256861 INFO  (coreLoadExecutor-662-thread-1) [    x:collection1] o.a.s.h.ReplicationHandler Commits will be reserved for 10000ms.
   [junit4]   2> 256862 INFO  (searcherExecutor-663-thread-1-processing-x:collection1) [    x:collection1] o.a.s.c.SolrCore [collection1] Registered new searcher Searcher@fd0ae34[collection1] main{ExitableDirectoryReader(UninvertingDirectoryReader())}
   [junit4]   2> 256895 INFO  (qtp1577324217-1413) [    x:collection1] o.a.s.u.p.LogUpdateProcessorFactory [collection1]  webapp=/solr path=/update params={wt=javabin&version=2}{add=[0]} 0 1
   [junit4]   2> 256902 INFO  (qtp1577324217-1414) [    x:collection1] o.a.s.u.p.LogUpdateProcessorFactory [collection1]  webapp=/solr path=/update params={wt=javabin&version=2}{add=[1]} 0 3
   [junit4]   2> 256903 INFO  (qtp1577324217-1416) [    x:collection1] o.a.s.u.p.LogUpdateProcessorFactory [collection1]  webapp=/solr path=/update params={wt=javabin&version=2}{add=[2]} 0 0
   [junit4]   2> 256904 INFO  (qtp1577324217-1414) [    x:collection1] o.a.s.u.p.LogUpdateProcessorFactory [collection1]  webapp=/solr path=/update params={wt=javabin&version=2}{add=[3]} 0 0
   [junit4]   2> 256906 INFO  (qtp1577324217-1416) [    x:collection1] o.a.s.u.p.LogUpdateProcessorFactory [collection1]  webapp=/solr path=/update params={wt=javabin&version=2}{add=[4]} 0 0
   [junit4]   2> 256920 INFO  (qtp1577324217-1414) [    x:collection1] o.a.s.u.p.LogUpdateProcessorFactory [collection1]  webapp=/solr path=/update params={wt=javabin&version=2}{add=[5]} 0 11
   [junit4]   2> 256929 INFO  (qtp1577324217-1414) [    x:collection1] o.a.s.u.p.LogUpdateProcessorFactory [collection1]  webapp=/solr path=/update params={wt=javabin&version=2}{add=[6]} 0 7
   [junit4]   2> 256930 INFO  (qtp1577324217-1414) [    x:collection1] o.a.s.u.p.LogUpdateProcessorFactory [collection1]  webapp=/solr path=/update params={wt=javabin&version=2}{add=[7]} 0 0
   [junit4]   2> 256931 INFO  (qtp1577324217-1414) [    x:collection1] o.a.s.u.p.LogUpdateProcessorFactory [collection1]  webapp=/solr path=/update params={wt=javabin&version=2}{add=[8]} 0 0
   [junit4]   2> 256933 INFO  (qtp1577324217-1414) [    x:collection1] o.a.s.u.p.LogUpdateProcessorFactory [collection1]  webapp=/solr path=/update params={wt=javabin&version=2}{add=[9]} 0 0
   [junit4]   2> 256937 INFO  (qtp1577324217-1414) [    x:collection1] o.a.s.u.p.LogUpdateProcessorFactory [collection1]  webapp=/solr path=/update params={wt=javabin&version=2}{add=[10]} 0 0
   [junit4]   2> 256938 INFO  (qtp1577324217-1414) [    x:collection1] o.a.s.u.p.LogUpdateProcessorFactory [collection1]  webapp=/solr path=/update params={wt=javabin&version=2}{add=[11]} 0 0
   [junit4]   2> 256947 INFO  (qtp1577324217-1414) [    x:collection1] o.a.s.u.p.LogUpdateProcessorFactory [collection1]  webapp=/solr path=/update params={wt=javabin&version=2}{add=[12]} 0 4
   [junit4]   2> 256955 INFO  (qtp1577324217-1414) [    x:collection1] o.a.s.u.p.LogUpdateProcessorFactory [collection1]  webapp=/solr path=/update params={wt=javabin&version=2}{add=[13]} 0 6
   [junit4]   2> 256956 INFO  (qtp1577324217-1414) [    x:collection1] o.a.s.u.p.LogUpdateProcessorFactory [collection1]  webapp=/solr path=/update params={wt=javabin&version=2}{add=[14]} 0 0
   [junit4]   2> 256960 INFO  (qtp1577324217-1414) [    x:collection1] o.a.s.u.p.LogUpdateProcessorFactory [collection1]  webapp=/solr path=/update params={wt=javabin&version=2}{add=[15]} 0 3
   [junit4]   2> 256961 INFO  (qtp1577324217-1414) [    x:collection1] o.a.s.u.p.LogUpdateProcessorFactory [collection1]  webapp=/solr path=/update params={wt=javabin&version=2}{add=[16]} 0 0
   [junit4]   2> 256976 INFO  (qtp1577324217-1414) [    x:collection1] o.a.s.u.p.LogUpdateProcessorFactory [collection1]  webapp=/solr path=/update params={wt=javabin&version=2}{add=[17]} 0 13
   [junit4]   2> 256977 INFO  (qtp1577324217-1414) [    x:collection1] o.a.s.u.p.LogUpdateProcessorFactory [collection1]  webapp=/solr path=/update params={wt=javabin&version=2}{add=[18]} 0 0
   [junit4]   2> 256978 INFO  (qtp1577324217-1414) [    x:collection1] o.a.s.u.p.LogUpdateProcessorFactory [collection1]  webapp=/solr path=/update params={wt=javabin&version=2}{add=[19]} 0 0
   [junit4]   2> 256979 INFO  (qtp1577324217-1414) [    x:collection1] o.a.s.u.p.LogUpdateProcessorFactory [collection1]  webapp=/solr path=/update params={wt=javabin&version=2}{add=[20]} 0 0
   [junit4]   2> 256980 INFO  (qtp1577324217-1414) [    x:collection1] o.a.s.u.p.LogUpdateProcessorFactory [collection1]  webapp=/solr path=/update params={wt=javabin&version=2}{add=[21]} 0 0
   [junit4]   2> 256985 INFO  (qtp1577324217-1414) [    x:collection1] o.a.s.u.p.LogUpdateProcessorFactory [collection1]  webapp=/solr path=/update params={wt=javabin&version=2}{add=[22]} 0 4
   [junit4]   2> 256986 INFO  (qtp1577324217-1414) [    x:collection1] o.a.s.u.p.LogUpdateProcessorFactory [collection1]  webapp=/solr path=/update params={wt=javabin&version=2}{add=[23]} 0 0
   [junit4]   2> 256987 INFO  (qtp1577324217-1414) [    x:coll

[...truncated too long message...]

NodeTest, RAMDirectoryFactoryTest, TestDownShardTolerantSearch, TestJoin, PluginInfoTest, ZkStateReaderTest, TermVectorComponentDistributedTest, TestSubQueryTransformer, BooleanFieldTest, TestConfigSets, ConfigSetsAPITest, TestExceedMaxTermLength, TestMergePolicyConfig, TestStressLucene, TestReqParamsAPI, TestConfig, CollectionsAPIDistributedZkTest, SegmentsInfoRequestHandlerTest, HttpSolrCallGetCoreTest, ScheduledTriggerTest, TestHttpShardHandlerFactory, DistribJoinFromCollectionTest, SpellCheckCollatorWithCollapseTest, DefaultValueUpdateProcessorTest, CustomHighlightComponentTest, TestRandomRequestDistribution, TestSchemaResource, TestManagedResource, SolrCoreMetricManagerTest, SolrMetricsIntegrationTest, DocumentAnalysisRequestHandlerTest, TestOmitPositions, TestXmlQParser, TestRuleBasedAuthorizationPlugin, TestIndexSearcher, TestRetrieveFieldsOptimizer, TestComplexPhraseQParserPlugin, TestCrossCoreJoin, TestIndexingPerformance, SpellingQueryConverterTest, TestExtendedDismaxParser, BinaryUpdateRequestHandlerTest, TestSort, OpenExchangeRatesOrgProviderTest, TestLeaderElectionZkExpiry, TestNestedDocsSort, TestRTimerTree, BasicDistributedZkTest, ChaosMonkeySafeLeaderTest, UnloadDistributedZkTest, SyncSliceTest, OpenCloseCoreStressTest, RecoveryZkTest, FullSolrCloudDistribCmdsTest, ClusterStateUpdateTest, LeaderElectionTest, ZkCLITest, ShardRoutingCustomTest, TestDistributedSearch, TestFaceting, DistributedSpellCheckComponentTest, TestStressReorder, TestReload, TestCoreContainer, TestSolr4Spatial, SolrCoreTest, SpellCheckComponentTest, PeerSyncTest, BadIndexSchemaTest, ConvertedLegacyTest, TestFunctionQuery, DirectUpdateHandlerTest, TestBadConfig, ShowFileRequestHandlerTest, DistributedQueryElevationComponentTest, SolrIndexSplitterTest, TestCoreDiscovery, SignatureUpdateProcessorFactoryTest, SuggesterFSTTest, SolrRequestParserTest, TestFoldingMultitermQuery, DocValuesTest, SuggesterTSTTest, SpatialFilterTest, SuggesterWFSTTest, PolyFieldTest, NoCacheHeaderTest, TestUpdate, FieldMutatingUpdateProcessorTest, TestAtomicUpdateErrorCases, TestWordDelimiterFilterFactory, StatelessScriptUpdateProcessorFactoryTest, TestSolrDeletionPolicy1, XsltUpdateRequestHandlerTest, DebugComponentTest, CacheHeaderTest, IndexBasedSpellCheckerTest, TestWriterPerf, DirectSolrSpellCheckerTest, TestReversedWildcardFilterFactory, PrimitiveFieldTypeTest, FileBasedSpellCheckerTest, TermsComponentTest, XmlUpdateRequestHandlerTest, RequestHandlersTest, RequiredFieldsTest, FastVectorHighlighterTest, IndexSchemaRuntimeFieldTest, LoggingHandlerTest, RegexBoostProcessorTest, TestJmxIntegration, TestCollationField, ReturnFieldsTest, TestCSVResponseWriter, TestAnalyzedSuggestions, UniqFieldsUpdateProcessorFactoryTest, JsonLoaderTest, CSVRequestHandlerTest, SearchHandlerTest, TestBinaryField, ExternalFileFieldSortTest, TestPostingsSolrHighlighter, NotRequiredUniqueKeyTest, TestCharFilters, TestXIncludeConfig, EchoParamsTest, TestSweetSpotSimilarityFactory, TestPerFieldSimilarity, TestLMJelinekMercerSimilarityFactory, TestFastWriter, URLClassifyProcessorTest, ChaosMonkeyNothingIsSafeTest, TestSystemIdResolver, ClusterStateTest, TestLRUCache, SliceStateTest, FileUtilsTest, TestEmbeddedSolrServerAdminHandler, TestEmbeddedSolrServerSchemaAPI, ConnectionReuseTest, AssignBackwardCompatibilityTest, CollectionStateFormat2Test, ConcurrentCreateRoutedAliasTest, ConnectionManagerTest, DeleteInactiveReplicaTest, DistributedQueueTest, LeaderElectionContextKeyTest, LeaderFailoverAfterPartitionTest, LeaderVoteWaitTimeoutTest, MoveReplicaTest, OverseerTaskQueueTest, RestartWhileUpdatingTest, RollingRestartTest, SimpleCollectionCreateDeleteTest, TestLocalFSCloudBackupRestore, TestReplicaProperties, AutoAddReplicasPlanActionTest, ComputePlanActionTest, HdfsAutoAddReplicasIntegrationTest, HttpTriggerListenerTest, IndexSizeTriggerTest, NodeAddedTriggerTest, NodeLostTriggerTest, TestClusterStateProvider, TestNodeLostTrigger, TestPolicyCloud, TestSimDistributedQueue, TestTriggerIntegration, BaseCdcrDistributedZkTest, CdcrRequestHandlerTest, HdfsRecoverLeaseTest, StressHdfsTest]
   [junit4] Completed [634/802 (4!)] on J0 in 125.58s, 1 test, 1 failure <<< FAILURES!

[...truncated 47608 lines...]
-ecj-javadoc-lint-tests:
    [mkdir] Created dir: /tmp/ecj1662549689
 [ecj-lint] Compiling 895 source files to /tmp/ecj1662549689
 [ecj-lint] invalid Class-Path header in manifest of jar file: /x1/jenkins/.ivy2/cache/org.restlet.jee/org.restlet/jars/org.restlet-2.3.0.jar
 [ecj-lint] invalid Class-Path header in manifest of jar file: /x1/jenkins/.ivy2/cache/org.restlet.jee/org.restlet.ext.servlet/jars/org.restlet.ext.servlet-2.3.0.jar
 [ecj-lint] ----------
 [ecj-lint] 1. WARNING in /x1/jenkins/jenkins-slave/workspace/Lucene-Solr-NightlyTests-7.x/checkout/solr/core/src/test/org/apache/solr/analysis/TokenizerChainTest.java (at line 37)
 [ecj-lint] TokenizerChain tokenizerChain = new TokenizerChain(
 [ecj-lint]               ^^^^^^^^^^^^^^
 [ecj-lint] Resource leak: 'tokenizerChain' is never closed
 [ecj-lint] ----------
 [ecj-lint] ----------
 [ecj-lint] 2. ERROR in /x1/jenkins/jenkins-slave/workspace/Lucene-Solr-NightlyTests-7.x/checkout/solr/core/src/test/org/apache/solr/cloud/DeleteReplicaTest.java (at line 31)
 [ecj-lint] import java.util.function.Supplier;
 [ecj-lint]       ^^^^^^^^^^^^^^^^^^^^^^^^^^^
 [ecj-lint] The import java.util.function.Supplier is never used
 [ecj-lint] ----------
 [ecj-lint] ----------
 [ecj-lint] 3. ERROR in /x1/jenkins/jenkins-slave/workspace/Lucene-Solr-NightlyTests-7.x/checkout/solr/core/src/test/org/apache/solr/cloud/ForceLeaderTest.java (at line 25)
 [ecj-lint] import java.util.concurrent.TimeUnit;
 [ecj-lint]       ^^^^^^^^^^^^^^^^^^^^^^^^^^^^^
 [ecj-lint] The import java.util.concurrent.TimeUnit is never used
 [ecj-lint] ----------
 [ecj-lint] 4. ERROR in /x1/jenkins/jenkins-slave/workspace/Lucene-Solr-NightlyTests-7.x/checkout/solr/core/src/test/org/apache/solr/cloud/ForceLeaderTest.java (at line 26)
 [ecj-lint] import java.util.stream.Collectors;
 [ecj-lint]       ^^^^^^^^^^^^^^^^^^^^^^^^^^^
 [ecj-lint] The import java.util.stream.Collectors is never used
 [ecj-lint] ----------
 [ecj-lint] 5. ERROR in /x1/jenkins/jenkins-slave/workspace/Lucene-Solr-NightlyTests-7.x/checkout/solr/core/src/test/org/apache/solr/cloud/ForceLeaderTest.java (at line 32)
 [ecj-lint] import org.apache.solr.cloud.overseer.OverseerAction;
 [ecj-lint]       ^^^^^^^^^^^^^^^^^^^^^^^^^^^^^^^^^^^^^^^^^^^^^
 [ecj-lint] The import org.apache.solr.cloud.overseer.OverseerAction is never used
 [ecj-lint] ----------
 [ecj-lint] 6. ERROR in /x1/jenkins/jenkins-slave/workspace/Lucene-Solr-NightlyTests-7.x/checkout/solr/core/src/test/org/apache/solr/cloud/ForceLeaderTest.java (at line 38)
 [ecj-lint] import org.apache.solr.common.cloud.ZkNodeProps;
 [ecj-lint]       ^^^^^^^^^^^^^^^^^^^^^^^^^^^^^^^^^^^^^^^^
 [ecj-lint] The import org.apache.solr.common.cloud.ZkNodeProps is never used
 [ecj-lint] ----------
 [ecj-lint] 7. ERROR in /x1/jenkins/jenkins-slave/workspace/Lucene-Solr-NightlyTests-7.x/checkout/solr/core/src/test/org/apache/solr/cloud/ForceLeaderTest.java (at line 39)
 [ecj-lint] import org.apache.solr.common.cloud.ZkStateReader;
 [ecj-lint]       ^^^^^^^^^^^^^^^^^^^^^^^^^^^^^^^^^^^^^^^^^^
 [ecj-lint] The import org.apache.solr.common.cloud.ZkStateReader is never used
 [ecj-lint] ----------
 [ecj-lint] 8. ERROR in /x1/jenkins/jenkins-slave/workspace/Lucene-Solr-NightlyTests-7.x/checkout/solr/core/src/test/org/apache/solr/cloud/ForceLeaderTest.java (at line 41)
 [ecj-lint] import org.apache.solr.common.util.Utils;
 [ecj-lint]       ^^^^^^^^^^^^^^^^^^^^^^^^^^^^^^^^^
 [ecj-lint] The import org.apache.solr.common.util.Utils is never used
 [ecj-lint] ----------
 [ecj-lint] ----------
 [ecj-lint] 9. ERROR in /x1/jenkins/jenkins-slave/workspace/Lucene-Solr-NightlyTests-7.x/checkout/solr/core/src/test/org/apache/solr/cloud/MoveReplicaTest.java (at line 25)
 [ecj-lint] import java.util.HashSet;
 [ecj-lint]       ^^^^^^^^^^^^^^^^^
 [ecj-lint] The import java.util.HashSet is never used
 [ecj-lint] ----------
 [ecj-lint] 10. ERROR in /x1/jenkins/jenkins-slave/workspace/Lucene-Solr-NightlyTests-7.x/checkout/solr/core/src/test/org/apache/solr/cloud/MoveReplicaTest.java (at line 42)
 [ecj-lint] import org.apache.solr.common.cloud.CollectionStateWatcher;
 [ecj-lint]       ^^^^^^^^^^^^^^^^^^^^^^^^^^^^^^^^^^^^^^^^^^^^^^^^^^^
 [ecj-lint] The import org.apache.solr.common.cloud.CollectionStateWatcher is never used
 [ecj-lint] ----------
 [ecj-lint] 11. ERROR in /x1/jenkins/jenkins-slave/workspace/Lucene-Solr-NightlyTests-7.x/checkout/solr/core/src/test/org/apache/solr/cloud/MoveReplicaTest.java (at line 46)
 [ecj-lint] import org.apache.solr.common.cloud.ZkStateReaderAccessor;
 [ecj-lint]       ^^^^^^^^^^^^^^^^^^^^^^^^^^^^^^^^^^^^^^^^^^^^^^^^^^
 [ecj-lint] The import org.apache.solr.common.cloud.ZkStateReaderAccessor is never used
 [ecj-lint] ----------
 [ecj-lint] 11 problems (10 errors, 1 warning)

BUILD FAILED
/x1/jenkins/jenkins-slave/workspace/Lucene-Solr-NightlyTests-7.x/checkout/build.xml:651: The following error occurred while executing this line:
/x1/jenkins/jenkins-slave/workspace/Lucene-Solr-NightlyTests-7.x/checkout/build.xml:101: The following error occurred while executing this line:
/x1/jenkins/jenkins-slave/workspace/Lucene-Solr-NightlyTests-7.x/checkout/solr/build.xml:690: The following error occurred while executing this line:
/x1/jenkins/jenkins-slave/workspace/Lucene-Solr-NightlyTests-7.x/checkout/lucene/common-build.xml:2095: The following error occurred while executing this line:
/x1/jenkins/jenkins-slave/workspace/Lucene-Solr-NightlyTests-7.x/checkout/lucene/common-build.xml:2128: Compile failed; see the compiler error output for details.

Total time: 250 minutes 27 seconds
Build step 'Invoke Ant' marked build as failure
Archiving artifacts
Recording test results
Email was triggered for: Failure - Any
Sending email for trigger: Failure - Any


---------------------------------------------------------------------
To unsubscribe, e-mail: [hidden email]
For additional commands, e-mail: [hidden email]