[JENKINS] Lucene-Solr-NightlyTests-7.x - Build # 81 - Still Failing

Previous Topic Next Topic
 
classic Classic list List threaded Threaded
3 messages Options
Reply | Threaded
Open this post in threaded view
|

[JENKINS] Lucene-Solr-NightlyTests-7.x - Build # 81 - Still Failing

Apache Jenkins Server-2
Build: https://builds.apache.org/job/Lucene-Solr-NightlyTests-7.x/81/

All tests passed

Build Log:
[...truncated 1708 lines...]
   [junit4] JVM J2: stdout was not empty, see: /x1/jenkins/jenkins-slave/workspace/Lucene-Solr-NightlyTests-7.x/checkout/lucene/build/core/test/temp/junit4-J2-20171114_002447_8114312669411900228701.sysout
   [junit4] >>> JVM J2 emitted unexpected output (verbatim) ----
   [junit4] #
   [junit4] # There is insufficient memory for the Java Runtime Environment to continue.
   [junit4] # Native memory allocation (mmap) failed to map 22020096 bytes for committing reserved memory.
   [junit4] # An error report file with more information is saved as:
   [junit4] # /x1/jenkins/jenkins-slave/workspace/Lucene-Solr-NightlyTests-7.x/checkout/lucene/build/core/test/J2/hs_err_pid26699.log
   [junit4] <<< JVM J2: EOF ----

   [junit4] JVM J2: stderr was not empty, see: /x1/jenkins/jenkins-slave/workspace/Lucene-Solr-NightlyTests-7.x/checkout/lucene/build/core/test/temp/junit4-J2-20171114_002447_8119103672823985129232.syserr
   [junit4] >>> JVM J2 emitted unexpected output (verbatim) ----
   [junit4] Java HotSpot(TM) 64-Bit Server VM warning: INFO: os::commit_memory(0x00000000edb00000, 22020096, 0) failed; error='Cannot allocate memory' (errno=12)
   [junit4] <<< JVM J2: EOF ----

   [junit4] JVM J1: stdout was not empty, see: /x1/jenkins/jenkins-slave/workspace/Lucene-Solr-NightlyTests-7.x/checkout/lucene/build/core/test/temp/junit4-J1-20171114_002447_8114762505336561268437.sysout
   [junit4] >>> JVM J1 emitted unexpected output (verbatim) ----
   [junit4] #
   [junit4] # There is insufficient memory for the Java Runtime Environment to continue.
   [junit4] # Native memory allocation (mmap) failed to map 1048576 bytes for committing reserved memory.
   [junit4] # An error report file with more information is saved as:
   [junit4] # /x1/jenkins/jenkins-slave/workspace/Lucene-Solr-NightlyTests-7.x/checkout/lucene/build/core/test/J1/hs_err_pid26698.log
   [junit4] <<< JVM J1: EOF ----

   [junit4] JVM J1: stderr was not empty, see: /x1/jenkins/jenkins-slave/workspace/Lucene-Solr-NightlyTests-7.x/checkout/lucene/build/core/test/temp/junit4-J1-20171114_002447_8111648972093733746642.syserr
   [junit4] >>> JVM J1 emitted unexpected output (verbatim) ----
   [junit4] Java HotSpot(TM) 64-Bit Server VM warning: INFO: os::commit_memory(0x00000000fff00000, 1048576, 0) failed; error='Cannot allocate memory' (errno=12)
   [junit4] <<< JVM J1: EOF ----

[...truncated 363 lines...]
   [junit4] ERROR: JVM J1 ended with an exception, command line: /usr/local/asfpackages/java/jdk1.8.0_144/jre/bin/java -XX:+HeapDumpOnOutOfMemoryError -XX:HeapDumpPath=/x1/jenkins/jenkins-slave/workspace/Lucene-Solr-NightlyTests-7.x/checkout/heapdumps -ea -esa -Dtests.prefix=tests -Dtests.seed=FF92EC3E12C1259A -Xmx512M -Dtests.iters= -Dtests.verbose=false -Dtests.infostream=false -Dtests.codec=random -Dtests.postingsformat=random -Dtests.docvaluesformat=random -Dtests.locale=random -Dtests.timezone=random -Dtests.directory=random -Dtests.linedocsfile=/home/jenkins/jenkins-slave/workspace/Lucene-Solr-NightlyTests-7.x/test-data/enwiki.random.lines.txt -Dtests.luceneMatchVersion=7.2.0 -Dtests.cleanthreads=perMethod -Djava.util.logging.config.file=/x1/jenkins/jenkins-slave/workspace/Lucene-Solr-NightlyTests-7.x/checkout/lucene/tools/junit4/logging.properties -Dtests.nightly=true -Dtests.weekly=false -Dtests.monster=false -Dtests.slow=true -Dtests.asserts=true -Dtests.multiplier=2 -DtempDir=./temp -Djava.io.tmpdir=./temp -Djunit4.tempDir=/x1/jenkins/jenkins-slave/workspace/Lucene-Solr-NightlyTests-7.x/checkout/lucene/build/core/test/temp -Dcommon.dir=/x1/jenkins/jenkins-slave/workspace/Lucene-Solr-NightlyTests-7.x/checkout/lucene -Dclover.db.dir=/x1/jenkins/jenkins-slave/workspace/Lucene-Solr-NightlyTests-7.x/checkout/lucene/build/clover/db -Djava.security.policy=/x1/jenkins/jenkins-slave/workspace/Lucene-Solr-NightlyTests-7.x/checkout/lucene/tools/junit4/tests.policy -Dtests.LUCENE_VERSION=7.2.0 -Djetty.testMode=1 -Djetty.insecurerandom=1 -Dsolr.directoryFactory=org.apache.solr.core.MockDirectoryFactory -Djava.awt.headless=true -Djdk.map.althashing.threshold=0 -Dtests.src.home=/x1/jenkins/jenkins-slave/workspace/Lucene-Solr-NightlyTests-7.x/checkout -Djava.security.egd=file:/dev/./urandom -Djunit4.childvm.cwd=/x1/jenkins/jenkins-slave/workspace/Lucene-Solr-NightlyTests-7.x/checkout/lucene/build/core/test/J1 -Djunit4.childvm.id=1 -Djunit4.childvm.count=3 -Dtests.leaveTemporary=false -Dtests.filterstacks=true -Djava.security.manager=org.apache.lucene.util.TestSecurityManager -Dfile.encoding=US-ASCII -classpath /x1/jenkins/jenkins-slave/workspace/Lucene-Solr-NightlyTests-7.x/checkout/lucene/build/codecs/classes/java:/x1/jenkins/jenkins-slave/workspace/Lucene-Solr-NightlyTests-7.x/checkout/lucene/build/test-framework/classes/java:/x1/jenkins/jenkins-slave/workspace/Lucene-Solr-NightlyTests-7.x/checkout/lucene/test-framework/lib/junit-4.10.jar:/x1/jenkins/jenkins-slave/workspace/Lucene-Solr-NightlyTests-7.x/checkout/lucene/test-framework/lib/randomizedtesting-runner-2.5.3.jar:/x1/jenkins/jenkins-slave/workspace/Lucene-Solr-NightlyTests-7.x/checkout/lucene/build/core/classes/java:/x1/jenkins/jenkins-slave/workspace/Lucene-Solr-NightlyTests-7.x/checkout/lucene/build/core/classes/test:/home/jenkins/tools/ant/apache-ant-1.8.4/lib/ant-launcher.jar:/x1/jenkins/.ant/lib/ivy-2.4.0.jar:/home/jenkins/tools/ant/apache-ant-1.8.4/lib/ant-junit.jar:/home/jenkins/tools/ant/apache-ant-1.8.4/lib/ant-apache-log4j.jar:/home/jenkins/tools/ant/apache-ant-1.8.4/lib/ant-junit4.jar:/home/jenkins/tools/ant/apache-ant-1.8.4/lib/ant-jai.jar:/home/jenkins/tools/ant/apache-ant-1.8.4/lib/ant-javamail.jar:/home/jenkins/tools/ant/apache-ant-1.8.4/lib/ant-apache-bsf.jar:/home/jenkins/tools/ant/apache-ant-1.8.4/lib/ant-commons-net.jar:/home/jenkins/tools/ant/apache-ant-1.8.4/lib/ant-antlr.jar:/home/jenkins/tools/ant/apache-ant-1.8.4/lib/ant-jsch.jar:/home/jenkins/tools/ant/apache-ant-1.8.4/lib/ant-apache-oro.jar:/home/jenkins/tools/ant/apache-ant-1.8.4/lib/ant-commons-logging.jar:/home/jenkins/tools/ant/apache-ant-1.8.4/lib/ant.jar:/home/jenkins/tools/ant/apache-ant-1.8.4/lib/ant-netrexx.jar:/home/jenkins/tools/ant/apache-ant-1.8.4/lib/ant-testutil.jar:/home/jenkins/tools/ant/apache-ant-1.8.4/lib/ant-jdepend.jar:/home/jenkins/tools/ant/apache-ant-1.8.4/lib/ant-apache-bcel.jar:/home/jenkins/tools/ant/apache-ant-1.8.4/lib/ant-apache-xalan2.jar:/home/jenkins/tools/ant/apache-ant-1.8.4/lib/ant-apache-resolver.jar:/home/jenkins/tools/ant/apache-ant-1.8.4/lib/ant-jmf.jar:/home/jenkins/tools/ant/apache-ant-1.8.4/lib/ant-apache-regexp.jar:/home/jenkins/tools/ant/apache-ant-1.8.4/lib/ant-swing.jar:/usr/local/asfpackages/java/jdk1.8.0_144/lib/tools.jar:/x1/jenkins/.ivy2/cache/com.carrotsearch.randomizedtesting/junit4-ant/jars/junit4-ant-2.5.3.jar com.carrotsearch.ant.tasks.junit4.slave.SlaveMainSafe -eventsfile /x1/jenkins/jenkins-slave/workspace/Lucene-Solr-NightlyTests-7.x/checkout/lucene/build/core/test/temp/junit4-J1-20171114_002447_8117461444505972627241.events @/x1/jenkins/jenkins-slave/workspace/Lucene-Solr-NightlyTests-7.x/checkout/lucene/build/core/test/temp/junit4-J1-20171114_002447_8117126377606181055619.suites -stdin
   [junit4] ERROR: JVM J1 ended with an exception: Forked process returned with error code: 1. Very likely a JVM crash.  See process stdout at: /x1/jenkins/jenkins-slave/workspace/Lucene-Solr-NightlyTests-7.x/checkout/lucene/build/core/test/temp/junit4-J1-20171114_002447_8114762505336561268437.sysout See process stderr at: /x1/jenkins/jenkins-slave/workspace/Lucene-Solr-NightlyTests-7.x/checkout/lucene/build/core/test/temp/junit4-J1-20171114_002447_8111648972093733746642.syserr
   [junit4] at com.carrotsearch.ant.tasks.junit4.JUnit4.executeSlave(JUnit4.java:1519)
   [junit4] at com.carrotsearch.ant.tasks.junit4.JUnit4.access$000(JUnit4.java:126)
   [junit4] at com.carrotsearch.ant.tasks.junit4.JUnit4$2.call(JUnit4.java:982)
   [junit4] at com.carrotsearch.ant.tasks.junit4.JUnit4$2.call(JUnit4.java:979)
   [junit4] at java.util.concurrent.FutureTask.run(FutureTask.java:266)
   [junit4] at java.util.concurrent.ThreadPoolExecutor.runWorker(ThreadPoolExecutor.java:1149)
   [junit4] at java.util.concurrent.ThreadPoolExecutor$Worker.run(ThreadPoolExecutor.java:624)
   [junit4] at java.lang.Thread.run(Thread.java:748)
   [junit4] ERROR: JVM J2 ended with an exception, command line: /usr/local/asfpackages/java/jdk1.8.0_144/jre/bin/java -XX:+HeapDumpOnOutOfMemoryError -XX:HeapDumpPath=/x1/jenkins/jenkins-slave/workspace/Lucene-Solr-NightlyTests-7.x/checkout/heapdumps -ea -esa -Dtests.prefix=tests -Dtests.seed=FF92EC3E12C1259A -Xmx512M -Dtests.iters= -Dtests.verbose=false -Dtests.infostream=false -Dtests.codec=random -Dtests.postingsformat=random -Dtests.docvaluesformat=random -Dtests.locale=random -Dtests.timezone=random -Dtests.directory=random -Dtests.linedocsfile=/home/jenkins/jenkins-slave/workspace/Lucene-Solr-NightlyTests-7.x/test-data/enwiki.random.lines.txt -Dtests.luceneMatchVersion=7.2.0 -Dtests.cleanthreads=perMethod -Djava.util.logging.config.file=/x1/jenkins/jenkins-slave/workspace/Lucene-Solr-NightlyTests-7.x/checkout/lucene/tools/junit4/logging.properties -Dtests.nightly=true -Dtests.weekly=false -Dtests.monster=false -Dtests.slow=true -Dtests.asserts=true -Dtests.multiplier=2 -DtempDir=./temp -Djava.io.tmpdir=./temp -Djunit4.tempDir=/x1/jenkins/jenkins-slave/workspace/Lucene-Solr-NightlyTests-7.x/checkout/lucene/build/core/test/temp -Dcommon.dir=/x1/jenkins/jenkins-slave/workspace/Lucene-Solr-NightlyTests-7.x/checkout/lucene -Dclover.db.dir=/x1/jenkins/jenkins-slave/workspace/Lucene-Solr-NightlyTests-7.x/checkout/lucene/build/clover/db -Djava.security.policy=/x1/jenkins/jenkins-slave/workspace/Lucene-Solr-NightlyTests-7.x/checkout/lucene/tools/junit4/tests.policy -Dtests.LUCENE_VERSION=7.2.0 -Djetty.testMode=1 -Djetty.insecurerandom=1 -Dsolr.directoryFactory=org.apache.solr.core.MockDirectoryFactory -Djava.awt.headless=true -Djdk.map.althashing.threshold=0 -Dtests.src.home=/x1/jenkins/jenkins-slave/workspace/Lucene-Solr-NightlyTests-7.x/checkout -Djava.security.egd=file:/dev/./urandom -Djunit4.childvm.cwd=/x1/jenkins/jenkins-slave/workspace/Lucene-Solr-NightlyTests-7.x/checkout/lucene/build/core/test/J2 -Djunit4.childvm.id=2 -Djunit4.childvm.count=3 -Dtests.leaveTemporary=false -Dtests.filterstacks=true -Djava.security.manager=org.apache.lucene.util.TestSecurityManager -Dfile.encoding=US-ASCII -classpath /x1/jenkins/jenkins-slave/workspace/Lucene-Solr-NightlyTests-7.x/checkout/lucene/build/codecs/classes/java:/x1/jenkins/jenkins-slave/workspace/Lucene-Solr-NightlyTests-7.x/checkout/lucene/build/test-framework/classes/java:/x1/jenkins/jenkins-slave/workspace/Lucene-Solr-NightlyTests-7.x/checkout/lucene/test-framework/lib/junit-4.10.jar:/x1/jenkins/jenkins-slave/workspace/Lucene-Solr-NightlyTests-7.x/checkout/lucene/test-framework/lib/randomizedtesting-runner-2.5.3.jar:/x1/jenkins/jenkins-slave/workspace/Lucene-Solr-NightlyTests-7.x/checkout/lucene/build/core/classes/java:/x1/jenkins/jenkins-slave/workspace/Lucene-Solr-NightlyTests-7.x/checkout/lucene/build/core/classes/test:/home/jenkins/tools/ant/apache-ant-1.8.4/lib/ant-launcher.jar:/x1/jenkins/.ant/lib/ivy-2.4.0.jar:/home/jenkins/tools/ant/apache-ant-1.8.4/lib/ant-junit.jar:/home/jenkins/tools/ant/apache-ant-1.8.4/lib/ant-apache-log4j.jar:/home/jenkins/tools/ant/apache-ant-1.8.4/lib/ant-junit4.jar:/home/jenkins/tools/ant/apache-ant-1.8.4/lib/ant-jai.jar:/home/jenkins/tools/ant/apache-ant-1.8.4/lib/ant-javamail.jar:/home/jenkins/tools/ant/apache-ant-1.8.4/lib/ant-apache-bsf.jar:/home/jenkins/tools/ant/apache-ant-1.8.4/lib/ant-commons-net.jar:/home/jenkins/tools/ant/apache-ant-1.8.4/lib/ant-antlr.jar:/home/jenkins/tools/ant/apache-ant-1.8.4/lib/ant-jsch.jar:/home/jenkins/tools/ant/apache-ant-1.8.4/lib/ant-apache-oro.jar:/home/jenkins/tools/ant/apache-ant-1.8.4/lib/ant-commons-logging.jar:/home/jenkins/tools/ant/apache-ant-1.8.4/lib/ant.jar:/home/jenkins/tools/ant/apache-ant-1.8.4/lib/ant-netrexx.jar:/home/jenkins/tools/ant/apache-ant-1.8.4/lib/ant-testutil.jar:/home/jenkins/tools/ant/apache-ant-1.8.4/lib/ant-jdepend.jar:/home/jenkins/tools/ant/apache-ant-1.8.4/lib/ant-apache-bcel.jar:/home/jenkins/tools/ant/apache-ant-1.8.4/lib/ant-apache-xalan2.jar:/home/jenkins/tools/ant/apache-ant-1.8.4/lib/ant-apache-resolver.jar:/home/jenkins/tools/ant/apache-ant-1.8.4/lib/ant-jmf.jar:/home/jenkins/tools/ant/apache-ant-1.8.4/lib/ant-apache-regexp.jar:/home/jenkins/tools/ant/apache-ant-1.8.4/lib/ant-swing.jar:/usr/local/asfpackages/java/jdk1.8.0_144/lib/tools.jar:/x1/jenkins/.ivy2/cache/com.carrotsearch.randomizedtesting/junit4-ant/jars/junit4-ant-2.5.3.jar com.carrotsearch.ant.tasks.junit4.slave.SlaveMainSafe -eventsfile /x1/jenkins/jenkins-slave/workspace/Lucene-Solr-NightlyTests-7.x/checkout/lucene/build/core/test/temp/junit4-J2-20171114_002447_8118966387714453190953.events @/x1/jenkins/jenkins-slave/workspace/Lucene-Solr-NightlyTests-7.x/checkout/lucene/build/core/test/temp/junit4-J2-20171114_002447_8113861448992097826200.suites -stdin
   [junit4] ERROR: JVM J2 ended with an exception: Forked process returned with error code: 1. Very likely a JVM crash.  See process stdout at: /x1/jenkins/jenkins-slave/workspace/Lucene-Solr-NightlyTests-7.x/checkout/lucene/build/core/test/temp/junit4-J2-20171114_002447_8114312669411900228701.sysout See process stderr at: /x1/jenkins/jenkins-slave/workspace/Lucene-Solr-NightlyTests-7.x/checkout/lucene/build/core/test/temp/junit4-J2-20171114_002447_8119103672823985129232.syserr
   [junit4] at com.carrotsearch.ant.tasks.junit4.JUnit4.executeSlave(JUnit4.java:1519)
   [junit4] at com.carrotsearch.ant.tasks.junit4.JUnit4.access$000(JUnit4.java:126)
   [junit4] at com.carrotsearch.ant.tasks.junit4.JUnit4$2.call(JUnit4.java:982)
   [junit4] at com.carrotsearch.ant.tasks.junit4.JUnit4$2.call(JUnit4.java:979)
   [junit4] at java.util.concurrent.FutureTask.run(FutureTask.java:266)
   [junit4] at java.util.concurrent.ThreadPoolExecutor.runWorker(ThreadPoolExecutor.java:1149)
   [junit4] at java.util.concurrent.ThreadPoolExecutor$Worker.run(ThreadPoolExecutor.java:624)
   [junit4] at java.lang.Thread.run(Thread.java:748)

BUILD FAILED
/x1/jenkins/jenkins-slave/workspace/Lucene-Solr-NightlyTests-7.x/checkout/build.xml:843: The following error occurred while executing this line:
/x1/jenkins/jenkins-slave/workspace/Lucene-Solr-NightlyTests-7.x/checkout/build.xml:779: The following error occurred while executing this line:
/x1/jenkins/jenkins-slave/workspace/Lucene-Solr-NightlyTests-7.x/checkout/build.xml:59: The following error occurred while executing this line:
/x1/jenkins/jenkins-slave/workspace/Lucene-Solr-NightlyTests-7.x/checkout/lucene/build.xml:50: The following error occurred while executing this line:
/x1/jenkins/jenkins-slave/workspace/Lucene-Solr-NightlyTests-7.x/checkout/lucene/common-build.xml:1512: The following error occurred while executing this line:
/x1/jenkins/jenkins-slave/workspace/Lucene-Solr-NightlyTests-7.x/checkout/lucene/common-build.xml:1038: At least one slave process threw an exception, first: Forked process returned with error code: 1. Very likely a JVM crash.  See process stdout at: /x1/jenkins/jenkins-slave/workspace/Lucene-Solr-NightlyTests-7.x/checkout/lucene/build/core/test/temp/junit4-J1-20171114_002447_8114762505336561268437.sysout See process stderr at: /x1/jenkins/jenkins-slave/workspace/Lucene-Solr-NightlyTests-7.x/checkout/lucene/build/core/test/temp/junit4-J1-20171114_002447_8111648972093733746642.syserr

Total time: 269 minutes 58 seconds
Build step 'Invoke Ant' marked build as failure
Archiving artifacts
[Fast Archiver] No artifacts from Lucene-Solr-NightlyTests-7.x #78 to compare, so performing full copy of artifacts
Recording test results
Email was triggered for: Failure - Any
Sending email for trigger: Failure - Any


---------------------------------------------------------------------
To unsubscribe, e-mail: [hidden email]
For additional commands, e-mail: [hidden email]
Reply | Threaded
Open this post in threaded view
|

[JENKINS] Lucene-Solr-NightlyTests-7.x - Build # 82 - Still Failing

Apache Jenkins Server-2
Build: https://builds.apache.org/job/Lucene-Solr-NightlyTests-7.x/82/

5 tests failed.
FAILED:  org.apache.solr.cloud.FullSolrCloudDistribCmdsTest.test

Error Message:
Java heap space

Stack Trace:
java.lang.OutOfMemoryError: Java heap space
        at __randomizedtesting.SeedInfo.seed([E07FE81933F3A07F:682BD7C39D0FCD87]:0)
        at java.util.Arrays.copyOf(Arrays.java:3332)
        at java.lang.AbstractStringBuilder.ensureCapacityInternal(AbstractStringBuilder.java:124)
        at java.lang.AbstractStringBuilder.append(AbstractStringBuilder.java:649)
        at java.lang.StringBuilder.append(StringBuilder.java:202)
        at org.apache.http.client.utils.URLEncodedUtils.urlEncode(URLEncodedUtils.java:536)
        at org.apache.http.client.utils.URLEncodedUtils.encodeFormFields(URLEncodedUtils.java:652)
        at org.apache.http.client.utils.URLEncodedUtils.format(URLEncodedUtils.java:404)
        at org.apache.http.client.utils.URLEncodedUtils.format(URLEncodedUtils.java:382)
        at org.apache.http.client.entity.UrlEncodedFormEntity.<init>(UrlEncodedFormEntity.java:75)
        at org.apache.solr.client.solrj.impl.HttpSolrClient.fillContentStream(HttpSolrClient.java:513)
        at org.apache.solr.client.solrj.impl.HttpSolrClient.createMethod(HttpSolrClient.java:420)
        at org.apache.solr.client.solrj.impl.HttpSolrClient.request(HttpSolrClient.java:253)
        at org.apache.solr.client.solrj.impl.HttpSolrClient.request(HttpSolrClient.java:244)
        at org.apache.solr.client.solrj.impl.LBHttpSolrClient.doRequest(LBHttpSolrClient.java:483)
        at org.apache.solr.client.solrj.impl.LBHttpSolrClient.request(LBHttpSolrClient.java:413)
        at org.apache.solr.client.solrj.impl.CloudSolrClient.sendRequest(CloudSolrClient.java:1104)
        at org.apache.solr.client.solrj.impl.CloudSolrClient.requestWithRetryOnStaleState(CloudSolrClient.java:883)
        at org.apache.solr.client.solrj.impl.CloudSolrClient.request(CloudSolrClient.java:816)
        at org.apache.solr.client.solrj.SolrRequest.process(SolrRequest.java:194)
        at org.apache.solr.client.solrj.SolrClient.query(SolrClient.java:974)
        at org.apache.solr.client.solrj.SolrClient.query(SolrClient.java:990)
        at org.apache.solr.cloud.CloudInspectUtil.compareResults(CloudInspectUtil.java:228)
        at org.apache.solr.cloud.CloudInspectUtil.compareResults(CloudInspectUtil.java:167)
        at org.apache.solr.cloud.FullSolrCloudDistribCmdsTest.testIndexingBatchPerRequestWithHttpSolrClient(FullSolrCloudDistribCmdsTest.java:668)
        at org.apache.solr.cloud.FullSolrCloudDistribCmdsTest.test(FullSolrCloudDistribCmdsTest.java:152)
        at sun.reflect.NativeMethodAccessorImpl.invoke0(Native Method)
        at sun.reflect.NativeMethodAccessorImpl.invoke(NativeMethodAccessorImpl.java:62)
        at sun.reflect.DelegatingMethodAccessorImpl.invoke(DelegatingMethodAccessorImpl.java:43)
        at java.lang.reflect.Method.invoke(Method.java:498)
        at com.carrotsearch.randomizedtesting.RandomizedRunner.invoke(RandomizedRunner.java:1737)
        at com.carrotsearch.randomizedtesting.RandomizedRunner$8.evaluate(RandomizedRunner.java:934)
        at com.carrotsearch.randomizedtesting.RandomizedRunner$9.evaluate(RandomizedRunner.java:970)


FAILED:  org.apache.solr.core.TestLazyCores.testNoCommit

Error Message:
Exception during query

Stack Trace:
java.lang.RuntimeException: Exception during query
        at __randomizedtesting.SeedInfo.seed([E07FE81933F3A07F:3F1F49C8F8D4C3DA]:0)
        at org.apache.solr.SolrTestCaseJ4.assertQ(SolrTestCaseJ4.java:901)
        at org.apache.solr.core.TestLazyCores.check10(TestLazyCores.java:847)
        at org.apache.solr.core.TestLazyCores.testNoCommit(TestLazyCores.java:829)
        at sun.reflect.NativeMethodAccessorImpl.invoke0(Native Method)
        at sun.reflect.NativeMethodAccessorImpl.invoke(NativeMethodAccessorImpl.java:62)
        at sun.reflect.DelegatingMethodAccessorImpl.invoke(DelegatingMethodAccessorImpl.java:43)
        at java.lang.reflect.Method.invoke(Method.java:498)
        at com.carrotsearch.randomizedtesting.RandomizedRunner.invoke(RandomizedRunner.java:1737)
        at com.carrotsearch.randomizedtesting.RandomizedRunner$8.evaluate(RandomizedRunner.java:934)
        at com.carrotsearch.randomizedtesting.RandomizedRunner$9.evaluate(RandomizedRunner.java:970)
        at com.carrotsearch.randomizedtesting.RandomizedRunner$10.evaluate(RandomizedRunner.java:984)
        at com.carrotsearch.randomizedtesting.rules.SystemPropertiesRestoreRule$1.evaluate(SystemPropertiesRestoreRule.java:57)
        at org.apache.lucene.util.TestRuleSetupTeardownChained$1.evaluate(TestRuleSetupTeardownChained.java:49)
        at org.apache.lucene.util.AbstractBeforeAfterRule$1.evaluate(AbstractBeforeAfterRule.java:45)
        at org.apache.lucene.util.TestRuleThreadAndTestName$1.evaluate(TestRuleThreadAndTestName.java:48)
        at org.apache.lucene.util.TestRuleIgnoreAfterMaxFailures$1.evaluate(TestRuleIgnoreAfterMaxFailures.java:64)
        at org.apache.lucene.util.TestRuleMarkFailure$1.evaluate(TestRuleMarkFailure.java:47)
        at com.carrotsearch.randomizedtesting.rules.StatementAdapter.evaluate(StatementAdapter.java:36)
        at com.carrotsearch.randomizedtesting.ThreadLeakControl$StatementRunner.run(ThreadLeakControl.java:368)
        at com.carrotsearch.randomizedtesting.ThreadLeakControl.forkTimeoutingTask(ThreadLeakControl.java:817)
        at com.carrotsearch.randomizedtesting.ThreadLeakControl$3.evaluate(ThreadLeakControl.java:468)
        at com.carrotsearch.randomizedtesting.RandomizedRunner.runSingleTest(RandomizedRunner.java:943)
        at com.carrotsearch.randomizedtesting.RandomizedRunner$5.evaluate(RandomizedRunner.java:829)
        at com.carrotsearch.randomizedtesting.RandomizedRunner$6.evaluate(RandomizedRunner.java:879)
        at com.carrotsearch.randomizedtesting.RandomizedRunner$7.evaluate(RandomizedRunner.java:890)
        at com.carrotsearch.randomizedtesting.rules.StatementAdapter.evaluate(StatementAdapter.java:36)
        at com.carrotsearch.randomizedtesting.rules.SystemPropertiesRestoreRule$1.evaluate(SystemPropertiesRestoreRule.java:57)
        at org.apache.lucene.util.AbstractBeforeAfterRule$1.evaluate(AbstractBeforeAfterRule.java:45)
        at com.carrotsearch.randomizedtesting.rules.StatementAdapter.evaluate(StatementAdapter.java:36)
        at org.apache.lucene.util.TestRuleStoreClassName$1.evaluate(TestRuleStoreClassName.java:41)
        at com.carrotsearch.randomizedtesting.rules.NoShadowingOrOverridesOnMethodsRule$1.evaluate(NoShadowingOrOverridesOnMethodsRule.java:40)
        at com.carrotsearch.randomizedtesting.rules.NoShadowingOrOverridesOnMethodsRule$1.evaluate(NoShadowingOrOverridesOnMethodsRule.java:40)
        at com.carrotsearch.randomizedtesting.rules.StatementAdapter.evaluate(StatementAdapter.java:36)
        at com.carrotsearch.randomizedtesting.rules.StatementAdapter.evaluate(StatementAdapter.java:36)
        at com.carrotsearch.randomizedtesting.rules.StatementAdapter.evaluate(StatementAdapter.java:36)
        at org.apache.lucene.util.TestRuleAssertionsRequired$1.evaluate(TestRuleAssertionsRequired.java:53)
        at org.apache.lucene.util.TestRuleMarkFailure$1.evaluate(TestRuleMarkFailure.java:47)
        at org.apache.lucene.util.TestRuleIgnoreAfterMaxFailures$1.evaluate(TestRuleIgnoreAfterMaxFailures.java:64)
        at org.apache.lucene.util.TestRuleIgnoreTestSuites$1.evaluate(TestRuleIgnoreTestSuites.java:54)
        at com.carrotsearch.randomizedtesting.rules.StatementAdapter.evaluate(StatementAdapter.java:36)
        at com.carrotsearch.randomizedtesting.ThreadLeakControl$StatementRunner.run(ThreadLeakControl.java:368)
        at java.lang.Thread.run(Thread.java:748)
Caused by: java.lang.RuntimeException: REQUEST FAILED: xpath=//result[@numFound='10']
        xml response was: <?xml version="1.0" encoding="UTF-8"?>
<response>
<lst name="responseHeader"><int name="status">0</int><int name="QTime">0</int><lst name="params"><str name="q">*:*</str></lst></lst><result name="response" numFound="0" start="0"></result>
</response>

        request was:q=*:*
        at org.apache.solr.SolrTestCaseJ4.assertQ(SolrTestCaseJ4.java:894)
        ... 41 more


FAILED:  junit.framework.TestSuite.org.apache.solr.core.TestLazyCores

Error Message:
1 thread leaked from SUITE scope at org.apache.solr.core.TestLazyCores:     1) Thread[id=31830, name=searcherExecutor-3112-thread-1, state=WAITING, group=TGRP-TestLazyCores]         at sun.misc.Unsafe.park(Native Method)         at java.util.concurrent.locks.LockSupport.park(LockSupport.java:175)         at java.util.concurrent.locks.AbstractQueuedSynchronizer$ConditionObject.await(AbstractQueuedSynchronizer.java:2039)         at java.util.concurrent.LinkedBlockingQueue.take(LinkedBlockingQueue.java:442)         at java.util.concurrent.ThreadPoolExecutor.getTask(ThreadPoolExecutor.java:1074)         at java.util.concurrent.ThreadPoolExecutor.runWorker(ThreadPoolExecutor.java:1134)         at java.util.concurrent.ThreadPoolExecutor$Worker.run(ThreadPoolExecutor.java:624)         at java.lang.Thread.run(Thread.java:748)

Stack Trace:
com.carrotsearch.randomizedtesting.ThreadLeakError: 1 thread leaked from SUITE scope at org.apache.solr.core.TestLazyCores:
   1) Thread[id=31830, name=searcherExecutor-3112-thread-1, state=WAITING, group=TGRP-TestLazyCores]
        at sun.misc.Unsafe.park(Native Method)
        at java.util.concurrent.locks.LockSupport.park(LockSupport.java:175)
        at java.util.concurrent.locks.AbstractQueuedSynchronizer$ConditionObject.await(AbstractQueuedSynchronizer.java:2039)
        at java.util.concurrent.LinkedBlockingQueue.take(LinkedBlockingQueue.java:442)
        at java.util.concurrent.ThreadPoolExecutor.getTask(ThreadPoolExecutor.java:1074)
        at java.util.concurrent.ThreadPoolExecutor.runWorker(ThreadPoolExecutor.java:1134)
        at java.util.concurrent.ThreadPoolExecutor$Worker.run(ThreadPoolExecutor.java:624)
        at java.lang.Thread.run(Thread.java:748)
        at __randomizedtesting.SeedInfo.seed([E07FE81933F3A07F]:0)


FAILED:  junit.framework.TestSuite.org.apache.solr.core.TestLazyCores

Error Message:
There are still zombie threads that couldn't be terminated:    1) Thread[id=31830, name=searcherExecutor-3112-thread-1, state=WAITING, group=TGRP-TestLazyCores]         at sun.misc.Unsafe.park(Native Method)         at java.util.concurrent.locks.LockSupport.park(LockSupport.java:175)         at java.util.concurrent.locks.AbstractQueuedSynchronizer$ConditionObject.await(AbstractQueuedSynchronizer.java:2039)         at java.util.concurrent.LinkedBlockingQueue.take(LinkedBlockingQueue.java:442)         at java.util.concurrent.ThreadPoolExecutor.getTask(ThreadPoolExecutor.java:1074)         at java.util.concurrent.ThreadPoolExecutor.runWorker(ThreadPoolExecutor.java:1134)         at java.util.concurrent.ThreadPoolExecutor$Worker.run(ThreadPoolExecutor.java:624)         at java.lang.Thread.run(Thread.java:748)

Stack Trace:
com.carrotsearch.randomizedtesting.ThreadLeakError: There are still zombie threads that couldn't be terminated:
   1) Thread[id=31830, name=searcherExecutor-3112-thread-1, state=WAITING, group=TGRP-TestLazyCores]
        at sun.misc.Unsafe.park(Native Method)
        at java.util.concurrent.locks.LockSupport.park(LockSupport.java:175)
        at java.util.concurrent.locks.AbstractQueuedSynchronizer$ConditionObject.await(AbstractQueuedSynchronizer.java:2039)
        at java.util.concurrent.LinkedBlockingQueue.take(LinkedBlockingQueue.java:442)
        at java.util.concurrent.ThreadPoolExecutor.getTask(ThreadPoolExecutor.java:1074)
        at java.util.concurrent.ThreadPoolExecutor.runWorker(ThreadPoolExecutor.java:1134)
        at java.util.concurrent.ThreadPoolExecutor$Worker.run(ThreadPoolExecutor.java:624)
        at java.lang.Thread.run(Thread.java:748)
        at __randomizedtesting.SeedInfo.seed([E07FE81933F3A07F]:0)


FAILED:  org.apache.solr.update.CdcrUpdateLogTest.testSubReader

Error Message:


Stack Trace:
java.lang.AssertionError
        at __randomizedtesting.SeedInfo.seed([E07FE81933F3A07F:ADA7627A432471AD]:0)
        at org.junit.Assert.fail(Assert.java:92)
        at org.junit.Assert.assertTrue(Assert.java:43)
        at org.junit.Assert.assertTrue(Assert.java:54)
        at org.apache.solr.update.CdcrUpdateLogTest.testSubReader(CdcrUpdateLogTest.java:583)
        at sun.reflect.NativeMethodAccessorImpl.invoke0(Native Method)
        at sun.reflect.NativeMethodAccessorImpl.invoke(NativeMethodAccessorImpl.java:62)
        at sun.reflect.DelegatingMethodAccessorImpl.invoke(DelegatingMethodAccessorImpl.java:43)
        at java.lang.reflect.Method.invoke(Method.java:498)
        at com.carrotsearch.randomizedtesting.RandomizedRunner.invoke(RandomizedRunner.java:1737)
        at com.carrotsearch.randomizedtesting.RandomizedRunner$8.evaluate(RandomizedRunner.java:934)
        at com.carrotsearch.randomizedtesting.RandomizedRunner$9.evaluate(RandomizedRunner.java:970)
        at com.carrotsearch.randomizedtesting.RandomizedRunner$10.evaluate(RandomizedRunner.java:984)
        at com.carrotsearch.randomizedtesting.rules.SystemPropertiesRestoreRule$1.evaluate(SystemPropertiesRestoreRule.java:57)
        at org.apache.lucene.util.TestRuleSetupTeardownChained$1.evaluate(TestRuleSetupTeardownChained.java:49)
        at org.apache.lucene.util.AbstractBeforeAfterRule$1.evaluate(AbstractBeforeAfterRule.java:45)
        at org.apache.lucene.util.TestRuleThreadAndTestName$1.evaluate(TestRuleThreadAndTestName.java:48)
        at org.apache.lucene.util.TestRuleIgnoreAfterMaxFailures$1.evaluate(TestRuleIgnoreAfterMaxFailures.java:64)
        at org.apache.lucene.util.TestRuleMarkFailure$1.evaluate(TestRuleMarkFailure.java:47)
        at com.carrotsearch.randomizedtesting.rules.StatementAdapter.evaluate(StatementAdapter.java:36)
        at com.carrotsearch.randomizedtesting.ThreadLeakControl$StatementRunner.run(ThreadLeakControl.java:368)
        at com.carrotsearch.randomizedtesting.ThreadLeakControl.forkTimeoutingTask(ThreadLeakControl.java:817)
        at com.carrotsearch.randomizedtesting.ThreadLeakControl$3.evaluate(ThreadLeakControl.java:468)
        at com.carrotsearch.randomizedtesting.RandomizedRunner.runSingleTest(RandomizedRunner.java:943)
        at com.carrotsearch.randomizedtesting.RandomizedRunner$5.evaluate(RandomizedRunner.java:829)
        at com.carrotsearch.randomizedtesting.RandomizedRunner$6.evaluate(RandomizedRunner.java:879)
        at com.carrotsearch.randomizedtesting.RandomizedRunner$7.evaluate(RandomizedRunner.java:890)
        at com.carrotsearch.randomizedtesting.rules.StatementAdapter.evaluate(StatementAdapter.java:36)
        at com.carrotsearch.randomizedtesting.rules.SystemPropertiesRestoreRule$1.evaluate(SystemPropertiesRestoreRule.java:57)
        at org.apache.lucene.util.AbstractBeforeAfterRule$1.evaluate(AbstractBeforeAfterRule.java:45)
        at com.carrotsearch.randomizedtesting.rules.StatementAdapter.evaluate(StatementAdapter.java:36)
        at org.apache.lucene.util.TestRuleStoreClassName$1.evaluate(TestRuleStoreClassName.java:41)
        at com.carrotsearch.randomizedtesting.rules.NoShadowingOrOverridesOnMethodsRule$1.evaluate(NoShadowingOrOverridesOnMethodsRule.java:40)
        at com.carrotsearch.randomizedtesting.rules.NoShadowingOrOverridesOnMethodsRule$1.evaluate(NoShadowingOrOverridesOnMethodsRule.java:40)
        at com.carrotsearch.randomizedtesting.rules.StatementAdapter.evaluate(StatementAdapter.java:36)
        at com.carrotsearch.randomizedtesting.rules.StatementAdapter.evaluate(StatementAdapter.java:36)
        at com.carrotsearch.randomizedtesting.rules.StatementAdapter.evaluate(StatementAdapter.java:36)
        at org.apache.lucene.util.TestRuleAssertionsRequired$1.evaluate(TestRuleAssertionsRequired.java:53)
        at org.apache.lucene.util.TestRuleMarkFailure$1.evaluate(TestRuleMarkFailure.java:47)
        at org.apache.lucene.util.TestRuleIgnoreAfterMaxFailures$1.evaluate(TestRuleIgnoreAfterMaxFailures.java:64)
        at org.apache.lucene.util.TestRuleIgnoreTestSuites$1.evaluate(TestRuleIgnoreTestSuites.java:54)
        at com.carrotsearch.randomizedtesting.rules.StatementAdapter.evaluate(StatementAdapter.java:36)
        at com.carrotsearch.randomizedtesting.ThreadLeakControl$StatementRunner.run(ThreadLeakControl.java:368)
        at java.lang.Thread.run(Thread.java:748)




Build Log:
[...truncated 13033 lines...]
   [junit4] Suite: org.apache.solr.update.CdcrUpdateLogTest
   [junit4]   2> Creating dataDir: /home/jenkins/jenkins-slave/workspace/Lucene-Solr-NightlyTests-7.x/checkout/solr/build/solr-core/test/J2/temp/solr.update.CdcrUpdateLogTest_E07FE81933F3A07F-001/init-core-data-001
   [junit4]   2> 1007717 WARN  (SUITE-CdcrUpdateLogTest-seed#[E07FE81933F3A07F]-worker) [    ] o.a.s.SolrTestCaseJ4 startTrackingSearchers: numOpens=61 numCloses=61
   [junit4]   2> 1007717 INFO  (SUITE-CdcrUpdateLogTest-seed#[E07FE81933F3A07F]-worker) [    ] o.a.s.SolrTestCaseJ4 Using PointFields (NUMERIC_POINTS_SYSPROP=true) w/NUMERIC_DOCVALUES_SYSPROP=false
   [junit4]   2> 1007718 INFO  (SUITE-CdcrUpdateLogTest-seed#[E07FE81933F3A07F]-worker) [    ] o.a.s.SolrTestCaseJ4 Randomized ssl (false) and clientAuth (false) via: @org.apache.solr.util.RandomizeSSL(reason=, ssl=NaN, value=NaN, clientAuth=NaN)
   [junit4]   2> 1007718 INFO  (SUITE-CdcrUpdateLogTest-seed#[E07FE81933F3A07F]-worker) [    ] o.a.s.SolrTestCaseJ4 SecureRandom sanity checks: test.solr.allowed.securerandom=null & java.security.egd=file:/dev/./urandom
   [junit4]   2> 1007718 INFO  (SUITE-CdcrUpdateLogTest-seed#[E07FE81933F3A07F]-worker) [    ] o.a.s.SolrTestCaseJ4 ####initCore
   [junit4]   2> 1007719 INFO  (SUITE-CdcrUpdateLogTest-seed#[E07FE81933F3A07F]-worker) [    ] o.a.s.c.SolrResourceLoader [null] Added 2 libs to classloader, from paths: [/home/jenkins/jenkins-slave/workspace/Lucene-Solr-NightlyTests-7.x/checkout/solr/core/src/test-files/solr/collection1/lib, /home/jenkins/jenkins-slave/workspace/Lucene-Solr-NightlyTests-7.x/checkout/solr/core/src/test-files/solr/collection1/lib/classes]
   [junit4]   2> 1007913 INFO  (SUITE-CdcrUpdateLogTest-seed#[E07FE81933F3A07F]-worker) [    ] o.a.s.c.SolrConfig Using Lucene MatchVersion: 7.2.0
   [junit4]   2> 1007949 INFO  (SUITE-CdcrUpdateLogTest-seed#[E07FE81933F3A07F]-worker) [    ] o.a.s.s.IndexSchema [null] Schema name=test
   [junit4]   2> 1008535 INFO  (SUITE-CdcrUpdateLogTest-seed#[E07FE81933F3A07F]-worker) [    ] o.a.s.s.IndexSchema Loaded schema test/1.6 with uniqueid field id
   [junit4]   2> 1008789 INFO  (SUITE-CdcrUpdateLogTest-seed#[E07FE81933F3A07F]-worker) [    ] o.a.s.m.r.SolrJmxReporter JMX monitoring for 'solr.node' (registry 'solr.node') enabled at server: com.sun.jmx.mbeanserver.JmxMBeanServer@25a4d28c
   [junit4]   2> 1008826 INFO  (SUITE-CdcrUpdateLogTest-seed#[E07FE81933F3A07F]-worker) [    ] o.a.s.m.r.SolrJmxReporter JMX monitoring for 'solr.jvm' (registry 'solr.jvm') enabled at server: com.sun.jmx.mbeanserver.JmxMBeanServer@25a4d28c
   [junit4]   2> 1008826 INFO  (SUITE-CdcrUpdateLogTest-seed#[E07FE81933F3A07F]-worker) [    ] o.a.s.m.r.SolrJmxReporter JMX monitoring for 'solr.jetty' (registry 'solr.jetty') enabled at server: com.sun.jmx.mbeanserver.JmxMBeanServer@25a4d28c
   [junit4]   2> 1008863 INFO  (coreLoadExecutor-1518-thread-1) [    ] o.a.s.c.TransientSolrCoreCacheDefault Allocating transient cache for 2147483647 transient cores
   [junit4]   2> 1008863 INFO  (coreLoadExecutor-1518-thread-1) [    x:collection1] o.a.s.c.SolrResourceLoader [null] Added 2 libs to classloader, from paths: [/home/jenkins/jenkins-slave/workspace/Lucene-Solr-NightlyTests-7.x/checkout/solr/core/src/test-files/solr/collection1/lib, /home/jenkins/jenkins-slave/workspace/Lucene-Solr-NightlyTests-7.x/checkout/solr/core/src/test-files/solr/collection1/lib/classes]
   [junit4]   2> 1009020 INFO  (coreLoadExecutor-1518-thread-1) [    x:collection1] o.a.s.c.SolrConfig Using Lucene MatchVersion: 7.2.0
   [junit4]   2> 1009201 INFO  (coreLoadExecutor-1518-thread-1) [    x:collection1] o.a.s.s.IndexSchema [collection1] Schema name=test
   [junit4]   2> 1009607 INFO  (coreLoadExecutor-1518-thread-1) [    x:collection1] o.a.s.s.IndexSchema Loaded schema test/1.6 with uniqueid field id
   [junit4]   2> 1009629 INFO  (coreLoadExecutor-1518-thread-1) [    x:collection1] o.a.s.c.CoreContainer Creating SolrCore 'collection1' using configuration from instancedir /home/jenkins/jenkins-slave/workspace/Lucene-Solr-NightlyTests-7.x/checkout/solr/core/src/test-files/solr/collection1, trusted=true
   [junit4]   2> 1009629 INFO  (coreLoadExecutor-1518-thread-1) [    x:collection1] o.a.s.m.r.SolrJmxReporter JMX monitoring for 'solr.core.collection1' (registry 'solr.core.collection1') enabled at server: com.sun.jmx.mbeanserver.JmxMBeanServer@25a4d28c
   [junit4]   2> 1009630 INFO  (coreLoadExecutor-1518-thread-1) [    x:collection1] o.a.s.c.SolrCore solr.RecoveryStrategy.Builder
   [junit4]   2> 1009630 INFO  (coreLoadExecutor-1518-thread-1) [    x:collection1] o.a.s.c.SolrCore [[collection1] ] Opening new SolrCore at [/home/jenkins/jenkins-slave/workspace/Lucene-Solr-NightlyTests-7.x/checkout/solr/core/src/test-files/solr/collection1], dataDir=[/home/jenkins/jenkins-slave/workspace/Lucene-Solr-NightlyTests-7.x/checkout/solr/build/solr-core/test/J2/temp/solr.update.CdcrUpdateLogTest_E07FE81933F3A07F-001/init-core-data-001/]
   [junit4]   2> 1009665 INFO  (coreLoadExecutor-1518-thread-1) [    x:collection1] o.a.s.u.RandomMergePolicy RandomMergePolicy wrapping class org.apache.lucene.index.TieredMergePolicy: [TieredMergePolicy: maxMergeAtOnce=32, maxMergeAtOnceExplicit=28, maxMergedSegmentMB=3.5986328125, floorSegmentMB=1.947265625, forceMergeDeletesPctAllowed=7.9713629932508425, segmentsPerTier=40.0, maxCFSSegmentSizeMB=8.796093022207999E12, noCFSRatio=0.859468641771325
   [junit4]   2> 1009849 INFO  (coreLoadExecutor-1518-thread-1) [    x:collection1] o.a.s.u.UpdateHandler Using UpdateLog implementation: org.apache.solr.update.CdcrUpdateLog
   [junit4]   2> 1009849 INFO  (coreLoadExecutor-1518-thread-1) [    x:collection1] o.a.s.u.UpdateLog Initializing UpdateLog: dataDir= defaultSyncLevel=FLUSH numRecordsToKeep=100 maxNumLogsToKeep=10 numVersionBuckets=65536
   [junit4]   2> 1009850 INFO  (coreLoadExecutor-1518-thread-1) [    x:collection1] o.a.s.u.CommitTracker Hard AutoCommit: disabled
   [junit4]   2> 1009850 INFO  (coreLoadExecutor-1518-thread-1) [    x:collection1] o.a.s.u.CommitTracker Soft AutoCommit: disabled
   [junit4]   2> 1009851 INFO  (coreLoadExecutor-1518-thread-1) [    x:collection1] o.a.s.u.RandomMergePolicy RandomMergePolicy wrapping class org.apache.lucene.index.LogByteSizeMergePolicy: [LogByteSizeMergePolicy: minMergeSize=1677721, mergeFactor=7, maxMergeSize=2147483648, maxMergeSizeForForcedMerge=9223372036854775807, calibrateSizeByDeletes=false, maxMergeDocs=2147483647, maxCFSSegmentSizeMB=8.796093022207999E12, noCFSRatio=0.0]
   [junit4]   2> 1009864 INFO  (coreLoadExecutor-1518-thread-1) [    x:collection1] o.a.s.s.SolrIndexSearcher Opening [Searcher@1fe801ca[collection1] main]
   [junit4]   2> 1009864 WARN  (coreLoadExecutor-1518-thread-1) [    x:collection1] o.a.s.r.ManagedResourceStorage Cannot write to config directory /home/jenkins/jenkins-slave/workspace/Lucene-Solr-NightlyTests-7.x/checkout/solr/core/src/test-files/solr/collection1/conf; switching to use InMemory storage instead.
   [junit4]   2> 1009865 INFO  (coreLoadExecutor-1518-thread-1) [    x:collection1] o.a.s.h.ReplicationHandler Commits will be reserved for 10000ms.
   [junit4]   2> 1009865 INFO  (searcherExecutor-1519-thread-1-processing-x:collection1) [    x:collection1] o.a.s.c.SolrCore [collection1] Registered new searcher Searcher@1fe801ca[collection1] main{ExitableDirectoryReader(UninvertingDirectoryReader())}
   [junit4]   2> 1009866 INFO  (coreLoadExecutor-1518-thread-1) [    x:collection1] o.a.s.u.UpdateLog Could not find max version in index or recent updates, using new clock 1584143309486424064
   [junit4]   2> 1009884 INFO  (SUITE-CdcrUpdateLogTest-seed#[E07FE81933F3A07F]-worker) [    ] o.a.s.SolrTestCaseJ4 ####initCore end
   [junit4]   2> 1009887 INFO  (TEST-CdcrUpdateLogTest.testRemoveOldLogs-seed#[E07FE81933F3A07F]) [    ] o.a.s.SolrTestCaseJ4 ###Starting testRemoveOldLogs
   [junit4]   2> 1009901 INFO  (TEST-CdcrUpdateLogTest.testRemoveOldLogs-seed#[E07FE81933F3A07F]) [    ] o.a.s.u.DirectUpdateHandler2 [collection1] REMOVING ALL DOCUMENTS FROM INDEX
   [junit4]   2> 1009920 INFO  (TEST-CdcrUpdateLogTest.testRemoveOldLogs-seed#[E07FE81933F3A07F]) [    ] o.a.s.s.SolrIndexSearcher Opening [Searcher@2ac21878[collection1] realtime]
   [junit4]   2> 1009920 INFO  (TEST-CdcrUpdateLogTest.testRemoveOldLogs-seed#[E07FE81933F3A07F]) [    ] o.a.s.u.p.LogUpdateProcessorFactory [collection1]  webapp=null path=null params={_version_=-9223372036854775807&update.distrib=FROMLEADER&versions=true&wt=json&indent=true}{deleteByQuery=*:* (-9223372036854775807)} 0 32
   [junit4]   2> 1009921 INFO  (TEST-CdcrUpdateLogTest.testRemoveOldLogs-seed#[E07FE81933F3A07F]) [    ] o.a.s.u.DirectUpdateHandler2 start commit{_version_=1584143309544095744,optimize=false,openSearcher=true,waitSearcher=true,expungeDeletes=false,softCommit=false,prepareCommit=false}
   [junit4]   2> 1009921 INFO  (TEST-CdcrUpdateLogTest.testRemoveOldLogs-seed#[E07FE81933F3A07F]) [    ] o.a.s.u.SolrIndexWriter Calling setCommitData with IW:org.apache.solr.update.SolrIndexWriter@faccde0 commitCommandVersion:1584143309544095744
   [junit4]   2> 1009992 INFO  (TEST-CdcrUpdateLogTest.testRemoveOldLogs-seed#[E07FE81933F3A07F]) [    ] o.a.s.s.SolrIndexSearcher Opening [Searcher@404ae3f6[collection1] main]
   [junit4]   2> 1009993 INFO  (TEST-CdcrUpdateLogTest.testRemoveOldLogs-seed#[E07FE81933F3A07F]) [    ] o.a.s.u.DirectUpdateHandler2 end_commit_flush
   [junit4]   2> 1010026 INFO  (searcherExecutor-1519-thread-1) [    ] o.a.s.c.SolrCore [collection1] Registered new searcher Searcher@404ae3f6[collection1] main{ExitableDirectoryReader(UninvertingDirectoryReader())}
   [junit4]   2> 1010026 INFO  (TEST-CdcrUpdateLogTest.testRemoveOldLogs-seed#[E07FE81933F3A07F]) [    ] o.a.s.u.p.LogUpdateProcessorFactory [collection1]  webapp=null path=null params={}{commit=} 0 105
   [junit4]   2> 1010028 INFO  (TEST-CdcrUpdateLogTest.testRemoveOldLogs-seed#[E07FE81933F3A07F]) [    ] o.a.s.c.CoreContainer Shutting down CoreContainer instance=1625083004
   [junit4]   2> 1010028 INFO  (TEST-CdcrUpdateLogTest.testRemoveOldLogs-seed#[E07FE81933F3A07F]) [    ] o.a.s.m.SolrMetricManager Closing metric reporters for registry=solr.node, tag=null
   [junit4]   2> 1010028 INFO  (TEST-CdcrUpdateLogTest.testRemoveOldLogs-seed#[E07FE81933F3A07F]) [    ] o.a.s.m.r.SolrJmxReporter Closing reporter [org.apache.solr.metrics.reporters.SolrJmxReporter@41444f22: rootName = null, domain = solr.node, service url = null, agent id = null] for registry solr.node / com.codahale.metrics.MetricRegistry@790743dc
   [junit4]   2> 1010044 INFO  (TEST-CdcrUpdateLogTest.testRemoveOldLogs-seed#[E07FE81933F3A07F]) [    ] o.a.s.m.SolrMetricManager Closing metric reporters for registry=solr.jvm, tag=null
   [junit4]   2> 1010044 INFO  (TEST-CdcrUpdateLogTest.testRemoveOldLogs-seed#[E07FE81933F3A07F]) [    ] o.a.s.m.r.SolrJmxReporter Closing reporter [org.apache.solr.metrics.reporters.SolrJmxReporter@3dc74ca8: rootName = null, domain = solr.jvm, service url = null, agent id = null] for registry solr.jvm / com.codahale.metrics.MetricRegistry@2f252074
   [junit4]   2> 1010100 INFO  (TEST-CdcrUpdateLogTest.testRemoveOldLogs-seed#[E07FE81933F3A07F]) [    ] o.a.s.m.SolrMetricManager Closing metric reporters for registry=solr.jetty, tag=null
   [junit4]   2> 1010100 INFO  (TEST-CdcrUpdateLogTest.testRemoveOldLogs-seed#[E07FE81933F3A07F]) [    ] o.a.s.m.r.SolrJmxReporter Closing reporter [org.apache.solr.metrics.reporters.SolrJmxReporter@3e5ed59f: rootName = null, domain = solr.jetty, service url = null, agent id = null] for registry solr.jetty / com.codahale.metrics.MetricRegistry@3123fa1
   [junit4]   2> 1010135 INFO  (coreCloseExecutor-1524-thread-1) [    x:collection1] o.a.s.c.SolrCore [collection1]  CLOSING SolrCore org.apache.solr.core.SolrCore@33d6a4af
   [junit4]   2> 1010135 INFO  (coreCloseExecutor-1524-thread-1) [    x:collection1] o.a.s.m.SolrMetricManager Closing metric reporters for registry=solr.core.collection1, tag=869704879
   [junit4]   2> 1010135 INFO  (coreCloseExecutor-1524-thread-1) [    x:collection1] o.a.s.m.r.SolrJmxReporter Closing reporter [org.apache.solr.metrics.reporters.SolrJmxReporter@6b5d3210: rootName = null, domain = solr.core.collection1, service url = null, agent id = null] for registry solr.core.collection1 / com.codahale.metrics.MetricRegistry@4bec75d
   [junit4]   2> 1010198 INFO  (TEST-CdcrUpdateLogTest.testRemoveOldLogs-seed#[E07FE81933F3A07F]) [    ] o.a.s.c.SolrResourceLoader [null] Added 2 libs to classloader, from paths: [/home/jenkins/jenkins-slave/workspace/Lucene-Solr-NightlyTests-7.x/checkout/solr/core/src/test-files/solr/collection1/lib, /home/jenkins/jenkins-slave/workspace/Lucene-Solr-NightlyTests-7.x/checkout/solr/core/src/test-files/solr/collection1/lib/classes]
   [junit4]   2> 1010397 INFO  (TEST-CdcrUpdateLogTest.testRemoveOldLogs-seed#[E07FE81933F3A07F]) [    ] o.a.s.c.SolrConfig Using Lucene MatchVersion: 7.2.0
   [junit4]   2> 1010434 INFO  (TEST-CdcrUpdateLogTest.testRemoveOldLogs-seed#[E07FE81933F3A07F]) [    ] o.a.s.s.IndexSchema [null] Schema name=test
   [junit4]   2> 1011109 INFO  (TEST-CdcrUpdateLogTest.testRemoveOldLogs-seed#[E07FE81933F3A07F]) [    ] o.a.s.s.IndexSchema Loaded schema test/1.6 with uniqueid field id
   [junit4]   2> 1011531 INFO  (TEST-CdcrUpdateLogTest.testRemoveOldLogs-seed#[E07FE81933F3A07F]) [    ] o.a.s.m.r.SolrJmxReporter JMX monitoring for 'solr.node' (registry 'solr.node') enabled at server: com.sun.jmx.mbeanserver.JmxMBeanServer@25a4d28c
   [junit4]   2> 1011603 INFO  (TEST-CdcrUpdateLogTest.testRemoveOldLogs-seed#[E07FE81933F3A07F]) [    ] o.a.s.m.r.SolrJmxReporter JMX monitoring for 'solr.jvm' (registry 'solr.jvm') enabled at server: com.sun.jmx.mbeanserver.JmxMBeanServer@25a4d28c
   [junit4]   2> 1011603 INFO  (TEST-CdcrUpdateLogTest.testRemoveOldLogs-seed#[E07FE81933F3A07F]) [    ] o.a.s.m.r.SolrJmxReporter JMX monitoring for 'solr.jetty' (registry 'solr.jetty') enabled at server: com.sun.jmx.mbeanserver.JmxMBeanServer@25a4d28c
   [junit4]   2> 1011676 INFO  (coreLoadExecutor-1531-thread-1) [    ] o.a.s.c.TransientSolrCoreCacheDefault Allocating transient cache for 2147483647 transient cores
   [junit4]   2> 1011693 INFO  (coreLoadExecutor-1531-thread-1) [    x:collection1] o.a.s.c.SolrResourceLoader [null] Added 2 libs to classloader, from paths: [/home/jenkins/jenkins-slave/workspace/Lucene-Solr-NightlyTests-7.x/checkout/solr/core/src/test-files/solr/collection1/lib, /home/jenkins/jenkins-slave/workspace/Lucene-Solr-NightlyTests-7.x/checkout/solr/core/src/test-files/solr/collection1/lib/classes]
   [junit4]   2> 1011894 INFO  (coreLoadExecutor-1531-thread-1) [    x:collection1] o.a.s.c.SolrConfig Using Lucene MatchVersion: 7.2.0
   [junit4]   2> 1011930 INFO  (coreLoadExecutor-1531-thread-1) [    x:collection1] o.a.s.s.IndexSchema [collection1] Schema name=test
   [junit4]   2> 1012332 INFO  (coreLoadExecutor-1531-thread-1) [    x:collection1] o.a.s.s.IndexSchema Loaded schema test/1.6 with uniqueid field id
   [junit4]   2> 1012353 INFO  (coreLoadExecutor-1531-thread-1) [    x:collection1] o.a.s.c.CoreContainer Creating SolrCore 'collection1' using configuration from instancedir /home/jenkins/jenkins-slave/workspace/Lucene-Solr-NightlyTests-7.x/checkout/solr/core/src/test-files/solr/collection1, trusted=true
   [junit4]   2> 1012354 INFO  (coreLoadExecutor-1531-thread-1) [    x:collection1] o.a.s.m.r.SolrJmxReporter JMX monitoring for 'solr.core.collection1' (registry 'solr.core.collection1') enabled at server: com.sun.jmx.mbeanserver.JmxMBeanServer@25a4d28c
   [junit4]   2> 1012354 INFO  (coreLoadExecutor-1531-thread-1) [    x:collection1] o.a.s.c.SolrCore solr.RecoveryStrategy.Builder
   [junit4]   2> 1012354 INFO  (coreLoadExecutor-1531-thread-1) [    x:collection1] o.a.s.c.SolrCore [[collection1] ] Opening new SolrCore at [/home/jenkins/jenkins-slave/workspace/Lucene-Solr-NightlyTests-7.x/checkout/solr/core/src/test-files/solr/collection1], dataDir=[/home/jenkins/jenkins-slave/workspace/Lucene-Solr-NightlyTests-7.x/checkout/solr/build/solr-core/test/J2/temp/solr.update.CdcrUpdateLogTest_E07FE81933F3A07F-001/init-core-data-001/]
   [junit4]   2> 1012557 INFO  (coreLoadExecutor-1531-thread-1) [    x:collection1] o.a.s.u.UpdateHandler Using UpdateLog implementation: org.apache.solr.update.CdcrUpdateLog
   [junit4]   2> 1012557 INFO  (coreLoadExecutor-1531-thread-1) [    x:collection1] o.a.s.u.UpdateLog Initializing UpdateLog: dataDir= defaultSyncLevel=FLUSH numRecordsToKeep=100 maxNumLogsToKeep=10 numVersionBuckets=65536
   [junit4]   2> 1012558 INFO  (coreLoadExecutor-1531-thread-1) [    x:collection1] o.a.s.u.CommitTracker Hard AutoCommit: disabled
   [junit4]   2> 1012558 INFO  (coreLoadExecutor-1531-thread-1) [    x:collection1] o.a.s.u.CommitTracker Soft AutoCommit: disabled
   [junit4]   2> 1012571 INFO  (coreLoadExecutor-1531-thread-1) [    x:collection1] o.a.s.u.RandomMergePolicy RandomMergePolicy wrapping class org.apache.lucene.index.TieredMergePolicy: [TieredMergePolicy: maxMergeAtOnce=32, maxMergeAtOnceExplicit=28, maxMergedSegmentMB=3.5986328125, floorSegmentMB=1.947265625, forceMergeDeletesPctAllowed=7.9713629932508425, segmentsPerTier=40.0, maxCFSSegmentSizeMB=8.796093022207999E12, noCFSRatio=0.859468641771325
   [junit4]   2> 1012572 INFO  (coreLoadExecutor-1531-thread-1) [    x:collection1] o.a.s.s.SolrIndexSearcher Opening [Searcher@479755d9[collection1] main]
   [junit4]   2> 1012572 WARN  (coreLoadExecutor-1531-thread-1) [    x:collection1] o.a.s.r.ManagedResourceStorage Cannot write to config directory /home/jenkins/jenkins-slave/workspace/Lucene-Solr-NightlyTests-7.x/checkout/solr/core/src/test-files/solr/collection1/conf; switching to use InMemory storage instead.
   [junit4]   2> 1012573 INFO  (coreLoadExecutor-1531-thread-1) [    x:collection1] o.a.s.h.ReplicationHandler Commits will be reserved for 10000ms.
   [junit4]   2> 1012592 INFO  (searcherExecutor-1532-thread-1-processing-x:collection1) [    x:collection1] o.a.s.c.SolrCore [collection1] Registered new searcher Searcher@479755d9[collection1] main{ExitableDirectoryReader(UninvertingDirectoryReader())}
   [junit4]   2> 1012592 INFO  (coreLoadExecutor-1531-thread-1) [    x:collection1] o.a.s.u.UpdateLog Could not find max version in index or recent updates, using new clock 1584143312344842240
   [junit4]   2> 1012604 INFO  (TEST-CdcrUpdateLogTest.testRemoveOldLogs-seed#[E07FE81933F3A07F]) [    ] o.a.s.u.p.LogUpdateProcessorFactory [collection1]  webapp=null path=null params={versions=true&wt=json&indent=true}{add=[0 (1584143312346939392)]} 0 10
   [junit4]   2> 1012605 INFO  (TEST-CdcrUpdateLogTest.testRemoveOldLogs-seed#[E07FE81933F3A07F]) [    ] o.a.s.u.p.LogUpdateProcessorFactory [collection1]  webapp=null path=null params={versions=true&wt=json&indent=true}{add=[1 (1584143312358473728)]} 0 0
   [junit4]   2> 1012605 INFO  (TEST-CdcrUpdateLogTest.testRemoveOldLogs-seed#[E07FE81933F3A07F]) [    ] o.a.s.u.p.LogUpdateProcessorFactory [collection1]  webapp=null path=null params={versions=true&wt=json&indent=true}{add=[2 (1584143312358473729)]} 0 0
   [junit4]   2> 1012605 INFO  (TEST-CdcrUpdateLogTest.testRemoveOldLogs-seed#[E07FE81933F3A07F]) [    ] o.a.s.u.p.LogUpdateProcessorFactory [collection1]  webapp=null path=null params={versions=true&wt=json&indent=true}{add=[3 (1584143312358473730)]} 0 0
   [junit4]   2> 1012605 INFO  (TEST-CdcrUpdateLogTest.testRemoveOldLogs-seed#[E07FE81933F3A07F]) [    ] o.a.s.u.p.LogUpdateProcessorFactory [collection1]  webapp=null path=null params={versions=true&wt=json&indent=true}{add=[4 (1584143312358473731)]} 0 0
   [junit4]   2> 1012605 INFO  (TEST-CdcrUpdateLogTest.testRemoveOldLogs-seed#[E07FE81933F3A07F]) [    ] o.a.s.u.p.LogUpdateProcessorFactory [collection1]  webapp=null path=null params={versions=true&wt=json&indent=true}{add=[5 (1584143312358473732)]} 0 0
   [junit4]   2> 1012605 INFO  (TEST-CdcrUpdateLogTest.testRemoveOldLogs-seed#[E07FE81933F3A07F]) [    ] o.a.s.u.p.LogUpdateProcessorFactory [collection1]  webapp=null path=null params={versions=true&wt=json&indent=true}{add=[6 (1584143312358473733)]} 0 0
   [junit4]   2> 1012606 INFO  (TEST-CdcrUpdateLogTest.testRemoveOldLogs-seed#[E07FE81933F3A07F]) [    ] o.a.s.u.p.LogUpdateProcessorFactory [collection1]  webapp=null path=null params={versions=true&wt=json&indent=true}{add=[7 (1584143312359522304)]} 0 0
   [junit4]   2> 1012606 INFO  (TEST-CdcrUpdateLogTest.testRemoveOldLogs-seed#[E07FE81933F3A07F]) [    ] o.a.s.u.p.LogUpdateProcessorFactory [collection1]  webapp=null path=null params={versions=true&wt=json&indent=true}{add=[8 (1584143312359522305)]} 0 0
   [junit4]   2> 1012606 INFO  (TEST-CdcrUpdateLogTest.testRemoveOldLogs-seed#[E07FE81933F3A07F]) [    ] o.a.s.u.p.LogUpdateProcessorFactory [collection1]  webapp=null path=null params={versions=true&wt=json&indent=true}{add=[9 (1584143312359522306)]} 0 0
   [junit4]   2> 1012606 INFO  (TEST-CdcrUpdateLogTest.testRemoveOldLogs-seed#[E07FE81933F3A07F]) [    ] o.a.s.c.S.Request [collection1]  webapp=null path=null params={qt=/get&getVersions=50&wt=xml} status=0 QTime=0
   [junit4]   2> 1012607 INFO  (TEST-CdcrUpdateLogTest.testRemoveOldLogs-seed#[E07FE81933F3A07F]) [    ] o.a.s.u.DirectUpdateHandler2 start commit{_version_=1584143312360570880,optimize=false,openSearcher=true,waitSearcher=true,expungeDeletes=false,softCommit=false,prepareCommit=false}
   [junit4]   2> 1012607 INFO  (TEST-CdcrUpdateLogTest.testRemoveOldLogs-seed#[E07FE81933F3A07F]) [    ] o.a.s.u.SolrIndexWriter Calling setCommitData with IW:org.apache.solr.update.SolrIndexWriter@15eeca8a commitCommandVersion:1584143312360570880
   [junit4]   2> 1013085 INFO  (TEST-CdcrUpdateLogTest.testRemoveOldLogs-seed#[E07FE81933F3A07F]) [    ] o.a.s.s.SolrIndexSearcher Opening [Searcher@69840f0f[collection1] main]
   [junit4]   2> 1013085 INFO  (TEST-CdcrUpdateLogTest.testRemoveOldLogs-seed#[E07FE81933F3A07F]) [    ] o.a.s.u.DirectUpdateHandler2 end_commit_flush
   [junit4]   2> 1013086 INFO  (searcherExecutor-1532-thread-1) [    ] o.a.s.c.SolrCore [collection1] Registered new searcher Searcher@69840f0f[collection1] main{ExitableDirectoryReader(UninvertingDirectoryReader(Uninverting(_0(7.2.0):C10)))}
   [junit4]   2> 1013086 INFO  (TEST-CdcrUpdateLogTest.testRemoveOldLogs-seed#[E07FE81933F3A07F]) [    ] o.a.s.u.p.LogUpdateProcessorFactory [collection1]  webapp=null path=null params={}{commit=} 0 479
   [junit4]   2> 1013087 INFO  (TEST-CdcrUpdateLogTest.testRemoveOldLogs-seed#[E07FE81933F3A07F]) [    ] o.a.s.c.S.Request [collection1]  webapp=null path=null params={qt=/get&getVersions=50&wt=xml} status=0 QTime=0
   [junit4]   2> 1013120 INFO  (TEST-CdcrUpdateLogTest.testRemoveOldLogs-seed#[E07FE81933F3A07F]) [    ] o.a.s.u.p.LogUpdateProcessorFactory [collection1]  webapp=null path=null params={versions=true&wt=json&indent=true}{add=[10 (1584143312897441792)]} 0 1
   [junit4]   2> 1013121 INFO  (TEST-CdcrUpdateLogTest.testRemoveOldLogs-seed#[E07FE81933F3A07F]) [    ] o.a.s.u.p.LogUpdateProcessorFactory [collection1]  webapp=null path=null params={versions=true&wt=json&indent=true}{add=[11 (1584143312899538944)]} 0 0
   [junit4]   2> 1013121 INFO  (TEST-CdcrUpdateLogTest.testRemoveOldLogs-seed#[E07FE81933F3A07F]) [    ] o.a.s.u.p.LogUpdateProcessorFactory [collection1]  webapp=null path=null params={versions=true&wt=json&indent=true}{add=[12 (1584143312899538945)]} 0 0
   [junit4]   2> 1013121 INFO  (TEST-CdcrUpdateLogTest.testRemoveOldLogs-seed#[E07FE81933F3A07F]) [    ] o.a.s.u.p.LogUpdateProcessorFactory [collection1]  webapp=null path=null params={versions=true&wt=json&indent=true}{add=[13 (1584143312899538946)]} 0 0
   [junit4]   2> 1013121 INFO  (TEST-CdcrUpdateLogTest.testRemoveOldLogs-seed#[E07FE81933F3A07F]) [    ] o.a.s.u.p.LogUpdateProcessorFactory [collection1]  webapp=null path=null params={versions=true&wt=json&indent=true}{add=[14 (1584143312899538947)]} 0 0
   [junit4]   2> 1013121 INFO  (TEST-CdcrUpdateLogTest.testRemoveOldLogs-seed#[E07FE81933F3A07F]) [    ] o.a.s.u.p.LogUpdateProcessorFactory [collection1]  webapp=null path=null params={versions=true&wt=json&indent=true}{add=[15 (1584143312899538948)]} 0 0
   [junit4]   2> 1013121 INFO  (TEST-CdcrUpdateLogTest.testRemoveOldLogs-seed#[E07FE81933F3A07F]) [    ] o.a.s.u.p.LogUpdateProcessorFactory [collection1]  webapp=null path=null params={versions=true&wt=json&indent=true}{add=[16 (1584143312899538949)]} 0 0
   [junit4]   2> 1013122 INFO  (TEST-CdcrUpdateLogTest.testRemoveOldLogs-seed#[E07FE81933F3A07F]) [    ] o.a.s.u.p.LogUpdateProcessorFactory [collection1]  webapp=null path=null params={versions=true&wt=json&indent=true}{add=[17 (1584143312900587520)]} 0 0
   [junit4]   2> 1013122 INFO  (TEST-CdcrUpdateLogTest.testRemoveOldLogs-seed#[E07FE81933F3A07F]) [    ] o.a.s.u.p.LogUpdateProcessorFactory [collection1]  webapp=null path=null params={versions=true&wt=json&indent=true}{add=[18 (1584143312900587521)]} 0 0
   [junit4]   2> 1013122 INFO  (TEST-CdcrUpdateLogTest.testRemoveOldLogs-seed#[E07FE81933F3A07F]) [    ] o.a.s.u.p.LogUpdateProcessorFactory [collection1]  webapp=null path=null params={versions=true&wt=json&indent=true}{add=[19 (1584143312900587522)]} 0 0
   [junit4]   2> 1013122 INFO  (TEST-CdcrUpdateLogTest.testRemoveOldLogs-seed#[E07FE81933F3A07F]) [    ] o.a.s.c.S.Request [collection1]  webapp=null path=null params={qt=/get&getVersions=50&wt=xml} status=0 QTime=0
   [junit4]   2> 1013122 INFO  (TEST-CdcrUpdateLogTest.testRemoveOldLogs-seed#[E07FE81933F3A07F]) [    ] o.a.s.u.DirectUpdateHandler2 start commit{_version_=1584143312900587523,optimize=false,openSearcher=true,waitSearcher=true,expungeDeletes=false,softCommit=false,prepareCommit=false}
   [junit4]   2> 1013122 INFO  (TEST-CdcrUpdateLogTest.testRemoveOldLogs-seed#[E07FE81933F3A07F]) [    ] o.a.s.u.SolrIndexWriter Calling setCommitData with IW:org.apache.solr.update.SolrIndexWriter@15eeca8a commitCommandVersion:1584143312900587523
   [junit4]   2> 1013324 INFO  (TEST-CdcrUpdateLogTest.testRemoveOldLogs-seed#[E07FE81933F3A07F]) [    ] o.a.s.s.SolrIndexSearcher Opening [Searcher@13084bab[collection1] main]
   [junit4]   2> 1013324 INFO  (TEST-CdcrUpdateLogTest.testRemoveOldLogs-seed#[E07FE81933F3A07F]) [    ] o.a.s.u.DirectUpdateHandler2 end_commit_flush
   [junit4]   2> 1013325 INFO  (searcherExecutor-1532-thread-1) [    ] o.a.s.c.SolrCore [collection1] Registered new searcher Searcher@13084bab[collection1] main{ExitableDirectoryReader(UninvertingDirectoryReader(Uninverting(_0(7.2.0):C10) Uninverting(_1(7.2.0):C10)))}
   [junit4]   2> 1013325 INFO  (TEST-CdcrUpdateLogTest.testRemoveOldLogs-seed#[E07FE81933F3A07F]) [    ] o.a.s.u.p.LogUpdateProcessorFactory [collection1]  webapp=null path=null params={}{commit=} 0 202
   [junit4]   2> 1013325 INFO  (TEST-CdcrUpdateLogTest.testRemoveOldLogs-seed#[E07FE81933F3A07F]) [    ] o.a.s.c.S.Request [collection1]  webapp=null path=null params={qt=/get&getVersions=50&wt=xml} status=0 QTime=0
   [junit4]   2> 1013339 INFO  (TEST-CdcrUpdateLogTest.testRemoveOldLogs-seed#[E07FE81933F3A07F]) [    ] o.a.s.u.p.LogUpdateProcessorFactory [collection1]  webapp=null path=null params={versions=true&wt=json&indent=true}{add=[20 (1584143313114497024)]} 0 13
   [junit4]   2> 1013339 INFO  (TEST-CdcrUpdateLogTest.testRemoveOldLogs-seed#[E07FE81933F3A07F]) [    ] o.a.s.u.p.LogUpdateProcessorFactory [collection1]  webapp=null path=null params={versions=true&wt=json&indent=true}{add=[21 (1584143313128128512)]} 0 0
   [junit4]   2> 1013339 INFO  (TEST-CdcrUpdateLogTest.testRemoveOldLogs-seed#[E07FE81933F3A07F]) [    ] o.a.s.u.p.LogUpdateProcessorFactory [collection1]  webapp=null path=null params={versions=true&wt=json&indent=true}{add=[22 (1584143313128128513)]} 0 0
   [junit4]   2> 1013340 INFO  (TEST-CdcrUpdateLogTest.testRemoveOldLogs-seed#[E07FE81933F3A07F]) [    ] o.a.s.u.p.LogUpdateProcessorFactory [collection1]  webapp=null path=null params={versions=true&wt=json&indent=true}{add=[23 (1584143313129177088)]} 0 0
   [junit4]   2> 1013340 INFO  (TEST-CdcrUpdateLogTest.testRemoveOldLogs-seed#[E07FE81933F3A07F]) [    ] o.a.s.u.p.LogUpdateProcessorFactory [collection1]  webapp=null path=null params={versions=true&wt=json&indent=true}{add=[24 (1584143313129177089)]} 0 0
   [junit4]   2> 1013340 INFO  (TEST-CdcrUpdateLogTest.testRemoveOldLogs-seed#[E07FE81933F3A07F]) [    ] o.a.s.u.p.LogUpdateProcessorFactory [collection1]  webapp=null path=null params={versions=true&wt=json&indent=true}{add=[25 (1584143313129177090)]} 0 0
   [junit4]   2> 1013340 INFO  (TEST-CdcrUpdateLogTest.testRemoveOldLogs-seed#[E07FE81933F3A07F]) [    ] o.a.s.u.p.LogUpdateProcessorFactory [collection1]  webapp=null path=null params={versions=true&wt=json&indent=true}{add=[26 (1584143313129177091)]} 0 0
   [junit4]   2> 1013340 INFO  (TEST-CdcrUpdateLogTest.testRemoveOldLogs-seed#[E07FE81933F3A07F]) [    ] o.a.s.u.p.LogUpdateProcessorFactory [collection1]  webapp=null path=null params={versions=true&wt=json&indent=true}{add=[27 (1584143313129177092)]} 0 0
   [junit4]   2> 1013340 INFO  (TEST-CdcrUpdateLogTest.testRemoveOldLogs-seed#[E07FE81933F3A07F]) [    ] o.a.s.u.p.LogUpdateProcessorFactory [collection1]  webapp=null path=null params={versions=true&wt=json&indent=true}{add=[28 (1584143313129177093)]} 0 0
   [junit4]   2> 1013341 INFO  (TEST-CdcrUpdateLogTest.testRemoveOldLogs-seed#[E07FE81933F3A07F]) [    ] o.a.s.u.p.LogUpdateProcessorFactory [collection1]  webapp=null path=null params={versions=true&wt=json&indent=true}{add=[29 (1584143313130225664)]} 0 0
   [junit4]   2> 1013341 INFO  (TEST-CdcrUpdateLogTest.testRemoveOldLogs-seed#[E07FE81933F3A07F]) [    ] o.a.s.u.p.LogUpdateProcessorFactory [collection1]  webapp=null path=null params={versions=true&wt=json&indent=true}{add=[30 (1584143313130225665)]} 0 0
   [junit4]   2> 1013341 INFO  (TEST-CdcrUpdateLogTest.testRemoveOldLogs-seed#[E07FE81933F3A07F]) [    ] o.a.s.u.p.LogUpdateProcessorFactory [collection1]  webapp=null path=null params={versions=true&wt=json&indent=true}{add=[31 (1584143313130225666)]} 0 0
   [junit4]   2> 1013341 INFO  (TEST-CdcrUpdateLogTest.testRemoveOldLogs-seed#[E07FE81933F3A07F]) [    ] o.a.s.u.p.LogUpdateProcessorFactory [collection1]  webapp=null path=null params={versions=true&wt=json&indent=true}{add=[32 (1584143313130225667)]} 0 0
   [junit4]   2> 1013341 INFO  (TEST-CdcrUpdateLogTest.testRemoveOldLogs-seed#[E07FE81933F3A07F]) [    ] o.a.s.u.p.LogUpdateProcessorFactory [collection1]  webapp=null path=null params={versions=true&wt=json&indent=true}{add=[33 (1584143313130225668)]} 0 0
   [junit4]   2> 1013341 INFO  (TEST-CdcrUpdateLogTest.testRemoveOldLogs-seed#[E07FE81933F3A07F]) [    ] o.a.s.u.p.LogUpdateProcessorFactory [collection1]  webapp=null path=null params={versions=true&wt=json&indent=true}{add=[34 (1584143313130225669)]} 0 0
   [junit4]   2> 1013342 INFO  (TEST-CdcrUpdateLogTest.testRemoveOldLogs-seed#[E07FE81933F3A07F]) [    ] o.a.s.u.p.LogUpdateProcessorFactory [collection1]  webapp=null path=null params={versions=true&wt=json&indent=true}{add=[35 (1584143313130225670)]} 0 0
   [junit4]   2> 1013355 INFO  (TEST-CdcrUpdateLogTest.testRemoveOldLogs-seed#[E07FE81933F3A07F]) [    ] o.a.s.u.p.LogUpdateProcessorFactory [collection1]  webapp=null path=null params={versions=true&wt=json&indent=true}{add=[36 (1584143313131274240)]} 0 13
   [junit4]   2> 1013355 INFO  (TEST-CdcrUpdateLogTest.testRemoveOldLogs-seed#[E07FE81933F3A07F]) [    ] o.a.s.u.p.LogUpdateProcessorFactory [collection1]  webapp=null path=null params={versions=true&wt=json&indent=true}{add=[37 (1584143313144905728)]} 0 0
   [junit4]   2> 1013356 INFO  (TEST-CdcrUpdateLogTest.testRemoveOldLogs-seed#[E07FE81933F3A07F]) [    ] o.a.s.u.p.LogUpdateProcessorFactory [collection1]  webapp=null path=null params={versions=true&wt=json&indent=true}{add=[38 (1584143313144905729)]} 0 0
   [junit4]   2> 1013356 INFO  (TEST-CdcrUpdateLogTest.testRemoveOldLogs-seed#[E07FE81933F3A07F]) [    ] o.a.s.u.p.LogUpdateProcessorFactory [collection1]  webapp=null path=null params={versions=true&wt=json&indent=true}{add=[39 (1584143313145954304)]} 0 0
   [junit4]   2> 1013356 INFO  (TEST-CdcrUpdateLogTest.testRemoveOldLogs-seed#[E07FE81933F3A07F]) [    ] o.a.s.u.p.LogUpdateProcessorFactory [collection1]  webapp=null path=null params={versions=true&wt=json&indent=true}{add=[40 (1584143313145954305)]} 0 0
   [junit4]   2> 1013356 INFO  (TEST-CdcrUpdateLogTest.testRemoveOldLogs-seed#[E07FE81933F3A07F]) [    ] o.a.s.u.p.LogUpdateProcessorFactory [collection1]  webapp=null path=null params={versions=true&wt=json&indent=true}{add=[41 (1584143313145954306)]} 0 0
   [junit4]   2> 1013356 INFO  (TEST-CdcrUpdateLogTest.testRemoveOldLogs-seed#[E07FE81933F3A07F]) [    ] o.a.s.u.p.LogUpdateProcessorFactory [collection1]  webapp=null path=null params={versions=true&wt=json&indent=true}{add=[42 (1584143313145954307)]} 0 0
   [junit4]   2> 1013356 INFO  (TEST-CdcrUpdateLogTest.testRemoveOldLogs-seed#[E07FE81933F3A07F]) [    ] o.a.s.u.p.LogUpdateProcessorFactory [collection1]  webapp=null path=null params={versions=true&wt=json&indent=true}{add=[43 (1584143313145954308)]} 0 0
   [junit4]   2> 1013357 INFO  (TEST-CdcrUpdateLogTest.testRemoveOldLogs-seed#[E07FE81933F3A07F]) [    ] o.a.s.u.p.LogUpdateProcessorFactory [collection1]  webapp=null path=null params={versions=true&wt=json&indent=true}{add=[44 (1584143313145954309)]} 0 0
   [junit4]   2> 1013357 INFO  (TEST-CdcrUpdateLogTest.testRemoveOldLogs-seed#[E07FE81933F3A07F]) [    ] o.a.s.u.p.LogUpdateProcessorFactory [collection1]  webapp=null path=null params={versions=true&wt=json&indent=true}{add=[45 (1584143313147002880)]} 0 0
   [junit4]   2> 1013357 INFO  (TEST-CdcrUpdateLogTest.testRemoveOldLogs-seed#[E07FE81933F3A07F]) [    ] o.a.s.u.p.LogUpdateProcessorFactory [collection1]  webapp=null path=null params={versions=true&wt=json&indent=true}{add=[46 (1584143313147002881)]} 0 0
   [junit4]   2> 1013357 INFO  (TEST-CdcrUpdateLogTest.testRemoveOldLogs-seed#[E07FE81933F3A07F]) [    ] o.a.s.u.p.LogUpdateProcessorFactory [collection1]  webapp=null path=null params={versions=true&wt=json&indent=true}{add=[47 (1584143313147002882)]} 0 0
   [junit4]   2> 1013357 INFO  (TEST-CdcrUpdateLogTest.testRemoveOldLogs-seed#[E07FE81933F3A07F]) [    ] o.a.s.u.p.LogUpdateProcessorFactory [collection1]  webapp=null path=null params={versions=true&wt=json&indent=true}{add=[48 (1584143313147002883)]} 0 0
   [junit4]   2> 1013357 INFO  (TEST-CdcrUpdateLogTest.testRemoveOldLogs-seed#[E07FE81933F3A07F]) [    ] o.a.s.u.p.LogUpdateProcessorFactory [collection1]  webapp=null path=null params={versions=true&wt=json&indent=true}{add=[49 (1584143313147002884)]} 0 0
   [junit4]   2> 1013357 INFO  (TEST-CdcrUpdateLogTest.testRemoveOldLogs-seed#[E07FE81933F3A07F]) [    ] o.a.s.u.p.LogUpdateProcessorFactory [collection1]  webapp=null path=null params={versions=true&wt=json&indent=true}{add=[50 (1584143313147002885)]} 0 0
   [junit4]   2> 1013358 INFO  (TEST-CdcrUpdateLogTest.testRemoveOldLogs-seed#[E07FE81933F3A07F]) [    ] o.a.s.u.p.LogUpdateProcessorFactory [collection1]  webapp=null path=null params={versions=true&wt=json&indent=true}{add=[51 (1584143313148051456)]} 0 0
   [junit4]   2> 1013358 INFO  (TEST-CdcrUpdateLogTest.testRemoveOldLogs-seed#[E07FE81933F3A07F]) [    ] o.a.s.u.p.LogUpdateProcessorFactory [collection1]  webapp=null path=null params={versions=true&wt=json&indent=true}{add=[52 (1584143313148051457)]} 0 0
   [junit4]   2> 1013358 INFO  (TEST-CdcrUpdateLogTest.testRemoveOldLogs-seed#[E07FE81933F3A07F]) [    ] o.a.s.u.p.LogUpdateProcessorFactory [collection1]  webapp=null path=null params={versions=true&wt=json&indent=true}{add=[53 (1584143313148051458)]} 0 0
   [junit4]   2> 1013358 INFO  (TEST-CdcrUpdateLogTest.testRemoveOldLogs-seed#[E07FE81933F3A07F]) [    ] o.a.s.u.p.LogUpdateProcessorFactory [collection1]  webapp=null path=null params={versions=true&wt=json&indent=true}{add=[54 (1584143313148051459)]} 0 0
   [junit4]   2> 1013358 INFO  (TEST-CdcrUpdateLogTest.testRemoveOldLogs-seed#[E07FE81933F3A07F]) [    ] o.a.s.u.p.LogUpdateProcessorFactory [collection1]  webapp=null path=null params={versions=true&wt=json&indent=true}{add=[55 (1584143313148051460)]} 0 0
   [junit4]   2> 1013358 INFO  (TEST-CdcrUpdateLogTest.testRemoveOldLogs-seed#[E07FE81933F3A07F]) [    ] o.a.s.u.p.LogUpdateProcessorFactory [collection1]  webapp=null path=null params={versions=true&wt=json&indent=true}{add=[56 (1584143313148051461)]} 0 0
   [junit4]   2> 1013358 INFO  (TEST-CdcrUpdateLogTest.testRemoveOldLogs-seed#[E07FE81933F3A07F]) [    ] o.a.s.u.p.LogUpdateProcessorFactory [collection1]  webapp=null path=null params={versions=true&wt=json&indent=true}{add=[57 (1584143313148051462)]} 0 0
   [junit4]   2> 1013359 INFO  (TEST-CdcrUpdateLogTest.testRemoveOldLogs-seed#[E07FE81933F3A07F]) [    ] o.a.s.u.p.LogUpdateProcessorFactory [collection1]  webapp=null path=null params={versions=true&wt=json&indent=true}{add=[58 (1584143313149100032)]} 0 0
   [junit4]   2> 1013448 INFO  (TEST-CdcrUpdateLogTest.testRemoveOldLogs-seed#[E07FE81933F3A07F]) [    ] o.a.s.u.p.LogUpdateProcessorFactory [collection1]  webapp=null path=null params={versions=true&wt=json&indent=true}{add=[59 (1584143313149100033)]} 0 0
   [junit4]   2> 1013465 INFO  (TEST-CdcrUpdateLogTest.testRemoveOldLogs-seed#[E07FE81933F3A07F]) [    ] o.a.s.u.p.LogUpdateProcessorFactory [collection1]  webapp=null path=null params={versions=true&wt=json&indent=true}{add=[60 (1584143313242423296)]} 0 16
   [junit4]   2> 1013465 INFO  (TEST-CdcrUpdateLogTest.testRemoveOldLogs-seed#[E07FE81933F3A07F]) [    ] o.a.s.u.p.LogUpdateProcessorFactory [collection1]  webapp=null path=null params={versions=true&wt=json&indent=true}{add=[61 (1584143313260249088)]} 0 0
   [junit4]   2> 1013465 INFO  (TEST-CdcrUpdateLogTest.testRemoveOldLogs-seed#[E07FE81933F3A07F]) [    ] o.a.s.u.p.LogUpdateProcessorFactory [collection1]  webapp=null path=null params={versions=true&wt=json&indent=true}{add=[62 (1584143313260249089)]} 0 0
   [junit4]   2> 1013465 INFO  (TEST-CdcrUpdateLogTest.testRemoveOldLogs-seed#[E07FE81933F3A07F]) [    ] o.a.s.u.p.LogUpdateProcessorFactory [collection1]  webapp=null path=null params={versions=true&wt=json&indent=true}{add=[63 (1584143313260249090)]} 0 0
   [junit4]   2> 1013465 INFO  (TEST-CdcrUpdateLogTest.testRemoveOldLogs-seed#[E07FE81933F3A07F]) [    ] o.a.s.u.p.LogUpdateProcessorFactory [collection1]  webapp=null path=null params={versions=true&wt=json&indent=true}{add=[64 (1584143313260249091)]} 0 0
   [junit4]   2> 1013466 INFO  (TEST-CdcrUpdateLogTest.testRemoveOldLogs-seed#[E07FE81933F3A07F]) [    ] o.a.s.u.p.LogUpdateProcessorFactory [collection1]  webapp=null path=null params={versions=true&wt=json&indent=true}{add=[65 (1584143313261297664)]} 0 0
   [junit4]   2> 1013466 INFO  (TEST-CdcrUpdateLogTest.testRemoveOldLogs-seed#[E07FE81933F3A07F]) [    ] o.a.s.u.p.LogUpdateProcessorFactory [collection1]  webapp=null path=null params={versions=true&wt=json&indent=true}{add=[66 (1584143313261297665)]} 0 0
   [junit4]   2> 1013466 INFO  (TEST-CdcrUpdateLogTest.testRemoveOldLogs-seed#[E07FE81933F3A07F]) [    ] o.a.s.u.p.LogUpdateProcessorFactory [collection1]  webapp=null path=null params={versions=true&wt=json&indent=true}{add=[67 (1584143313261297666)]} 0 0
   [junit4]   2> 1013466 INFO  (TEST-CdcrUpdateLogTest.testRemoveOldLogs-seed#[E07FE81933F3A07F]) [    ] o.a.s.u.p.LogUpdateProcessorFactory [collection1]  webapp=null path=null params={versions=true&wt=json&indent=true}{add=[68 (1584143313261297667)]} 0 0
   [junit4]   2> 1013466 INFO  (TEST-CdcrUpdateLogTest.testRemoveOldLogs-seed#[E07FE81933F3A07F]) [    ] o.a.s.u.p.LogUpdateProcessorFactory [collection1]  webapp=null path=null params={versions=true&wt=json&indent=true}{add=[69 (1584143313261297668)]} 0 0
   [junit4]   2> 1013466 INFO  (TEST-CdcrUpdateLogTest.testRemoveOldLogs-seed#[E07FE81933F3A07F]) [    ] o.a.s.u.p.LogUpdateProcessorFactory [collection1]  webapp=null path=null params={versions=true&wt=json&indent=true}{add=[70 (1584143313261297669)]} 0 0
   [junit4]   2> 1013467 INFO  (TEST-CdcrUpdateLogTest.testRemoveOldLogs-seed#[E07FE81933F3A07F]) [    ] o.a.s.u.p.LogUpdateProcessorFactory [collection1]  webapp=null path=null params={versions=true&wt=json&indent=true}{add=[71 (1584143313262346240)]} 0 0
   [junit4]   2> 1013467 INFO  (TEST-CdcrUpdateLogTest.testRemoveOldLogs-seed#[E07FE81933F3A07F]) [    ] o.a.s.u.p.LogUpdateProcessorFactory [collection1]  webapp=null path=null params={versions=true&wt=json&indent=true}{add=[72 (1584143313262346241)]} 0 0
   [junit4]   2> 1013467 INFO  (TEST-CdcrUpdateLogTest.testRemoveOldLogs-seed#[E07FE81933F3A07F]) [    ] o.a.s.u.p.LogUpdateProcessorFactory [collection1]  webapp=null path=null params={versions=true&wt=json&indent=true}{add=[73 (1584143313262346242)]} 0 0
   [junit4]   2> 1013467 INFO  (TEST-CdcrUpdateLogTest.testRemoveOldLogs-seed#[E07FE81933F3A07F]) [    ] o.a.s.u.p.LogUpdateProcessorFactory [collection1]  webapp=null path=null params={versions=true&wt=json&indent=true}{add=[74 (1584143313262346243)]} 0 0
   [junit4]   2> 1013467 INFO  (TEST-CdcrUpdateLogTest.testRemoveOldLogs-seed#[E07FE81933F3A07F]) [    ] o.a.s.u.p.LogUpdateProcessorFactory [collection1]  webapp=null path=null params={versions=true&wt=json&indent=true}{add=[75 (1584143313262346244)]} 0 0
   [junit4]   2> 1013467 INFO  (TEST-CdcrUpdateLogTest.testRemoveOldLogs-seed#[E07FE81933F3A07F]) [    ] o.a.s.u.p.LogUpdateProcessorFactory [collection1]  webapp=null path=null params={versions=true&wt=json&indent=true}{add=[76 (1584143313262346245)]} 0 0
   [junit4]   2> 1013467 INFO  (TEST-CdcrUpdateLogTest.testRemoveOldLogs-seed#[E07FE81933F3A07F]) [    ] o.a.s.u.p.LogUpdateProcessorFactory [collection1]  webapp=null path=null params={versions=true&wt=json&indent=true}{add=[77 (1584143313262346246)]} 0 0
   [junit4]   2> 1013468 INFO  (TEST-CdcrUpdateLogTest.testRemoveOldLogs-seed#[E07FE81933F3A07F]) [    ] o.a.s.u.p.LogUpdateProcessorFactory [collection1]  webapp=null path=null params={versions=true&wt=json&indent=true}{add=[78 (1584143313263394816)]} 0 0
   [junit4]   2> 1013468 INFO  (TEST-CdcrUpdateLogTest.testRemoveOldLogs-seed#[E07FE81933F3A07F]) [    ] o.a.s.u.p.LogUpdateProcessorFactory [collection1]  webapp=null path=null params={versions=true&wt=json&indent=true}{add=[79 (1584143313263394817)]} 0 0
   [junit4]   2> 1013468 INFO  (TEST-CdcrUpdateLogTest.testRemoveOldLogs-seed#[E07FE81933F3A07F]) [    ] o.a.s.u.p.LogUpdateProcessorFactory [collection1]  webapp=null path=null params={versions=true&wt=json&indent=true}{add=[80 (1584143313263394818)]} 0 0
   [junit4]   2> 1013468 INFO  (TEST-CdcrUpdateLogTest.testRemoveOldLogs-seed#[E07FE81933F3A07F]) [    ] o.a.s.u.p.LogUpdateProcessorFactory [collection1]  webapp=null path=null params={versions=true&wt=json&indent=true}{add=[81 (1584143313263394819)]} 0 0
   [junit4]   2> 1013468 INFO  (TEST-CdcrUpdateLogTest.testRemoveOldLogs-seed#[E07FE81933F3A07F]) [    ] o.a.s.u.p.LogUpdateProcessorFactory [collection1]  webapp=null path=null params={versions=true&wt=json&indent=true}{add=[82 (1584143313263394820)]} 0 0
   [junit4]   2> 1013468 INFO  (TEST-CdcrUpdateLogTest.testRemoveOldLogs-seed#[E07FE81933F3A07F]) [    ] o.a.s.u.p.LogUpdateProcessorFactory [collection1]  webapp=null path=null params={versions=true&wt=json&indent=true}{add=[83 (1584143313263394821)]} 0 0
   [junit4]   2> 1013538 INFO  (TEST-CdcrUpdateLogTest.testRemoveOldLogs-seed#[E07FE81933F3A07F]) [    ] o.a.s.u.p.LogUpdateProcessorFactory [collection1]  webapp=null path=null params={versions=true&wt=json&indent=true}{add=[84 (1584143313318969344)]} 0 16
   [junit4]   2> 1013538 INFO  (TEST-CdcrUpdateLogTest.testRemoveOldLogs-seed#[E07FE81933F3A07F]) [    ] o.a.s.u.p.LogUpdateProcessorFactory [collection1]  webapp=null path=null params={versions=true&wt=json&indent=true}{add=[85 (1584143313336795136)]} 0 0
   [junit4]   2> 1013538 INFO  (TEST-CdcrUpdateLogTest.testRemoveOldLogs-seed#[E07FE81933F3A07F]) [    ] o.a.s.u.p.LogUpdateProcessorFactory [collection1]  webapp=null path=null params={versions=true&wt=json&indent=true}{add=[86 (1584143313336795137)]} 0 0
   [junit4]   2> 1013538 INFO  (TEST-CdcrUpdateLogTest.testRemoveOldLogs-seed#[E07FE81933F3A07F]) [    ] o.a.s.u.p.LogUpdateProcessorFactory [collection1]  webapp=null path=null params={versions=true&wt=json&indent=true}{add=[87 (1584143313336795138)]} 0 0
   [junit4]   2> 1013539 INFO  (TEST-CdcrUpdateLogTest.testRemoveOldLogs-seed#[E07FE81933F3A07F]) [    ] o.a.s.u.p.LogUpdateProcessorFactory [collection1]  webapp=null path=null params={versions=true&wt=json&indent=true}{add=[88 (1584143313337843712)]} 0 0
   [junit4]   2> 1013539 INFO  (TEST-CdcrUpdateLogTest.testRemoveOldLogs-seed#[E07FE81933F3A07F]) [    ] o.a.s.u.p.LogUpdateProcessorFactory [collection1]  webapp=null path=null params={versions=true&wt=json&indent=true}{add=[89 (1584143313337843713)]} 0 0
   [junit4]   2> 1013539 INFO  (TEST-CdcrUpdateLogTest.testRemoveOldLogs-seed#[E07FE81933F3A07F]) [    ] o.a.s.u.p.LogUpdateProcessorFactory [collection1]  webapp=null path=null params={versions=true&wt=json&indent=true}{add=[90 (1584143313337843714)]} 0 0
   [junit4]   2> 1013539 INFO  (TEST-CdcrUpdateLogTest.testRemoveOldLogs-seed#[E07FE81933F3A07F]) [    ] o.a.s.u.p.LogUpdateProcessorFactory [collection1]  webapp=null path=null params={versions=true&wt=json&indent=true}{add=[91 (1584143313337843715)]} 0 0
   [junit4]   2> 1013539 INFO  (TEST-CdcrUpdateLogTest.testRemoveOldLogs-seed#[E07FE81933F3A07F]) [    ] o.a.s.u.p.LogUpdateProcessorFactory [collection1]  webapp=null path=null params={versions=true&wt=json&indent=true}{add=[92 (1584143313337843716)]} 0 0
   [junit4]   2> 1013539 INFO  (TEST-CdcrUpdateLogTest.testRemoveOldLogs-seed#[E07FE81933F3A07F]) [    ] o.a.s.u.p.LogUpdateProcessorFactory [collection1]  webapp=null path=null params={versions=true&wt=json&indent=true}{add=[93 (1584143313337843717)]} 0 0
   [junit4]   2> 1013540 INFO  (TEST-CdcrUpdateLogTest.testRemoveOldLogs-seed#[E07FE81933F3A07F]) [    ] o.a.s.u.p.LogUpdateProcessorFactory [collection1]  webapp=null path=null params={versions=true&wt=json&indent=true}{add=[94 (1584143313337843718)]} 0 0
   [junit4]   2> 1013540 INFO  (TEST-CdcrUpdateLogTest.testRemoveOldLogs-seed#[E07FE81933F3A07F]) [    ] o.a.s.u.p.LogUpdateProcessorFactory [collection1]  webapp=null path=null params={versions=true&wt=json&indent=true}{add=[95 (1584143313338892288)]} 0 0
   [junit4]   2> 1013540 INFO  (TEST-CdcrUpdateLogTest.testRemoveOldLogs-seed#[E07FE81933F3A07F]) [    ] o.a.s.u.p.LogUpdateProcessorFactory [collection1]  webapp=null path=null params={versions=true&wt=json&indent=true}{add=[96 (1584143313338892289)]} 0 0
   [junit4]   2> 1013540 INFO  (TEST-CdcrUpdateLogTest.testRemoveOldLogs-seed#[E07FE81933F3A07F]) [    ] o.a.s.u.p.LogUpdateProcessorFactory [collection1]  webapp=null path=null params={versions=true&wt=json&indent=true}{add=[97 (1584143313338892290)]} 0 0
   [junit4]   2> 1013540 INFO  (TEST-CdcrUpdateLogTest.testRemoveOldLogs-seed#[E07FE81933F3A07F]) [    ] o.a.s.u.p.LogUpdateProcessorFactory [collection1]  webapp=null path=null params={versions=true&wt=json&indent=true}{add=[98 (1584143313338892291)]} 0 0
   [junit4]   2> 1013540 INFO  (TEST-CdcrUpdateLogTest.testRemoveOldLogs-seed#[E07FE81933F3A07F]) [    ] o.a.s.u.p.LogUpdateProcessorFactory [collection1]  webapp=null path=null params={versions=true&wt=json&indent=true}{add=[99 (1584143313338892292)]} 0 0
   [junit4]   2> 1013540 INFO  (TEST-CdcrUpdateLogTest.testRemoveOldLogs-seed#[E07FE81933F3A07F]) [    ] o.a.s.u.p.LogUpdateProcessorFactory [collection1]  webapp=null path=null params={versions=true&wt=json&indent=true}{add=[100 (1584143313338892293)]} 0 0
   [junit4]   2> 1013541 INFO  (TEST-CdcrUpdateLogTest.testRemoveOldLogs-seed#[E07FE81933F3A07F]) [    ] o.a.s.u.p.LogUpdateProcessorFactory [collection1]  webapp=null path=null params={versions=true&wt=json&indent=true}{add=[101 (1584143313339940864)]} 0 0
   [junit4]   2> 1013541 INFO  (TEST-CdcrUpdateLogTest.testRemoveOldLogs-seed#[E07FE81933F3A07F]) [    ] o.a.s.u.p.LogUpdateProcessorFactory [collection1]  webapp=null path=null params={versions=true&wt=json&indent=true}{add=[102 (1584143313339940865)]} 0 0
   [junit4]   2> 1013541 INFO  (TEST-CdcrUpdateLogTest.testRemoveOldLogs-seed#[E07FE81933F3A07F]) [    ] o.a.s.u.p.LogUpdateProcessorFactory [collection1]  webapp=null path=null params={versions=true&wt=json&indent=true}{add=[103 (1584143313339940866)]} 0 0
   [junit4]   2> 1013541 INFO  (TEST-CdcrUpdateLogTest.testRemoveOldLogs-seed#[E07FE81933F3A07F]) [    ] o.a.s.u.p.LogUpdateProcessorFactory [collection1]  webapp=null path=null params={versions=true&wt=json&indent=true}{add=[104 (1584143313339940867)]} 0 0
   [junit4]   2> 1013541 INFO  (TEST-CdcrUpdateLogTest.testRemoveOldLogs-seed#[E07FE81933F3A07F]) [    ] o.a.s.u.p.LogUpdateProcessorFactory [collection1]  webapp=null path=null params={versions=true&wt=json&indent=true}{add=[105 (1584143313339940868)]} 0 0
   [junit4]   2> 1013541 INFO  (TEST-CdcrUpdateLogTest.testRemoveOldLogs-seed#[E07FE81933F3A07F]) [    ] o.a.s.u.p.LogUpdateProcessorFactory [collection1]  webapp=null path=null params={versions=true&wt=json&indent=true}{add=[106 (1584143313339940869)]} 0 0
   [junit4]   2> 1013574 INFO  (TEST-CdcrUpdateLogTest.testRemoveOldLogs-seed#[E07FE81933F3A07F]) [    ] o.a.s.u.p.LogUpdateProcessorFactory [collection1]  webapp=null path=null params={versions=true&wt=json&indent=true}{add=[107 (1584143313339940870)]} 0 32
   [junit4]   2> 1013574 INFO  (TEST-CdcrUpdateLogTest.testRemoveOldLogs-seed#[E07FE81933F3A07F]) [    ] o.a.s.u.p.LogUpdateProcessorFactory [collection1]  webapp=null path=null params={versions=true&wt=json&indent=true}{add=[108 (1584143313374543872)]} 0 0
   [junit4]   2> 1013668 INFO  (TEST-CdcrUpdateLogTest.testRemoveOldLogs-seed#[E07FE81933F3A07F]) [    ] o.a.s.u.p.LogUpdateProcessorFactory [collection1]  webapp=null path=null params={versions=true&wt=json&indent=true}{add=[109 (1584143313413341184)]} 0 94
   [junit4]   2> 1013669 INFO  (TEST-CdcrUpdateLogTest.testRemoveOldLogs-seed#[E07FE81933F3A07F]) [    ] o.a.s.u.p.LogUpdateProcessorFactory [collection1]  webapp=null path=null params={versions=true&wt=json&indent=true}{add=[110 (1584143313474158592)]} 0 0
   [junit4]   2> 1013669 INFO  (TEST-CdcrUpdateLogTest.testRemoveOldLogs-seed#[E07FE81933F3A07F]) [    ] o.a.s.u.p.LogUpdateProcessorFactory [collection1]  webapp=null path=null params={versions=true&wt=json&indent=true}{add=[111 (1584143313474158593)]} 0 0
   [junit4]   2> 1013669 INFO  (TEST-CdcrUpdateLogTest.testRemoveOldLogs-seed#[E07FE81933F3A07F]) [    ] o.a.s.u.p.LogUpdateProcessorFactory [collection1]  webapp=null path=null params={versions=true&wt=json&indent=true}{add=[112 (1584143313474158594)]} 0 0
   [junit4]   2> 1013669 INFO  (TEST-CdcrUpdateLogTest.testRemoveOldLogs-seed#[E07FE81933F3A07F]) [    ] o.a.s.u.p.LogUpdateProcessorFactory [collection1]  webapp=null path=null params={versions=true&wt=json&indent=true}{add=[113 (1584143313474158595)]} 0 0
   [junit4]   2> 1013669 INFO  (TEST-CdcrUpdateLogTest.testRemoveOldLogs-seed#[E07FE81933F3A07F]) [    ] o.a.s.u.p.LogUpdateProcessorFactory [collection1]  webapp=null path=null params={versions=true&wt=json&indent=true}{add=[114 (1584143313474158596)]} 0 0
   [junit4]   2> 1013669 INFO  (TEST-CdcrUpdateLogTest.testRemoveOldLogs-seed#[E07FE81933F3A07F]) [    ] o.a.s.u.p.LogUpdateProcessorFactory [collection1]  webapp=null path=null params={versions=true&wt=json&indent=true}{add=[115 (1584143313474158597)]} 0 0
   [junit4]   2> 1013670 INFO  (TEST-CdcrUpdateLogTest.testRemoveOldLogs-seed#[E07FE81933F3A07F]) [    ] o.a.s.u.p.LogUpdateProcessorFactory [collection1]  webapp=null path=null params={versions=true&wt=json&indent=true}{add=[116 (1584143313475207168)]} 0 0
   [junit4]   2> 1013670 INFO  (TEST-CdcrUpdateLogTest.testRemoveOldLogs-seed#[E07FE81933F3A07F]) [    ] o.a.s.u.p.LogUpdateProcessorFactory [collection1]  webapp=null path=null params={versions=true&wt=json&indent=true}{add=[117 (1584143313475207169)]} 0 0
   [junit4]   2> 1013670 INFO  (TEST-CdcrUpdateLogTest.testRemoveOldLogs-seed#[E07FE81933F3A07F]) [    ] o.a.s.u.p.LogUpdateProcessorFactory [collection1]  webapp=null path=null params={versions=true&wt=json&indent=true}{add=[118 (1584143313475207170)]} 0 0
   [junit4]   2> 1013670 INFO  (TEST-CdcrUpdateLogTest.testRemoveOldLogs-seed#[E07FE81933F3A07F]) [    ] o.a.s.u.p.LogUpdateProcessorFactory [collection1]  webapp=null path=null params={versions=true&wt=json&indent=true}{add=[119 (1584143313475207171)]} 0 0
   [junit4]   2> 1013670 INFO  (TEST-CdcrUpdateLogTest.testRemoveOldLogs-seed#[E07FE81933F3A07F]) [    ] o.a.s.u.p.LogUpdateProcessorFactory [collection1]  webapp=null path=null params={versions=true&wt=json&indent=true}{add=[120 (1584143313475207172)]} 0 0
   [junit4]   2> 1013670 INFO  (TEST-CdcrUpdateLogTest.testRemoveOldLogs-seed#[E07FE81933F3A07F]) [    ] o.a.s.u.p.LogUpdateProcessorFactory [collection1]  webapp=null path=null params={versions=true&wt=json&indent=true}{add=[121 (1584143313475207173)]} 0 0
   [junit4]   2> 1013671 INFO  (TEST-CdcrUpdateLogTest.testRemoveOldLogs-seed#[E07FE81933F3A07F]) [    ] o.a.s.u.p.LogUpdateProcessorFactory [collection1]  webapp=null path=null params={versions=true&wt=json&indent=true}{add=[122 (1584143313475207174)]} 0 0
   [junit4]   2> 1013671 INFO  (TEST-CdcrUpdateLogTest.testRemoveOldLogs-seed#[E07FE81933F3A07F]) [    ] o.a.s.u.p.LogUpdateProcessorFactory [collection1]  webapp=null path=null params={versions=true&wt=json&indent=true}{add=[123 (1584143313476255744)]} 0 0
   [junit4]   2> 1013671 INFO  (TEST-CdcrUpdateLogTest.testRemoveOldLogs-seed#[E07FE81933F3A07F]) [    ] o.a.s.u.p.LogUpdateProcessorFactory [collection1]  webapp=null path=null params={versions=true&wt=json&indent=true}{add=[124 (1584143313476255745)]} 0 0
   [junit4]   2> 1013671 INFO  (TEST-CdcrUpdateLogTest.testRemoveOldLogs-seed#[E07FE81933F3A07F]) [    ] o.a.s.c.S.Request [collection1]  webapp=null path=null params={qt=/get&getVersions=50&wt=xml} status=0 QTime=0
   [junit4]   2> 1013671 INFO  (TEST-CdcrUpdateLogTest.testRemoveOldLogs-seed#[E07FE81933F3A07F]) [    ] o.a.s.u.DirectUpdateHandler2 start commit{_version_=1584143313476255746,optimize=false,openSearcher=true,waitSearcher=true,expungeDeletes=false,softCommit=false,prepareCommit=false}
   [junit4]   2> 1013671 INFO  (TEST-CdcrUpdateLogTest.testRemoveOldLogs-seed#[E07FE81933F3A07F]) [    ] o.a.s.u.SolrIndexWriter Calling setCommitData with IW:org.apache.solr.update.SolrIndexWriter@15eeca8a commitCommandVersion:1584143313476255746
   [junit4]   2> 1013853 INFO  (TEST-CdcrUpdateLogTest.testRemoveOldLogs-seed#[E07FE81933F3A07F]) [    ] o.a.s.s.SolrIndexSearcher Opening [Searcher@152b3e6b[collection1] main]
   [junit4]   2> 1013853 INFO  (TEST-CdcrUpdateLogTest.testRemoveOldLogs-seed#[E07FE81933F3A07F]) [    ] o.a.s.u.DirectUpdateHandler2 end_commit_flush
   [junit4]   2> 1013854 INFO  (searcherExecutor-1532-thread-1) [    ] o.a.s.c.SolrCore [collection1] Registered new searcher Searcher@152b3e6b[collection1] main{ExitableDirectoryReader(UninvertingDirectoryReader(Uninverting(_0(7.2.0):C10) Uninverting(_1(7.2.0):C10) Uninverting(_2(7.2.0):C105)))}
   [junit4]   2> 1013854 INFO  (TEST-CdcrUpdateLogTest.testRemoveOldLogs-seed#[E07FE81933F3A07F]) [    ] o.a.s.u.p.LogUpdateProcessorFactory [collection1]  webapp=null path=null params={}{commit=} 0 182
   [junit4]   2> 1013887 INFO  (TEST-CdcrUpdateLogTest.testRemoveOldLogs-seed#[E07FE81933F3A07F]) [    ] o.a.s.c.S.Request [collection1]  webapp=null path=null params={qt=/get&getVersions=50&wt=xml} status=0 QTime=0
   [junit4]   2> 1013889 INFO  (TEST-CdcrUpdateLogTest.testRemoveOldLogs-seed#[E07FE81933F3A07F]) [    ] o.a.s.u.p.LogUpdateProcessorFactory [collection1]  webapp=null path=null params={versions=true&wt=json&indent=true}{add=[125 (1584143313703796736)]} 0 0
   [junit4]   2> 1013889 INFO  (TEST-CdcrUpdateLogTest.testRemoveOldLogs-seed#[E07FE81933F3A07F]) [    ] o.a.s.u.p.LogUpdateProcessorFactory [collection1]  webapp=null path=null params={versions=true&wt=json&indent=true}{add=[126 (1584143313704845312)]} 0 0
   [junit4]   2> 1013889 INFO  (TEST-CdcrUpdateLogTest.testRemoveOldLogs-seed#[E07FE81933F3A07F]) [    ] o.a.s.u.p.LogUpdateProcessorFactory [collection1]  webapp=null path=null params={versions=true&wt=json&indent=true}{add=[127 (1584143313704845313)]} 0 0
   [junit4]   2> 1013889 INFO  (TEST-CdcrUpdateLogTest.testRemoveOldLogs-seed#[E07FE81933F3A07F]) [    ] o.a.s.u.p.LogUpdateProcessorFactory [collection1]  webapp=null path=null params={versions=true&wt=json&indent=true}{add=[128 (1584143313704845314)]} 0 0
   [junit4]   2> 1013889 INFO  (TEST-CdcrUpdateLogTest.testRemoveOldLogs-seed#[E07FE81933F3A07F]) [    ] o.a.s.u.p.LogUpdateProcessorFactory [collection1]  webapp=null path=null params={versions=true&wt=json&indent=true}{add=[129 (1584143313704845315)]} 0 0
   [junit4]   2> 1013890 INFO  (TEST-CdcrUpdateLogTest.testRemoveOldLogs-seed#[E07FE81933F3A07F]) [    ] o.a.s.u.p.LogUpdateProcessorFactory [collection1]  webapp=null path=null params={versions=true&wt=json&indent=true}{add=[130 (1584143313704845316)]} 0 0
   [junit4]   2> 1013890 INFO  (TEST-CdcrUpdateLogTest.testRemoveOldLogs-seed#[E07FE81933F3A07F]) [    ] o.a.s.u.p.LogUpdateProcessorFactory [collection1]  webapp=null path=null params={versions=true&wt=json&indent=true}{add=[131 (1584143313705893888)]} 0 0
   [junit4]   2> 1013890 INFO  (TEST-CdcrUpdateLogTest.testRemoveOldLogs-seed#[E07FE81933F3A07F]) [    ] o.a.s.u.p.LogUpdateProcessorFactory [collection1]  webapp=null path=null params={versions=true&wt=json&indent=true}{add=[132 (1584143313705893889)]} 0 0
   [junit4]   2> 1013890 INFO  (TEST-CdcrUpdateLogTest.testRemoveOldLogs-seed#[E07FE81933F3A07F]) [    ] o.a.s.u.p.LogUpdateProcessorFactory [collection1]  webapp=null path=null params={versions=true&wt=json&indent=true}{add=[133 (1584143313705893890)]} 0 0
   [junit4]   2> 1013890 INFO  (TEST-CdcrUpdateLogTest.testRemoveOldLogs-seed#[E07FE81933F3A07F]) [    ] o.a.s.u.p.LogUpdateProcessorFactory [collection1]  webapp=null path=null params={versions=true&wt=json&indent=true}{add=[134 (1584143313705893891)]} 0 0
   [junit4]   2> 1013890 INFO  (TEST-CdcrUpdateLogTest.testRemoveOldLogs-seed#[E07FE81933F3A07F]) [    ] o.a.s.c.S.Request [collection1]  webapp=null path=null params={qt=/get&getVersions=50&wt=xml} status=0 QTime=0
   [junit4]   2> 1013891 INFO  (TEST-CdcrUpdateLogTest.testRemoveOldLogs-seed#[E07FE81933F3A07F]) [    ] o.a.s.u.DirectUpdateHandler2 start commit{_version_=1584143313706942464,optimize=false,openSearcher=true,waitSearcher=true,expungeDeletes=false,softCommit=false,prepareCommit=false}
   [junit4]   2> 1013891 INFO  (TEST-CdcrUpdateLogTest.testRemoveOldLogs-seed#[E07FE81933F3A07F]) [    ] o.a.s.u.SolrIndexWriter Calling setCommitData with IW:org.apache.solr.update.SolrIndexWriter@15eeca8a commitCommandVersion:1584143313706942464
   [junit4]   2> 1014087 INFO  (TEST-CdcrUpdateLogTest.testRemoveOldLogs-seed#[E07FE81933F3A07F]) [    ] o.a.s.s.SolrIndexSearcher Opening [Searcher@85663a0[collection1] main]
   [junit4]   2> 1014087 INFO  (TEST-CdcrUpdateLogTest.testRemoveOldLogs-seed#[E07FE81933F3A07F]) [    ] o.a.s.u.DirectUpdateHandler2 end_commit_flush
   [junit4]   2> 1014088 INFO  (searcherExecutor-1532-thread-1) [    ] o.a.s.c.SolrCore [collection1] Registered new searcher Searcher@85663a0[collection1] main{ExitableDirectoryReader(UninvertingDirectoryReader(Uninverting(_0(7.2.0):C10) Uninverting(_1(7.2.0):C10) Uninverting(_2(7.2.0):C105) Uninverting(_3(7.2.0):C10)))}
   [junit4]   2> 1014088 INFO  (TEST-CdcrUpdateLogTest.testRemoveOldLogs-seed#[E07FE81933F3A07F]) [    ] o.a.s.u.p.LogUpdateProcessorFactory [collection1]  webapp=null path=null params={}{commit=} 0 197
   [junit4]   2> 1014089 INFO  (TEST-CdcrUpdateLogTest.testRemoveOldLogs-seed#[E07FE81933F3A07F]) [    ] o.a.s.c.S.Request [collection1]  webapp=null path=null params={qt=/get&getVersions=50&wt=xml} status=0 QTime=0
   [junit4]   2> 1014089 INFO  (TEST-CdcrUpdateLogTest.testRemoveOldLogs-seed#[E07FE81933F3A07F]) [    ] o.a.s.c.CoreContainer Shutting down CoreContainer instance=209960743
   [junit4]   2> 1014089 INFO  (TEST-CdcrUpdateLogTest.testRemoveOldLogs-seed#[E07FE81933F3A07F]) [    ] o.a.s.m.SolrMetricManager Closing metric reporters for registry=solr.node, tag=null
   [junit4]   2> 1014089 INFO  (TEST-CdcrUpdateLogTest.testRemoveOldLogs-seed#[E07FE81933F3A07F]) [    ] o.a.s.m.r.SolrJmxReporter Closing reporter [org.apache.solr.metrics.reporters.SolrJmxReporter@57e2b99c: rootName = null, domain = solr.node, service url = null, agent id = null] for registry solr.node / com.codahale.metrics.MetricRegistry@20ad01c9
   [junit4]   2> 1014125 INFO  (TEST-CdcrUpdateLogTest.testRemoveOldLogs-seed#[E07FE81933F3A07F]) [    ] o.a.s.m.SolrMetricManager Closing metric reporters for registry=solr.jvm, tag=null
   [junit4]   2> 1014125 INFO  (TEST-CdcrUpdateLogTest.testRemoveOldLogs-seed#[E07FE81933F3A07F]) [    ] o.a.s.m.r.SolrJmxReporter Closing reporter [org.apache.solr.metrics.reporters.SolrJmxReporter@e53581f: rootName = null, domain = solr.jvm, service url = null, agent id = null] for registry solr.jvm / com.codahale.metrics.MetricRegistry@2f252074
   [junit4]   2> 1014161 INFO  (TEST-CdcrUpdateLogTest.testRemoveOldLogs-seed#[E07FE81933F3A07F]) [    ] o.a.s.m.SolrMetricManager Closing metric reporters for registry=solr.jetty, tag=null
   [junit4]   2> 1014161 INFO  (TEST-CdcrUpdateLogTest.testRemoveOldLogs-seed#[E07FE81933F3A07F]) [    ] o.a.s.m.r.SolrJmxReporter Closing reporter [org.apache.solr.metrics.reporters.SolrJmxReporter@2accb09c: rootName = null, domain = solr.jetty, service url = null, agent id = null] for registry solr.jetty / com.codahale.metrics.MetricRegistry@3123fa1
   [junit4]   2> 1014175 INFO  (coreCloseExecutor-1537-thread-1) [    x:collection1] o.a.s.c.SolrCore [collection1]  CLOSING SolrCore org.apache.solr.core.SolrCore@4bebb2ac
   [junit4]   2> 1014175 INFO  (coreCloseExecutor-1537-thread-1) [    x:collection1] o.a.s.m.SolrMetricManager Closing metric reporters for registry=solr.core.collection1, tag=1273737900
   [junit4]   2> 1014175 INFO  (coreCloseExecutor-1537-thread-1) [    x:collection1] o.a.s.m.r.SolrJmxReporter Closing reporter [org.apache.solr.metrics.reporters.SolrJmxReporter@270bd6e1: rootName = null, domain = solr.core.collection1, service url = null, agent id = null] for registry solr.core.collection1 / com.codahale.metrics.MetricRegistry@19efeb67
   [junit4]   2> 1014468 INFO  (TEST-CdcrUpdateLogTest.testRemoveOldLogs-seed#[E07FE81933F3A07F]) [    ] o.a.s.c.SolrResourceLoader [null] Added 2 libs to classloader, from paths: [/home/jenkins/jenkins-slave/workspace/Lucene-Solr-NightlyTests-7.x/checkout/solr/core/src/test-files/solr/collection1/lib, /home/jenkins/jenkins-slave/workspace/Lucene-Solr-NightlyTests-7.x/checkout/solr/core/src/test-files/solr/collection1/lib/classes]
   [junit4]   2> 1014616 INFO  (TEST-CdcrUpdateLogTest.testRemoveOldLogs-seed#[E07FE81933F3A07F]) [    ] o.a.s.c.SolrConfig Using Lucene MatchVersion: 7.2.0
   [junit4]   2> 1014656 INFO  (TEST-CdcrUpdateLogTest.testRemoveOldLogs-seed#[E07FE81933F3A07F]) [    ] o.a.s.s.IndexSchema [null] Schema name=test
   [junit4]   2> 1015224 INFO  (TEST-CdcrUpdateLogTest.testRemoveOldLogs-seed#[E07FE81933F3A07F]) [    ] o.a.s.s.IndexSchema Loaded schema test/1.6 with uniqueid field id
   [junit4]   2> 1015427 INFO  (TEST-CdcrUpdateLogTest.testRemoveOldLogs-seed#[E07FE81933F3A07F]) [    ] o.a.s.m.r.SolrJmxReporter JMX monitoring for 'solr.node' (registry 'solr.node') enabled at server: com.sun.jmx.mbeanserver.JmxMBeanServer@25a4d28c
   [junit4]   2> 1015531 INFO  (TEST-CdcrUpdateLogTest.testRemoveOldLogs-seed#[E07FE81933F3A07F]) [    ] o.a.s.m.r.SolrJmxReporter JMX monitoring for 'solr.jvm' (registry 'solr.jvm') enabled at server: com.sun.jmx.mbeanserver.JmxMBeanServer@25a4d28c
   [junit4]   2> 1015531 INFO  (TEST-CdcrUpdateLogTest.testRemoveOldLogs-seed#[E07FE81933F3A07F]) [    ] o.a.s.m.r.SolrJmxReporter JMX monitoring for 'solr.jetty' (registry 'solr.jetty') enabled at server: com.sun.jmx.mbeanserver.JmxMBeanServer@25a4d28c
   [junit4]   2> 1015575 INFO  (coreLoadExecutor-1544-thread-1) [    ] o.a.s.c.TransientSolrCoreCacheDefault Allocating transient cache for 2147483647 transient cores
   [junit4]   2> 1015575 INFO  (coreLoadExecutor-1544-thread-1) [    x:collection1] o.a.s.c.SolrResourceLoader [null] Added 2 libs to classloader, from paths: [/home/jenkins/jenkins-slave/workspace/Lucene-Solr-NightlyTests-7.x/checkout/solr/core/src/test-files/solr/collection1/lib, /home/jenkins/jenkins-slave/workspace/Lucene-Solr-NightlyTests-7.x/checkout/solr/core/src/test-files/solr/collection1/lib/classes]
   [junit4]   2> 1015718 INFO  (coreLoadExecutor-1544-thread-1) [    x:collection1] o.a.s.c.SolrConfig Using Lucene MatchVersion: 7.2.0
   [junit4]   2> 1015753 INFO  (coreLoadExecutor-1544-thread-1) [    x:collection1] o.a.s.s.IndexSchema [collection1] Schema name=test
   [junit4]   2> 1016269 INFO  (coreLoadExecutor-1544-thread-1) [    x:collection1] o.a.s.s.IndexSchema Loaded schema test/1.6 with uniqueid field id
   [junit4]   2> 1016287 INFO  (coreLoadExecutor-1544-thread-1) [    x:collection1] o.a.s.c.CoreContainer Creating SolrCore 'collection1' using configuration from instancedir /home/jenkins/jenkins-slave/workspace/Lucene-Solr-NightlyTests-7.x/checkout/solr/core/src/test-files/solr/collection1, trusted=true
   [junit4]   2> 1016287 INFO  (coreLoadExecutor-1544-thread-1) [    x:collection1] o.a.s.m.r.SolrJmxReporter JMX monitoring for 'solr.core.collection1' (registry 'solr.core.collection1') enabled at server: com.sun.jmx.mbeanserver.JmxMBeanServer@25a4d28c
   [junit4]   2> 1016287 INFO  (coreLoadExecutor-1544-thread-1) [    x:collection1] o.a.s.c.SolrCore solr.RecoveryStrategy.Builder
   [junit4]   2> 1016287 INFO  (coreLoadExecutor-1544-thread-1) [    x:collection1] o.a.s.c.SolrCore [[collection1] ] Opening new SolrCore at [/home/jenkins/jenkins-slave/workspace/Lucene-Solr-NightlyTests-7.x/checkout/solr/core/src/test-files/solr/collection1], dataDir=[/home/jenkins/jenkins-slave/workspace/Lucene-Solr-NightlyTests-7.x/checkout/solr/build/solr-core/test/J2/temp/solr.update.CdcrUpdateLogTest_E07FE81933F3A07F-001/init-core-data-001/]
   [junit4]   2> 1016672 INFO  (coreLoadExecutor-1544-thread-1) [    x:collection1] o.a.s.u.UpdateHandler Using UpdateLog implementation: org.apache.solr.update.CdcrUpdateLog
   [junit4]   2> 1016672 INFO  (coreLoadExecutor-1544-thread-1) [    x:collection1] o.a.s.u.UpdateLog Initializing UpdateLog: dataDir= defaultSyncLevel=FLUSH numRecordsToKeep=100 maxNumLogsToKeep=10 numVersionBuckets=65536
   [junit4]   2> 1016686 INFO  (coreLoadExecutor-1544-thread-1) [    x:collection1] o.a.s.u.CommitTracker Hard AutoCommit: disabled
   [junit4]   2> 1016686 INFO  (coreLoadExecutor-1544-thread-1) [    x:collection1] o.a.s.u.CommitTracker Soft AutoCommit: disabled
   [junit4]   2> 1016688 INFO  (coreLoadExecutor-1544-thread-1) [    x:collection1] o.a.s.u.RandomMergePolicy RandomMergePolicy wrapping class org.apache.lucene.index.TieredMergePolicy: [TieredMergePolicy: maxMergeAtOnce=32, maxMergeAtOnceExplicit=28, maxMergedSegmentMB=3.5986328125, floorSegmentMB=1.947265625, forceMergeDeletesPctAllowed=7.9713629932508425, segmentsPerTier=40.0, maxCFSSegmentSizeMB=8.796093022207999E12, noCFSRatio=0.859468641771325
   [junit4]   2> 1016760 INFO  (coreLoadExecutor-1544-thread-1) [    x:collection1] o.a.s.s.SolrIndexSearcher Opening [Searcher@53983702[collection1] main]
   [junit4]   2> 1016760 WARN  (coreLoadExecutor-1544-thread-1) [    x:collection1] o.a.s.r.ManagedResourceStorage Cannot write to config directory /home/jenkins/jenkins-slave/workspace/Lucene-Solr-NightlyTests-7.x/checkout/solr/core/src/test-files/solr/collection1/conf; switching to use InMemory storage instead.
   [junit4]   2> 1016761 INFO  (coreLoadExecutor-1544-thread-1) [    x:collection1] o.a.s.h.ReplicationHandler Commits will be reserved for 10000ms.
   [junit4]   2> 1016762 INFO  (searcherExecutor-1545-thread-1-processing-x:collection1) [    x:collection1] o.a.s.c.SolrCore [collection1] Registered new searcher Searcher@53983702[collection1] main{ExitableDirectoryReader(UninvertingDirectoryReader(Uninverting(_0(7.2.0):C10) Uninverting(_1(7.2.0):C10) Uninverting(_2(7.2.0):C105) Uninverting(_3(7.2.0):C10)))}
   [junit4]   2> 1016887 INFO  (TEST-CdcrUpdateLogTest.testRemoveOldLogs-seed#[E07FE81933F3A07F]) [    ] o.a.s.u.p.LogUpdateProcessorFactory [collection1]  webapp=null path=null params={versions=true&wt=json&indent=true}{add=[135 (1584143316732084224)]} 0 110
   [junit4]   2> 1016887 INFO  (TEST-CdcrUpdateLogTest.testRemoveOldLogs-seed#[E07FE81933F3A07F]) [    ] o.a.s.u.p.LogUpdateProcessorFactory [collection1]  webapp=null path=null params={versions=true&wt=json&indent=true}{add=[136 (1584143316848476160)]} 0 0
   [junit4]   2> 1016887 INFO  (TEST-CdcrUpdateLogTest.testRemoveOldLogs-seed#[E07FE81933F3A07F]) [    ] o.a.s.u.p.LogUpdateProcessorFactory [collection1]  webapp=null path=null params={versions=true&wt=json&indent=true}{add=[137 (1584143316848476161)]} 0 0
   [junit4]   2> 1016887 INFO  (TEST-CdcrUpdateLogTest.testRemoveOldLogs-seed#[E07FE81933F3A07F]) [    ] o.a.s.u.p.LogUpdateProcessorFactory [collection1]  webapp=null path=null params={versions=true&wt=json&indent=true}{add=[138 (1584143316848476162)]} 0 0
   [junit4]   2> 1016887 INFO  (TEST-CdcrUpdateLogTest.testRemoveOldLogs-seed#[E07FE81933F3A07F]) [    ] o.a.s.u.p.LogUpdateProcessorFactory [collection1]  webapp=null path=null params={versions=true&wt=json&indent=true}{add=[139 (1584143316848476163)]} 0 0
   [junit4]   2> 1016888 INFO  (TEST-CdcrUpdateLogTest.testRemoveOldLogs-seed#[E07FE81933F3A07F]) [    ] o.a.s.u.p.LogUpdateProcessorFactory [collection1]  webapp=null path=null params={versions=true&wt=json&indent=true}{add=[140 (1584143316849524736)]} 0 0
   [junit4]   2> 1016888 INFO  (TEST-CdcrUpdateLogTest.testRemoveOldLogs-seed#[E07FE81933F3A07F]) [    ] o.a.s.u.p.LogUpdateProcessorFactory [collection1]  webapp=null path=null params={versions=true&wt=json&indent=true}{add=[141 (1584143316849524737)]} 0 0
   [junit4]   2> 1016888 INFO  (TEST-CdcrUpdateLogTest.testRemoveOldLogs-seed#[E07FE81933F3A07F]) [    ] o.a.s.u.p.LogUpdateProcessorFactory [collection1]  webapp=null path=null params={versions=true&wt=json&indent=true}{add=[142 (1584143316849524738)]} 0 0
   [junit4]   2> 1016888 INFO  (TEST-CdcrUpdateLogTest.testRemoveOldLogs-seed#[E07FE81933F3A07F]) [    ] o.a.s.u.p.LogUpdateProcessorFactory [collection1]  webapp=null path=null params={versions=true&wt=json&indent=true}{add=[143 (1584143316849524739)]} 0 0
   [junit4]   2> 1016888 INFO  (TEST-CdcrUpdateLogTest.testRemoveOldLogs-seed#[E07FE81933F3A07F]) [    ] o.a.s.u.p.LogUpdateProcessorFactory [collection1]  webapp=null path=null params={versions=true&wt=json&indent=true}{add=[144 (1584143316849524740)]} 0 0
   [junit4]   2> 1016888 INFO  (TEST-CdcrUpdateLogTest.testRemoveOldLogs-seed#[E07FE81933F3A07F]) [    ] o.a.s.u.p.LogUpdateProcessorFactory [collection1]  webapp=null path=null params={versions=true&wt=json&indent=true}{add=[145 (1584143316849524741)]} 0 0
   [junit4]   2> 1016902 INFO  (TEST-CdcrUpdateLogTest.testRemoveOldLogs-seed#[E07FE81933F3A07F]) [    ] o.a.s.u.p.LogUpdateProcessorFactory [collection1]  webapp=null path=null params={versions=true&wt=json&indent=true}{add=[146 (1584143316864204800)]} 0 0
   [junit4]   2> 1016902 INFO  (TEST-CdcrUpdateLogTest.testRemoveOldLogs-seed#[E07FE81933F3A07F]) [    ] o.a.s.u.p.LogUpdateProcessorFactory [collection1]  webapp=null path=null params={versions=true&wt=json&indent=true}{add=[147 (1584143316864204801)]} 0 0
   [junit4]   2> 1016902 INFO  (TEST-CdcrUpdateLogTest.testRemoveOldLogs-seed#[E07FE81933F3A07F]) [    ] o.a.s.u.p.LogUpdateProcessorFactory [collection1]  webapp=null path=null params={versions=true&wt=json&indent=true}{add=[148 (1584143316864204802)]} 0 0
   [junit4]   2> 1016903 INFO  (TEST-CdcrUpdateLogTest.testRemoveOldLogs-seed#[E07FE81933F3A07F]) [    ] o.a.s.u.p.LogUpdateProcessorFactory [collection1]  webapp=null path=null params={versions=true&wt=json&indent=true}{add=[149 (1584143316864204803)]} 0 0
   [junit4]   2> 1016903 INFO  (TEST-CdcrUpdateLogTest.testRemoveOldLogs-seed#[E07FE81933F3A07F]) [    ] o.a.s.u.p.LogUpdateProcessorFactory [collection1]  webapp=null path=null params={versions=true&wt=json&indent=true}{add=[150 (1584143316865253376)]} 0 0
   [junit4]   2> 1016903 INFO  (TEST-CdcrUpdateLogTest.testRemoveOldLogs-seed#[E07FE81933F3A07F]) [    ] o.a.s.u.p.LogUpdateProcessorFactory [collection1]  webapp=null path=null params={versions=true&wt=json&indent=true}{add=[151 (1584143316865253377)]} 0 0
   [junit4]   2> 1016903 INFO  (TEST-CdcrUpdateLogTest.testRemoveOldLogs-seed#[E07FE81933F3A07F]) [    ] o.a.s.u.p.LogUpdateProcessorFactory [collection1]  webapp=null path=null params={versions=true&wt=json&indent=true}{add=[152 (1584143316865253378)]} 0 0
   [junit4]   2> 1016903 INFO  (TEST-CdcrUpdateLogTest.testRemoveOldLogs-seed#[E07FE81933F3A07F]) [    ] o.a.s.u.p.LogUpdateProcessorFactory [collection1]  webapp=null path=null params={versions=true&wt=json&indent=true}{add=[153 (1584143316865253379)]} 0 0
   [junit4]   2> 1016903 INFO  (TEST-CdcrUpdateLogTest.testRemoveOldLogs-seed#[E07FE81933F3A07F]) [    ] o.a.s.u.p.LogUpdateProcessorFactory [collection1]  webapp=null path=null params={versions=true&wt=json&indent=true}{add=[154 (1584143316865253380)]} 0 0
   [junit4]   2> 1016903 INFO  (TEST-CdcrUpdateLogTest.testRemoveOldLogs-seed#[E07FE81933F3A07F]) [    ] o.a.s.u.p.LogUpdateProcessorFactory [collection1]  webapp=null path=null params={versions=true&wt=json&indent=true}{add=[155 (1584143316865253381)]} 0 0
   [junit4]   2> 1016904 INFO  (TEST-CdcrUpdateLogTest.testRemoveOldLogs-seed#[E07FE81933F3A07F]) [    ] o.a.s.u.p.LogUpdateProcessorFactory [collection1]  webapp=null path=null params={versions=true&wt=json&indent=true}{add=[156 (158

[...truncated too long message...]

  [junit4]   2> 5246310 INFO  (SUITE-TestLazyCores-seed#[E07FE81933F3A07F]-worker) [    x:badConfig1] o.a.s.SolrTestCaseJ4 ###deleteCore
   [junit4]   2> 5246310 INFO  (SUITE-TestLazyCores-seed#[E07FE81933F3A07F]-worker) [    x:badConfig1] o.a.s.c.CoreContainer Shutting down CoreContainer instance=1263979190
   [junit4]   2> 5246310 INFO  (SUITE-TestLazyCores-seed#[E07FE81933F3A07F]-worker) [    x:badConfig1] o.a.s.m.SolrMetricManager Closing metric reporters for registry=solr.node, tag=null
   [junit4]   2> 5246310 INFO  (SUITE-TestLazyCores-seed#[E07FE81933F3A07F]-worker) [    x:badConfig1] o.a.s.m.SolrMetricManager Closing metric reporters for registry=solr.jvm, tag=null
   [junit4]   2> 5246310 INFO  (SUITE-TestLazyCores-seed#[E07FE81933F3A07F]-worker) [    x:badConfig1] o.a.s.m.SolrMetricManager Closing metric reporters for registry=solr.jetty, tag=null
   [junit4]   2> NOTE: leaving temporary files on disk at: /home/jenkins/jenkins-slave/workspace/Lucene-Solr-NightlyTests-7.x/checkout/solr/build/solr-core/test/J1/temp/solr.core.TestLazyCores_E07FE81933F3A07F-001
   [junit4]   2> Nov 15, 2017 3:50:23 PM com.carrotsearch.randomizedtesting.ThreadLeakControl checkThreadLeaks
   [junit4]   2> WARNING: Will linger awaiting termination of 1 leaked thread(s).
   [junit4]   2> Nov 15, 2017 3:50:43 PM com.carrotsearch.randomizedtesting.ThreadLeakControl checkThreadLeaks
   [junit4]   2> SEVERE: 1 thread leaked from SUITE scope at org.apache.solr.core.TestLazyCores:
   [junit4]   2>    1) Thread[id=31830, name=searcherExecutor-3112-thread-1, state=WAITING, group=TGRP-TestLazyCores]
   [junit4]   2>         at sun.misc.Unsafe.park(Native Method)
   [junit4]   2>         at java.util.concurrent.locks.LockSupport.park(LockSupport.java:175)
   [junit4]   2>         at java.util.concurrent.locks.AbstractQueuedSynchronizer$ConditionObject.await(AbstractQueuedSynchronizer.java:2039)
   [junit4]   2>         at java.util.concurrent.LinkedBlockingQueue.take(LinkedBlockingQueue.java:442)
   [junit4]   2>         at java.util.concurrent.ThreadPoolExecutor.getTask(ThreadPoolExecutor.java:1074)
   [junit4]   2>         at java.util.concurrent.ThreadPoolExecutor.runWorker(ThreadPoolExecutor.java:1134)
   [junit4]   2>         at java.util.concurrent.ThreadPoolExecutor$Worker.run(ThreadPoolExecutor.java:624)
   [junit4]   2>         at java.lang.Thread.run(Thread.java:748)
   [junit4]   2> Nov 15, 2017 3:50:43 PM com.carrotsearch.randomizedtesting.ThreadLeakControl tryToInterruptAll
   [junit4]   2> INFO: Starting to interrupt leaked threads:
   [junit4]   2>    1) Thread[id=31830, name=searcherExecutor-3112-thread-1, state=WAITING, group=TGRP-TestLazyCores]
   [junit4]   2> Nov 15, 2017 3:50:46 PM com.carrotsearch.randomizedtesting.ThreadLeakControl tryToInterruptAll
   [junit4]   2> SEVERE: There are still zombie threads that couldn't be terminated:
   [junit4]   2>    1) Thread[id=31830, name=searcherExecutor-3112-thread-1, state=WAITING, group=TGRP-TestLazyCores]
   [junit4]   2>         at sun.misc.Unsafe.park(Native Method)
   [junit4]   2>         at java.util.concurrent.locks.LockSupport.park(LockSupport.java:175)
   [junit4]   2>         at java.util.concurrent.locks.AbstractQueuedSynchronizer$ConditionObject.await(AbstractQueuedSynchronizer.java:2039)
   [junit4]   2>         at java.util.concurrent.LinkedBlockingQueue.take(LinkedBlockingQueue.java:442)
   [junit4]   2>         at java.util.concurrent.ThreadPoolExecutor.getTask(ThreadPoolExecutor.java:1074)
   [junit4]   2>         at java.util.concurrent.ThreadPoolExecutor.runWorker(ThreadPoolExecutor.java:1134)
   [junit4]   2>         at java.util.concurrent.ThreadPoolExecutor$Worker.run(ThreadPoolExecutor.java:624)
   [junit4]   2>         at java.lang.Thread.run(Thread.java:748)
   [junit4]   2> NOTE: test params are: codec=CheapBastard, sim=RandomSimilarity(queryNorm=true): {}, locale=bg, timezone=America/Metlakatla
   [junit4]   2> NOTE: Linux 4.4.0-83-generic amd64/Oracle Corporation 1.8.0_152 (64-bit)/cpus=4,threads=2,free=234019688,total=532152320
   [junit4]   2> NOTE: All tests run in this JVM: [TestCloudRecovery, TestQuerySenderNoQuery, RequestLoggingTest, ZkStateReaderTest, TestZkAclsWithHadoopAuth, TestLuceneMatchVersion, MultiThreadedOCPTest, TestAtomicUpdateErrorCases, TermVectorComponentDistributedTest, DistributedVersionInfoTest, SuggestComponentContextFilterQueryTest, TestJettySolrRunner, TestSearcherReuse, HLLSerializationTest, TestNumericTokenStream, TestConfigReload, TestAddFieldRealTimeGet, TestFastWriter, CircularListTest, HighlighterConfigTest, TestXmlQParser, TestDocSet, RequestHandlersTest, TestBlendedInfixSuggestions, TestRetrieveFieldsOptimizer, TestTrackingShardHandlerFactory, MetricUtilsTest, TestSQLHandlerNonCloud, SampleTest, RegexBytesRefFilterTest, DistributedFacetPivotWhiteBoxTest, DirectUpdateHandlerTest, TestManagedSchema, TestMacros, CollectionTooManyReplicasTest, TestStressReorder, TriggerIntegrationTest, TestInitQParser, LeaderFailureAfterFreshStartTest, MergeStrategyTest, DOMUtilTest, TestCollationField, TestMaxTokenLenTokenizer, TestAuthenticationFramework, TestCursorMarkWithoutUniqueKey, TestFieldCacheWithThreads, OverriddenZkACLAndCredentialsProvidersTest, SuggesterFSTTest, WrapperMergePolicyFactoryTest, OverseerRolesTest, TestSerializedLuceneMatchVersion, SynonymTokenizerTest, AnalysisErrorHandlingTest, CollectionsAPIDistributedZkTest, ConvertedLegacyTest, SpellingQueryConverterTest, TestMissingGroups, TestIntervalFaceting, SearchRateTriggerTest, SolrCLIZkUtilsTest, PrimUtilsTest, TestRemoteStreaming, TestCloudJSONFacetJoinDomain, SolrRequestParserTest, SolrSlf4jReporterTest, TestMultiValuedNumericRangeQuery, LukeRequestHandlerTest, TestOmitPositions, ShowFileRequestHandlerTest, CdcrBootstrapTest, MoreLikeThisHandlerTest, HdfsBasicDistributedZkTest, TestLazyCores]
   [junit4]   2> NOTE: download the large Jenkins line-docs file by running 'ant get-jenkins-line-docs' in the lucene directory.
   [junit4]   2> NOTE: reproduce with: ant test  -Dtestcase=TestLazyCores -Dtests.seed=E07FE81933F3A07F -Dtests.multiplier=2 -Dtests.nightly=true -Dtests.slow=true -Dtests.linedocsfile=/home/jenkins/jenkins-slave/workspace/Lucene-Solr-NightlyTests-7.x/test-data/enwiki.random.lines.txt -Dtests.locale=bg -Dtests.timezone=America/Metlakatla -Dtests.asserts=true -Dtests.file.encoding=US-ASCII
   [junit4] ERROR   0.00s J1 | TestLazyCores (suite) <<<
   [junit4]    > Throwable #1: com.carrotsearch.randomizedtesting.ThreadLeakError: 1 thread leaked from SUITE scope at org.apache.solr.core.TestLazyCores:
   [junit4]    >    1) Thread[id=31830, name=searcherExecutor-3112-thread-1, state=WAITING, group=TGRP-TestLazyCores]
   [junit4]    >         at sun.misc.Unsafe.park(Native Method)
   [junit4]    >         at java.util.concurrent.locks.LockSupport.park(LockSupport.java:175)
   [junit4]    >         at java.util.concurrent.locks.AbstractQueuedSynchronizer$ConditionObject.await(AbstractQueuedSynchronizer.java:2039)
   [junit4]    >         at java.util.concurrent.LinkedBlockingQueue.take(LinkedBlockingQueue.java:442)
   [junit4]    >         at java.util.concurrent.ThreadPoolExecutor.getTask(ThreadPoolExecutor.java:1074)
   [junit4]    >         at java.util.concurrent.ThreadPoolExecutor.runWorker(ThreadPoolExecutor.java:1134)
   [junit4]    >         at java.util.concurrent.ThreadPoolExecutor$Worker.run(ThreadPoolExecutor.java:624)
   [junit4]    >         at java.lang.Thread.run(Thread.java:748)
   [junit4]    > at __randomizedtesting.SeedInfo.seed([E07FE81933F3A07F]:0)Throwable #2: com.carrotsearch.randomizedtesting.ThreadLeakError: There are still zombie threads that couldn't be terminated:
   [junit4]    >    1) Thread[id=31830, name=searcherExecutor-3112-thread-1, state=WAITING, group=TGRP-TestLazyCores]
   [junit4]    >         at sun.misc.Unsafe.park(Native Method)
   [junit4]    >         at java.util.concurrent.locks.LockSupport.park(LockSupport.java:175)
   [junit4]    >         at java.util.concurrent.locks.AbstractQueuedSynchronizer$ConditionObject.await(AbstractQueuedSynchronizer.java:2039)
   [junit4]    >         at java.util.concurrent.LinkedBlockingQueue.take(LinkedBlockingQueue.java:442)
   [junit4]    >         at java.util.concurrent.ThreadPoolExecutor.getTask(ThreadPoolExecutor.java:1074)
   [junit4]    >         at java.util.concurrent.ThreadPoolExecutor.runWorker(ThreadPoolExecutor.java:1134)
   [junit4]    >         at java.util.concurrent.ThreadPoolExecutor$Worker.run(ThreadPoolExecutor.java:624)
   [junit4]    >         at java.lang.Thread.run(Thread.java:748)
   [junit4]    > at __randomizedtesting.SeedInfo.seed([E07FE81933F3A07F]:0)
   [junit4] Completed [265/748 (3!)] on J1 in 40.47s, 9 tests, 3 errors <<< FAILURES!

[...truncated 1422 lines...]
   [junit4] JVM J2: stdout was not empty, see: /home/jenkins/jenkins-slave/workspace/Lucene-Solr-NightlyTests-7.x/checkout/solr/build/solr-core/test/temp/junit4-J2-20171115_142244_1167157284968867563765.sysout
   [junit4] >>> JVM J2 emitted unexpected output (verbatim) ----
   [junit4] java.lang.OutOfMemoryError: Java heap space
   [junit4] Dumping heap to /home/jenkins/jenkins-slave/workspace/Lucene-Solr-NightlyTests-7.x/checkout/heapdumps/java_pid28685.hprof ...
   [junit4] Heap dump file created [730901583 bytes in 20.226 secs]
   [junit4] <<< JVM J2: EOF ----

[...truncated 8502 lines...]
BUILD FAILED
/home/jenkins/jenkins-slave/workspace/Lucene-Solr-NightlyTests-7.x/checkout/build.xml:843: The following error occurred while executing this line:
/home/jenkins/jenkins-slave/workspace/Lucene-Solr-NightlyTests-7.x/checkout/build.xml:787: Some of the tests produced a heap dump, but did not fail. Maybe a suppressed OutOfMemoryError? Dumps created:
* java_pid28685.hprof

Total time: 760 minutes 23 seconds
Build step 'Invoke Ant' marked build as failure
Archiving artifacts
Recording test results
Email was triggered for: Failure - Any
Sending email for trigger: Failure - Any


---------------------------------------------------------------------
To unsubscribe, e-mail: [hidden email]
For additional commands, e-mail: [hidden email]
Reply | Threaded
Open this post in threaded view
|

[JENKINS] Lucene-Solr-NightlyTests-7.x - Build # 83 - Still unstable

Apache Jenkins Server-2
Build: https://builds.apache.org/job/Lucene-Solr-NightlyTests-7.x/83/

7 tests failed.
FAILED:  org.apache.lucene.spatial3d.TestGeo3DPoint.testRandomBig

Error Message:
Test abandoned because suite timeout was reached.

Stack Trace:
java.lang.Exception: Test abandoned because suite timeout was reached.
        at __randomizedtesting.SeedInfo.seed([3E235A0EA737AC2E]:0)


FAILED:  junit.framework.TestSuite.org.apache.lucene.spatial3d.TestGeo3DPoint

Error Message:
Suite timeout exceeded (>= 7200000 msec).

Stack Trace:
java.lang.Exception: Suite timeout exceeded (>= 7200000 msec).
        at __randomizedtesting.SeedInfo.seed([3E235A0EA737AC2E]:0)


FAILED:  org.apache.solr.handler.dataimport.TestContentStreamDataSource.testCommitWithin

Error Message:
expected:<0> but was:<2>

Stack Trace:
java.lang.AssertionError: expected:<0> but was:<2>
        at __randomizedtesting.SeedInfo.seed([EC8D07AEAB38D403:565F68D628163A16]:0)
        at org.junit.Assert.fail(Assert.java:93)
        at org.junit.Assert.failNotEquals(Assert.java:647)
        at org.junit.Assert.assertEquals(Assert.java:128)
        at org.junit.Assert.assertEquals(Assert.java:472)
        at org.junit.Assert.assertEquals(Assert.java:456)
        at org.apache.solr.handler.dataimport.TestContentStreamDataSource.testCommitWithin(TestContentStreamDataSource.java:98)
        at sun.reflect.NativeMethodAccessorImpl.invoke0(Native Method)
        at sun.reflect.NativeMethodAccessorImpl.invoke(NativeMethodAccessorImpl.java:62)
        at sun.reflect.DelegatingMethodAccessorImpl.invoke(DelegatingMethodAccessorImpl.java:43)
        at java.lang.reflect.Method.invoke(Method.java:498)
        at com.carrotsearch.randomizedtesting.RandomizedRunner.invoke(RandomizedRunner.java:1737)
        at com.carrotsearch.randomizedtesting.RandomizedRunner$8.evaluate(RandomizedRunner.java:934)
        at com.carrotsearch.randomizedtesting.RandomizedRunner$9.evaluate(RandomizedRunner.java:970)
        at com.carrotsearch.randomizedtesting.RandomizedRunner$10.evaluate(RandomizedRunner.java:984)
        at com.carrotsearch.randomizedtesting.rules.SystemPropertiesRestoreRule$1.evaluate(SystemPropertiesRestoreRule.java:57)
        at org.apache.lucene.util.TestRuleSetupTeardownChained$1.evaluate(TestRuleSetupTeardownChained.java:49)
        at org.apache.lucene.util.AbstractBeforeAfterRule$1.evaluate(AbstractBeforeAfterRule.java:45)
        at org.apache.lucene.util.TestRuleThreadAndTestName$1.evaluate(TestRuleThreadAndTestName.java:48)
        at org.apache.lucene.util.TestRuleIgnoreAfterMaxFailures$1.evaluate(TestRuleIgnoreAfterMaxFailures.java:64)
        at org.apache.lucene.util.TestRuleMarkFailure$1.evaluate(TestRuleMarkFailure.java:47)
        at com.carrotsearch.randomizedtesting.rules.StatementAdapter.evaluate(StatementAdapter.java:36)
        at com.carrotsearch.randomizedtesting.ThreadLeakControl$StatementRunner.run(ThreadLeakControl.java:368)
        at com.carrotsearch.randomizedtesting.ThreadLeakControl.forkTimeoutingTask(ThreadLeakControl.java:817)
        at com.carrotsearch.randomizedtesting.ThreadLeakControl$3.evaluate(ThreadLeakControl.java:468)
        at com.carrotsearch.randomizedtesting.RandomizedRunner.runSingleTest(RandomizedRunner.java:943)
        at com.carrotsearch.randomizedtesting.RandomizedRunner$5.evaluate(RandomizedRunner.java:829)
        at com.carrotsearch.randomizedtesting.RandomizedRunner$6.evaluate(RandomizedRunner.java:879)
        at com.carrotsearch.randomizedtesting.RandomizedRunner$7.evaluate(RandomizedRunner.java:890)
        at com.carrotsearch.randomizedtesting.rules.StatementAdapter.evaluate(StatementAdapter.java:36)
        at com.carrotsearch.randomizedtesting.rules.SystemPropertiesRestoreRule$1.evaluate(SystemPropertiesRestoreRule.java:57)
        at org.apache.lucene.util.AbstractBeforeAfterRule$1.evaluate(AbstractBeforeAfterRule.java:45)
        at com.carrotsearch.randomizedtesting.rules.StatementAdapter.evaluate(StatementAdapter.java:36)
        at org.apache.lucene.util.TestRuleStoreClassName$1.evaluate(TestRuleStoreClassName.java:41)
        at com.carrotsearch.randomizedtesting.rules.NoShadowingOrOverridesOnMethodsRule$1.evaluate(NoShadowingOrOverridesOnMethodsRule.java:40)
        at com.carrotsearch.randomizedtesting.rules.NoShadowingOrOverridesOnMethodsRule$1.evaluate(NoShadowingOrOverridesOnMethodsRule.java:40)
        at com.carrotsearch.randomizedtesting.rules.StatementAdapter.evaluate(StatementAdapter.java:36)
        at com.carrotsearch.randomizedtesting.rules.StatementAdapter.evaluate(StatementAdapter.java:36)
        at com.carrotsearch.randomizedtesting.rules.StatementAdapter.evaluate(StatementAdapter.java:36)
        at org.apache.lucene.util.TestRuleAssertionsRequired$1.evaluate(TestRuleAssertionsRequired.java:53)
        at org.apache.lucene.util.TestRuleMarkFailure$1.evaluate(TestRuleMarkFailure.java:47)
        at org.apache.lucene.util.TestRuleIgnoreAfterMaxFailures$1.evaluate(TestRuleIgnoreAfterMaxFailures.java:64)
        at org.apache.lucene.util.TestRuleIgnoreTestSuites$1.evaluate(TestRuleIgnoreTestSuites.java:54)
        at com.carrotsearch.randomizedtesting.rules.StatementAdapter.evaluate(StatementAdapter.java:36)
        at com.carrotsearch.randomizedtesting.ThreadLeakControl$StatementRunner.run(ThreadLeakControl.java:368)
        at java.lang.Thread.run(Thread.java:748)


FAILED:  org.apache.solr.TestDistributedSearch.test

Error Message:
Expected to find shardAddress in the up shard info: {error=org.apache.solr.client.solrj.SolrServerException: Time allowed to handle this request exceeded,trace=org.apache.solr.client.solrj.SolrServerException: Time allowed to handle this request exceeded  at org.apache.solr.client.solrj.impl.LBHttpSolrClient.request(LBHttpSolrClient.java:460)  at org.apache.solr.handler.component.HttpShardHandlerFactory.makeLoadBalancedRequest(HttpShardHandlerFactory.java:273)  at org.apache.solr.handler.component.HttpShardHandler.lambda$submit$0(HttpShardHandler.java:175)  at java.util.concurrent.FutureTask.run(FutureTask.java:266)  at java.util.concurrent.Executors$RunnableAdapter.call(Executors.java:511)  at java.util.concurrent.FutureTask.run(FutureTask.java:266)  at com.codahale.metrics.InstrumentedExecutorService$InstrumentedRunnable.run(InstrumentedExecutorService.java:176)  at org.apache.solr.common.util.ExecutorUtil$MDCAwareThreadPoolExecutor.lambda$execute$0(ExecutorUtil.java:188)  at java.util.concurrent.ThreadPoolExecutor.runWorker(ThreadPoolExecutor.java:1149)  at java.util.concurrent.ThreadPoolExecutor$Worker.run(ThreadPoolExecutor.java:624)  at java.lang.Thread.run(Thread.java:748) ,time=18}

Stack Trace:
java.lang.AssertionError: Expected to find shardAddress in the up shard info: {error=org.apache.solr.client.solrj.SolrServerException: Time allowed to handle this request exceeded,trace=org.apache.solr.client.solrj.SolrServerException: Time allowed to handle this request exceeded
        at org.apache.solr.client.solrj.impl.LBHttpSolrClient.request(LBHttpSolrClient.java:460)
        at org.apache.solr.handler.component.HttpShardHandlerFactory.makeLoadBalancedRequest(HttpShardHandlerFactory.java:273)
        at org.apache.solr.handler.component.HttpShardHandler.lambda$submit$0(HttpShardHandler.java:175)
        at java.util.concurrent.FutureTask.run(FutureTask.java:266)
        at java.util.concurrent.Executors$RunnableAdapter.call(Executors.java:511)
        at java.util.concurrent.FutureTask.run(FutureTask.java:266)
        at com.codahale.metrics.InstrumentedExecutorService$InstrumentedRunnable.run(InstrumentedExecutorService.java:176)
        at org.apache.solr.common.util.ExecutorUtil$MDCAwareThreadPoolExecutor.lambda$execute$0(ExecutorUtil.java:188)
        at java.util.concurrent.ThreadPoolExecutor.runWorker(ThreadPoolExecutor.java:1149)
        at java.util.concurrent.ThreadPoolExecutor$Worker.run(ThreadPoolExecutor.java:624)
        at java.lang.Thread.run(Thread.java:748)
,time=18}
        at __randomizedtesting.SeedInfo.seed([F8F95484A142CDA5:70AD6B5E0FBEA05D]:0)
        at org.junit.Assert.fail(Assert.java:93)
        at org.junit.Assert.assertTrue(Assert.java:43)
        at org.apache.solr.TestDistributedSearch.comparePartialResponses(TestDistributedSearch.java:1191)
        at org.apache.solr.TestDistributedSearch.queryPartialResults(TestDistributedSearch.java:1132)
        at org.apache.solr.TestDistributedSearch.test(TestDistributedSearch.java:992)
        at sun.reflect.NativeMethodAccessorImpl.invoke0(Native Method)
        at sun.reflect.NativeMethodAccessorImpl.invoke(NativeMethodAccessorImpl.java:62)
        at sun.reflect.DelegatingMethodAccessorImpl.invoke(DelegatingMethodAccessorImpl.java:43)
        at java.lang.reflect.Method.invoke(Method.java:498)
        at com.carrotsearch.randomizedtesting.RandomizedRunner.invoke(RandomizedRunner.java:1737)
        at com.carrotsearch.randomizedtesting.RandomizedRunner$8.evaluate(RandomizedRunner.java:934)
        at com.carrotsearch.randomizedtesting.RandomizedRunner$9.evaluate(RandomizedRunner.java:970)
        at com.carrotsearch.randomizedtesting.RandomizedRunner$10.evaluate(RandomizedRunner.java:984)
        at org.apache.solr.BaseDistributedSearchTestCase$ShardsRepeatRule$ShardsRepeatStatement.callStatement(BaseDistributedSearchTestCase.java:1019)
        at org.apache.solr.BaseDistributedSearchTestCase$ShardsRepeatRule$ShardsStatement.evaluate(BaseDistributedSearchTestCase.java:968)
        at com.carrotsearch.randomizedtesting.rules.SystemPropertiesRestoreRule$1.evaluate(SystemPropertiesRestoreRule.java:57)
        at org.apache.lucene.util.TestRuleSetupTeardownChained$1.evaluate(TestRuleSetupTeardownChained.java:49)
        at org.apache.lucene.util.AbstractBeforeAfterRule$1.evaluate(AbstractBeforeAfterRule.java:45)
        at org.apache.lucene.util.TestRuleThreadAndTestName$1.evaluate(TestRuleThreadAndTestName.java:48)
        at org.apache.lucene.util.TestRuleIgnoreAfterMaxFailures$1.evaluate(TestRuleIgnoreAfterMaxFailures.java:64)
        at org.apache.lucene.util.TestRuleMarkFailure$1.evaluate(TestRuleMarkFailure.java:47)
        at com.carrotsearch.randomizedtesting.rules.StatementAdapter.evaluate(StatementAdapter.java:36)
        at com.carrotsearch.randomizedtesting.ThreadLeakControl$StatementRunner.run(ThreadLeakControl.java:368)
        at com.carrotsearch.randomizedtesting.ThreadLeakControl.forkTimeoutingTask(ThreadLeakControl.java:817)
        at com.carrotsearch.randomizedtesting.ThreadLeakControl$3.evaluate(ThreadLeakControl.java:468)
        at com.carrotsearch.randomizedtesting.RandomizedRunner.runSingleTest(RandomizedRunner.java:943)
        at com.carrotsearch.randomizedtesting.RandomizedRunner$5.evaluate(RandomizedRunner.java:829)
        at com.carrotsearch.randomizedtesting.RandomizedRunner$6.evaluate(RandomizedRunner.java:879)
        at com.carrotsearch.randomizedtesting.RandomizedRunner$7.evaluate(RandomizedRunner.java:890)
        at com.carrotsearch.randomizedtesting.rules.StatementAdapter.evaluate(StatementAdapter.java:36)
        at com.carrotsearch.randomizedtesting.rules.SystemPropertiesRestoreRule$1.evaluate(SystemPropertiesRestoreRule.java:57)
        at org.apache.lucene.util.AbstractBeforeAfterRule$1.evaluate(AbstractBeforeAfterRule.java:45)
        at com.carrotsearch.randomizedtesting.rules.StatementAdapter.evaluate(StatementAdapter.java:36)
        at org.apache.lucene.util.TestRuleStoreClassName$1.evaluate(TestRuleStoreClassName.java:41)
        at com.carrotsearch.randomizedtesting.rules.NoShadowingOrOverridesOnMethodsRule$1.evaluate(NoShadowingOrOverridesOnMethodsRule.java:40)
        at com.carrotsearch.randomizedtesting.rules.NoShadowingOrOverridesOnMethodsRule$1.evaluate(NoShadowingOrOverridesOnMethodsRule.java:40)
        at com.carrotsearch.randomizedtesting.rules.StatementAdapter.evaluate(StatementAdapter.java:36)
        at com.carrotsearch.randomizedtesting.rules.StatementAdapter.evaluate(StatementAdapter.java:36)
        at com.carrotsearch.randomizedtesting.rules.StatementAdapter.evaluate(StatementAdapter.java:36)
        at org.apache.lucene.util.TestRuleAssertionsRequired$1.evaluate(TestRuleAssertionsRequired.java:53)
        at org.apache.lucene.util.TestRuleMarkFailure$1.evaluate(TestRuleMarkFailure.java:47)
        at org.apache.lucene.util.TestRuleIgnoreAfterMaxFailures$1.evaluate(TestRuleIgnoreAfterMaxFailures.java:64)
        at org.apache.lucene.util.TestRuleIgnoreTestSuites$1.evaluate(TestRuleIgnoreTestSuites.java:54)
        at com.carrotsearch.randomizedtesting.rules.StatementAdapter.evaluate(StatementAdapter.java:36)
        at com.carrotsearch.randomizedtesting.ThreadLeakControl$StatementRunner.run(ThreadLeakControl.java:368)
        at java.lang.Thread.run(Thread.java:748)


FAILED:  org.apache.solr.cloud.hdfs.HdfsBasicDistributedZk2Test.test

Error Message:
Timeout occured while waiting response from server at: http://127.0.0.1:43054/collection1

Stack Trace:
org.apache.solr.client.solrj.SolrServerException: Timeout occured while waiting response from server at: http://127.0.0.1:43054/collection1
        at __randomizedtesting.SeedInfo.seed([F8F95484A142CDA5:70AD6B5E0FBEA05D]:0)
        at org.apache.solr.client.solrj.impl.HttpSolrClient.executeMethod(HttpSolrClient.java:654)
        at org.apache.solr.client.solrj.impl.HttpSolrClient.request(HttpSolrClient.java:255)
        at org.apache.solr.client.solrj.impl.HttpSolrClient.request(HttpSolrClient.java:244)
        at org.apache.solr.client.solrj.impl.LBHttpSolrClient.doRequest(LBHttpSolrClient.java:483)
        at org.apache.solr.client.solrj.impl.LBHttpSolrClient.request(LBHttpSolrClient.java:413)
        at org.apache.solr.client.solrj.impl.CloudSolrClient.sendRequest(CloudSolrClient.java:1104)
        at org.apache.solr.client.solrj.impl.CloudSolrClient.requestWithRetryOnStaleState(CloudSolrClient.java:883)
        at org.apache.solr.client.solrj.impl.CloudSolrClient.request(CloudSolrClient.java:816)
        at org.apache.solr.client.solrj.SolrRequest.process(SolrRequest.java:194)
        at org.apache.solr.client.solrj.SolrClient.commit(SolrClient.java:484)
        at org.apache.solr.client.solrj.SolrClient.commit(SolrClient.java:463)
        at org.apache.solr.cloud.AbstractFullDistribZkTestBase.commit(AbstractFullDistribZkTestBase.java:1582)
        at org.apache.solr.cloud.BasicDistributedZk2Test.brindDownShardIndexSomeDocsAndRecover(BasicDistributedZk2Test.java:388)
        at org.apache.solr.cloud.BasicDistributedZk2Test.test(BasicDistributedZk2Test.java:108)
        at sun.reflect.NativeMethodAccessorImpl.invoke0(Native Method)
        at sun.reflect.NativeMethodAccessorImpl.invoke(NativeMethodAccessorImpl.java:62)
        at sun.reflect.DelegatingMethodAccessorImpl.invoke(DelegatingMethodAccessorImpl.java:43)
        at java.lang.reflect.Method.invoke(Method.java:498)
        at com.carrotsearch.randomizedtesting.RandomizedRunner.invoke(RandomizedRunner.java:1737)
        at com.carrotsearch.randomizedtesting.RandomizedRunner$8.evaluate(RandomizedRunner.java:934)
        at com.carrotsearch.randomizedtesting.RandomizedRunner$9.evaluate(RandomizedRunner.java:970)
        at com.carrotsearch.randomizedtesting.RandomizedRunner$10.evaluate(RandomizedRunner.java:984)
        at org.apache.solr.BaseDistributedSearchTestCase$ShardsRepeatRule$ShardsFixedStatement.callStatement(BaseDistributedSearchTestCase.java:993)
        at org.apache.solr.BaseDistributedSearchTestCase$ShardsRepeatRule$ShardsStatement.evaluate(BaseDistributedSearchTestCase.java:968)
        at com.carrotsearch.randomizedtesting.rules.SystemPropertiesRestoreRule$1.evaluate(SystemPropertiesRestoreRule.java:57)
        at org.apache.lucene.util.TestRuleSetupTeardownChained$1.evaluate(TestRuleSetupTeardownChained.java:49)
        at org.apache.lucene.util.AbstractBeforeAfterRule$1.evaluate(AbstractBeforeAfterRule.java:45)
        at org.apache.lucene.util.TestRuleThreadAndTestName$1.evaluate(TestRuleThreadAndTestName.java:48)
        at org.apache.lucene.util.TestRuleIgnoreAfterMaxFailures$1.evaluate(TestRuleIgnoreAfterMaxFailures.java:64)
        at org.apache.lucene.util.TestRuleMarkFailure$1.evaluate(TestRuleMarkFailure.java:47)
        at com.carrotsearch.randomizedtesting.rules.StatementAdapter.evaluate(StatementAdapter.java:36)
        at com.carrotsearch.randomizedtesting.ThreadLeakControl$StatementRunner.run(ThreadLeakControl.java:368)
        at com.carrotsearch.randomizedtesting.ThreadLeakControl.forkTimeoutingTask(ThreadLeakControl.java:817)
        at com.carrotsearch.randomizedtesting.ThreadLeakControl$3.evaluate(ThreadLeakControl.java:468)
        at com.carrotsearch.randomizedtesting.RandomizedRunner.runSingleTest(RandomizedRunner.java:943)
        at com.carrotsearch.randomizedtesting.RandomizedRunner$5.evaluate(RandomizedRunner.java:829)
        at com.carrotsearch.randomizedtesting.RandomizedRunner$6.evaluate(RandomizedRunner.java:879)
        at com.carrotsearch.randomizedtesting.RandomizedRunner$7.evaluate(RandomizedRunner.java:890)
        at com.carrotsearch.randomizedtesting.rules.StatementAdapter.evaluate(StatementAdapter.java:36)
        at com.carrotsearch.randomizedtesting.rules.SystemPropertiesRestoreRule$1.evaluate(SystemPropertiesRestoreRule.java:57)
        at org.apache.lucene.util.AbstractBeforeAfterRule$1.evaluate(AbstractBeforeAfterRule.java:45)
        at com.carrotsearch.randomizedtesting.rules.StatementAdapter.evaluate(StatementAdapter.java:36)
        at org.apache.lucene.util.TestRuleStoreClassName$1.evaluate(TestRuleStoreClassName.java:41)
        at com.carrotsearch.randomizedtesting.rules.NoShadowingOrOverridesOnMethodsRule$1.evaluate(NoShadowingOrOverridesOnMethodsRule.java:40)
        at com.carrotsearch.randomizedtesting.rules.NoShadowingOrOverridesOnMethodsRule$1.evaluate(NoShadowingOrOverridesOnMethodsRule.java:40)
        at com.carrotsearch.randomizedtesting.rules.StatementAdapter.evaluate(StatementAdapter.java:36)
        at com.carrotsearch.randomizedtesting.rules.StatementAdapter.evaluate(StatementAdapter.java:36)
        at com.carrotsearch.randomizedtesting.rules.StatementAdapter.evaluate(StatementAdapter.java:36)
        at org.apache.lucene.util.TestRuleAssertionsRequired$1.evaluate(TestRuleAssertionsRequired.java:53)
        at org.apache.lucene.util.TestRuleMarkFailure$1.evaluate(TestRuleMarkFailure.java:47)
        at org.apache.lucene.util.TestRuleIgnoreAfterMaxFailures$1.evaluate(TestRuleIgnoreAfterMaxFailures.java:64)
        at org.apache.lucene.util.TestRuleIgnoreTestSuites$1.evaluate(TestRuleIgnoreTestSuites.java:54)
        at com.carrotsearch.randomizedtesting.rules.StatementAdapter.evaluate(StatementAdapter.java:36)
        at com.carrotsearch.randomizedtesting.ThreadLeakControl$StatementRunner.run(ThreadLeakControl.java:368)
        at java.lang.Thread.run(Thread.java:748)
Caused by: java.net.SocketTimeoutException: Read timed out
        at java.net.SocketInputStream.socketRead0(Native Method)
        at java.net.SocketInputStream.socketRead(SocketInputStream.java:116)
        at java.net.SocketInputStream.read(SocketInputStream.java:171)
        at java.net.SocketInputStream.read(SocketInputStream.java:141)
        at org.apache.http.impl.io.SessionInputBufferImpl.streamRead(SessionInputBufferImpl.java:137)
        at org.apache.http.impl.io.SessionInputBufferImpl.fillBuffer(SessionInputBufferImpl.java:153)
        at org.apache.http.impl.io.SessionInputBufferImpl.readLine(SessionInputBufferImpl.java:282)
        at org.apache.http.impl.conn.DefaultHttpResponseParser.parseHead(DefaultHttpResponseParser.java:138)
        at org.apache.http.impl.conn.DefaultHttpResponseParser.parseHead(DefaultHttpResponseParser.java:56)
        at org.apache.http.impl.io.AbstractMessageParser.parse(AbstractMessageParser.java:259)
        at org.apache.http.impl.DefaultBHttpClientConnection.receiveResponseHeader(DefaultBHttpClientConnection.java:163)
        at org.apache.http.impl.conn.CPoolProxy.receiveResponseHeader(CPoolProxy.java:165)
        at org.apache.http.protocol.HttpRequestExecutor.doReceiveResponse(HttpRequestExecutor.java:273)
        at org.apache.http.protocol.HttpRequestExecutor.execute(HttpRequestExecutor.java:125)
        at org.apache.http.impl.execchain.MainClientExec.execute(MainClientExec.java:272)
        at org.apache.http.impl.execchain.ProtocolExec.execute(ProtocolExec.java:185)
        at org.apache.http.impl.execchain.RetryExec.execute(RetryExec.java:89)
        at org.apache.http.impl.execchain.RedirectExec.execute(RedirectExec.java:111)
        at org.apache.http.impl.client.InternalHttpClient.doExecute(InternalHttpClient.java:185)
        at org.apache.http.impl.client.CloseableHttpClient.execute(CloseableHttpClient.java:83)
        at org.apache.http.impl.client.CloseableHttpClient.execute(CloseableHttpClient.java:56)
        at org.apache.solr.client.solrj.impl.HttpSolrClient.executeMethod(HttpSolrClient.java:542)
        ... 54 more


FAILED:  org.apache.solr.handler.TestReplicationHandler.doTestIndexAndConfigReplication

Error Message:
Index: 0, Size: 0

Stack Trace:
java.lang.IndexOutOfBoundsException: Index: 0, Size: 0
        at __randomizedtesting.SeedInfo.seed([F8F95484A142CDA5:ECB10FD1824570BB]:0)
        at java.util.ArrayList.rangeCheck(ArrayList.java:657)
        at java.util.ArrayList.get(ArrayList.java:433)
        at org.apache.solr.handler.TestReplicationHandler.doTestIndexAndConfigReplication(TestReplicationHandler.java:561)
        at sun.reflect.NativeMethodAccessorImpl.invoke0(Native Method)
        at sun.reflect.NativeMethodAccessorImpl.invoke(NativeMethodAccessorImpl.java:62)
        at sun.reflect.DelegatingMethodAccessorImpl.invoke(DelegatingMethodAccessorImpl.java:43)
        at java.lang.reflect.Method.invoke(Method.java:498)
        at com.carrotsearch.randomizedtesting.RandomizedRunner.invoke(RandomizedRunner.java:1737)
        at com.carrotsearch.randomizedtesting.RandomizedRunner$8.evaluate(RandomizedRunner.java:934)
        at com.carrotsearch.randomizedtesting.RandomizedRunner$9.evaluate(RandomizedRunner.java:970)
        at com.carrotsearch.randomizedtesting.RandomizedRunner$10.evaluate(RandomizedRunner.java:984)
        at com.carrotsearch.randomizedtesting.rules.SystemPropertiesRestoreRule$1.evaluate(SystemPropertiesRestoreRule.java:57)
        at org.apache.lucene.util.TestRuleSetupTeardownChained$1.evaluate(TestRuleSetupTeardownChained.java:49)
        at org.apache.lucene.util.AbstractBeforeAfterRule$1.evaluate(AbstractBeforeAfterRule.java:45)
        at org.apache.lucene.util.TestRuleThreadAndTestName$1.evaluate(TestRuleThreadAndTestName.java:48)
        at org.apache.lucene.util.TestRuleIgnoreAfterMaxFailures$1.evaluate(TestRuleIgnoreAfterMaxFailures.java:64)
        at org.apache.lucene.util.TestRuleMarkFailure$1.evaluate(TestRuleMarkFailure.java:47)
        at com.carrotsearch.randomizedtesting.rules.StatementAdapter.evaluate(StatementAdapter.java:36)
        at com.carrotsearch.randomizedtesting.ThreadLeakControl$StatementRunner.run(ThreadLeakControl.java:368)
        at com.carrotsearch.randomizedtesting.ThreadLeakControl.forkTimeoutingTask(ThreadLeakControl.java:817)
        at com.carrotsearch.randomizedtesting.ThreadLeakControl$3.evaluate(ThreadLeakControl.java:468)
        at com.carrotsearch.randomizedtesting.RandomizedRunner.runSingleTest(RandomizedRunner.java:943)
        at com.carrotsearch.randomizedtesting.RandomizedRunner$5.evaluate(RandomizedRunner.java:829)
        at com.carrotsearch.randomizedtesting.RandomizedRunner$6.evaluate(RandomizedRunner.java:879)
        at com.carrotsearch.randomizedtesting.RandomizedRunner$7.evaluate(RandomizedRunner.java:890)
        at com.carrotsearch.randomizedtesting.rules.StatementAdapter.evaluate(StatementAdapter.java:36)
        at com.carrotsearch.randomizedtesting.rules.SystemPropertiesRestoreRule$1.evaluate(SystemPropertiesRestoreRule.java:57)
        at org.apache.lucene.util.AbstractBeforeAfterRule$1.evaluate(AbstractBeforeAfterRule.java:45)
        at com.carrotsearch.randomizedtesting.rules.StatementAdapter.evaluate(StatementAdapter.java:36)
        at org.apache.lucene.util.TestRuleStoreClassName$1.evaluate(TestRuleStoreClassName.java:41)
        at com.carrotsearch.randomizedtesting.rules.NoShadowingOrOverridesOnMethodsRule$1.evaluate(NoShadowingOrOverridesOnMethodsRule.java:40)
        at com.carrotsearch.randomizedtesting.rules.NoShadowingOrOverridesOnMethodsRule$1.evaluate(NoShadowingOrOverridesOnMethodsRule.java:40)
        at com.carrotsearch.randomizedtesting.rules.StatementAdapter.evaluate(StatementAdapter.java:36)
        at com.carrotsearch.randomizedtesting.rules.StatementAdapter.evaluate(StatementAdapter.java:36)
        at com.carrotsearch.randomizedtesting.rules.StatementAdapter.evaluate(StatementAdapter.java:36)
        at org.apache.lucene.util.TestRuleAssertionsRequired$1.evaluate(TestRuleAssertionsRequired.java:53)
        at org.apache.lucene.util.TestRuleMarkFailure$1.evaluate(TestRuleMarkFailure.java:47)
        at org.apache.lucene.util.TestRuleIgnoreAfterMaxFailures$1.evaluate(TestRuleIgnoreAfterMaxFailures.java:64)
        at org.apache.lucene.util.TestRuleIgnoreTestSuites$1.evaluate(TestRuleIgnoreTestSuites.java:54)
        at com.carrotsearch.randomizedtesting.rules.StatementAdapter.evaluate(StatementAdapter.java:36)
        at com.carrotsearch.randomizedtesting.ThreadLeakControl$StatementRunner.run(ThreadLeakControl.java:368)
        at java.lang.Thread.run(Thread.java:748)


FAILED:  org.apache.solr.update.CdcrUpdateLogTest.testSubReader

Error Message:


Stack Trace:
java.lang.AssertionError
        at __randomizedtesting.SeedInfo.seed([F8F95484A142CDA5:B521DEE7D1951C77]:0)
        at org.junit.Assert.fail(Assert.java:92)
        at org.junit.Assert.assertTrue(Assert.java:43)
        at org.junit.Assert.assertTrue(Assert.java:54)
        at org.apache.solr.update.CdcrUpdateLogTest.testSubReader(CdcrUpdateLogTest.java:583)
        at sun.reflect.NativeMethodAccessorImpl.invoke0(Native Method)
        at sun.reflect.NativeMethodAccessorImpl.invoke(NativeMethodAccessorImpl.java:62)
        at sun.reflect.DelegatingMethodAccessorImpl.invoke(DelegatingMethodAccessorImpl.java:43)
        at java.lang.reflect.Method.invoke(Method.java:498)
        at com.carrotsearch.randomizedtesting.RandomizedRunner.invoke(RandomizedRunner.java:1737)
        at com.carrotsearch.randomizedtesting.RandomizedRunner$8.evaluate(RandomizedRunner.java:934)
        at com.carrotsearch.randomizedtesting.RandomizedRunner$9.evaluate(RandomizedRunner.java:970)
        at com.carrotsearch.randomizedtesting.RandomizedRunner$10.evaluate(RandomizedRunner.java:984)
        at com.carrotsearch.randomizedtesting.rules.SystemPropertiesRestoreRule$1.evaluate(SystemPropertiesRestoreRule.java:57)
        at org.apache.lucene.util.TestRuleSetupTeardownChained$1.evaluate(TestRuleSetupTeardownChained.java:49)
        at org.apache.lucene.util.AbstractBeforeAfterRule$1.evaluate(AbstractBeforeAfterRule.java:45)
        at org.apache.lucene.util.TestRuleThreadAndTestName$1.evaluate(TestRuleThreadAndTestName.java:48)
        at org.apache.lucene.util.TestRuleIgnoreAfterMaxFailures$1.evaluate(TestRuleIgnoreAfterMaxFailures.java:64)
        at org.apache.lucene.util.TestRuleMarkFailure$1.evaluate(TestRuleMarkFailure.java:47)
        at com.carrotsearch.randomizedtesting.rules.StatementAdapter.evaluate(StatementAdapter.java:36)
        at com.carrotsearch.randomizedtesting.ThreadLeakControl$StatementRunner.run(ThreadLeakControl.java:368)
        at com.carrotsearch.randomizedtesting.ThreadLeakControl.forkTimeoutingTask(ThreadLeakControl.java:817)
        at com.carrotsearch.randomizedtesting.ThreadLeakControl$3.evaluate(ThreadLeakControl.java:468)
        at com.carrotsearch.randomizedtesting.RandomizedRunner.runSingleTest(RandomizedRunner.java:943)
        at com.carrotsearch.randomizedtesting.RandomizedRunner$5.evaluate(RandomizedRunner.java:829)
        at com.carrotsearch.randomizedtesting.RandomizedRunner$6.evaluate(RandomizedRunner.java:879)
        at com.carrotsearch.randomizedtesting.RandomizedRunner$7.evaluate(RandomizedRunner.java:890)
        at com.carrotsearch.randomizedtesting.rules.StatementAdapter.evaluate(StatementAdapter.java:36)
        at com.carrotsearch.randomizedtesting.rules.SystemPropertiesRestoreRule$1.evaluate(SystemPropertiesRestoreRule.java:57)
        at org.apache.lucene.util.AbstractBeforeAfterRule$1.evaluate(AbstractBeforeAfterRule.java:45)
        at com.carrotsearch.randomizedtesting.rules.StatementAdapter.evaluate(StatementAdapter.java:36)
        at org.apache.lucene.util.TestRuleStoreClassName$1.evaluate(TestRuleStoreClassName.java:41)
        at com.carrotsearch.randomizedtesting.rules.NoShadowingOrOverridesOnMethodsRule$1.evaluate(NoShadowingOrOverridesOnMethodsRule.java:40)
        at com.carrotsearch.randomizedtesting.rules.NoShadowingOrOverridesOnMethodsRule$1.evaluate(NoShadowingOrOverridesOnMethodsRule.java:40)
        at com.carrotsearch.randomizedtesting.rules.StatementAdapter.evaluate(StatementAdapter.java:36)
        at com.carrotsearch.randomizedtesting.rules.StatementAdapter.evaluate(StatementAdapter.java:36)
        at com.carrotsearch.randomizedtesting.rules.StatementAdapter.evaluate(StatementAdapter.java:36)
        at org.apache.lucene.util.TestRuleAssertionsRequired$1.evaluate(TestRuleAssertionsRequired.java:53)
        at org.apache.lucene.util.TestRuleMarkFailure$1.evaluate(TestRuleMarkFailure.java:47)
        at org.apache.lucene.util.TestRuleIgnoreAfterMaxFailures$1.evaluate(TestRuleIgnoreAfterMaxFailures.java:64)
        at org.apache.lucene.util.TestRuleIgnoreTestSuites$1.evaluate(TestRuleIgnoreTestSuites.java:54)
        at com.carrotsearch.randomizedtesting.rules.StatementAdapter.evaluate(StatementAdapter.java:36)
        at com.carrotsearch.randomizedtesting.ThreadLeakControl$StatementRunner.run(ThreadLeakControl.java:368)
        at java.lang.Thread.run(Thread.java:748)




Build Log:
[...truncated 10741 lines...]
   [junit4] Suite: org.apache.lucene.spatial3d.TestGeo3DPoint
   [junit4]   2> нов 16, 2017 5:36:28 PM com.carrotsearch.randomizedtesting.ThreadLeakControl$2 evaluate
   [junit4]   2> WARNING: Suite execution timed out: org.apache.lucene.spatial3d.TestGeo3DPoint
   [junit4]   2>    1) Thread[id=9, name=JUnit4-serializer-daemon, state=TIMED_WAITING, group=main]
   [junit4]   2>         at java.lang.Thread.sleep(Native Method)
   [junit4]   2>         at com.carrotsearch.ant.tasks.junit4.events.Serializer$1.run(Serializer.java:50)
   [junit4]   2>    2) Thread[id=11, name=SUITE-TestGeo3DPoint-seed#[3E235A0EA737AC2E], state=RUNNABLE, group=TGRP-TestGeo3DPoint]
   [junit4]   2>         at java.lang.Thread.getStackTrace(Thread.java:1559)
   [junit4]   2>         at com.carrotsearch.randomizedtesting.ThreadLeakControl$4.run(ThreadLeakControl.java:696)
   [junit4]   2>         at com.carrotsearch.randomizedtesting.ThreadLeakControl$4.run(ThreadLeakControl.java:693)
   [junit4]   2>         at java.security.AccessController.doPrivileged(Native Method)
   [junit4]   2>         at com.carrotsearch.randomizedtesting.ThreadLeakControl.getStackTrace(ThreadLeakControl.java:693)
   [junit4]   2>         at com.carrotsearch.randomizedtesting.ThreadLeakControl.getThreadsWithTraces(ThreadLeakControl.java:709)
   [junit4]   2>         at com.carrotsearch.randomizedtesting.ThreadLeakControl.formatThreadStacksFull(ThreadLeakControl.java:689)
   [junit4]   2>         at com.carrotsearch.randomizedtesting.ThreadLeakControl.access$1000(ThreadLeakControl.java:65)
   [junit4]   2>         at com.carrotsearch.randomizedtesting.ThreadLeakControl$2.evaluate(ThreadLeakControl.java:415)
   [junit4]   2>         at com.carrotsearch.randomizedtesting.RandomizedRunner.runSuite(RandomizedRunner.java:705)
   [junit4]   2>         at com.carrotsearch.randomizedtesting.RandomizedRunner.access$200(RandomizedRunner.java:139)
   [junit4]   2>         at com.carrotsearch.randomizedtesting.RandomizedRunner$2.run(RandomizedRunner.java:626)
   [junit4]   2>    3) Thread[id=12, name=TEST-TestGeo3DPoint.testRandomBig-seed#[3E235A0EA737AC2E], state=RUNNABLE, group=TGRP-TestGeo3DPoint]
   [junit4]   2>         at org.apache.lucene.spatial3d.geom.GeoBaseDistanceShape.isWithin(GeoBaseDistanceShape.java:36)
   [junit4]   2>         at org.apache.lucene.spatial3d.geom.GeoBaseShape.getBounds(GeoBaseShape.java:43)
   [junit4]   2>         at org.apache.lucene.spatial3d.geom.GeoStandardPath.getBounds(GeoStandardPath.java:422)
   [junit4]   2>         at org.apache.lucene.spatial3d.TestGeo3DPoint.verify(TestGeo3DPoint.java:846)
   [junit4]   2>         at org.apache.lucene.spatial3d.TestGeo3DPoint.doTestRandom(TestGeo3DPoint.java:548)
   [junit4]   2>         at org.apache.lucene.spatial3d.TestGeo3DPoint.testRandomBig(TestGeo3DPoint.java:480)
   [junit4]   2>         at sun.reflect.NativeMethodAccessorImpl.invoke0(Native Method)
   [junit4]   2>         at sun.reflect.NativeMethodAccessorImpl.invoke(NativeMethodAccessorImpl.java:62)
   [junit4]   2>         at sun.reflect.DelegatingMethodAccessorImpl.invoke(DelegatingMethodAccessorImpl.java:43)
   [junit4]   2>         at java.lang.reflect.Method.invoke(Method.java:498)
   [junit4]   2>         at com.carrotsearch.randomizedtesting.RandomizedRunner.invoke(RandomizedRunner.java:1737)
   [junit4]   2>         at com.carrotsearch.randomizedtesting.RandomizedRunner$8.evaluate(RandomizedRunner.java:934)
   [junit4]   2>         at com.carrotsearch.randomizedtesting.RandomizedRunner$9.evaluate(RandomizedRunner.java:970)
   [junit4]   2>         at com.carrotsearch.randomizedtesting.RandomizedRunner$10.evaluate(RandomizedRunner.java:984)
   [junit4]   2>         at org.apache.lucene.util.TestRuleSetupTeardownChained$1.evaluate(TestRuleSetupTeardownChained.java:49)
   [junit4]   2>         at org.apache.lucene.util.AbstractBeforeAfterRule$1.evaluate(AbstractBeforeAfterRule.java:45)
   [junit4]   2>         at org.apache.lucene.util.TestRuleThreadAndTestName$1.evaluate(TestRuleThreadAndTestName.java:48)
   [junit4]   2>         at org.apache.lucene.util.TestRuleIgnoreAfterMaxFailures$1.evaluate(TestRuleIgnoreAfterMaxFailures.java:64)
   [junit4]   2>         at org.apache.lucene.util.TestRuleMarkFailure$1.evaluate(TestRuleMarkFailure.java:47)
   [junit4]   2>         at com.carrotsearch.randomizedtesting.rules.StatementAdapter.evaluate(StatementAdapter.java:36)
   [junit4]   2>         at com.carrotsearch.randomizedtesting.ThreadLeakControl$StatementRunner.run(ThreadLeakControl.java:368)
   [junit4]   2>         at com.carrotsearch.randomizedtesting.ThreadLeakControl.forkTimeoutingTask(ThreadLeakControl.java:817)
   [junit4]   2>         at com.carrotsearch.randomizedtesting.ThreadLeakControl$3.evaluate(ThreadLeakControl.java:468)
   [junit4]   2>         at com.carrotsearch.randomizedtesting.RandomizedRunner.runSingleTest(RandomizedRunner.java:943)
   [junit4]   2>         at com.carrotsearch.randomizedtesting.RandomizedRunner$5.evaluate(RandomizedRunner.java:829)
   [junit4]   2>         at com.carrotsearch.randomizedtesting.RandomizedRunner$6.evaluate(RandomizedRunner.java:879)
   [junit4]   2>         at com.carrotsearch.randomizedtesting.RandomizedRunner$7.evaluate(RandomizedRunner.java:890)
   [junit4]   2>         at org.apache.lucene.util.AbstractBeforeAfterRule$1.evaluate(AbstractBeforeAfterRule.java:45)
   [junit4]   2>         at com.carrotsearch.randomizedtesting.rules.StatementAdapter.evaluate(StatementAdapter.java:36)
   [junit4]   2>         at org.apache.lucene.util.TestRuleStoreClassName$1.evaluate(TestRuleStoreClassName.java:41)
   [junit4]   2>         at com.carrotsearch.randomizedtesting.rules.NoShadowingOrOverridesOnMethodsRule$1.evaluate(NoShadowingOrOverridesOnMethodsRule.java:40)
   [junit4]   2>         at com.carrotsearch.randomizedtesting.rules.NoShadowingOrOverridesOnMethodsRule$1.evaluate(NoShadowingOrOverridesOnMethodsRule.java:40)
   [junit4]   2>         at com.carrotsearch.randomizedtesting.rules.StatementAdapter.evaluate(StatementAdapter.java:36)
   [junit4]   2>         at com.carrotsearch.randomizedtesting.rules.StatementAdapter.evaluate(StatementAdapter.java:36)
   [junit4]   2>         at com.carrotsearch.randomizedtesting.rules.StatementAdapter.evaluate(StatementAdapter.java:36)
   [junit4]   2>         at org.apache.lucene.util.TestRuleAssertionsRequired$1.evaluate(TestRuleAssertionsRequired.java:53)
   [junit4]   2>         at org.apache.lucene.util.TestRuleMarkFailure$1.evaluate(TestRuleMarkFailure.java:47)
   [junit4]   2>         at org.apache.lucene.util.TestRuleIgnoreAfterMaxFailures$1.evaluate(TestRuleIgnoreAfterMaxFailures.java:64)
   [junit4]   2>         at org.apache.lucene.util.TestRuleIgnoreTestSuites$1.evaluate(TestRuleIgnoreTestSuites.java:54)
   [junit4]   2>         at com.carrotsearch.randomizedtesting.rules.StatementAdapter.evaluate(StatementAdapter.java:36)
   [junit4]   2>         at com.carrotsearch.randomizedtesting.ThreadLeakControl$StatementRunner.run(ThreadLeakControl.java:368)
   [junit4]   2>         at java.lang.Thread.run(Thread.java:748)
   [junit4]   2>    4) Thread[id=1, name=main, state=WAITING, group=main]
   [junit4]   2>         at java.lang.Object.wait(Native Method)
   [junit4]   2>         at java.lang.Thread.join(Thread.java:1252)
   [junit4]   2>         at java.lang.Thread.join(Thread.java:1326)
   [junit4]   2>         at com.carrotsearch.randomizedtesting.RandomizedRunner.runSuite(RandomizedRunner.java:636)
   [junit4]   2>         at com.carrotsearch.randomizedtesting.RandomizedRunner.run(RandomizedRunner.java:493)
   [junit4]   2>         at com.carrotsearch.ant.tasks.junit4.slave.SlaveMain.execute(SlaveMain.java:251)
   [junit4]   2>         at com.carrotsearch.ant.tasks.junit4.slave.SlaveMain.main(SlaveMain.java:368)
   [junit4]   2>         at com.carrotsearch.ant.tasks.junit4.slave.SlaveMainSafe.main(SlaveMainSafe.java:13)
   [junit4]   2> NOTE: download the large Jenkins line-docs file by running 'ant get-jenkins-line-docs' in the lucene directory.
   [junit4]   2> NOTE: reproduce with: ant test  -Dtestcase=TestGeo3DPoint -Dtests.method=testRandomBig -Dtests.seed=3E235A0EA737AC2E -Dtests.multiplier=2 -Dtests.nightly=true -Dtests.slow=true -Dtests.linedocsfile=/home/jenkins/jenkins-slave/workspace/Lucene-Solr-NightlyTests-7.x/test-data/enwiki.random.lines.txt -Dtests.locale=sr-ME -Dtests.timezone=Asia/Shanghai -Dtests.asserts=true -Dtests.file.encoding=UTF-8
   [junit4] ERROR   7155s J1 | TestGeo3DPoint.testRandomBig <<<
   [junit4]    > Throwable #1: java.lang.Exception: Test abandoned because suite timeout was reached.
   [junit4]    > at __randomizedtesting.SeedInfo.seed([3E235A0EA737AC2E]:0)
   [junit4]   2> нов 16, 2017 5:36:28 PM com.carrotsearch.randomizedtesting.ThreadLeakControl checkThreadLeaks
   [junit4]   2> WARNING: Will linger awaiting termination of 1 leaked thread(s).
   [junit4]   2> нов 16, 2017 5:36:48 PM com.carrotsearch.randomizedtesting.ThreadLeakControl checkThreadLeaks
   [junit4]   2> SEVERE: 1 thread leaked from SUITE scope at org.apache.lucene.spatial3d.TestGeo3DPoint:
   [junit4]   2>    1) Thread[id=12, name=TEST-TestGeo3DPoint.testRandomBig-seed#[3E235A0EA737AC2E], state=RUNNABLE, group=TGRP-TestGeo3DPoint]
   [junit4]   2>         at org.apache.lucene.spatial3d.TestGeo3DPoint.verify(TestGeo3DPoint.java:840)
   [junit4]   2>         at org.apache.lucene.spatial3d.TestGeo3DPoint.doTestRandom(TestGeo3DPoint.java:548)
   [junit4]   2>         at org.apache.lucene.spatial3d.TestGeo3DPoint.testRandomBig(TestGeo3DPoint.java:480)
   [junit4]   2>         at sun.reflect.NativeMethodAccessorImpl.invoke0(Native Method)
   [junit4]   2>         at sun.reflect.NativeMethodAccessorImpl.invoke(NativeMethodAccessorImpl.java:62)
   [junit4]   2>         at sun.reflect.DelegatingMethodAccessorImpl.invoke(DelegatingMethodAccessorImpl.java:43)
   [junit4]   2>         at java.lang.reflect.Method.invoke(Method.java:498)
   [junit4]   2>         at com.carrotsearch.randomizedtesting.RandomizedRunner.invoke(RandomizedRunner.java:1737)
   [junit4]   2>         at com.carrotsearch.randomizedtesting.RandomizedRunner$8.evaluate(RandomizedRunner.java:934)
   [junit4]   2>         at com.carrotsearch.randomizedtesting.RandomizedRunner$9.evaluate(RandomizedRunner.java:970)
   [junit4]   2>         at com.carrotsearch.randomizedtesting.RandomizedRunner$10.evaluate(RandomizedRunner.java:984)
   [junit4]   2>         at org.apache.lucene.util.TestRuleSetupTeardownChained$1.evaluate(TestRuleSetupTeardownChained.java:49)
   [junit4]   2>         at org.apache.lucene.util.AbstractBeforeAfterRule$1.evaluate(AbstractBeforeAfterRule.java:45)
   [junit4]   2>         at org.apache.lucene.util.TestRuleThreadAndTestName$1.evaluate(TestRuleThreadAndTestName.java:48)
   [junit4]   2>         at org.apache.lucene.util.TestRuleIgnoreAfterMaxFailures$1.evaluate(TestRuleIgnoreAfterMaxFailures.java:64)
   [junit4]   2>         at org.apache.lucene.util.TestRuleMarkFailure$1.evaluate(TestRuleMarkFailure.java:47)
   [junit4]   2>         at com.carrotsearch.randomizedtesting.rules.StatementAdapter.evaluate(StatementAdapter.java:36)
   [junit4]   2>         at com.carrotsearch.randomizedtesting.ThreadLeakControl$StatementRunner.run(ThreadLeakControl.java:368)
   [junit4]   2>         at com.carrotsearch.randomizedtesting.ThreadLeakControl.forkTimeoutingTask(ThreadLeakControl.java:817)
   [junit4]   2>         at com.carrotsearch.randomizedtesting.ThreadLeakControl$3.evaluate(ThreadLeakControl.java:468)
   [junit4]   2>         at com.carrotsearch.randomizedtesting.RandomizedRunner.runSingleTest(RandomizedRunner.java:943)
   [junit4]   2>         at com.carrotsearch.randomizedtesting.RandomizedRunner$5.evaluate(RandomizedRunner.java:829)
   [junit4]   2>         at com.carrotsearch.randomizedtesting.RandomizedRunner$6.evaluate(RandomizedRunner.java:879)
   [junit4]   2>         at com.carrotsearch.randomizedtesting.RandomizedRunner$7.evaluate(RandomizedRunner.java:890)
   [junit4]   2>         at org.apache.lucene.util.AbstractBeforeAfterRule$1.evaluate(AbstractBeforeAfterRule.java:45)
   [junit4]   2>         at com.carrotsearch.randomizedtesting.rules.StatementAdapter.evaluate(StatementAdapter.java:36)
   [junit4]   2>         at org.apache.lucene.util.TestRuleStoreClassName$1.evaluate(TestRuleStoreClassName.java:41)
   [junit4]   2>         at com.carrotsearch.randomizedtesting.rules.NoShadowingOrOverridesOnMethodsRule$1.evaluate(NoShadowingOrOverridesOnMethodsRule.java:40)
   [junit4]   2>         at com.carrotsearch.randomizedtesting.rules.NoShadowingOrOverridesOnMethodsRule$1.evaluate(NoShadowingOrOverridesOnMethodsRule.java:40)
   [junit4]   2>         at com.carrotsearch.randomizedtesting.rules.StatementAdapter.evaluate(StatementAdapter.java:36)
   [junit4]   2>         at com.carrotsearch.randomizedtesting.rules.StatementAdapter.evaluate(StatementAdapter.java:36)
   [junit4]   2>         at com.carrotsearch.randomizedtesting.rules.StatementAdapter.evaluate(StatementAdapter.java:36)
   [junit4]   2>         at org.apache.lucene.util.TestRuleAssertionsRequired$1.evaluate(TestRuleAssertionsRequired.java:53)
   [junit4]   2>         at org.apache.lucene.util.TestRuleMarkFailure$1.evaluate(TestRuleMarkFailure.java:47)
   [junit4]   2>         at org.apache.lucene.util.TestRuleIgnoreAfterMaxFailures$1.evaluate(TestRuleIgnoreAfterMaxFailures.java:64)
   [junit4]   2>         at org.apache.lucene.util.TestRuleIgnoreTestSuites$1.evaluate(TestRuleIgnoreTestSuites.java:54)
   [junit4]   2>         at com.carrotsearch.randomizedtesting.rules.StatementAdapter.evaluate(StatementAdapter.java:36)
   [junit4]   2>         at com.carrotsearch.randomizedtesting.ThreadLeakControl$StatementRunner.run(ThreadLeakControl.java:368)
   [junit4]   2>         at java.lang.Thread.run(Thread.java:748)
   [junit4]   2> нов 16, 2017 5:36:48 PM com.carrotsearch.randomizedtesting.ThreadLeakControl tryToInterruptAll
   [junit4]   2> INFO: Starting to interrupt leaked threads:
   [junit4]   2>    1) Thread[id=12, name=TEST-TestGeo3DPoint.testRandomBig-seed#[3E235A0EA737AC2E], state=RUNNABLE, group=TGRP-TestGeo3DPoint]
   [junit4]   2> нов 16, 2017 5:36:51 PM com.carrotsearch.randomizedtesting.ThreadLeakControl tryToInterruptAll
   [junit4]   2> SEVERE: There are still zombie threads that couldn't be terminated:
   [junit4]   2>    1) Thread[id=12, name=TEST-TestGeo3DPoint.testRandomBig-seed#[3E235A0EA737AC2E], state=RUNNABLE, group=TGRP-TestGeo3DPoint]
   [junit4]   2>         at org.apache.lucene.spatial3d.geom.Plane.findCrossings(Plane.java:667)
   [junit4]   2>         at org.apache.lucene.spatial3d.geom.GeoComplexPolygon$DualCrossingEdgeIterator.matches(GeoComplexPolygon.java:1077)
   [junit4]   2>         at org.apache.lucene.spatial3d.geom.GeoComplexPolygon$Node.traverse(GeoComplexPolygon.java:553)
   [junit4]   2>         at org.apache.lucene.spatial3d.geom.GeoComplexPolygon$Node.traverse(GeoComplexPolygon.java:561)
   [junit4]   2>         at org.apache.lucene.spatial3d.geom.GeoComplexPolygon$Node.traverse(GeoComplexPolygon.java:558)
   [junit4]   2>         at org.apache.lucene.spatial3d.geom.GeoComplexPolygon$Tree.traverse(GeoComplexPolygon.java:649)
   [junit4]   2>         at org.apache.lucene.spatial3d.geom.GeoComplexPolygon$Tree.traverse(GeoComplexPolygon.java:635)
   [junit4]   2>         at org.apache.lucene.spatial3d.geom.GeoComplexPolygon.isWithin(GeoComplexPolygon.java:371)
   [junit4]   2>         at org.apache.lucene.spatial3d.geom.GeoBaseMembershipShape.isWithin(GeoBaseMembershipShape.java:36)
   [junit4]   2>         at org.apache.lucene.spatial3d.geom.GeoBaseShape.getBounds(GeoBaseShape.java:39)
   [junit4]   2>         at org.apache.lucene.spatial3d.geom.GeoComplexPolygon.getBounds(GeoComplexPolygon.java:441)
   [junit4]   2>         at org.apache.lucene.spatial3d.TestGeo3DPoint.verify(TestGeo3DPoint.java:846)
   [junit4]   2>         at org.apache.lucene.spatial3d.TestGeo3DPoint.doTestRandom(TestGeo3DPoint.java:548)
   [junit4]   2>         at org.apache.lucene.spatial3d.TestGeo3DPoint.testRandomBig(TestGeo3DPoint.java:480)
   [junit4]   2>         at sun.reflect.NativeMethodAccessorImpl.invoke0(Native Method)
   [junit4]   2>         at sun.reflect.NativeMethodAccessorImpl.invoke(NativeMethodAccessorImpl.java:62)
   [junit4]   2>         at sun.reflect.DelegatingMethodAccessorImpl.invoke(DelegatingMethodAccessorImpl.java:43)
   [junit4]   2>         at java.lang.reflect.Method.invoke(Method.java:498)
   [junit4]   2>         at com.carrotsearch.randomizedtesting.RandomizedRunner.invoke(RandomizedRunner.java:1737)
   [junit4]   2>         at com.carrotsearch.randomizedtesting.RandomizedRunner$8.evaluate(RandomizedRunner.java:934)
   [junit4]   2>         at com.carrotsearch.randomizedtesting.RandomizedRunner$9.evaluate(RandomizedRunner.java:970)
   [junit4]   2>         at com.carrotsearch.randomizedtesting.RandomizedRunner$10.evaluate(RandomizedRunner.java:984)
   [junit4]   2>         at org.apache.lucene.util.TestRuleSetupTeardownChained$1.evaluate(TestRuleSetupTeardownChained.java:49)
   [junit4]   2>         at org.apache.lucene.util.AbstractBeforeAfterRule$1.evaluate(AbstractBeforeAfterRule.java:45)
   [junit4]   2>         at org.apache.lucene.util.TestRuleThreadAndTestName$1.evaluate(TestRuleThreadAndTestName.java:48)
   [junit4]   2>         at org.apache.lucene.util.TestRuleIgnoreAfterMaxFailures$1.evaluate(TestRuleIgnoreAfterMaxFailures.java:64)
   [junit4]   2>         at org.apache.lucene.util.TestRuleMarkFailure$1.evaluate(TestRuleMarkFailure.java:47)
   [junit4]   2>         at com.carrotsearch.randomizedtesting.rules.StatementAdapter.evaluate(StatementAdapter.java:36)
   [junit4]   2>         at com.carrotsearch.randomizedtesting.ThreadLeakControl$StatementRunner.run(ThreadLeakControl.java:368)
   [junit4]   2>         at com.carrotsearch.randomizedtesting.ThreadLeakControl.forkTimeoutingTask(ThreadLeakControl.java:817)
   [junit4]   2>         at com.carrotsearch.randomizedtesting.ThreadLeakControl$3.evaluate(ThreadLeakControl.java:468)
   [junit4]   2>         at com.carrotsearch.randomizedtesting.RandomizedRunner.runSingleTest(RandomizedRunner.java:943)
   [junit4]   2>         at com.carrotsearch.randomizedtesting.RandomizedRunner$5.evaluate(RandomizedRunner.java:829)
   [junit4]   2>         at com.carrotsearch.randomizedtesting.RandomizedRunner$6.evaluate(RandomizedRunner.java:879)
   [junit4]   2>         at com.carrotsearch.randomizedtesting.RandomizedRunner$7.evaluate(RandomizedRunner.java:890)
   [junit4]   2>         at org.apache.lucene.util.AbstractBeforeAfterRule$1.evaluate(AbstractBeforeAfterRule.java:45)
   [junit4]   2>         at com.carrotsearch.randomizedtesting.rules.StatementAdapter.evaluate(StatementAdapter.java:36)
   [junit4]   2>         at org.apache.lucene.util.TestRuleStoreClassName$1.evaluate(TestRuleStoreClassName.java:41)
   [junit4]   2>         at com.carrotsearch.randomizedtesting.rules.NoShadowingOrOverridesOnMethodsRule$1.evaluate(NoShadowingOrOverridesOnMethodsRule.java:40)
   [junit4]   2>         at com.carrotsearch.randomizedtesting.rules.NoShadowingOrOverridesOnMethodsRule$1.evaluate(NoShadowingOrOverridesOnMethodsRule.java:40)
   [junit4]   2>         at com.carrotsearch.randomizedtesting.rules.StatementAdapter.evaluate(StatementAdapter.java:36)
   [junit4]   2>         at com.carrotsearch.randomizedtesting.rules.StatementAdapter.evaluate(StatementAdapter.java:36)
   [junit4]   2>         at com.carrotsearch.randomizedtesting.rules.StatementAdapter.evaluate(StatementAdapter.java:36)
   [junit4]   2>         at org.apache.lucene.util.TestRuleAssertionsRequired$1.evaluate(TestRuleAssertionsRequired.java:53)
   [junit4]   2>         at org.apache.lucene.util.TestRuleMarkFailure$1.evaluate(TestRuleMarkFailure.java:47)
   [junit4]   2>         at org.apache.lucene.util.TestRuleIgnoreAfterMaxFailures$1.evaluate(TestRuleIgnoreAfterMaxFailures.java:64)
   [junit4]   2>         at org.apache.lucene.util.TestRuleIgnoreTestSuites$1.evaluate(TestRuleIgnoreTestSuites.java:54)
   [junit4]   2>         at com.carrotsearch.randomizedtesting.rules.StatementAdapter.evaluate(StatementAdapter.java:36)
   [junit4]   2>         at com.carrotsearch.randomizedtesting.ThreadLeakControl$StatementRunner.run(ThreadLeakControl.java:368)
   [junit4]   2>         at java.lang.Thread.run(Thread.java:748)
   [junit4]   2> NOTE: test params are: codec=Asserting(Lucene70): {id=Lucene50(blocksize=128)}, docValues:{id=DocValuesFormat(name=Lucene70), point=DocValuesFormat(name=Lucene70)}, maxPointsInLeafNode=1568, maxMBSortInHeap=5.668985814833965, sim=RandomSimilarity(queryNorm=true): {}, locale=sr-ME, timezone=Asia/Shanghai
   [junit4]   2> NOTE: Linux 4.4.0-83-generic amd64/Oracle Corporation 1.8.0_152 (64-bit)/cpus=4,threads=2,free=66358680,total=492306432
   [junit4]   2> NOTE: All tests run in this JVM: [TestGeo3DPoint]
   [junit4]   2> NOTE: download the large Jenkins line-docs file by running 'ant get-jenkins-line-docs' in the lucene directory.
   [junit4]   2> NOTE: reproduce with: ant test  -Dtestcase=TestGeo3DPoint -Dtests.seed=3E235A0EA737AC2E -Dtests.multiplier=2 -Dtests.nightly=true -Dtests.slow=true -Dtests.linedocsfile=/home/jenkins/jenkins-slave/workspace/Lucene-Solr-NightlyTests-7.x/test-data/enwiki.random.lines.txt -Dtests.locale=sr-ME -Dtests.timezone=Asia/Shanghai -Dtests.asserts=true -Dtests.file.encoding=UTF-8
   [junit4] ERROR   0.00s J1 | TestGeo3DPoint (suite) <<<
   [junit4]    > Throwable #1: java.lang.Exception: Suite timeout exceeded (>= 7200000 msec).
   [junit4]    > at __randomizedtesting.SeedInfo.seed([3E235A0EA737AC2E]:0)
   [junit4] Completed [13/15 (1!)] on J1 in 7224.78s, 5 tests, 2 errors <<< FAILURES!

[...truncated 1860 lines...]
   [junit4] Suite: org.apache.solr.update.CdcrUpdateLogTest
   [junit4]   2> Creating dataDir: /home/jenkins/jenkins-slave/workspace/Lucene-Solr-NightlyTests-7.x/checkout/solr/build/solr-core/test/J2/temp/solr.update.CdcrUpdateLogTest_F8F95484A142CDA5-001/init-core-data-001
   [junit4]   2> 44474 WARN  (SUITE-CdcrUpdateLogTest-seed#[F8F95484A142CDA5]-worker) [    ] o.a.s.SolrTestCaseJ4 startTrackingSearchers: numOpens=9 numCloses=9
   [junit4]   2> 44513 INFO  (SUITE-CdcrUpdateLogTest-seed#[F8F95484A142CDA5]-worker) [    ] o.a.s.SolrTestCaseJ4 Using PointFields (NUMERIC_POINTS_SYSPROP=true) w/NUMERIC_DOCVALUES_SYSPROP=true
   [junit4]   2> 44515 INFO  (SUITE-CdcrUpdateLogTest-seed#[F8F95484A142CDA5]-worker) [    ] o.a.s.SolrTestCaseJ4 Randomized ssl (true) and clientAuth (false) via: @org.apache.solr.util.RandomizeSSL(reason=, ssl=NaN, value=NaN, clientAuth=NaN)
   [junit4]   2> 46910 INFO  (SUITE-CdcrUpdateLogTest-seed#[F8F95484A142CDA5]-worker) [    ] o.a.s.SolrTestCaseJ4 SecureRandom sanity checks: test.solr.allowed.securerandom=null & java.security.egd=file:/dev/./urandom
   [junit4]   2> 46911 INFO  (SUITE-CdcrUpdateLogTest-seed#[F8F95484A142CDA5]-worker) [    ] o.a.s.SolrTestCaseJ4 ####initCore
   [junit4]   2> 46911 INFO  (SUITE-CdcrUpdateLogTest-seed#[F8F95484A142CDA5]-worker) [    ] o.a.s.c.SolrResourceLoader [null] Added 2 libs to classloader, from paths: [/home/jenkins/jenkins-slave/workspace/Lucene-Solr-NightlyTests-7.x/checkout/solr/core/src/test-files/solr/collection1/lib, /home/jenkins/jenkins-slave/workspace/Lucene-Solr-NightlyTests-7.x/checkout/solr/core/src/test-files/solr/collection1/lib/classes]
   [junit4]   2> 47059 INFO  (SUITE-CdcrUpdateLogTest-seed#[F8F95484A142CDA5]-worker) [    ] o.a.s.c.SolrConfig Using Lucene MatchVersion: 7.2.0
   [junit4]   2> 47204 INFO  (SUITE-CdcrUpdateLogTest-seed#[F8F95484A142CDA5]-worker) [    ] o.a.s.s.IndexSchema [null] Schema name=test
   [junit4]   2> 48214 INFO  (SUITE-CdcrUpdateLogTest-seed#[F8F95484A142CDA5]-worker) [    ] o.a.s.s.IndexSchema Loaded schema test/1.6 with uniqueid field id
   [junit4]   2> 49140 WARN  (SUITE-CdcrUpdateLogTest-seed#[F8F95484A142CDA5]-worker) [    ] o.a.s.m.r.SolrJmxReporter No JMX server found. Not exposing Solr metrics via JMX.
   [junit4]   2> 49140 WARN  (SUITE-CdcrUpdateLogTest-seed#[F8F95484A142CDA5]-worker) [    ] o.a.s.m.r.SolrJmxReporter No JMX server found. Not exposing Solr metrics via JMX.
   [junit4]   2> 49140 WARN  (SUITE-CdcrUpdateLogTest-seed#[F8F95484A142CDA5]-worker) [    ] o.a.s.m.r.SolrJmxReporter No JMX server found. Not exposing Solr metrics via JMX.
   [junit4]   2> 49195 INFO  (coreLoadExecutor-19-thread-1) [    ] o.a.s.c.TransientSolrCoreCacheDefault Allocating transient cache for 2147483647 transient cores
   [junit4]   2> 49232 INFO  (coreLoadExecutor-19-thread-1) [    x:collection1] o.a.s.c.SolrResourceLoader [null] Added 2 libs to classloader, from paths: [/home/jenkins/jenkins-slave/workspace/Lucene-Solr-NightlyTests-7.x/checkout/solr/core/src/test-files/solr/collection1/lib, /home/jenkins/jenkins-slave/workspace/Lucene-Solr-NightlyTests-7.x/checkout/solr/core/src/test-files/solr/collection1/lib/classes]
   [junit4]   2> 49581 INFO  (coreLoadExecutor-19-thread-1) [    x:collection1] o.a.s.c.SolrConfig Using Lucene MatchVersion: 7.2.0
   [junit4]   2> 49727 INFO  (coreLoadExecutor-19-thread-1) [    x:collection1] o.a.s.s.IndexSchema [collection1] Schema name=test
   [junit4]   2> 51078 INFO  (coreLoadExecutor-19-thread-1) [    x:collection1] o.a.s.s.IndexSchema Loaded schema test/1.6 with uniqueid field id
   [junit4]   2> 51336 INFO  (coreLoadExecutor-19-thread-1) [    x:collection1] o.a.s.c.CoreContainer Creating SolrCore 'collection1' using configuration from instancedir /home/jenkins/jenkins-slave/workspace/Lucene-Solr-NightlyTests-7.x/checkout/solr/core/src/test-files/solr/collection1, trusted=true
   [junit4]   2> 51336 WARN  (coreLoadExecutor-19-thread-1) [    x:collection1] o.a.s.m.r.SolrJmxReporter No JMX server found. Not exposing Solr metrics via JMX.
   [junit4]   2> 51574 INFO  (coreLoadExecutor-19-thread-1) [    x:collection1] o.a.s.c.SolrCore solr.RecoveryStrategy.Builder
   [junit4]   2> 51574 INFO  (coreLoadExecutor-19-thread-1) [    x:collection1] o.a.s.c.SolrCore [[collection1] ] Opening new SolrCore at [/home/jenkins/jenkins-slave/workspace/Lucene-Solr-NightlyTests-7.x/checkout/solr/core/src/test-files/solr/collection1], dataDir=[/home/jenkins/jenkins-slave/workspace/Lucene-Solr-NightlyTests-7.x/checkout/solr/build/solr-core/test/J2/temp/solr.update.CdcrUpdateLogTest_F8F95484A142CDA5-001/init-core-data-001/]
   [junit4]   2> 51611 INFO  (coreLoadExecutor-19-thread-1) [    x:collection1] o.a.s.u.RandomMergePolicy RandomMergePolicy wrapping class org.apache.lucene.index.TieredMergePolicy: [TieredMergePolicy: maxMergeAtOnce=15, maxMergeAtOnceExplicit=11, maxMergedSegmentMB=51.69140625, floorSegmentMB=0.4404296875, forceMergeDeletesPctAllowed=26.06851102108426, segmentsPerTier=29.0, maxCFSSegmentSizeMB=1.529296875, noCFSRatio=0.30051911918410346
   [junit4]   2> 52423 INFO  (coreLoadExecutor-19-thread-1) [    x:collection1] o.a.s.u.UpdateHandler Using UpdateLog implementation: org.apache.solr.update.CdcrUpdateLog
   [junit4]   2> 52569 INFO  (coreLoadExecutor-19-thread-1) [    x:collection1] o.a.s.u.UpdateLog Initializing UpdateLog: dataDir= defaultSyncLevel=FLUSH numRecordsToKeep=100 maxNumLogsToKeep=10 numVersionBuckets=65536
   [junit4]   2> 52571 INFO  (coreLoadExecutor-19-thread-1) [    x:collection1] o.a.s.u.CommitTracker Hard AutoCommit: disabled
   [junit4]   2> 52572 INFO  (coreLoadExecutor-19-thread-1) [    x:collection1] o.a.s.u.CommitTracker Soft AutoCommit: disabled
   [junit4]   2> 52573 INFO  (coreLoadExecutor-19-thread-1) [    x:collection1] o.a.s.u.RandomMergePolicy RandomMergePolicy wrapping class org.apache.lucene.index.MockRandomMergePolicy: org.apache.lucene.index.MockRandomMergePolicy@5ef961f2
   [junit4]   2> 52643 INFO  (coreLoadExecutor-19-thread-1) [    x:collection1] o.a.s.s.SolrIndexSearcher Opening [Searcher@745e69ca[collection1] main]
   [junit4]   2> 52643 WARN  (coreLoadExecutor-19-thread-1) [    x:collection1] o.a.s.r.ManagedResourceStorage Cannot write to config directory /home/jenkins/jenkins-slave/workspace/Lucene-Solr-NightlyTests-7.x/checkout/solr/core/src/test-files/solr/collection1/conf; switching to use InMemory storage instead.
   [junit4]   2> 52644 INFO  (coreLoadExecutor-19-thread-1) [    x:collection1] o.a.s.h.ReplicationHandler Commits will be reserved for 10000ms.
   [junit4]   2> 52659 INFO  (searcherExecutor-20-thread-1-processing-x:collection1) [    x:collection1] o.a.s.c.SolrCore [collection1] Registered new searcher Searcher@745e69ca[collection1] main{ExitableDirectoryReader(UninvertingDirectoryReader())}
   [junit4]   2> 52660 INFO  (coreLoadExecutor-19-thread-1) [    x:collection1] o.a.s.u.UpdateLog Could not find max version in index or recent updates, using new clock 1584215559816347648
   [junit4]   2> 52695 INFO  (SUITE-CdcrUpdateLogTest-seed#[F8F95484A142CDA5]-worker) [    ] o.a.s.SolrTestCaseJ4 ####initCore end
   [junit4]   2> 52697 INFO  (TEST-CdcrUpdateLogTest.testResetToLastPosition-seed#[F8F95484A142CDA5]) [    ] o.a.s.SolrTestCaseJ4 ###Starting testResetToLastPosition
   [junit4]   2> 52806 INFO  (TEST-CdcrUpdateLogTest.testResetToLastPosition-seed#[F8F95484A142CDA5]) [    ] o.a.s.u.DirectUpdateHandler2 [collection1] REMOVING ALL DOCUMENTS FROM INDEX
   [junit4]   2> 52808 INFO  (TEST-CdcrUpdateLogTest.testResetToLastPosition-seed#[F8F95484A142CDA5]) [    ] o.a.s.s.SolrIndexSearcher Opening [Searcher@78159603[collection1] realtime]
   [junit4]   2> 52808 INFO  (TEST-CdcrUpdateLogTest.testResetToLastPosition-seed#[F8F95484A142CDA5]) [    ] o.a.s.u.p.LogUpdateProcessorFactory [collection1]  webapp=null path=null params={_version_=-9223372036854775807&update.distrib=FROMLEADER&versions=true&wt=json&indent=true}{deleteByQuery=*:* (-9223372036854775807)} 0 109
   [junit4]   2> 52842 INFO  (TEST-CdcrUpdateLogTest.testResetToLastPosition-seed#[F8F95484A142CDA5]) [    ] o.a.s.u.DirectUpdateHandler2 start commit{_version_=1584215560007188480,optimize=false,openSearcher=true,waitSearcher=true,expungeDeletes=false,softCommit=false,prepareCommit=false}
   [junit4]   2> 52842 INFO  (TEST-CdcrUpdateLogTest.testResetToLastPosition-seed#[F8F95484A142CDA5]) [    ] o.a.s.u.SolrIndexWriter Calling setCommitData with IW:org.apache.solr.update.SolrIndexWriter@cd22ad7 commitCommandVersion:1584215560007188480
   [junit4]   2> 53114 INFO  (TEST-CdcrUpdateLogTest.testResetToLastPosition-seed#[F8F95484A142CDA5]) [    ] o.a.s.s.SolrIndexSearcher Opening [Searcher@26147159[collection1] main]
   [junit4]   2> 53117 INFO  (searcherExecutor-20-thread-1) [    ] o.a.s.c.SolrCore [collection1] Registered new searcher Searcher@26147159[collection1] main{ExitableDirectoryReader(UninvertingDirectoryReader())}
   [junit4]   2> 53117 INFO  (TEST-CdcrUpdateLogTest.testResetToLastPosition-seed#[F8F95484A142CDA5]) [    ] o.a.s.u.DirectUpdateHandler2 end_commit_flush
   [junit4]   2> 53134 INFO  (TEST-CdcrUpdateLogTest.testResetToLastPosition-seed#[F8F95484A142CDA5]) [    ] o.a.s.u.p.LogUpdateProcessorFactory [collection1]  webapp=null path=null params={}{commit=} 0 292
   [junit4]   2> 53174 INFO  (TEST-CdcrUpdateLogTest.testResetToLastPosition-seed#[F8F95484A142CDA5]) [    ] o.a.s.c.CoreContainer Shutting down CoreContainer instance=1461318401
   [junit4]   2> 53174 INFO  (TEST-CdcrUpdateLogTest.testResetToLastPosition-seed#[F8F95484A142CDA5]) [    ] o.a.s.m.SolrMetricManager Closing metric reporters for registry=solr.node, tag=null
   [junit4]   2> 53187 INFO  (TEST-CdcrUpdateLogTest.testResetToLastPosition-seed#[F8F95484A142CDA5]) [    ] o.a.s.m.r.SolrJmxReporter Closing reporter [org.apache.solr.metrics.reporters.SolrJmxReporter@666ffc22: rootName = null, domain = solr.node, service url = null, agent id = null] for registry solr.node / null
   [junit4]   2> 53187 INFO  (TEST-CdcrUpdateLogTest.testResetToLastPosition-seed#[F8F95484A142CDA5]) [    ] o.a.s.m.SolrMetricManager Closing metric reporters for registry=solr.jvm, tag=null
   [junit4]   2> 53187 INFO  (TEST-CdcrUpdateLogTest.testResetToLastPosition-seed#[F8F95484A142CDA5]) [    ] o.a.s.m.r.SolrJmxReporter Closing reporter [org.apache.solr.metrics.reporters.SolrJmxReporter@6374d70f: rootName = null, domain = solr.jvm, service url = null, agent id = null] for registry solr.jvm / null
   [junit4]   2> 53187 INFO  (TEST-CdcrUpdateLogTest.testResetToLastPosition-seed#[F8F95484A142CDA5]) [    ] o.a.s.m.SolrMetricManager Closing metric reporters for registry=solr.jetty, tag=null
   [junit4]   2> 53187 INFO  (TEST-CdcrUpdateLogTest.testResetToLastPosition-seed#[F8F95484A142CDA5]) [    ] o.a.s.m.r.SolrJmxReporter Closing reporter [org.apache.solr.metrics.reporters.SolrJmxReporter@33b74b2c: rootName = null, domain = solr.jetty, service url = null, agent id = null] for registry solr.jetty / null
   [junit4]   2> 53301 INFO  (coreCloseExecutor-25-thread-1) [    x:collection1] o.a.s.c.SolrCore [collection1]  CLOSING SolrCore org.apache.solr.core.SolrCore@32dade14
   [junit4]   2> 53314 INFO  (coreCloseExecutor-25-thread-1) [    x:collection1] o.a.s.m.SolrMetricManager Closing metric reporters for registry=solr.core.collection1, tag=853204500
   [junit4]   2> 53317 INFO  (coreCloseExecutor-25-thread-1) [    x:collection1] o.a.s.m.r.SolrJmxReporter Closing reporter [org.apache.solr.metrics.reporters.SolrJmxReporter@29f54e6: rootName = null, domain = solr.core.collection1, service url = null, agent id = null] for registry solr.core.collection1 / null
   [junit4]   2> 53448 INFO  (TEST-CdcrUpdateLogTest.testResetToLastPosition-seed#[F8F95484A142CDA5]) [    ] o.a.s.c.SolrResourceLoader [null] Added 2 libs to classloader, from paths: [/home/jenkins/jenkins-slave/workspace/Lucene-Solr-NightlyTests-7.x/checkout/solr/core/src/test-files/solr/collection1/lib, /home/jenkins/jenkins-slave/workspace/Lucene-Solr-NightlyTests-7.x/checkout/solr/core/src/test-files/solr/collection1/lib/classes]
   [junit4]   2> 53785 INFO  (TEST-CdcrUpdateLogTest.testResetToLastPosition-seed#[F8F95484A142CDA5]) [    ] o.a.s.c.SolrConfig Using Lucene MatchVersion: 7.2.0
   [junit4]   2> 53881 INFO  (TEST-CdcrUpdateLogTest.testResetToLastPosition-seed#[F8F95484A142CDA5]) [    ] o.a.s.s.IndexSchema [null] Schema name=test
   [junit4]   2> 54890 INFO  (TEST-CdcrUpdateLogTest.testResetToLastPosition-seed#[F8F95484A142CDA5]) [    ] o.a.s.s.IndexSchema Loaded schema test/1.6 with uniqueid field id
   [junit4]   2> 55327 WARN  (TEST-CdcrUpdateLogTest.testResetToLastPosition-seed#[F8F95484A142CDA5]) [    ] o.a.s.m.r.SolrJmxReporter No JMX server found. Not exposing Solr metrics via JMX.
   [junit4]   2> 55328 WARN  (TEST-CdcrUpdateLogTest.testResetToLastPosition-seed#[F8F95484A142CDA5]) [    ] o.a.s.m.r.SolrJmxReporter No JMX server found. Not exposing Solr metrics via JMX.
   [junit4]   2> 55328 WARN  (TEST-CdcrUpdateLogTest.testResetToLastPosition-seed#[F8F95484A142CDA5]) [    ] o.a.s.m.r.SolrJmxReporter No JMX server found. Not exposing Solr metrics via JMX.
   [junit4]   2> 55436 INFO  (coreLoadExecutor-32-thread-1) [    ] o.a.s.c.TransientSolrCoreCacheDefault Allocating transient cache for 2147483647 transient cores
   [junit4]   2> 55436 INFO  (coreLoadExecutor-32-thread-1) [    x:collection1] o.a.s.c.SolrResourceLoader [null] Added 2 libs to classloader, from paths: [/home/jenkins/jenkins-slave/workspace/Lucene-Solr-NightlyTests-7.x/checkout/solr/core/src/test-files/solr/collection1/lib, /home/jenkins/jenkins-slave/workspace/Lucene-Solr-NightlyTests-7.x/checkout/solr/core/src/test-files/solr/collection1/lib/classes]
   [junit4]   2> 55694 INFO  (coreLoadExecutor-32-thread-1) [    x:collection1] o.a.s.c.SolrConfig Using Lucene MatchVersion: 7.2.0
   [junit4]   2> 55805 INFO  (coreLoadExecutor-32-thread-1) [    x:collection1] o.a.s.s.IndexSchema [collection1] Schema name=test
   [junit4]   2> 56515 INFO  (coreLoadExecutor-32-thread-1) [    x:collection1] o.a.s.s.IndexSchema Loaded schema test/1.6 with uniqueid field id
   [junit4]   2> 56626 INFO  (coreLoadExecutor-32-thread-1) [    x:collection1] o.a.s.c.CoreContainer Creating SolrCore 'collection1' using configuration from instancedir /home/jenkins/jenkins-slave/workspace/Lucene-Solr-NightlyTests-7.x/checkout/solr/core/src/test-files/solr/collection1, trusted=true
   [junit4]   2> 56627 WARN  (coreLoadExecutor-32-thread-1) [    x:collection1] o.a.s.m.r.SolrJmxReporter No JMX server found. Not exposing Solr metrics via JMX.
   [junit4]   2> 56741 INFO  (coreLoadExecutor-32-thread-1) [    x:collection1] o.a.s.c.SolrCore solr.RecoveryStrategy.Builder
   [junit4]   2> 56741 INFO  (coreLoadExecutor-32-thread-1) [    x:collection1] o.a.s.c.SolrCore [[collection1] ] Opening new SolrCore at [/home/jenkins/jenkins-slave/workspace/Lucene-Solr-NightlyTests-7.x/checkout/solr/core/src/test-files/solr/collection1], dataDir=[/home/jenkins/jenkins-slave/workspace/Lucene-Solr-NightlyTests-7.x/checkout/solr/build/solr-core/test/J2/temp/solr.update.CdcrUpdateLogTest_F8F95484A142CDA5-001/init-core-data-001/]
   [junit4]   2> 57363 INFO  (coreLoadExecutor-32-thread-1) [    x:collection1] o.a.s.u.UpdateHandler Using UpdateLog implementation: org.apache.solr.update.CdcrUpdateLog
   [junit4]   2> 57363 INFO  (coreLoadExecutor-32-thread-1) [    x:collection1] o.a.s.u.UpdateLog Initializing UpdateLog: dataDir= defaultSyncLevel=FLUSH numRecordsToKeep=100 maxNumLogsToKeep=10 numVersionBuckets=65536
   [junit4]   2> 57365 INFO  (coreLoadExecutor-32-thread-1) [    x:collection1] o.a.s.u.CommitTracker Hard AutoCommit: disabled
   [junit4]   2> 57365 INFO  (coreLoadExecutor-32-thread-1) [    x:collection1] o.a.s.u.CommitTracker Soft AutoCommit: disabled
   [junit4]   2> 57381 INFO  (coreLoadExecutor-32-thread-1) [    x:collection1] o.a.s.u.RandomMergePolicy RandomMergePolicy wrapping class org.apache.lucene.index.TieredMergePolicy: [TieredMergePolicy: maxMergeAtOnce=15, maxMergeAtOnceExplicit=11, maxMergedSegmentMB=51.69140625, floorSegmentMB=0.4404296875, forceMergeDeletesPctAllowed=26.06851102108426, segmentsPerTier=29.0, maxCFSSegmentSizeMB=1.529296875, noCFSRatio=0.30051911918410346
   [junit4]   2> 57383 INFO  (coreLoadExecutor-32-thread-1) [    x:collection1] o.a.s.s.SolrIndexSearcher Opening [Searcher@2d07fafe[collection1] main]
   [junit4]   2> 57400 WARN  (coreLoadExecutor-32-thread-1) [    x:collection1] o.a.s.r.ManagedResourceStorage Cannot write to config directory /home/jenkins/jenkins-slave/workspace/Lucene-Solr-NightlyTests-7.x/checkout/solr/core/src/test-files/solr/collection1/conf; switching to use InMemory storage instead.
   [junit4]   2> 57402 INFO  (coreLoadExecutor-32-thread-1) [    x:collection1] o.a.s.h.ReplicationHandler Commits will be reserved for 10000ms.
   [junit4]   2> 57403 INFO  (searcherExecutor-33-thread-1-processing-x:collection1) [    x:collection1] o.a.s.c.SolrCore [collection1] Registered new searcher Searcher@2d07fafe[collection1] main{ExitableDirectoryReader(UninvertingDirectoryReader())}
   [junit4]   2> 57404 INFO  (coreLoadExecutor-32-thread-1) [    x:collection1] o.a.s.u.UpdateLog Could not find max version in index or recent updates, using new clock 1584215564790792192
   [junit4]   2> 57568 INFO  (TEST-CdcrUpdateLogTest.testResetToLastPosition-seed#[F8F95484A142CDA5]) [    ] o.a.s.u.p.LogUpdateProcessorFactory [collection1]  webapp=null path=null params={versions=true&wt=json&indent=true}{add=[0 (1584215564901941248)]} 0 106
   [junit4]   2> 57569 INFO  (TEST-CdcrUpdateLogTest.testResetToLastPosition-seed#[F8F95484A142CDA5]) [    ] o.a.s.u.p.LogUpdateProcessorFactory [collection1]  webapp=null path=null params={versions=true&wt=json&indent=true}{add=[1 (1584215564963807232)]} 0 1
   [junit4]   2> 57570 INFO  (TEST-CdcrUpdateLogTest.testResetToLastPosition-seed#[F8F95484A142CDA5]) [    ] o.a.s.u.p.LogUpdateProcessorFactory [collection1]  webapp=null path=null params={versions=true&wt=json&indent=true}{add=[2 (1584215564964855808)]} 0 0
   [junit4]   2> 57604 INFO  (TEST-CdcrUpdateLogTest.testResetToLastPosition-seed#[F8F95484A142CDA5]) [    ] o.a.s.u.p.LogUpdateProcessorFactory [collection1]  webapp=null path=null params={versions=true&wt=json&indent=true}{add=[3 (1584215565000507392)]} 0 0
   [junit4]   2> 57605 INFO  (TEST-CdcrUpdateLogTest.testResetToLastPosition-seed#[F8F95484A142CDA5]) [    ] o.a.s.u.p.LogUpdateProcessorFactory [collection1]  webapp=null path=null params={versions=true&wt=json&indent=true}{add=[4 (1584215565000507393)]} 0 0
   [junit4]   2> 57605 INFO  (TEST-CdcrUpdateLogTest.testResetToLastPosition-seed#[F8F95484A142CDA5]) [    ] o.a.s.u.p.LogUpdateProcessorFactory [collection1]  webapp=null path=null params={versions=true&wt=json&indent=true}{add=[5 (1584215565001555968)]} 0 0
   [junit4]   2> 57606 INFO  (TEST-CdcrUpdateLogTest.testResetToLastPosition-seed#[F8F95484A142CDA5]) [    ] o.a.s.u.p.LogUpdateProcessorFactory [collection1]  webapp=null path=null params={versions=true&wt=json&indent=true}{add=[6 (1584215565001555969)]} 0 0
   [junit4]   2> 57606 INFO  (TEST-CdcrUpdateLogTest.testResetToLastPosition-seed#[F8F95484A142CDA5]) [    ] o.a.s.u.p.LogUpdateProcessorFactory [collection1]  webapp=null path=null params={versions=true&wt=json&indent=true}{add=[7 (1584215565002604544)]} 0 0
   [junit4]   2> 57607 INFO  (TEST-CdcrUpdateLogTest.testResetToLastPosition-seed#[F8F95484A142CDA5]) [    ] o.a.s.u.p.LogUpdateProcessorFactory [collection1]  webapp=null path=null params={versions=true&wt=json&indent=true}{add=[8 (1584215565003653120)]} 0 0
   [junit4]   2> 57656 INFO  (TEST-CdcrUpdateLogTest.testResetToLastPosition-seed#[F8F95484A142CDA5]) [    ] o.a.s.u.p.LogUpdateProcessorFactory [collection1]  webapp=null path=null params={versions=true&wt=json&indent=true}{add=[9 (1584215565003653121)]} 0 49
   [junit4]   2> 57657 INFO  (TEST-CdcrUpdateLogTest.testResetToLastPosition-seed#[F8F95484A142CDA5]) [    ] o.a.s.u.DirectUpdateHandler2 start commit{_version_=1584215565056081920,optimize=false,openSearcher=true,waitSearcher=true,expungeDeletes=false,softCommit=false,prepareCommit=false}
   [junit4]   2> 57659 INFO  (TEST-CdcrUpdateLogTest.testResetToLastPosition-seed#[F8F95484A142CDA5]) [    ] o.a.s.u.SolrIndexWriter Calling setCommitData with IW:org.apache.solr.update.SolrIndexWriter@7c1d75b2 commitCommandVersion:1584215565056081920
   [junit4]   2> 57946 INFO  (TEST-CdcrUpdateLogTest.testResetToLastPosition-seed#[F8F95484A142CDA5]) [    ] o.a.s.s.SolrIndexSearcher Opening [Searcher@594b0385[collection1] main]
   [junit4]   2> 57947 INFO  (searcherExecutor-33-thread-1) [    ] o.a.s.c.SolrCore [collection1] Registered new searcher Searcher@594b0385[collection1] main{ExitableDirectoryReader(UninvertingDirectoryReader(Uninverting(_0(7.2.0):c10)))}
   [junit4]   2> 57948 INFO  (TEST-CdcrUpdateLogTest.testResetToLastPosition-seed#[F8F95484A142CDA5]) [    ] o.a.s.u.DirectUpdateHandler2 end_commit_flush
   [junit4]   2> 57948 INFO  (TEST-CdcrUpdateLogTest.testResetToLastPosition-seed#[F8F95484A142CDA5]) [    ] o.a.s.u.p.LogUpdateProcessorFactory [collection1]  webapp=null path=null params={}{commit=} 0 291
   [junit4]   2> 57982 INFO  (TEST-CdcrUpdateLogTest.testResetToLastPosition-seed#[F8F95484A142CDA5]) [    ] o.a.s.u.p.LogUpdateProcessorFactory [collection1]  webapp=null path=null params={versions=true&wt=json&indent=true}{add=[10 (1584215565375897600)]} 0 20
   [junit4]   2> 57983 INFO  (TEST-CdcrUpdateLogTest.testResetToLastPosition-seed#[F8F95484A142CDA5]) [    ] o.a.s.u.p.LogUpdateProcessorFactory [collection1]  webapp=null path=null params={versions=true&wt=json&indent=true}{add=[11 (1584215565397917696)]} 0 0
   [junit4]   2> 57998 INFO  (TEST-CdcrUpdateLogTest.testResetToLastPosition-seed#[F8F95484A142CDA5]) [    ] o.a.s.u.p.LogUpdateProcessorFactory [collection1]  webapp=null path=null params={versions=true&wt=json&indent=true}{add=[12 (1584215565413646336)]} 0 0
   [junit4]   2> 57999 INFO  (TEST-CdcrUpdateLogTest.testResetToLastPosition-seed#[F8F95484A142CDA5]) [    ] o.a.s.u.p.LogUpdateProcessorFactory [collection1]  webapp=null path=null params={versions=true&wt=json&indent=true}{add=[13 (1584215565414694912)]} 0 0
   [junit4]   2> 57999 INFO  (TEST-CdcrUpdateLogTest.testResetToLastPosition-seed#[F8F95484A142CDA5]) [    ] o.a.s.u.p.LogUpdateProcessorFactory [collection1]  webapp=null path=null params={versions=true&wt=json&indent=true}{add=[14 (1584215565414694913)]} 0 0
   [junit4]   2> 58000 INFO  (TEST-CdcrUpdateLogTest.testResetToLastPosition-seed#[F8F95484A142CDA5]) [    ] o.a.s.u.p.LogUpdateProcessorFactory [collection1]  webapp=null path=null params={versions=true&wt=json&indent=true}{add=[15 (1584215565415743488)]} 0 0
   [junit4]   2> 58000 INFO  (TEST-CdcrUpdateLogTest.testResetToLastPosition-seed#[F8F95484A142CDA5]) [    ] o.a.s.u.p.LogUpdateProcessorFactory [collection1]  webapp=null path=null params={versions=true&wt=json&indent=true}{add=[16 (1584215565415743489)]} 0 0
   [junit4]   2> 58001 INFO  (TEST-CdcrUpdateLogTest.testResetToLastPosition-seed#[F8F95484A142CDA5]) [    ] o.a.s.u.p.LogUpdateProcessorFactory [collection1]  webapp=null path=null params={versions=true&wt=json&indent=true}{add=[17 (1584215565416792064)]} 0 0
   [junit4]   2> 58002 INFO  (TEST-CdcrUpdateLogTest.testResetToLastPosition-seed#[F8F95484A142CDA5]) [    ] o.a.s.u.p.LogUpdateProcessorFactory [collection1]  webapp=null path=null params={versions=true&wt=json&indent=true}{add=[18 (1584215565416792065)]} 0 0
   [junit4]   2> 58055 INFO  (TEST-CdcrUpdateLogTest.testResetToLastPosition-seed#[F8F95484A142CDA5]) [    ] o.a.s.u.p.LogUpdateProcessorFactory [collection1]  webapp=null path=null params={versions=true&wt=json&indent=true}{add=[19 (1584215565455589376)]} 0 17
   [junit4]   2> 58056 INFO  (TEST-CdcrUpdateLogTest.testResetToLastPosition-seed#[F8F95484A142CDA5]) [    ] o.a.s.u.DirectUpdateHandler2 start commit{_version_=1584215565474463744,optimize=false,openSearcher=true,waitSearcher=true,expungeDeletes=false,softCommit=false,prepareCommit=false}
   [junit4]   2> 58057 INFO  (TEST-CdcrUpdateLogTest.testResetToLastPosition-seed#[F8F95484A142CDA5]) [    ] o.a.s.u.SolrIndexWriter Calling setCommitData with IW:org.apache.solr.update.SolrIndexWriter@7c1d75b2 commitCommandVersion:1584215565474463744
   [junit4]   2> 58221 INFO  (TEST-CdcrUpdateLogTest.testResetToLastPosition-seed#[F8F95484A142CDA5]) [    ] o.a.s.s.SolrIndexSearcher Opening [Searcher@68cf392f[collection1] main]
   [junit4]   2> 58255 INFO  (searcherExecutor-33-thread-1) [    ] o.a.s.c.SolrCore [collection1] Registered new searcher Searcher@68cf392f[collection1] main{ExitableDirectoryReader(UninvertingDirectoryReader(Uninverting(_0(7.2.0):c10) Uninverting(_1(7.2.0):c10)))}
   [junit4]   2> 58255 INFO  (TEST-CdcrUpdateLogTest.testResetToLastPosition-seed#[F8F95484A142CDA5]) [    ] o.a.s.u.DirectUpdateHandler2 end_commit_flush
   [junit4]   2> 58255 INFO  (TEST-CdcrUpdateLogTest.testResetToLastPosition-seed#[F8F95484A142CDA5]) [    ] o.a.s.u.p.LogUpdateProcessorFactory [collection1]  webapp=null path=null params={}{commit=} 0 199
   [junit4]   2> 58275 INFO  (TEST-CdcrUpdateLogTest.testResetToLastPosition-seed#[F8F95484A142CDA5]) [    ] o.a.s.SolrTestCaseJ4 ###Ending testResetToLastPosition
   [junit4]   2> 58330 INFO  (TEST-CdcrUpdateLogTest.testSubReader-seed#[F8F95484A142CDA5]) [    ] o.a.s.SolrTestCaseJ4 ###Starting testSubReader
   [junit4]   2> 58330 INFO  (TEST-CdcrUpdateLogTest.testSubReader-seed#[F8F95484A142CDA5]) [    ] o.a.s.u.DirectUpdateHandler2 [collection1] REMOVING ALL DOCUMENTS FROM INDEX
   [junit4]   2> 58331 INFO  (TEST-CdcrUpdateLogTest.testSubReader-seed#[F8F95484A142CDA5]) [    ] o.a.s.s.SolrIndexSearcher Opening [Searcher@7ed4686c[collection1] realtime]
   [junit4]   2> 58350 INFO  (TEST-CdcrUpdateLogTest.testSubReader-seed#[F8F95484A142CDA5]) [    ] o.a.s.u.p.LogUpdateProcessorFactory [collection1]  webapp=null path=null params={_version_=-9223372036854775807&update.distrib=FROMLEADER&versions=true&wt=json&indent=true}{deleteByQuery=*:* (-9223372036854775807)} 0 20
   [junit4]   2> 58364 INFO  (TEST-CdcrUpdateLogTest.testSubReader-seed#[F8F95484A142CDA5]) [    ] o.a.s.u.DirectUpdateHandler2 start commit{_version_=1584215565797425152,optimize=false,openSearcher=true,waitSearcher=true,expungeDeletes=false,softCommit=false,prepareCommit=false}
   [junit4]   2> 58364 INFO  (TEST-CdcrUpdateLogTest.testSubReader-seed#[F8F95484A142CDA5]) [    ] o.a.s.u.SolrIndexWriter Calling setCommitData with IW:org.apache.solr.update.SolrIndexWriter@7c1d75b2 commitCommandVersion:1584215565797425152
   [junit4]   2> 58386 INFO  (TEST-CdcrUpdateLogTest.testSubReader-seed#[F8F95484A142CDA5]) [    ] o.a.s.s.SolrIndexSearcher Opening [Searcher@15fc737[collection1] main]
   [junit4]   2> 58387 INFO  (TEST-CdcrUpdateLogTest.testSubReader-seed#[F8F95484A142CDA5]) [    ] o.a.s.u.DirectUpdateHandler2 end_commit_flush
   [junit4]   2> 58387 INFO  (searcherExecutor-33-thread-1) [    ] o.a.s.c.SolrCore [collection1] Registered new searcher Searcher@15fc737[collection1] main{ExitableDirectoryReader(UninvertingDirectoryReader())}
   [junit4]   2> 58568 INFO  (TEST-CdcrUpdateLogTest.testSubReader-seed#[F8F95484A142CDA5]) [    ] o.a.s.u.p.LogUpdateProcessorFactory [collection1]  webapp=null path=null params={}{commit=} 0 203
   [junit4]   2> 58568 INFO  (TEST-CdcrUpdateLogTest.testSubReader-seed#[F8F95484A142CDA5]) [    ] o.a.s.c.CoreContainer Shutting down CoreContainer instance=403781308
   [junit4]   2> 58568 INFO  (TEST-CdcrUpdateLogTest.testSubReader-seed#[F8F95484A142CDA5]) [    ] o.a.s.m.SolrMetricManager Closing metric reporters for registry=solr.node, tag=null
   [junit4]   2> 58569 INFO  (TEST-CdcrUpdateLogTest.testSubReader-seed#[F8F95484A142CDA5]) [    ] o.a.s.m.r.SolrJmxReporter Closing reporter [org.apache.solr.metrics.reporters.SolrJmxReporter@706e80ee: rootName = null, domain = solr.node, service url = null, agent id = null] for registry solr.node / null
   [junit4]   2> 58569 INFO  (TEST-CdcrUpdateLogTest.testSubReader-seed#[F8F95484A142CDA5]) [    ] o.a.s.m.SolrMetricManager Closing metric reporters for registry=solr.jvm, tag=null
   [junit4]   2> 58569 INFO  (TEST-CdcrUpdateLogTest.testSubReader-seed#[F8F95484A142CDA5]) [    ] o.a.s.m.r.SolrJmxReporter Closing reporter [org.apache.solr.metrics.reporters.SolrJmxReporter@6934e69: rootName = null, domain = solr.jvm, service url = null, agent id = null] for registry solr.jvm / null
   [junit4]   2> 58569 INFO  (TEST-CdcrUpdateLogTest.testSubReader-seed#[F8F95484A142CDA5]) [    ] o.a.s.m.SolrMetricManager Closing metric reporters for registry=solr.jetty, tag=null
   [junit4]   2> 58569 INFO  (TEST-CdcrUpdateLogTest.testSubReader-seed#[F8F95484A142CDA5]) [    ] o.a.s.m.r.SolrJmxReporter Closing reporter [org.apache.solr.metrics.reporters.SolrJmxReporter@798a57f3: rootName = null, domain = solr.jetty, service url = null, agent id = null] for registry solr.jetty / null
   [junit4]   2> 58827 INFO  (coreCloseExecutor-38-thread-1) [    x:collection1] o.a.s.c.SolrCore [collection1]  CLOSING SolrCore org.apache.solr.core.SolrCore@75cd91c2
   [junit4]   2> 58827 INFO  (coreCloseExecutor-38-thread-1) [    x:collection1] o.a.s.m.SolrMetricManager Closing metric reporters for registry=solr.core.collection1, tag=1976406466
   [junit4]   2> 58857 INFO  (coreCloseExecutor-38-thread-1) [    x:collection1] o.a.s.m.r.SolrJmxReporter Closing reporter [org.apache.solr.metrics.reporters.SolrJmxReporter@305e2a38: rootName = null, domain = solr.core.collection1, service url = null, agent id = null] for registry solr.core.collection1 / null
   [junit4]   2> 58878 INFO  (TEST-CdcrUpdateLogTest.testSubReader-seed#[F8F95484A142CDA5]) [    ] o.a.s.c.SolrResourceLoader [null] Added 2 libs to classloader, from paths: [/home/jenkins/jenkins-slave/workspace/Lucene-Solr-NightlyTests-7.x/checkout/solr/core/src/test-files/solr/collection1/lib, /home/jenkins/jenkins-slave/workspace/Lucene-Solr-NightlyTests-7.x/checkout/solr/core/src/test-files/solr/collection1/lib/classes]
   [junit4]   2> 59186 INFO  (TEST-CdcrUpdateLogTest.testSubReader-seed#[F8F95484A142CDA5]) [    ] o.a.s.c.SolrConfig Using Lucene MatchVersion: 7.2.0
   [junit4]   2> 59523 INFO  (TEST-CdcrUpdateLogTest.testSubReader-seed#[F8F95484A142CDA5]) [    ] o.a.s.s.IndexSchema [null] Schema name=test
   [junit4]   2> 60685 INFO  (TEST-CdcrUpdateLogTest.testSubReader-seed#[F8F95484A142CDA5]) [    ] o.a.s.s.IndexSchema Loaded schema test/1.6 with uniqueid field id
   [junit4]   2> 61177 WARN  (TEST-CdcrUpdateLogTest.testSubReader-seed#[F8F95484A142CDA5]) [    ] o.a.s.m.r.SolrJmxReporter No JMX server found. Not exposing Solr metrics via JMX.
   [junit4]   2> 61177 WARN  (TEST-CdcrUpdateLogTest.testSubReader-seed#[F8F95484A142CDA5]) [    ] o.a.s.m.r.SolrJmxReporter No JMX server found. Not exposing Solr metrics via JMX.
   [junit4]   2> 61178 WARN  (TEST-CdcrUpdateLogTest.testSubReader-seed#[F8F95484A142CDA5]) [    ] o.a.s.m.r.SolrJmxReporter No JMX server found. Not exposing Solr metrics via JMX.
   [junit4]   2> 61194 INFO  (coreLoadExecutor-45-thread-1) [    ] o.a.s.c.TransientSolrCoreCacheDefault Allocating transient cache for 2147483647 transient cores
   [junit4]   2> 61194 INFO  (coreLoadExecutor-45-thread-1) [    x:collection1] o.a.s.c.SolrResourceLoader [null] Added 2 libs to classloader, from paths: [/home/jenkins/jenkins-slave/workspace/Lucene-Solr-NightlyTests-7.x/checkout/solr/core/src/test-files/solr/collection1/lib, /home/jenkins/jenkins-slave/workspace/Lucene-Solr-NightlyTests-7.x/checkout/solr/core/src/test-files/solr/collection1/lib/classes]
   [junit4]   2> 61561 INFO  (coreLoadExecutor-45-thread-1) [    x:collection1] o.a.s.c.SolrConfig Using Lucene MatchVersion: 7.2.0
   [junit4]   2> 61673 INFO  (coreLoadExecutor-45-thread-1) [    x:collection1] o.a.s.s.IndexSchema [collection1] Schema name=test
   [junit4]   2> 62200 INFO  (coreLoadExecutor-45-thread-1) [    x:collection1] o.a.s.s.IndexSchema Loaded schema test/1.6 with uniqueid field id
   [junit4]   2> 62295 INFO  (coreLoadExecutor-45-thread-1) [    x:collection1] o.a.s.c.CoreContainer Creating SolrCore 'collection1' using configuration from instancedir /home/jenkins/jenkins-slave/workspace/Lucene-Solr-NightlyTests-7.x/checkout/solr/core/src/test-files/solr/collection1, trusted=true
   [junit4]   2> 62331 WARN  (coreLoadExecutor-45-thread-1) [    x:collection1] o.a.s.m.r.SolrJmxReporter No JMX server found. Not exposing Solr metrics via JMX.
   [junit4]   2> 62385 INFO  (coreLoadExecutor-45-thread-1) [    x:collection1] o.a.s.c.SolrCore solr.RecoveryStrategy.Builder
   [junit4]   2> 62385 INFO  (coreLoadExecutor-45-thread-1) [    x:collection1] o.a.s.c.SolrCore [[collection1] ] Opening new SolrCore at [/home/jenkins/jenkins-slave/workspace/Lucene-Solr-NightlyTests-7.x/checkout/solr/core/src/test-files/solr/collection1], dataDir=[/home/jenkins/jenkins-slave/workspace/Lucene-Solr-NightlyTests-7.x/checkout/solr/build/solr-core/test/J2/temp/solr.update.CdcrUpdateLogTest_F8F95484A142CDA5-001/init-core-data-001/]
   [junit4]   2> 62841 INFO  (coreLoadExecutor-45-thread-1) [    x:collection1] o.a.s.u.UpdateHandler Using UpdateLog implementation: org.apache.solr.update.CdcrUpdateLog
   [junit4]   2> 62841 INFO  (coreLoadExecutor-45-thread-1) [    x:collection1] o.a.s.u.UpdateLog Initializing UpdateLog: dataDir= defaultSyncLevel=FLUSH numRecordsToKeep=100 maxNumLogsToKeep=10 numVersionBuckets=65536
   [junit4]   2> 62861 INFO  (coreLoadExecutor-45-thread-1) [    x:collection1] o.a.s.u.CommitTracker Hard AutoCommit: disabled
   [junit4]   2> 62861 INFO  (coreLoadExecutor-45-thread-1) [    x:collection1] o.a.s.u.CommitTracker Soft AutoCommit: disabled
   [junit4]   2> 62862 INFO  (coreLoadExecutor-45-thread-1) [    x:collection1] o.a.s.u.RandomMergePolicy RandomMergePolicy wrapping class org.apache.lucene.index.TieredMergePolicy: [TieredMergePolicy: maxMergeAtOnce=15, maxMergeAtOnceExplicit=11, maxMergedSegmentMB=51.69140625, floorSegmentMB=0.4404296875, forceMergeDeletesPctAllowed=26.06851102108426, segmentsPerTier=29.0, maxCFSSegmentSizeMB=1.529296875, noCFSRatio=0.30051911918410346
   [junit4]   2> 62863 INFO  (coreLoadExecutor-45-thread-1) [    x:collection1] o.a.s.s.SolrIndexSearcher Opening [Searcher@148ce317[collection1] main]
   [junit4]   2> 62864 WARN  (coreLoadExecutor-45-thread-1) [    x:collection1] o.a.s.r.ManagedResourceStorage Cannot write to config directory /home/jenkins/jenkins-slave/workspace/Lucene-Solr-NightlyTests-7.x/checkout/solr/core/src/test-files/solr/collection1/conf; switching to use InMemory storage instead.
   [junit4]   2> 62864 INFO  (coreLoadExecutor-45-thread-1) [    x:collection1] o.a.s.h.ReplicationHandler Commits will be reserved for 10000ms.
   [junit4]   2> 62951 INFO  (searcherExecutor-46-thread-1-processing-x:collection1) [    x:collection1] o.a.s.c.SolrCore [collection1] Registered new searcher Searcher@148ce317[collection1] main{ExitableDirectoryReader(UninvertingDirectoryReader())}
   [junit4]   2> 62951 INFO  (coreLoadExecutor-45-thread-1) [    x:collection1] o.a.s.u.UpdateLog Could not find max version in index or recent updates, using new clock 1584215570607243264
   [junit4]   2> 63063 INFO  (TEST-CdcrUpdateLogTest.testSubReader-seed#[F8F95484A142CDA5]) [    ] o.a.s.u.p.LogUpdateProcessorFactory [collection1]  webapp=null path=null params={versions=true&wt=json&indent=true}{add=[0 (1584215570707906560)]} 0 76
   [junit4]   2> 63096 INFO  (TEST-CdcrUpdateLogTest.testSubReader-seed#[F8F95484A142CDA5]) [    ] o.a.s.u.p.LogUpdateProcessorFactory [collection1]  webapp=null path=null params={versions=true&wt=json&indent=true}{add=[1 (1584215570759286784)]} 0 33
   [junit4]   2> 63097 INFO  (TEST-CdcrUpdateLogTest.testSubReader-seed#[F8F95484A142CDA5]) [    ] o.a.s.u.p.LogUpdateProcessorFactory [collection1]  webapp=null path=null params={versions=true&wt=json&indent=true}{add=[2 (1584215570760335360)]} 0 0
   [junit4]   2> 63098 INFO  (TEST-CdcrUpdateLogTest.testSubReader-seed#[F8F95484A142CDA5]) [    ] o.a.s.u.p.LogUpdateProcessorFactory [collection1]  webapp=null path=null params={versions=true&wt=json&indent=true}{add=[3 (1584215570760335361)]} 0 0
   [junit4]   2> 63098 INFO  (TEST-CdcrUpdateLogTest.testSubReader-seed#[F8F95484A142CDA5]) [    ] o.a.s.u.p.LogUpdateProcessorFactory [collection1]  webapp=null path=null params={versions=true&wt=json&indent=true}{add=[4 (1584215570761383936)]} 0 0
   [junit4]   2> 63099 INFO  (TEST-CdcrUpdateLogTest.testSubReader-seed#[F8F95484A142CDA5]) [    ] o.a.s.u.p.LogUpdateProcessorFactory [collection1]  webapp=null path=null params={versions=true&wt=json&indent=true}{add=[5 (1584215570761383937)]} 0 0
   [junit4]   2> 63099 INFO  (TEST-CdcrUpdateLogTest.testSubReader-seed#[F8F95484A142CDA5]) [    ] o.a.s.u.p.LogUpdateProcessorFactory [collection1]  webapp=null path=null params={versions=true&wt=json&indent=true}{add=[6 (1584215570762432512)]} 0 0
   [junit4]   2> 63100 INFO  (TEST-CdcrUpdateLogTest.testSubReader-seed#[F8F95484A142CDA5]) [    ] o.a.s.u.p.LogUpdateProcessorFactory [collection1]  webapp=null path=null params={versions=true&wt=json&indent=true}{add=[7 (1584215570762432513)]} 0 0
   [junit4]   2> 63119 INFO  (TEST-CdcrUpdateLogTest.testSubReader-seed#[F8F95484A142CDA5]) [    ] o.a.s.u.p.LogUpdateProcessorFactory [collection1]  webapp=null path=null params={versions=true&wt=json&indent=true}{add=[8 (1584215570783404032)]} 0 19
   [junit4]   2> 63135 INFO  (TEST-CdcrUpdateLogTest.testSubReader-seed#[F8F95484A142CDA5]) [    ] o.a.s.u.p.LogUpdateProcessorFactory [collection1]  webapp=null path=null params={versions=true&wt=json&indent=true}{add=[9 (1584215570784452608)]} 0 15
   [junit4]   2> 63135 INFO  (TEST-CdcrUpdateLogTest.testSubReader-seed#[F8F95484A142CDA5]) [    ] o.a.s.u.DirectUpdateHandler2 start commit{_version_=1584215570800181248,optimize=false,openSearcher=true,waitSearcher=true,expungeDeletes=false,softCommit=false,prepareCommit=false}
   [junit4]   2> 63135 INFO  (TEST-CdcrUpdateLogTest.testSubReader-seed#[F8F95484A142CDA5]) [    ] o.a.s.u.SolrIndexWriter Calling setCommitData with IW:org.apache.solr.update.SolrIndexWriter@365e5f48 commitCommandVersion:1584215570800181248
   [junit4]   2> 63285 INFO  (TEST-CdcrUpdateLogTest.testSubReader-seed#[F8F95484A142CDA5]) [    ] o.a.s.s.SolrIndexSearcher Opening [Searcher@1be169a6[collection1] main]
   [junit4]   2> 63286 INFO  (TEST-CdcrUpdateLogTest.testSubReader-seed#[F8F95484A142CDA5]) [    ] o.a.s.u.DirectUpdateHandler2 end_commit_flush
   [junit4]   2> 63316 INFO  (searcherExecutor-46-thread-1) [    ] o.a.s.c.SolrCore [collection1] Registered new searcher Searcher@1be169a6[collection1] main{ExitableDirectoryReader(UninvertingDirectoryReader(Uninverting(_2(7.2.0):c10)))}
   [junit4]   2> 63320 INFO  (TEST-CdcrUpdateLogTest.testSubReader-seed#[F8F95484A142CDA5]) [    ] o.a.s.u.p.LogUpdateProcessorFactory [collection1]  webapp=null path=null params={}{commit=} 0 184
   [junit4]   2> 63322 INFO  (TEST-CdcrUpdateLogTest.testSubReader-seed#[F8F95484A142CDA5]) [    ] o.a.s.u.p.LogUpdateProcessorFactory [collection1]  webapp=null path=null params={versions=true&wt=json&indent=true}{add=[10 (1584215570995216384)]} 0 1
   [junit4]   2> 63323 INFO  (TEST-CdcrUpdateLogTest.testSubReader-seed#[F8F95484A142CDA5]) [    ] o.a.s.u.p.LogUpdateProcessorFactory [collection1]  webapp=null path=null params={versions=true&wt=json&indent=true}{add=[11 (1584215570997313536)]} 0 0
   [junit4]   2> 63340 INFO  (TEST-CdcrUpdateLogTest.testSubReader-seed#[F8F95484A142CDA5]) [    ] o.a.s.u.p.LogUpdateProcessorFactory [collection1]  webapp=null path=null params={versions=true&wt=json&indent=true}{add=[12 (1584215570997313537)]} 0 17
   [junit4]   2> 6334

[...truncated too long message...]

ilter.logWelcomeBanner |___/\___/_|_|    Start time: 2017-11-16T13:51:14.549Z
   [junit4]   2> 135196 T60 oasc.SolrXmlConfig.fromFile Loading container configuration from /home/jenkins/jenkins-slave/workspace/Lucene-Solr-NightlyTests-7.x/checkout/solr/build/contrib/solr-dataimporthandler/test/J1/temp/solr.handler.dataimport.TestContentStreamDataSource_EC8D07AEAB38D403-001/inst-002/solr.xml
   [junit4]   2> 135393 T60 oasc.SolrXmlConfig.getMetricReporterPluginInfos MBean server found: com.sun.jmx.mbeanserver.JmxMBeanServer@5e22f059, but no JMX reporters were configured - adding default JMX reporter.
   [junit4]   2> 135891 T60 oasmr.SolrJmxReporter.doInit JMX monitoring for 'solr.node' (registry 'solr.node') enabled at server: com.sun.jmx.mbeanserver.JmxMBeanServer@5e22f059
   [junit4]   2> 136218 T60 oasmr.SolrJmxReporter.doInit JMX monitoring for 'solr.jvm' (registry 'solr.jvm') enabled at server: com.sun.jmx.mbeanserver.JmxMBeanServer@5e22f059
   [junit4]   2> 136218 T60 oasmr.SolrJmxReporter.doInit JMX monitoring for 'solr.jetty' (registry 'solr.jetty') enabled at server: com.sun.jmx.mbeanserver.JmxMBeanServer@5e22f059
   [junit4]   2> 136270 T60 oasc.CorePropertiesLocator.discover Found 1 core definitions underneath /home/jenkins/jenkins-slave/workspace/Lucene-Solr-NightlyTests-7.x/checkout/solr/build/contrib/solr-dataimporthandler/test/J1/temp/solr.handler.dataimport.TestContentStreamDataSource_EC8D07AEAB38D403-001/inst-002
   [junit4]   2> 136270 T60 oasc.CorePropertiesLocator.discover Cores are: [collection1]
   [junit4]   2> 136343 T94 oasc.TransientSolrCoreCacheDefault.doInit Allocating transient cache for 2147483647 transient cores
   [junit4]   2> 136973 T94 x:x:collection1 oasc.SolrConfig.<init> Using Lucene MatchVersion: 7.2.0
   [junit4]   2> 137186 T94 x:x:collection1 oass.IndexSchema.readSchema [collection1] Schema name=dih_test
   [junit4]   2> 137295 T94 x:x:collection1 oass.IndexSchema.readSchema Loaded schema dih_test/4.0 with uniqueid field id
   [junit4]   2> 137295 T94 x:x:collection1 oasc.CoreContainer.createFromDescriptor Creating SolrCore 'collection1' using configuration from instancedir /home/jenkins/jenkins-slave/workspace/Lucene-Solr-NightlyTests-7.x/checkout/solr/build/contrib/solr-dataimporthandler/test/J1/temp/solr.handler.dataimport.TestContentStreamDataSource_EC8D07AEAB38D403-001/inst-002/collection1, trusted=true
   [junit4]   2> 137322 T94 x:x:collection1 oasmr.SolrJmxReporter.doInit JMX monitoring for 'solr.core.collection1' (registry 'solr.core.collection1') enabled at server: com.sun.jmx.mbeanserver.JmxMBeanServer@5e22f059
   [junit4]   2> 137322 T94 x:x:collection1 oasc.SolrCore.initRecoveryStrategyBuilder solr.RecoveryStrategy.Builder
   [junit4]   2> 137322 T94 x:x:collection1 oasc.SolrCore.<init> [[collection1] ] Opening new SolrCore at [/home/jenkins/jenkins-slave/workspace/Lucene-Solr-NightlyTests-7.x/checkout/solr/build/contrib/solr-dataimporthandler/test/J1/temp/solr.handler.dataimport.TestContentStreamDataSource_EC8D07AEAB38D403-001/inst-002/collection1], dataDir=[/home/jenkins/jenkins-slave/workspace/Lucene-Solr-NightlyTests-7.x/checkout/solr/build/contrib/solr-dataimporthandler/test/J1/temp/solr.handler.dataimport.TestContentStreamDataSource_EC8D07AEAB38D403-001/inst-002/collection1/data/]
   [junit4]   2> 138097 T94 x:x:collection1 oasu.CommitTracker.<init> Hard AutoCommit: disabled
   [junit4]   2> 138113 T94 x:x:collection1 oasu.CommitTracker.<init> Soft AutoCommit: disabled
   [junit4]   2> 138130 T94 x:x:collection1 oass.SolrIndexSearcher.<init> Opening [Searcher@42da7fce[collection1] main]
   [junit4]   2> 138130 T94 x:x:collection1 oasr.ManagedResourceStorage$FileStorageIO.configure File-based storage initialized to use dir: /home/jenkins/jenkins-slave/workspace/Lucene-Solr-NightlyTests-7.x/checkout/solr/build/contrib/solr-dataimporthandler/test/J1/temp/solr.handler.dataimport.TestContentStreamDataSource_EC8D07AEAB38D403-001/inst-002/collection1/conf
   [junit4]   2> 138131 T94 x:x:collection1 oash.ReplicationHandler.inform Commits will be reserved for 10000ms.
   [junit4]   2> 138151 T98 x:x:collection1 oasc.SolrCore.registerSearcher [collection1] Registered new searcher Searcher@42da7fce[collection1] main{ExitableDirectoryReader(UninvertingDirectoryReader())}
   [junit4]   2> ASYNC  NEW_CORE C7 name=collection1 org.apache.solr.core.SolrCore@7d2e42ae
   [junit4]   2> 138187 T86 x:x:collection1 C7 oashd.DataImporter.maybeReloadConfiguration Loading DIH Configuration: data-config.xml
   [junit4]   2> 138189 T86 x:x:collection1 C7 oashd.DataImporter.loadDataConfig Data Configuration loaded successfully
   [junit4]   2> 138189 T86 x:x:collection1 C7 oashd.DataImporter.doFullImport Starting Full Import
   [junit4]   2> 138190 T86 x:x:collection1 C7 oashd.SimplePropertiesWriter.readIndexerProperties WARN Unable to read: dataimport.properties
   [junit4]   2> 138276 T86 x:x:collection1 C7 oashd.DocBuilder.finish Import completed successfully
   [junit4]   2> 138277 T86 x:x:collection1 C7 oasu.DirectUpdateHandler2.commit start commit{,optimize=false,openSearcher=true,waitSearcher=true,expungeDeletes=false,softCommit=false,prepareCommit=false}
   [junit4]   2> 138277 T86 x:x:collection1 C7 oasu.SolrIndexWriter.setCommitData Calling setCommitData with IW:org.apache.solr.update.SolrIndexWriter@66a85a1 commitCommandVersion:0
   [junit4]   2> 138406 T86 x:x:collection1 C7 oass.SolrIndexSearcher.<init> Opening [Searcher@7f1836e9[collection1] main]
   [junit4]   2> 138407 T86 x:x:collection1 C7 oasu.DirectUpdateHandler2.commit end_commit_flush
   [junit4]   2> 138479 T98 x:x:collection1 C7 oasc.SolrCore.registerSearcher [collection1] Registered new searcher Searcher@7f1836e9[collection1] main{ExitableDirectoryReader(UninvertingDirectoryReader(Uninverting(_0(7.2.0):C2)))}
   [junit4]   2> 138479 T86 x:x:collection1 C7 oashd.SimplePropertiesWriter.readIndexerProperties WARN Unable to read: dataimport.properties
   [junit4]   2> 138479 T86 x:x:collection1 C7 oashd.SimplePropertiesWriter.persist Wrote last indexed time to dataimport.properties
   [junit4]   2> 138480 T86 x:x:collection1 C7 oashd.DocBuilder.execute Time taken = 0:0:0.289
   [junit4]   2> 138480 T86 x:x:collection1 C7 oasup.LogUpdateProcessorFactory$LogUpdateProcessor.finish [collection1]  webapp=/solr path=/dataimport params={clean=false&wt=javabin&version=2&command=full-import}{add=[1, 2],commit=} 0 292
   [junit4]   2> 138543 T87 x:x:collection1 C7 oasc.SolrCore.execute [collection1]  webapp=/solr path=/select params={q=*:*&wt=javabin&version=2} hits=2 status=0 QTime=51
   [junit4]   2> 138584 T60 oejs.AbstractConnector.doStop Stopped ServerConnector@4af65ef7{HTTP/1.1,[http/1.1]}{127.0.0.1:0}
   [junit4]   2> 138584 T60 oasc.CoreContainer.shutdown Shutting down CoreContainer instance=381407276
   [junit4]   2> 138585 T60 oasm.SolrMetricManager.closeReporters Closing metric reporters for registry=solr.node, tag=null
   [junit4]   2> 138585 T60 oasmr.SolrJmxReporter.close Closing reporter [org.apache.solr.metrics.reporters.SolrJmxReporter@65721801: rootName = null, domain = solr.node, service url = null, agent id = null] for registry solr.node / com.codahale.metrics.MetricRegistry@284b54eb
   [junit4]   2> 138662 T60 oasm.SolrMetricManager.closeReporters Closing metric reporters for registry=solr.jvm, tag=null
   [junit4]   2> 138663 T60 oasmr.SolrJmxReporter.close Closing reporter [org.apache.solr.metrics.reporters.SolrJmxReporter@74243eff: rootName = null, domain = solr.jvm, service url = null, agent id = null] for registry solr.jvm / com.codahale.metrics.MetricRegistry@4b0ccb21
   [junit4]   2> 138789 T60 oasm.SolrMetricManager.closeReporters Closing metric reporters for registry=solr.jetty, tag=null
   [junit4]   2> 138789 T60 oasmr.SolrJmxReporter.close Closing reporter [org.apache.solr.metrics.reporters.SolrJmxReporter@1f083867: rootName = null, domain = solr.jetty, service url = null, agent id = null] for registry solr.jetty / com.codahale.metrics.MetricRegistry@7e8c73b2
   [junit4]   2> 138798 T102 x:x:collection1 oasc.SolrCore.close [collection1]  CLOSING SolrCore org.apache.solr.core.SolrCore@7d2e42ae
   [junit4]   2> 138799 T102 x:x:collection1 oasm.SolrMetricManager.closeReporters Closing metric reporters for registry=solr.core.collection1, tag=2100183726
   [junit4]   2> 138799 T102 x:x:collection1 oasmr.SolrJmxReporter.close Closing reporter [org.apache.solr.metrics.reporters.SolrJmxReporter@5d5c5b73: rootName = null, domain = solr.core.collection1, service url = null, agent id = null] for registry solr.core.collection1 / com.codahale.metrics.MetricRegistry@2a8b52ff
   [junit4]   2> 139077 T60 oejsh.ContextHandler.doStop Stopped o.e.j.s.ServletContextHandler@640ffe5e{/solr,null,UNAVAILABLE}
   [junit4]   2> 139100 T60 oas.SolrTestCaseJ4.tearDown ###Ending testSimple
   [junit4]   2> NOTE: leaving temporary files on disk at: /home/jenkins/jenkins-slave/workspace/Lucene-Solr-NightlyTests-7.x/checkout/solr/build/contrib/solr-dataimporthandler/test/J1/temp/solr.handler.dataimport.TestContentStreamDataSource_EC8D07AEAB38D403-001
   [junit4]   2> NOTE: test params are: codec=Asserting(Lucene70): {id=PostingsFormat(name=Direct), desc=Lucene50(blocksize=128)}, docValues:{timestamp=DocValuesFormat(name=Direct)}, maxPointsInLeafNode=1670, maxMBSortInHeap=7.65132961917487, sim=RandomSimilarity(queryNorm=false): {}, locale=es-PR, timezone=America/Grand_Turk
   [junit4]   2> NOTE: Linux 4.4.0-83-generic amd64/Oracle Corporation 1.8.0_152 (64-bit)/cpus=4,threads=1,free=232974520,total=397934592
   [junit4]   2> NOTE: All tests run in this JVM: [TestNestedChildren, TestErrorHandling, TestEntityProcessorBase, TestScriptTransformer, TestJdbcDataSourceConvertType, TestNumberFormatTransformer, TestContextImpl, TestFileListEntityProcessor, TestSqlEntityProcessorDelta, TestContentStreamDataSource]
   [junit4] Completed [23/38 (1!)] on J1 in 20.45s, 2 tests, 1 failure <<< FAILURES!

[...truncated 41769 lines...]


---------------------------------------------------------------------
To unsubscribe, e-mail: [hidden email]
For additional commands, e-mail: [hidden email]