[JENKINS] Lucene-Solr-NightlyTests-8.x - Build # 21 - Still unstable

classic Classic list List threaded Threaded
2 messages Options
Reply | Threaded
Open this post in threaded view
|

[JENKINS] Lucene-Solr-NightlyTests-8.x - Build # 21 - Still unstable

Apache Jenkins Server-2
Build: https://builds.apache.org/job/Lucene-Solr-NightlyTests-8.x/21/

2 tests failed.
FAILED:  org.apache.solr.cloud.api.collections.ShardSplitTest.test

Error Message:
SPLITSHARD was not successful even after three tries

Stack Trace:
java.lang.AssertionError: SPLITSHARD was not successful even after three tries
        at __randomizedtesting.SeedInfo.seed([8AC25117A864E334:2966ECD06988ECC]:0)
        at org.junit.Assert.fail(Assert.java:88)
        at org.apache.solr.cloud.api.collections.ShardSplitTest.trySplit(ShardSplitTest.java:946)
        at org.apache.solr.cloud.api.collections.ShardSplitTest.splitByRouteKeyTest(ShardSplitTest.java:920)
        at org.apache.solr.cloud.api.collections.ShardSplitTest.test(ShardSplitTest.java:113)
        at sun.reflect.NativeMethodAccessorImpl.invoke0(Native Method)
        at sun.reflect.NativeMethodAccessorImpl.invoke(NativeMethodAccessorImpl.java:62)
        at sun.reflect.DelegatingMethodAccessorImpl.invoke(DelegatingMethodAccessorImpl.java:43)
        at java.lang.reflect.Method.invoke(Method.java:498)
        at com.carrotsearch.randomizedtesting.RandomizedRunner.invoke(RandomizedRunner.java:1750)
        at com.carrotsearch.randomizedtesting.RandomizedRunner$8.evaluate(RandomizedRunner.java:938)
        at com.carrotsearch.randomizedtesting.RandomizedRunner$9.evaluate(RandomizedRunner.java:974)
        at com.carrotsearch.randomizedtesting.RandomizedRunner$10.evaluate(RandomizedRunner.java:988)
        at org.apache.solr.BaseDistributedSearchTestCase$ShardsRepeatRule$ShardsFixedStatement.callStatement(BaseDistributedSearchTestCase.java:1082)
        at org.apache.solr.BaseDistributedSearchTestCase$ShardsRepeatRule$ShardsStatement.evaluate(BaseDistributedSearchTestCase.java:1054)
        at com.carrotsearch.randomizedtesting.rules.SystemPropertiesRestoreRule$1.evaluate(SystemPropertiesRestoreRule.java:57)
        at org.apache.lucene.util.TestRuleSetupTeardownChained$1.evaluate(TestRuleSetupTeardownChained.java:49)
        at org.apache.lucene.util.AbstractBeforeAfterRule$1.evaluate(AbstractBeforeAfterRule.java:45)
        at org.apache.lucene.util.TestRuleThreadAndTestName$1.evaluate(TestRuleThreadAndTestName.java:48)
        at org.apache.lucene.util.TestRuleIgnoreAfterMaxFailures$1.evaluate(TestRuleIgnoreAfterMaxFailures.java:64)
        at org.apache.lucene.util.TestRuleMarkFailure$1.evaluate(TestRuleMarkFailure.java:47)
        at com.carrotsearch.randomizedtesting.rules.StatementAdapter.evaluate(StatementAdapter.java:36)
        at com.carrotsearch.randomizedtesting.ThreadLeakControl$StatementRunner.run(ThreadLeakControl.java:368)
        at com.carrotsearch.randomizedtesting.ThreadLeakControl.forkTimeoutingTask(ThreadLeakControl.java:817)
        at com.carrotsearch.randomizedtesting.ThreadLeakControl$3.evaluate(ThreadLeakControl.java:468)
        at com.carrotsearch.randomizedtesting.RandomizedRunner.runSingleTest(RandomizedRunner.java:947)
        at com.carrotsearch.randomizedtesting.RandomizedRunner$5.evaluate(RandomizedRunner.java:832)
        at com.carrotsearch.randomizedtesting.RandomizedRunner$6.evaluate(RandomizedRunner.java:883)
        at com.carrotsearch.randomizedtesting.RandomizedRunner$7.evaluate(RandomizedRunner.java:894)
        at com.carrotsearch.randomizedtesting.rules.StatementAdapter.evaluate(StatementAdapter.java:36)
        at com.carrotsearch.randomizedtesting.rules.SystemPropertiesRestoreRule$1.evaluate(SystemPropertiesRestoreRule.java:57)
        at org.apache.lucene.util.AbstractBeforeAfterRule$1.evaluate(AbstractBeforeAfterRule.java:45)
        at com.carrotsearch.randomizedtesting.rules.StatementAdapter.evaluate(StatementAdapter.java:36)
        at org.apache.lucene.util.TestRuleStoreClassName$1.evaluate(TestRuleStoreClassName.java:41)
        at com.carrotsearch.randomizedtesting.rules.NoShadowingOrOverridesOnMethodsRule$1.evaluate(NoShadowingOrOverridesOnMethodsRule.java:40)
        at com.carrotsearch.randomizedtesting.rules.NoShadowingOrOverridesOnMethodsRule$1.evaluate(NoShadowingOrOverridesOnMethodsRule.java:40)
        at com.carrotsearch.randomizedtesting.rules.StatementAdapter.evaluate(StatementAdapter.java:36)
        at com.carrotsearch.randomizedtesting.rules.StatementAdapter.evaluate(StatementAdapter.java:36)
        at com.carrotsearch.randomizedtesting.rules.StatementAdapter.evaluate(StatementAdapter.java:36)
        at org.apache.lucene.util.TestRuleAssertionsRequired$1.evaluate(TestRuleAssertionsRequired.java:53)
        at org.apache.lucene.util.TestRuleMarkFailure$1.evaluate(TestRuleMarkFailure.java:47)
        at org.apache.lucene.util.TestRuleIgnoreAfterMaxFailures$1.evaluate(TestRuleIgnoreAfterMaxFailures.java:64)
        at org.apache.lucene.util.TestRuleIgnoreTestSuites$1.evaluate(TestRuleIgnoreTestSuites.java:54)
        at com.carrotsearch.randomizedtesting.rules.StatementAdapter.evaluate(StatementAdapter.java:36)
        at com.carrotsearch.randomizedtesting.ThreadLeakControl$StatementRunner.run(ThreadLeakControl.java:368)
        at java.lang.Thread.run(Thread.java:748)


FAILED:  junit.framework.TestSuite.org.apache.solr.client.solrj.impl.CloudSolrClientTest

Error Message:
ObjectTracker found 4 object(s) that were not released!!! [MockDirectoryWrapper, MockDirectoryWrapper, SolrCore, RawDirectoryWrapper] org.apache.solr.common.util.ObjectReleaseTracker$ObjectTrackerException: org.apache.lucene.store.MockDirectoryWrapper  at org.apache.solr.common.util.ObjectReleaseTracker.track(ObjectReleaseTracker.java:42)  at org.apache.solr.core.CachingDirectoryFactory.get(CachingDirectoryFactory.java:348)  at org.apache.solr.update.SolrIndexWriter.create(SolrIndexWriter.java:95)  at org.apache.solr.core.SolrCore.initIndex(SolrCore.java:778)  at org.apache.solr.core.SolrCore.<init>(SolrCore.java:975)  at org.apache.solr.core.SolrCore.<init>(SolrCore.java:882)  at org.apache.solr.core.CoreContainer.createFromDescriptor(CoreContainer.java:1189)  at org.apache.solr.core.CoreContainer.create(CoreContainer.java:1099)  at org.apache.solr.handler.admin.CoreAdminOperation.lambda$static$0(CoreAdminOperation.java:92)  at org.apache.solr.handler.admin.CoreAdminOperation.execute(CoreAdminOperation.java:360)  at org.apache.solr.handler.admin.CoreAdminHandler$CallInfo.call(CoreAdminHandler.java:395)  at org.apache.solr.handler.admin.CoreAdminHandler.lambda$handleRequestBody$0(CoreAdminHandler.java:188)  at com.codahale.metrics.InstrumentedExecutorService$InstrumentedRunnable.run(InstrumentedExecutorService.java:176)  at org.apache.solr.common.util.ExecutorUtil$MDCAwareThreadPoolExecutor.lambda$execute$0(ExecutorUtil.java:209)  at java.util.concurrent.ThreadPoolExecutor.runWorker(ThreadPoolExecutor.java:1149)  at java.util.concurrent.ThreadPoolExecutor$Worker.run(ThreadPoolExecutor.java:624)  at java.lang.Thread.run(Thread.java:748)  org.apache.solr.common.util.ObjectReleaseTracker$ObjectTrackerException: org.apache.lucene.store.MockDirectoryWrapper  at org.apache.solr.common.util.ObjectReleaseTracker.track(ObjectReleaseTracker.java:42)  at org.apache.solr.core.CachingDirectoryFactory.get(CachingDirectoryFactory.java:348)  at org.apache.solr.core.SolrCore.getNewIndexDir(SolrCore.java:367)  at org.apache.solr.core.SolrCore.initIndex(SolrCore.java:746)  at org.apache.solr.core.SolrCore.<init>(SolrCore.java:975)  at org.apache.solr.core.SolrCore.<init>(SolrCore.java:882)  at org.apache.solr.core.CoreContainer.createFromDescriptor(CoreContainer.java:1189)  at org.apache.solr.core.CoreContainer.create(CoreContainer.java:1099)  at org.apache.solr.handler.admin.CoreAdminOperation.lambda$static$0(CoreAdminOperation.java:92)  at org.apache.solr.handler.admin.CoreAdminOperation.execute(CoreAdminOperation.java:360)  at org.apache.solr.handler.admin.CoreAdminHandler$CallInfo.call(CoreAdminHandler.java:395)  at org.apache.solr.handler.admin.CoreAdminHandler.lambda$handleRequestBody$0(CoreAdminHandler.java:188)  at com.codahale.metrics.InstrumentedExecutorService$InstrumentedRunnable.run(InstrumentedExecutorService.java:176)  at org.apache.solr.common.util.ExecutorUtil$MDCAwareThreadPoolExecutor.lambda$execute$0(ExecutorUtil.java:209)  at java.util.concurrent.ThreadPoolExecutor.runWorker(ThreadPoolExecutor.java:1149)  at java.util.concurrent.ThreadPoolExecutor$Worker.run(ThreadPoolExecutor.java:624)  at java.lang.Thread.run(Thread.java:748)  org.apache.solr.common.util.ObjectReleaseTracker$ObjectTrackerException: org.apache.solr.core.SolrCore  at org.apache.solr.common.util.ObjectReleaseTracker.track(ObjectReleaseTracker.java:42)  at org.apache.solr.core.SolrCore.<init>(SolrCore.java:1062)  at org.apache.solr.core.SolrCore.<init>(SolrCore.java:882)  at org.apache.solr.core.CoreContainer.createFromDescriptor(CoreContainer.java:1189)  at org.apache.solr.core.CoreContainer.create(CoreContainer.java:1099)  at org.apache.solr.handler.admin.CoreAdminOperation.lambda$static$0(CoreAdminOperation.java:92)  at org.apache.solr.handler.admin.CoreAdminOperation.execute(CoreAdminOperation.java:360)  at org.apache.solr.handler.admin.CoreAdminHandler$CallInfo.call(CoreAdminHandler.java:395)  at org.apache.solr.handler.admin.CoreAdminHandler.lambda$handleRequestBody$0(CoreAdminHandler.java:188)  at com.codahale.metrics.InstrumentedExecutorService$InstrumentedRunnable.run(InstrumentedExecutorService.java:176)  at org.apache.solr.common.util.ExecutorUtil$MDCAwareThreadPoolExecutor.lambda$execute$0(ExecutorUtil.java:209)  at java.util.concurrent.ThreadPoolExecutor.runWorker(ThreadPoolExecutor.java:1149)  at java.util.concurrent.ThreadPoolExecutor$Worker.run(ThreadPoolExecutor.java:624)  at java.lang.Thread.run(Thread.java:748)  org.apache.solr.common.util.ObjectReleaseTracker$ObjectTrackerException: org.apache.lucene.store.RawDirectoryWrapper  at org.apache.solr.common.util.ObjectReleaseTracker.track(ObjectReleaseTracker.java:42)  at org.apache.solr.core.CachingDirectoryFactory.get(CachingDirectoryFactory.java:348)  at org.apache.solr.handler.IndexFetcher.fetchLatestIndex(IndexFetcher.java:509)  at org.apache.solr.handler.IndexFetcher.fetchLatestIndex(IndexFetcher.java:351)  at org.apache.solr.handler.ReplicationHandler.doFetch(ReplicationHandler.java:424)  at org.apache.solr.handler.ReplicationHandler.lambda$setupPolling$13(ReplicationHandler.java:1193)  at java.util.concurrent.Executors$RunnableAdapter.call(Executors.java:511)  at java.util.concurrent.FutureTask.runAndReset(FutureTask.java:308)  at java.util.concurrent.ScheduledThreadPoolExecutor$ScheduledFutureTask.access$301(ScheduledThreadPoolExecutor.java:180)  at java.util.concurrent.ScheduledThreadPoolExecutor$ScheduledFutureTask.run(ScheduledThreadPoolExecutor.java:294)  at java.util.concurrent.ThreadPoolExecutor.runWorker(ThreadPoolExecutor.java:1149)  at java.util.concurrent.ThreadPoolExecutor$Worker.run(ThreadPoolExecutor.java:624)  at java.lang.Thread.run(Thread.java:748)   expected null, but was:<ObjectTracker found 4 object(s) that were not released!!! [MockDirectoryWrapper, MockDirectoryWrapper, SolrCore, RawDirectoryWrapper] org.apache.solr.common.util.ObjectReleaseTracker$ObjectTrackerException: org.apache.lucene.store.MockDirectoryWrapper  at org.apache.solr.common.util.ObjectReleaseTracker.track(ObjectReleaseTracker.java:42)  at org.apache.solr.core.CachingDirectoryFactory.get(CachingDirectoryFactory.java:348)  at org.apache.solr.update.SolrIndexWriter.create(SolrIndexWriter.java:95)  at org.apache.solr.core.SolrCore.initIndex(SolrCore.java:778)  at org.apache.solr.core.SolrCore.<init>(SolrCore.java:975)  at org.apache.solr.core.SolrCore.<init>(SolrCore.java:882)  at org.apache.solr.core.CoreContainer.createFromDescriptor(CoreContainer.java:1189)  at org.apache.solr.core.CoreContainer.create(CoreContainer.java:1099)  at org.apache.solr.handler.admin.CoreAdminOperation.lambda$static$0(CoreAdminOperation.java:92)  at org.apache.solr.handler.admin.CoreAdminOperation.execute(CoreAdminOperation.java:360)  at org.apache.solr.handler.admin.CoreAdminHandler$CallInfo.call(CoreAdminHandler.java:395)  at org.apache.solr.handler.admin.CoreAdminHandler.lambda$handleRequestBody$0(CoreAdminHandler.java:188)  at com.codahale.metrics.InstrumentedExecutorService$InstrumentedRunnable.run(InstrumentedExecutorService.java:176)  at org.apache.solr.common.util.ExecutorUtil$MDCAwareThreadPoolExecutor.lambda$execute$0(ExecutorUtil.java:209)  at java.util.concurrent.ThreadPoolExecutor.runWorker(ThreadPoolExecutor.java:1149)  at java.util.concurrent.ThreadPoolExecutor$Worker.run(ThreadPoolExecutor.java:624)  at java.lang.Thread.run(Thread.java:748)  org.apache.solr.common.util.ObjectReleaseTracker$ObjectTrackerException: org.apache.lucene.store.MockDirectoryWrapper  at org.apache.solr.common.util.ObjectReleaseTracker.track(ObjectReleaseTracker.java:42)  at org.apache.solr.core.CachingDirectoryFactory.get(CachingDirectoryFactory.java:348)  at org.apache.solr.core.SolrCore.getNewIndexDir(SolrCore.java:367)  at org.apache.solr.core.SolrCore.initIndex(SolrCore.java:746)  at org.apache.solr.core.SolrCore.<init>(SolrCore.java:975)  at org.apache.solr.core.SolrCore.<init>(SolrCore.java:882)  at org.apache.solr.core.CoreContainer.createFromDescriptor(CoreContainer.java:1189)  at org.apache.solr.core.CoreContainer.create(CoreContainer.java:1099)  at org.apache.solr.handler.admin.CoreAdminOperation.lambda$static$0(CoreAdminOperation.java:92)  at org.apache.solr.handler.admin.CoreAdminOperation.execute(CoreAdminOperation.java:360)  at org.apache.solr.handler.admin.CoreAdminHandler$CallInfo.call(CoreAdminHandler.java:395)  at org.apache.solr.handler.admin.CoreAdminHandler.lambda$handleRequestBody$0(CoreAdminHandler.java:188)  at com.codahale.metrics.InstrumentedExecutorService$InstrumentedRunnable.run(InstrumentedExecutorService.java:176)  at org.apache.solr.common.util.ExecutorUtil$MDCAwareThreadPoolExecutor.lambda$execute$0(ExecutorUtil.java:209)  at java.util.concurrent.ThreadPoolExecutor.runWorker(ThreadPoolExecutor.java:1149)  at java.util.concurrent.ThreadPoolExecutor$Worker.run(ThreadPoolExecutor.java:624)  at java.lang.Thread.run(Thread.java:748)  org.apache.solr.common.util.ObjectReleaseTracker$ObjectTrackerException: org.apache.solr.core.SolrCore  at org.apache.solr.common.util.ObjectReleaseTracker.track(ObjectReleaseTracker.java:42)  at org.apache.solr.core.SolrCore.<init>(SolrCore.java:1062)  at org.apache.solr.core.SolrCore.<init>(SolrCore.java:882)  at org.apache.solr.core.CoreContainer.createFromDescriptor(CoreContainer.java:1189)  at org.apache.solr.core.CoreContainer.create(CoreContainer.java:1099)  at org.apache.solr.handler.admin.CoreAdminOperation.lambda$static$0(CoreAdminOperation.java:92)  at org.apache.solr.handler.admin.CoreAdminOperation.execute(CoreAdminOperation.java:360)  at org.apache.solr.handler.admin.CoreAdminHandler$CallInfo.call(CoreAdminHandler.java:395)  at org.apache.solr.handler.admin.CoreAdminHandler.lambda$handleRequestBody$0(CoreAdminHandler.java:188)  at com.codahale.metrics.InstrumentedExecutorService$InstrumentedRunnable.run(InstrumentedExecutorService.java:176)  at org.apache.solr.common.util.ExecutorUtil$MDCAwareThreadPoolExecutor.lambda$execute$0(ExecutorUtil.java:209)  at java.util.concurrent.ThreadPoolExecutor.runWorker(ThreadPoolExecutor.java:1149)  at java.util.concurrent.ThreadPoolExecutor$Worker.run(ThreadPoolExecutor.java:624)  at java.lang.Thread.run(Thread.java:748)  org.apache.solr.common.util.ObjectReleaseTracker$ObjectTrackerException: org.apache.lucene.store.RawDirectoryWrapper  at org.apache.solr.common.util.ObjectReleaseTracker.track(ObjectReleaseTracker.java:42)  at org.apache.solr.core.CachingDirectoryFactory.get(CachingDirectoryFactory.java:348)  at org.apache.solr.handler.IndexFetcher.fetchLatestIndex(IndexFetcher.java:509)  at org.apache.solr.handler.IndexFetcher.fetchLatestIndex(IndexFetcher.java:351)  at org.apache.solr.handler.ReplicationHandler.doFetch(ReplicationHandler.java:424)  at org.apache.solr.handler.ReplicationHandler.lambda$setupPolling$13(ReplicationHandler.java:1193)  at java.util.concurrent.Executors$RunnableAdapter.call(Executors.java:511)  at java.util.concurrent.FutureTask.runAndReset(FutureTask.java:308)  at java.util.concurrent.ScheduledThreadPoolExecutor$ScheduledFutureTask.access$301(ScheduledThreadPoolExecutor.java:180)  at java.util.concurrent.ScheduledThreadPoolExecutor$ScheduledFutureTask.run(ScheduledThreadPoolExecutor.java:294)  at java.util.concurrent.ThreadPoolExecutor.runWorker(ThreadPoolExecutor.java:1149)  at java.util.concurrent.ThreadPoolExecutor$Worker.run(ThreadPoolExecutor.java:624)  at java.lang.Thread.run(Thread.java:748)  >

Stack Trace:
java.lang.AssertionError: ObjectTracker found 4 object(s) that were not released!!! [MockDirectoryWrapper, MockDirectoryWrapper, SolrCore, RawDirectoryWrapper]
org.apache.solr.common.util.ObjectReleaseTracker$ObjectTrackerException: org.apache.lucene.store.MockDirectoryWrapper
        at org.apache.solr.common.util.ObjectReleaseTracker.track(ObjectReleaseTracker.java:42)
        at org.apache.solr.core.CachingDirectoryFactory.get(CachingDirectoryFactory.java:348)
        at org.apache.solr.update.SolrIndexWriter.create(SolrIndexWriter.java:95)
        at org.apache.solr.core.SolrCore.initIndex(SolrCore.java:778)
        at org.apache.solr.core.SolrCore.<init>(SolrCore.java:975)
        at org.apache.solr.core.SolrCore.<init>(SolrCore.java:882)
        at org.apache.solr.core.CoreContainer.createFromDescriptor(CoreContainer.java:1189)
        at org.apache.solr.core.CoreContainer.create(CoreContainer.java:1099)
        at org.apache.solr.handler.admin.CoreAdminOperation.lambda$static$0(CoreAdminOperation.java:92)
        at org.apache.solr.handler.admin.CoreAdminOperation.execute(CoreAdminOperation.java:360)
        at org.apache.solr.handler.admin.CoreAdminHandler$CallInfo.call(CoreAdminHandler.java:395)
        at org.apache.solr.handler.admin.CoreAdminHandler.lambda$handleRequestBody$0(CoreAdminHandler.java:188)
        at com.codahale.metrics.InstrumentedExecutorService$InstrumentedRunnable.run(InstrumentedExecutorService.java:176)
        at org.apache.solr.common.util.ExecutorUtil$MDCAwareThreadPoolExecutor.lambda$execute$0(ExecutorUtil.java:209)
        at java.util.concurrent.ThreadPoolExecutor.runWorker(ThreadPoolExecutor.java:1149)
        at java.util.concurrent.ThreadPoolExecutor$Worker.run(ThreadPoolExecutor.java:624)
        at java.lang.Thread.run(Thread.java:748)

org.apache.solr.common.util.ObjectReleaseTracker$ObjectTrackerException: org.apache.lucene.store.MockDirectoryWrapper
        at org.apache.solr.common.util.ObjectReleaseTracker.track(ObjectReleaseTracker.java:42)
        at org.apache.solr.core.CachingDirectoryFactory.get(CachingDirectoryFactory.java:348)
        at org.apache.solr.core.SolrCore.getNewIndexDir(SolrCore.java:367)
        at org.apache.solr.core.SolrCore.initIndex(SolrCore.java:746)
        at org.apache.solr.core.SolrCore.<init>(SolrCore.java:975)
        at org.apache.solr.core.SolrCore.<init>(SolrCore.java:882)
        at org.apache.solr.core.CoreContainer.createFromDescriptor(CoreContainer.java:1189)
        at org.apache.solr.core.CoreContainer.create(CoreContainer.java:1099)
        at org.apache.solr.handler.admin.CoreAdminOperation.lambda$static$0(CoreAdminOperation.java:92)
        at org.apache.solr.handler.admin.CoreAdminOperation.execute(CoreAdminOperation.java:360)
        at org.apache.solr.handler.admin.CoreAdminHandler$CallInfo.call(CoreAdminHandler.java:395)
        at org.apache.solr.handler.admin.CoreAdminHandler.lambda$handleRequestBody$0(CoreAdminHandler.java:188)
        at com.codahale.metrics.InstrumentedExecutorService$InstrumentedRunnable.run(InstrumentedExecutorService.java:176)
        at org.apache.solr.common.util.ExecutorUtil$MDCAwareThreadPoolExecutor.lambda$execute$0(ExecutorUtil.java:209)
        at java.util.concurrent.ThreadPoolExecutor.runWorker(ThreadPoolExecutor.java:1149)
        at java.util.concurrent.ThreadPoolExecutor$Worker.run(ThreadPoolExecutor.java:624)
        at java.lang.Thread.run(Thread.java:748)

org.apache.solr.common.util.ObjectReleaseTracker$ObjectTrackerException: org.apache.solr.core.SolrCore
        at org.apache.solr.common.util.ObjectReleaseTracker.track(ObjectReleaseTracker.java:42)
        at org.apache.solr.core.SolrCore.<init>(SolrCore.java:1062)
        at org.apache.solr.core.SolrCore.<init>(SolrCore.java:882)
        at org.apache.solr.core.CoreContainer.createFromDescriptor(CoreContainer.java:1189)
        at org.apache.solr.core.CoreContainer.create(CoreContainer.java:1099)
        at org.apache.solr.handler.admin.CoreAdminOperation.lambda$static$0(CoreAdminOperation.java:92)
        at org.apache.solr.handler.admin.CoreAdminOperation.execute(CoreAdminOperation.java:360)
        at org.apache.solr.handler.admin.CoreAdminHandler$CallInfo.call(CoreAdminHandler.java:395)
        at org.apache.solr.handler.admin.CoreAdminHandler.lambda$handleRequestBody$0(CoreAdminHandler.java:188)
        at com.codahale.metrics.InstrumentedExecutorService$InstrumentedRunnable.run(InstrumentedExecutorService.java:176)
        at org.apache.solr.common.util.ExecutorUtil$MDCAwareThreadPoolExecutor.lambda$execute$0(ExecutorUtil.java:209)
        at java.util.concurrent.ThreadPoolExecutor.runWorker(ThreadPoolExecutor.java:1149)
        at java.util.concurrent.ThreadPoolExecutor$Worker.run(ThreadPoolExecutor.java:624)
        at java.lang.Thread.run(Thread.java:748)

org.apache.solr.common.util.ObjectReleaseTracker$ObjectTrackerException: org.apache.lucene.store.RawDirectoryWrapper
        at org.apache.solr.common.util.ObjectReleaseTracker.track(ObjectReleaseTracker.java:42)
        at org.apache.solr.core.CachingDirectoryFactory.get(CachingDirectoryFactory.java:348)
        at org.apache.solr.handler.IndexFetcher.fetchLatestIndex(IndexFetcher.java:509)
        at org.apache.solr.handler.IndexFetcher.fetchLatestIndex(IndexFetcher.java:351)
        at org.apache.solr.handler.ReplicationHandler.doFetch(ReplicationHandler.java:424)
        at org.apache.solr.handler.ReplicationHandler.lambda$setupPolling$13(ReplicationHandler.java:1193)
        at java.util.concurrent.Executors$RunnableAdapter.call(Executors.java:511)
        at java.util.concurrent.FutureTask.runAndReset(FutureTask.java:308)
        at java.util.concurrent.ScheduledThreadPoolExecutor$ScheduledFutureTask.access$301(ScheduledThreadPoolExecutor.java:180)
        at java.util.concurrent.ScheduledThreadPoolExecutor$ScheduledFutureTask.run(ScheduledThreadPoolExecutor.java:294)
        at java.util.concurrent.ThreadPoolExecutor.runWorker(ThreadPoolExecutor.java:1149)
        at java.util.concurrent.ThreadPoolExecutor$Worker.run(ThreadPoolExecutor.java:624)
        at java.lang.Thread.run(Thread.java:748)

 expected null, but was:<ObjectTracker found 4 object(s) that were not released!!! [MockDirectoryWrapper, MockDirectoryWrapper, SolrCore, RawDirectoryWrapper]
org.apache.solr.common.util.ObjectReleaseTracker$ObjectTrackerException: org.apache.lucene.store.MockDirectoryWrapper
        at org.apache.solr.common.util.ObjectReleaseTracker.track(ObjectReleaseTracker.java:42)
        at org.apache.solr.core.CachingDirectoryFactory.get(CachingDirectoryFactory.java:348)
        at org.apache.solr.update.SolrIndexWriter.create(SolrIndexWriter.java:95)
        at org.apache.solr.core.SolrCore.initIndex(SolrCore.java:778)
        at org.apache.solr.core.SolrCore.<init>(SolrCore.java:975)
        at org.apache.solr.core.SolrCore.<init>(SolrCore.java:882)
        at org.apache.solr.core.CoreContainer.createFromDescriptor(CoreContainer.java:1189)
        at org.apache.solr.core.CoreContainer.create(CoreContainer.java:1099)
        at org.apache.solr.handler.admin.CoreAdminOperation.lambda$static$0(CoreAdminOperation.java:92)
        at org.apache.solr.handler.admin.CoreAdminOperation.execute(CoreAdminOperation.java:360)
        at org.apache.solr.handler.admin.CoreAdminHandler$CallInfo.call(CoreAdminHandler.java:395)
        at org.apache.solr.handler.admin.CoreAdminHandler.lambda$handleRequestBody$0(CoreAdminHandler.java:188)
        at com.codahale.metrics.InstrumentedExecutorService$InstrumentedRunnable.run(InstrumentedExecutorService.java:176)
        at org.apache.solr.common.util.ExecutorUtil$MDCAwareThreadPoolExecutor.lambda$execute$0(ExecutorUtil.java:209)
        at java.util.concurrent.ThreadPoolExecutor.runWorker(ThreadPoolExecutor.java:1149)
        at java.util.concurrent.ThreadPoolExecutor$Worker.run(ThreadPoolExecutor.java:624)
        at java.lang.Thread.run(Thread.java:748)

org.apache.solr.common.util.ObjectReleaseTracker$ObjectTrackerException: org.apache.lucene.store.MockDirectoryWrapper
        at org.apache.solr.common.util.ObjectReleaseTracker.track(ObjectReleaseTracker.java:42)
        at org.apache.solr.core.CachingDirectoryFactory.get(CachingDirectoryFactory.java:348)
        at org.apache.solr.core.SolrCore.getNewIndexDir(SolrCore.java:367)
        at org.apache.solr.core.SolrCore.initIndex(SolrCore.java:746)
        at org.apache.solr.core.SolrCore.<init>(SolrCore.java:975)
        at org.apache.solr.core.SolrCore.<init>(SolrCore.java:882)
        at org.apache.solr.core.CoreContainer.createFromDescriptor(CoreContainer.java:1189)
        at org.apache.solr.core.CoreContainer.create(CoreContainer.java:1099)
        at org.apache.solr.handler.admin.CoreAdminOperation.lambda$static$0(CoreAdminOperation.java:92)
        at org.apache.solr.handler.admin.CoreAdminOperation.execute(CoreAdminOperation.java:360)
        at org.apache.solr.handler.admin.CoreAdminHandler$CallInfo.call(CoreAdminHandler.java:395)
        at org.apache.solr.handler.admin.CoreAdminHandler.lambda$handleRequestBody$0(CoreAdminHandler.java:188)
        at com.codahale.metrics.InstrumentedExecutorService$InstrumentedRunnable.run(InstrumentedExecutorService.java:176)
        at org.apache.solr.common.util.ExecutorUtil$MDCAwareThreadPoolExecutor.lambda$execute$0(ExecutorUtil.java:209)
        at java.util.concurrent.ThreadPoolExecutor.runWorker(ThreadPoolExecutor.java:1149)
        at java.util.concurrent.ThreadPoolExecutor$Worker.run(ThreadPoolExecutor.java:624)
        at java.lang.Thread.run(Thread.java:748)

org.apache.solr.common.util.ObjectReleaseTracker$ObjectTrackerException: org.apache.solr.core.SolrCore
        at org.apache.solr.common.util.ObjectReleaseTracker.track(ObjectReleaseTracker.java:42)
        at org.apache.solr.core.SolrCore.<init>(SolrCore.java:1062)
        at org.apache.solr.core.SolrCore.<init>(SolrCore.java:882)
        at org.apache.solr.core.CoreContainer.createFromDescriptor(CoreContainer.java:1189)
        at org.apache.solr.core.CoreContainer.create(CoreContainer.java:1099)
        at org.apache.solr.handler.admin.CoreAdminOperation.lambda$static$0(CoreAdminOperation.java:92)
        at org.apache.solr.handler.admin.CoreAdminOperation.execute(CoreAdminOperation.java:360)
        at org.apache.solr.handler.admin.CoreAdminHandler$CallInfo.call(CoreAdminHandler.java:395)
        at org.apache.solr.handler.admin.CoreAdminHandler.lambda$handleRequestBody$0(CoreAdminHandler.java:188)
        at com.codahale.metrics.InstrumentedExecutorService$InstrumentedRunnable.run(InstrumentedExecutorService.java:176)
        at org.apache.solr.common.util.ExecutorUtil$MDCAwareThreadPoolExecutor.lambda$execute$0(ExecutorUtil.java:209)
        at java.util.concurrent.ThreadPoolExecutor.runWorker(ThreadPoolExecutor.java:1149)
        at java.util.concurrent.ThreadPoolExecutor$Worker.run(ThreadPoolExecutor.java:624)
        at java.lang.Thread.run(Thread.java:748)

org.apache.solr.common.util.ObjectReleaseTracker$ObjectTrackerException: org.apache.lucene.store.RawDirectoryWrapper
        at org.apache.solr.common.util.ObjectReleaseTracker.track(ObjectReleaseTracker.java:42)
        at org.apache.solr.core.CachingDirectoryFactory.get(CachingDirectoryFactory.java:348)
        at org.apache.solr.handler.IndexFetcher.fetchLatestIndex(IndexFetcher.java:509)
        at org.apache.solr.handler.IndexFetcher.fetchLatestIndex(IndexFetcher.java:351)
        at org.apache.solr.handler.ReplicationHandler.doFetch(ReplicationHandler.java:424)
        at org.apache.solr.handler.ReplicationHandler.lambda$setupPolling$13(ReplicationHandler.java:1193)
        at java.util.concurrent.Executors$RunnableAdapter.call(Executors.java:511)
        at java.util.concurrent.FutureTask.runAndReset(FutureTask.java:308)
        at java.util.concurrent.ScheduledThreadPoolExecutor$ScheduledFutureTask.access$301(ScheduledThreadPoolExecutor.java:180)
        at java.util.concurrent.ScheduledThreadPoolExecutor$ScheduledFutureTask.run(ScheduledThreadPoolExecutor.java:294)
        at java.util.concurrent.ThreadPoolExecutor.runWorker(ThreadPoolExecutor.java:1149)
        at java.util.concurrent.ThreadPoolExecutor$Worker.run(ThreadPoolExecutor.java:624)
        at java.lang.Thread.run(Thread.java:748)

>
        at __randomizedtesting.SeedInfo.seed([E6EC7CF6CAC10ADE]:0)
        at org.junit.Assert.fail(Assert.java:88)
        at org.junit.Assert.failNotNull(Assert.java:755)
        at org.junit.Assert.assertNull(Assert.java:737)
        at org.apache.solr.SolrTestCaseJ4.teardownTestCases(SolrTestCaseJ4.java:322)
        at sun.reflect.GeneratedMethodAccessor43.invoke(Unknown Source)
        at sun.reflect.DelegatingMethodAccessorImpl.invoke(DelegatingMethodAccessorImpl.java:43)
        at java.lang.reflect.Method.invoke(Method.java:498)
        at com.carrotsearch.randomizedtesting.RandomizedRunner.invoke(RandomizedRunner.java:1750)
        at com.carrotsearch.randomizedtesting.RandomizedRunner$7.evaluate(RandomizedRunner.java:901)
        at com.carrotsearch.randomizedtesting.rules.StatementAdapter.evaluate(StatementAdapter.java:36)
        at com.carrotsearch.randomizedtesting.rules.SystemPropertiesRestoreRule$1.evaluate(SystemPropertiesRestoreRule.java:57)
        at org.apache.lucene.util.AbstractBeforeAfterRule$1.evaluate(AbstractBeforeAfterRule.java:45)
        at com.carrotsearch.randomizedtesting.rules.StatementAdapter.evaluate(StatementAdapter.java:36)
        at org.apache.lucene.util.TestRuleStoreClassName$1.evaluate(TestRuleStoreClassName.java:41)
        at com.carrotsearch.randomizedtesting.rules.NoShadowingOrOverridesOnMethodsRule$1.evaluate(NoShadowingOrOverridesOnMethodsRule.java:40)
        at com.carrotsearch.randomizedtesting.rules.NoShadowingOrOverridesOnMethodsRule$1.evaluate(NoShadowingOrOverridesOnMethodsRule.java:40)
        at com.carrotsearch.randomizedtesting.rules.StatementAdapter.evaluate(StatementAdapter.java:36)
        at com.carrotsearch.randomizedtesting.rules.StatementAdapter.evaluate(StatementAdapter.java:36)
        at com.carrotsearch.randomizedtesting.rules.StatementAdapter.evaluate(StatementAdapter.java:36)
        at org.apache.lucene.util.TestRuleAssertionsRequired$1.evaluate(TestRuleAssertionsRequired.java:53)
        at org.apache.lucene.util.TestRuleMarkFailure$1.evaluate(TestRuleMarkFailure.java:47)
        at org.apache.lucene.util.TestRuleIgnoreAfterMaxFailures$1.evaluate(TestRuleIgnoreAfterMaxFailures.java:64)
        at org.apache.lucene.util.TestRuleIgnoreTestSuites$1.evaluate(TestRuleIgnoreTestSuites.java:54)
        at com.carrotsearch.randomizedtesting.rules.StatementAdapter.evaluate(StatementAdapter.java:36)
        at com.carrotsearch.randomizedtesting.ThreadLeakControl$StatementRunner.run(ThreadLeakControl.java:368)
        at java.lang.Thread.run(Thread.java:748)




Build Log:
[...truncated 15243 lines...]
   [junit4] Suite: org.apache.solr.cloud.api.collections.ShardSplitTest
   [junit4]   2> 3022374 INFO  (SUITE-ShardSplitTest-seed#[8AC25117A864E334]-worker) [    ] o.a.s.SolrTestCaseJ4 SecureRandom sanity checks: test.solr.allowed.securerandom=null & java.security.egd=file:/dev/./urandom
   [junit4]   2> Creating dataDir: /x1/jenkins/jenkins-slave/workspace/Lucene-Solr-NightlyTests-8.x/checkout/solr/build/solr-core/test/J0/temp/solr.cloud.api.collections.ShardSplitTest_8AC25117A864E334-001/init-core-data-001
   [junit4]   2> 3022376 INFO  (SUITE-ShardSplitTest-seed#[8AC25117A864E334]-worker) [    ] o.a.s.SolrTestCaseJ4 Using PointFields (NUMERIC_POINTS_SYSPROP=true) w/NUMERIC_DOCVALUES_SYSPROP=false
   [junit4]   2> 3022377 INFO  (SUITE-ShardSplitTest-seed#[8AC25117A864E334]-worker) [    ] o.a.s.SolrTestCaseJ4 Randomized ssl (false) and clientAuth (false) via: @org.apache.solr.SolrTestCaseJ4$SuppressSSL(bugUrl=https://issues.apache.org/jira/browse/SOLR-5776)
   [junit4]   2> 3022377 INFO  (SUITE-ShardSplitTest-seed#[8AC25117A864E334]-worker) [    ] o.a.s.BaseDistributedSearchTestCase Setting hostContext system property: /fdr/x
   [junit4]   2> 3022385 INFO  (TEST-ShardSplitTest.testSplitLocking-seed#[8AC25117A864E334]) [    ] o.a.s.c.ZkTestServer STARTING ZK TEST SERVER
   [junit4]   2> 3022390 INFO  (ZkTestServer Run Thread) [    ] o.a.s.c.ZkTestServer client port:0.0.0.0/0.0.0.0:0
   [junit4]   2> 3022390 INFO  (ZkTestServer Run Thread) [    ] o.a.s.c.ZkTestServer Starting server
   [junit4]   2> 3022490 INFO  (TEST-ShardSplitTest.testSplitLocking-seed#[8AC25117A864E334]) [    ] o.a.s.c.ZkTestServer start zk server on port:45205
   [junit4]   2> 3022490 INFO  (TEST-ShardSplitTest.testSplitLocking-seed#[8AC25117A864E334]) [    ] o.a.s.c.ZkTestServer parse host and port list: 127.0.0.1:45205
   [junit4]   2> 3022490 INFO  (TEST-ShardSplitTest.testSplitLocking-seed#[8AC25117A864E334]) [    ] o.a.s.c.ZkTestServer connecting to 127.0.0.1 45205
   [junit4]   2> 3022497 INFO  (zkConnectionManagerCallback-15082-thread-1) [    ] o.a.s.c.c.ConnectionManager zkClient has connected
   [junit4]   2> 3022503 INFO  (zkConnectionManagerCallback-15084-thread-1) [    ] o.a.s.c.c.ConnectionManager zkClient has connected
   [junit4]   2> 3022505 INFO  (TEST-ShardSplitTest.testSplitLocking-seed#[8AC25117A864E334]) [    ] o.a.s.c.ZkTestServer put /x1/jenkins/jenkins-slave/workspace/Lucene-Solr-NightlyTests-8.x/checkout/solr/core/src/test-files/solr/collection1/conf/solrconfig-tlog.xml to /configs/conf1/solrconfig.xml
   [junit4]   2> 3022506 INFO  (TEST-ShardSplitTest.testSplitLocking-seed#[8AC25117A864E334]) [    ] o.a.s.c.ZkTestServer put /x1/jenkins/jenkins-slave/workspace/Lucene-Solr-NightlyTests-8.x/checkout/solr/core/src/test-files/solr/collection1/conf/schema15.xml to /configs/conf1/schema.xml
   [junit4]   2> 3022508 INFO  (TEST-ShardSplitTest.testSplitLocking-seed#[8AC25117A864E334]) [    ] o.a.s.c.ZkTestServer put /x1/jenkins/jenkins-slave/workspace/Lucene-Solr-NightlyTests-8.x/checkout/solr/core/src/test-files/solr/collection1/conf/solrconfig.snippet.randomindexconfig.xml to /configs/conf1/solrconfig.snippet.randomindexconfig.xml
   [junit4]   2> 3022509 INFO  (TEST-ShardSplitTest.testSplitLocking-seed#[8AC25117A864E334]) [    ] o.a.s.c.ZkTestServer put /x1/jenkins/jenkins-slave/workspace/Lucene-Solr-NightlyTests-8.x/checkout/solr/core/src/test-files/solr/collection1/conf/stopwords.txt to /configs/conf1/stopwords.txt
   [junit4]   2> 3022510 INFO  (TEST-ShardSplitTest.testSplitLocking-seed#[8AC25117A864E334]) [    ] o.a.s.c.ZkTestServer put /x1/jenkins/jenkins-slave/workspace/Lucene-Solr-NightlyTests-8.x/checkout/solr/core/src/test-files/solr/collection1/conf/protwords.txt to /configs/conf1/protwords.txt
   [junit4]   2> 3022512 INFO  (TEST-ShardSplitTest.testSplitLocking-seed#[8AC25117A864E334]) [    ] o.a.s.c.ZkTestServer put /x1/jenkins/jenkins-slave/workspace/Lucene-Solr-NightlyTests-8.x/checkout/solr/core/src/test-files/solr/collection1/conf/currency.xml to /configs/conf1/currency.xml
   [junit4]   2> 3022513 INFO  (TEST-ShardSplitTest.testSplitLocking-seed#[8AC25117A864E334]) [    ] o.a.s.c.ZkTestServer put /x1/jenkins/jenkins-slave/workspace/Lucene-Solr-NightlyTests-8.x/checkout/solr/core/src/test-files/solr/collection1/conf/enumsConfig.xml to /configs/conf1/enumsConfig.xml
   [junit4]   2> 3022514 INFO  (TEST-ShardSplitTest.testSplitLocking-seed#[8AC25117A864E334]) [    ] o.a.s.c.ZkTestServer put /x1/jenkins/jenkins-slave/workspace/Lucene-Solr-NightlyTests-8.x/checkout/solr/core/src/test-files/solr/collection1/conf/open-exchange-rates.json to /configs/conf1/open-exchange-rates.json
   [junit4]   2> 3022515 INFO  (TEST-ShardSplitTest.testSplitLocking-seed#[8AC25117A864E334]) [    ] o.a.s.c.ZkTestServer put /x1/jenkins/jenkins-slave/workspace/Lucene-Solr-NightlyTests-8.x/checkout/solr/core/src/test-files/solr/collection1/conf/mapping-ISOLatin1Accent.txt to /configs/conf1/mapping-ISOLatin1Accent.txt
   [junit4]   2> 3022516 INFO  (TEST-ShardSplitTest.testSplitLocking-seed#[8AC25117A864E334]) [    ] o.a.s.c.ZkTestServer put /x1/jenkins/jenkins-slave/workspace/Lucene-Solr-NightlyTests-8.x/checkout/solr/core/src/test-files/solr/collection1/conf/old_synonyms.txt to /configs/conf1/old_synonyms.txt
   [junit4]   2> 3022517 INFO  (TEST-ShardSplitTest.testSplitLocking-seed#[8AC25117A864E334]) [    ] o.a.s.c.ZkTestServer put /x1/jenkins/jenkins-slave/workspace/Lucene-Solr-NightlyTests-8.x/checkout/solr/core/src/test-files/solr/collection1/conf/synonyms.txt to /configs/conf1/synonyms.txt
   [junit4]   2> 3022518 INFO  (TEST-ShardSplitTest.testSplitLocking-seed#[8AC25117A864E334]) [    ] o.a.s.c.AbstractFullDistribZkTestBase Will use NRT replicas unless explicitly asked otherwise
   [junit4]   2> 3022695 WARN  (TEST-ShardSplitTest.testSplitLocking-seed#[8AC25117A864E334]) [    ] o.e.j.s.AbstractConnector Ignoring deprecated socket close linger time
   [junit4]   2> 3022695 INFO  (TEST-ShardSplitTest.testSplitLocking-seed#[8AC25117A864E334]) [    ] o.a.s.c.s.e.JettySolrRunner Start Jetty (original configured port=0)
   [junit4]   2> 3022695 INFO  (TEST-ShardSplitTest.testSplitLocking-seed#[8AC25117A864E334]) [    ] o.a.s.c.s.e.JettySolrRunner Trying to start Jetty on port 0 try number 1 ...
   [junit4]   2> 3022695 INFO  (TEST-ShardSplitTest.testSplitLocking-seed#[8AC25117A864E334]) [    ] o.e.j.s.Server jetty-9.4.14.v20181114; built: 2018-11-14T21:20:31.478Z; git: c4550056e785fb5665914545889f21dc136ad9e6; jvm 1.8.0_191-b12
   [junit4]   2> 3022696 INFO  (TEST-ShardSplitTest.testSplitLocking-seed#[8AC25117A864E334]) [    ] o.e.j.s.session DefaultSessionIdManager workerName=node0
   [junit4]   2> 3022696 INFO  (TEST-ShardSplitTest.testSplitLocking-seed#[8AC25117A864E334]) [    ] o.e.j.s.session No SessionScavenger set, using defaults
   [junit4]   2> 3022696 INFO  (TEST-ShardSplitTest.testSplitLocking-seed#[8AC25117A864E334]) [    ] o.e.j.s.session node0 Scavenging every 600000ms
   [junit4]   2> 3022699 INFO  (TEST-ShardSplitTest.testSplitLocking-seed#[8AC25117A864E334]) [    ] o.e.j.s.h.ContextHandler Started o.e.j.s.ServletContextHandler@7822a440{/fdr/x,null,AVAILABLE}
   [junit4]   2> 3022699 INFO  (TEST-ShardSplitTest.testSplitLocking-seed#[8AC25117A864E334]) [    ] o.e.j.s.AbstractConnector Started ServerConnector@1ecda4b4{HTTP/1.1,[http/1.1, h2c]}{127.0.0.1:45030}
   [junit4]   2> 3022699 INFO  (TEST-ShardSplitTest.testSplitLocking-seed#[8AC25117A864E334]) [    ] o.e.j.s.Server Started @3022763ms
   [junit4]   2> 3022699 INFO  (TEST-ShardSplitTest.testSplitLocking-seed#[8AC25117A864E334]) [    ] o.a.s.c.s.e.JettySolrRunner Jetty properties: {solr.data.dir=/x1/jenkins/jenkins-slave/workspace/Lucene-Solr-NightlyTests-8.x/checkout/solr/build/solr-core/test/J0/temp/solr.cloud.api.collections.ShardSplitTest_8AC25117A864E334-001/tempDir-001/control/data, replicaType=NRT, hostContext=/fdr/x, hostPort=45030, coreRootDirectory=/x1/jenkins/jenkins-slave/workspace/Lucene-Solr-NightlyTests-8.x/checkout/solr/build/solr-core/test/J0/temp/solr.cloud.api.collections.ShardSplitTest_8AC25117A864E334-001/control-001/cores}
   [junit4]   2> 3022700 ERROR (TEST-ShardSplitTest.testSplitLocking-seed#[8AC25117A864E334]) [    ] o.a.s.u.StartupLoggingUtils Missing Java Option solr.log.dir. Logging may be missing or incomplete.
   [junit4]   2> 3022700 INFO  (TEST-ShardSplitTest.testSplitLocking-seed#[8AC25117A864E334]) [    ] o.a.s.s.SolrDispatchFilter Using logger factory org.apache.logging.slf4j.Log4jLoggerFactory
   [junit4]   2> 3022700 INFO  (TEST-ShardSplitTest.testSplitLocking-seed#[8AC25117A864E334]) [    ] o.a.s.s.SolrDispatchFilter  ___      _       Welcome to Apache Solr™ version 8.1.0
   [junit4]   2> 3022700 INFO  (TEST-ShardSplitTest.testSplitLocking-seed#[8AC25117A864E334]) [    ] o.a.s.s.SolrDispatchFilter / __| ___| |_ _   Starting in cloud mode on port null
   [junit4]   2> 3022700 INFO  (TEST-ShardSplitTest.testSplitLocking-seed#[8AC25117A864E334]) [    ] o.a.s.s.SolrDispatchFilter \__ \/ _ \ | '_|  Install dir: null
   [junit4]   2> 3022700 INFO  (TEST-ShardSplitTest.testSplitLocking-seed#[8AC25117A864E334]) [    ] o.a.s.s.SolrDispatchFilter |___/\___/_|_|    Start time: 2019-02-12T16:07:36.193Z
   [junit4]   2> 3022702 INFO  (zkConnectionManagerCallback-15086-thread-1) [    ] o.a.s.c.c.ConnectionManager zkClient has connected
   [junit4]   2> 3022703 INFO  (TEST-ShardSplitTest.testSplitLocking-seed#[8AC25117A864E334]) [    ] o.a.s.s.SolrDispatchFilter Loading solr.xml from SolrHome (not found in ZooKeeper)
   [junit4]   2> 3022703 INFO  (TEST-ShardSplitTest.testSplitLocking-seed#[8AC25117A864E334]) [    ] o.a.s.c.SolrXmlConfig Loading container configuration from /x1/jenkins/jenkins-slave/workspace/Lucene-Solr-NightlyTests-8.x/checkout/solr/build/solr-core/test/J0/temp/solr.cloud.api.collections.ShardSplitTest_8AC25117A864E334-001/control-001/solr.xml
   [junit4]   2> 3022708 INFO  (TEST-ShardSplitTest.testSplitLocking-seed#[8AC25117A864E334]) [    ] o.a.s.c.SolrXmlConfig Configuration parameter autoReplicaFailoverWorkLoopDelay is ignored
   [junit4]   2> 3022708 INFO  (TEST-ShardSplitTest.testSplitLocking-seed#[8AC25117A864E334]) [    ] o.a.s.c.SolrXmlConfig Configuration parameter autoReplicaFailoverBadNodeExpiration is ignored
   [junit4]   2> 3022710 INFO  (TEST-ShardSplitTest.testSplitLocking-seed#[8AC25117A864E334]) [    ] o.a.s.c.SolrXmlConfig MBean server found: com.sun.jmx.mbeanserver.JmxMBeanServer@4ca16c27, but no JMX reporters were configured - adding default JMX reporter.
   [junit4]   2> 3022791 INFO  (TEST-ShardSplitTest.testSplitLocking-seed#[8AC25117A864E334]) [    ] o.a.s.h.c.HttpShardHandlerFactory Host whitelist initialized: WhitelistHostChecker [whitelistHosts=null, whitelistHostCheckingEnabled=false]
   [junit4]   2> 3022793 WARN  (TEST-ShardSplitTest.testSplitLocking-seed#[8AC25117A864E334]) [    ] o.e.j.u.s.S.config No Client EndPointIdentificationAlgorithm configured for SslContextFactory@739d3a01[provider=null,keyStore=null,trustStore=null]
   [junit4]   2> 3022797 WARN  (TEST-ShardSplitTest.testSplitLocking-seed#[8AC25117A864E334]) [    ] o.e.j.u.s.S.config No Client EndPointIdentificationAlgorithm configured for SslContextFactory@9edaf5f[provider=null,keyStore=null,trustStore=null]
   [junit4]   2> 3022798 INFO  (TEST-ShardSplitTest.testSplitLocking-seed#[8AC25117A864E334]) [    ] o.a.s.c.ZkContainer Zookeeper client=127.0.0.1:45205/solr
   [junit4]   2> 3022801 INFO  (zkConnectionManagerCallback-15092-thread-1) [    ] o.a.s.c.c.ConnectionManager zkClient has connected
   [junit4]   2> 3022811 INFO  (zkConnectionManagerCallback-15094-thread-1) [    ] o.a.s.c.c.ConnectionManager zkClient has connected
   [junit4]   2> 3022895 INFO  (TEST-ShardSplitTest.testSplitLocking-seed#[8AC25117A864E334]) [n:127.0.0.1:45030_fdr%2Fx    ] o.a.s.c.OverseerElectionContext I am going to be the leader 127.0.0.1:45030_fdr%2Fx
   [junit4]   2> 3022895 INFO  (TEST-ShardSplitTest.testSplitLocking-seed#[8AC25117A864E334]) [n:127.0.0.1:45030_fdr%2Fx    ] o.a.s.c.Overseer Overseer (id=72786512746840068-127.0.0.1:45030_fdr%2Fx-n_0000000000) starting
   [junit4]   2> 3022914 INFO  (zkConnectionManagerCallback-15101-thread-1) [    ] o.a.s.c.c.ConnectionManager zkClient has connected
   [junit4]   2> 3022916 INFO  (TEST-ShardSplitTest.testSplitLocking-seed#[8AC25117A864E334]) [n:127.0.0.1:45030_fdr%2Fx    ] o.a.s.c.s.i.ZkClientClusterStateProvider Cluster at 127.0.0.1:45205/solr ready
   [junit4]   2> 3022919 INFO  (OverseerStateUpdate-72786512746840068-127.0.0.1:45030_fdr%2Fx-n_0000000000) [n:127.0.0.1:45030_fdr%2Fx    ] o.a.s.c.Overseer Starting to work on the main queue : 127.0.0.1:45030_fdr%2Fx
   [junit4]   2> 3022922 DEBUG (OverseerCollectionConfigSetProcessor-72786512746840068-127.0.0.1:45030_fdr%2Fx-n_0000000000) [n:127.0.0.1:45030_fdr%2Fx    ] o.a.s.c.OverseerTaskProcessor Process current queue of overseer operations
   [junit4]   2> 3022924 DEBUG (OverseerCollectionConfigSetProcessor-72786512746840068-127.0.0.1:45030_fdr%2Fx-n_0000000000) [n:127.0.0.1:45030_fdr%2Fx    ] o.a.s.c.OverseerTaskProcessor Cleaning up work-queue. #Running tasks: 0 #Completed tasks: 0
   [junit4]   2> 3022924 DEBUG (OverseerCollectionConfigSetProcessor-72786512746840068-127.0.0.1:45030_fdr%2Fx-n_0000000000) [n:127.0.0.1:45030_fdr%2Fx    ] o.a.s.c.OverseerTaskProcessor RunningTasks: []
   [junit4]   2> 3022924 DEBUG (OverseerCollectionConfigSetProcessor-72786512746840068-127.0.0.1:45030_fdr%2Fx-n_0000000000) [n:127.0.0.1:45030_fdr%2Fx    ] o.a.s.c.OverseerTaskProcessor BlockedTasks: []
   [junit4]   2> 3022924 DEBUG (OverseerCollectionConfigSetProcessor-72786512746840068-127.0.0.1:45030_fdr%2Fx-n_0000000000) [n:127.0.0.1:45030_fdr%2Fx    ] o.a.s.c.OverseerTaskProcessor CompletedTasks: []
   [junit4]   2> 3022924 INFO  (OverseerCollectionConfigSetProcessor-72786512746840068-127.0.0.1:45030_fdr%2Fx-n_0000000000) [n:127.0.0.1:45030_fdr%2Fx    ] o.a.s.c.OverseerTaskProcessor RunningZKTasks: []
   [junit4]   2> 3022924 INFO  (TEST-ShardSplitTest.testSplitLocking-seed#[8AC25117A864E334]) [n:127.0.0.1:45030_fdr%2Fx    ] o.a.s.c.ZkController Register node as live in ZooKeeper:/live_nodes/127.0.0.1:45030_fdr%2Fx
   [junit4]   2> 3022927 INFO  (zkCallback-15093-thread-1) [    ] o.a.s.c.c.ZkStateReader Updated live nodes from ZooKeeper... (0) -> (1)
   [junit4]   2> 3022928 INFO  (zkCallback-15100-thread-1) [    ] o.a.s.c.c.ZkStateReader Updated live nodes from ZooKeeper... (0) -> (1)
   [junit4]   2> 3022979 INFO  (TEST-ShardSplitTest.testSplitLocking-seed#[8AC25117A864E334]) [n:127.0.0.1:45030_fdr%2Fx    ] o.a.s.h.a.MetricsHistoryHandler No .system collection, keeping metrics history in memory.
   [junit4]   2> 3023030 INFO  (TEST-ShardSplitTest.testSplitLocking-seed#[8AC25117A864E334]) [n:127.0.0.1:45030_fdr%2Fx    ] o.a.s.m.r.SolrJmxReporter JMX monitoring for 'solr.node' (registry 'solr.node') enabled at server: com.sun.jmx.mbeanserver.JmxMBeanServer@4ca16c27
   [junit4]   2> 3023049 INFO  (TEST-ShardSplitTest.testSplitLocking-seed#[8AC25117A864E334]) [n:127.0.0.1:45030_fdr%2Fx    ] o.a.s.m.r.SolrJmxReporter JMX monitoring for 'solr.jvm' (registry 'solr.jvm') enabled at server: com.sun.jmx.mbeanserver.JmxMBeanServer@4ca16c27
   [junit4]   2> 3023049 INFO  (TEST-ShardSplitTest.testSplitLocking-seed#[8AC25117A864E334]) [n:127.0.0.1:45030_fdr%2Fx    ] o.a.s.m.r.SolrJmxReporter JMX monitoring for 'solr.jetty' (registry 'solr.jetty') enabled at server: com.sun.jmx.mbeanserver.JmxMBeanServer@4ca16c27
   [junit4]   2> 3023052 INFO  (TEST-ShardSplitTest.testSplitLocking-seed#[8AC25117A864E334]) [n:127.0.0.1:45030_fdr%2Fx    ] o.a.s.c.CorePropertiesLocator Found 0 core definitions underneath /x1/jenkins/jenkins-slave/workspace/Lucene-Solr-NightlyTests-8.x/checkout/solr/build/solr-core/test/J0/temp/solr.cloud.api.collections.ShardSplitTest_8AC25117A864E334-001/control-001/cores
   [junit4]   2> 3023092 INFO  (zkConnectionManagerCallback-15107-thread-1) [    ] o.a.s.c.c.ConnectionManager zkClient has connected
   [junit4]   2> 3023094 INFO  (TEST-ShardSplitTest.testSplitLocking-seed#[8AC25117A864E334]) [    ] o.a.s.c.c.ZkStateReader Updated live nodes from ZooKeeper... (0) -> (1)
   [junit4]   2> 3023095 INFO  (TEST-ShardSplitTest.testSplitLocking-seed#[8AC25117A864E334]) [    ] o.a.s.c.s.i.ZkClientClusterStateProvider Cluster at 127.0.0.1:45205/solr ready
   [junit4]   2> 3023097 INFO  (qtp492727898-48882) [n:127.0.0.1:45030_fdr%2Fx    ] o.a.s.h.a.CollectionsHandler Invoked Collection Action :create with params collection.configName=conf1&name=control_collection&nrtReplicas=1&action=CREATE&numShards=1&createNodeSet=127.0.0.1:45030_fdr%252Fx&wt=javabin&version=2 and sendToOCPQueue=true
   [junit4]   2> 3023101 DEBUG (OverseerCollectionConfigSetProcessor-72786512746840068-127.0.0.1:45030_fdr%2Fx-n_0000000000) [n:127.0.0.1:45030_fdr%2Fx    ] o.a.s.c.OverseerTaskProcessor Got 1 tasks from work-queue : [[org.apache.solr.cloud.OverseerTaskQueue$QueueEvent@2e684ecf]]
   [junit4]   2> 3023101 DEBUG (OverseerCollectionConfigSetProcessor-72786512746840068-127.0.0.1:45030_fdr%2Fx-n_0000000000) [n:127.0.0.1:45030_fdr%2Fx    ] o.a.s.c.OverseerTaskProcessor Marked task [/overseer/collection-queue-work/qn-0000000000] as running
   [junit4]   2> 3023101 DEBUG (OverseerCollectionConfigSetProcessor-72786512746840068-127.0.0.1:45030_fdr%2Fx-n_0000000000) [n:127.0.0.1:45030_fdr%2Fx    ] o.a.s.c.OverseerTaskProcessor Overseer Collection Message Handler: Get the message id:/overseer/collection-queue-work/qn-0000000000 message:{
   [junit4]   2>   "name":"control_collection",
   [junit4]   2>   "fromApi":"true",
   [junit4]   2>   "collection.configName":"conf1",
   [junit4]   2>   "numShards":"1",
   [junit4]   2>   "createNodeSet":"127.0.0.1:45030_fdr%2Fx",
   [junit4]   2>   "nrtReplicas":"1",
   [junit4]   2>   "stateFormat":"2",
   [junit4]   2>   "replicationFactor":"1",
   [junit4]   2>   "operation":"create"}
   [junit4]   2> 3023102 DEBUG (OverseerCollectionConfigSetProcessor-72786512746840068-127.0.0.1:45030_fdr%2Fx-n_0000000000) [n:127.0.0.1:45030_fdr%2Fx    ] o.a.s.c.OverseerTaskProcessor Cleaning up work-queue. #Running tasks: 1 #Completed tasks: 0
   [junit4]   2> 3023102 DEBUG (OverseerCollectionConfigSetProcessor-72786512746840068-127.0.0.1:45030_fdr%2Fx-n_0000000000) [n:127.0.0.1:45030_fdr%2Fx    ] o.a.s.c.OverseerTaskProcessor RunningTasks: [/overseer/collection-queue-work/qn-0000000000]
   [junit4]   2> 3023102 DEBUG (OverseerCollectionConfigSetProcessor-72786512746840068-127.0.0.1:45030_fdr%2Fx-n_0000000000) [n:127.0.0.1:45030_fdr%2Fx    ] o.a.s.c.OverseerTaskProcessor BlockedTasks: []
   [junit4]   2> 3023102 DEBUG (OverseerThreadFactory-13963-thread-1-processing-n:127.0.0.1:45030_fdr%2Fx) [n:127.0.0.1:45030_fdr%2Fx    ] o.a.s.c.OverseerTaskProcessor Runner processing /overseer/collection-queue-work/qn-0000000000
   [junit4]   2> 3023102 DEBUG (OverseerCollectionConfigSetProcessor-72786512746840068-127.0.0.1:45030_fdr%2Fx-n_0000000000) [n:127.0.0.1:45030_fdr%2Fx    ] o.a.s.c.OverseerTaskProcessor CompletedTasks: []
   [junit4]   2> 3023102 INFO  (OverseerCollectionConfigSetProcessor-72786512746840068-127.0.0.1:45030_fdr%2Fx-n_0000000000) [n:127.0.0.1:45030_fdr%2Fx    ] o.a.s.c.OverseerTaskProcessor RunningZKTasks: [/overseer/collection-queue-work/qn-0000000000]
   [junit4]   2> 3023102 DEBUG (OverseerThreadFactory-13963-thread-1-processing-n:127.0.0.1:45030_fdr%2Fx) [n:127.0.0.1:45030_fdr%2Fx    ] o.a.s.c.a.c.OverseerCollectionMessageHandler OverseerCollectionMessageHandler.processMessage : create , {
   [junit4]   2>   "name":"control_collection",
   [junit4]   2>   "fromApi":"true",
   [junit4]   2>   "collection.configName":"conf1",
   [junit4]   2>   "numShards":"1",
   [junit4]   2>   "createNodeSet":"127.0.0.1:45030_fdr%2Fx",
   [junit4]   2>   "nrtReplicas":"1",
   [junit4]   2>   "stateFormat":"2",
   [junit4]   2>   "replicationFactor":"1",
   [junit4]   2>   "operation":"create"}
   [junit4]   2> 3023102 INFO  (OverseerThreadFactory-13963-thread-1-processing-n:127.0.0.1:45030_fdr%2Fx) [n:127.0.0.1:45030_fdr%2Fx    ] o.a.s.c.a.c.CreateCollectionCmd Create collection control_collection
   [junit4]   2> 3023103 DEBUG (OverseerThreadFactory-13963-thread-1-processing-n:127.0.0.1:45030_fdr%2Fx) [n:127.0.0.1:45030_fdr%2Fx    ] o.a.s.c.a.c.OverseerCollectionMessageHandler creating collections conf node /collections/control_collection
   [junit4]   2> 3023104 DEBUG (OverseerThreadFactory-13963-thread-1-processing-n:127.0.0.1:45030_fdr%2Fx) [n:127.0.0.1:45030_fdr%2Fx    ] o.a.s.c.a.c.CreateCollectionCmd Check for collection zkNode:control_collection
   [junit4]   2> 3023105 DEBUG (OverseerThreadFactory-13963-thread-1-processing-n:127.0.0.1:45030_fdr%2Fx) [n:127.0.0.1:45030_fdr%2Fx    ] o.a.s.c.a.c.CreateCollectionCmd Collection zkNode exists
   [junit4]   2> 3023107 DEBUG (OverseerStateUpdate-72786512746840068-127.0.0.1:45030_fdr%2Fx-n_0000000000) [n:127.0.0.1:45030_fdr%2Fx    ] o.a.s.c.Overseer processMessage: queueSize: 1, message = {
   [junit4]   2>   "name":"control_collection",
   [junit4]   2>   "fromApi":"true",
   [junit4]   2>   "collection.configName":"conf1",
   [junit4]   2>   "numShards":"1",
   [junit4]   2>   "createNodeSet":"127.0.0.1:45030_fdr%2Fx",
   [junit4]   2>   "nrtReplicas":"1",
   [junit4]   2>   "stateFormat":"2",
   [junit4]   2>   "replicationFactor":"1",
   [junit4]   2>   "operation":"create"} current state version: 0
   [junit4]   2> 3023107 DEBUG (OverseerStateUpdate-72786512746840068-127.0.0.1:45030_fdr%2Fx-n_0000000000) [n:127.0.0.1:45030_fdr%2Fx    ] o.a.s.c.o.ClusterStateMutator building a new cName: control_collection
   [junit4]   2> 3023109 DEBUG (OverseerStateUpdate-72786512746840068-127.0.0.1:45030_fdr%2Fx-n_0000000000) [n:127.0.0.1:45030_fdr%2Fx    ] o.a.s.c.o.ZkStateWriter going to create_collection /collections/control_collection/state.json
   [junit4]   2> 3023207 DEBUG (OverseerThreadFactory-13963-thread-1-processing-n:127.0.0.1:45030_fdr%2Fx) [n:127.0.0.1:45030_fdr%2Fx    ] o.a.s.c.a.c.Assign shardnames [shard1] NRT 1 TLOG 0 PULL 0 , policy null, nodeList [127.0.0.1:45030_fdr%2Fx]
   [junit4]   2> 3023209 INFO  (qtp492727898-48884) [n:127.0.0.1:45030_fdr%2Fx    ] o.a.s.s.HttpSolrCall [admin] webapp=null path=/admin/metrics params={prefix=CONTAINER.fs.usableSpace,CONTAINER.fs.totalSpace,CORE.coreName&wt=javabin&version=2&group=solr.node,solr.core} status=0 QTime=0
   [junit4]   2> 3023210 INFO  (qtp492727898-48885) [n:127.0.0.1:45030_fdr%2Fx    ] o.a.s.s.HttpSolrCall [admin] webapp=null path=/admin/metrics params={prefix=CONTAINER.fs.usableSpace,CONTAINER.fs.totalSpace,CORE.coreName&wt=javabin&version=2&group=solr.node,solr.core} status=0 QTime=0
   [junit4]   2> 3023211 INFO  (qtp492727898-48881) [n:127.0.0.1:45030_fdr%2Fx    ] o.a.s.s.HttpSolrCall [admin] webapp=null path=/admin/metrics params={prefix=CONTAINER.fs.usableSpace,CONTAINER.fs.totalSpace,CORE.coreName&wt=javabin&version=2&group=solr.node,solr.core} status=0 QTime=0
   [junit4]   2> 3023212 INFO  (qtp492727898-48883) [n:127.0.0.1:45030_fdr%2Fx    ] o.a.s.s.HttpSolrCall [admin] webapp=null path=/admin/metrics params={prefix=CONTAINER.fs.usableSpace,CONTAINER.fs.totalSpace,CORE.coreName&wt=javabin&version=2&group=solr.node,solr.core} status=0 QTime=0
   [junit4]   2> 3023213 INFO  (qtp492727898-48884) [n:127.0.0.1:45030_fdr%2Fx    ] o.a.s.s.HttpSolrCall [admin] webapp=null path=/admin/metrics params={prefix=CONTAINER.fs.usableSpace,CONTAINER.fs.totalSpace,CORE.coreName&wt=javabin&version=2&group=solr.node,solr.core} status=0 QTime=0
   [junit4]   2> 3023214 DEBUG (OverseerThreadFactory-13963-thread-1-processing-n:127.0.0.1:45030_fdr%2Fx) [n:127.0.0.1:45030_fdr%2Fx    ] o.a.s.c.a.c.CreateCollectionCmd Creating SolrCores for new collection control_collection, shardNames [shard1] , message : {
   [junit4]   2>   "name":"control_collection",
   [junit4]   2>   "fromApi":"true",
   [junit4]   2>   "collection.configName":"conf1",
   [junit4]   2>   "numShards":"1",
   [junit4]   2>   "createNodeSet":"127.0.0.1:45030_fdr%2Fx",
   [junit4]   2>   "nrtReplicas":"1",
   [junit4]   2>   "stateFormat":"2",
   [junit4]   2>   "replicationFactor":"1",
   [junit4]   2>   "operation":"create"}
   [junit4]   2> 3023215 DEBUG (OverseerThreadFactory-13963-thread-1-processing-n:127.0.0.1:45030_fdr%2Fx) [n:127.0.0.1:45030_fdr%2Fx    ] o.a.s.c.a.c.CreateCollectionCmd Creating core control_collection_shard1_replica_n1 as part of shard shard1 of collection control_collection on 127.0.0.1:45030_fdr%2Fx
   [junit4]   2> 3023220 INFO  (qtp492727898-48885) [n:127.0.0.1:45030_fdr%2Fx    x:control_collection_shard1_replica_n1] o.a.s.h.a.CoreAdminOperation core create command qt=/admin/cores&collection.configName=conf1&newCollection=true&name=control_collection_shard1_replica_n1&action=CREATE&numShards=1&collection=control_collection&shard=shard1&wt=javabin&version=2&replicaType=NRT
   [junit4]   2> 3023221 INFO  (qtp492727898-48885) [n:127.0.0.1:45030_fdr%2Fx    x:control_collection_shard1_replica_n1] o.a.s.c.TransientSolrCoreCacheDefault Allocating transient cache for 4 transient cores
   [junit4]   2> 3023223 DEBUG (OverseerStateUpdate-72786512746840068-127.0.0.1:45030_fdr%2Fx-n_0000000000) [n:127.0.0.1:45030_fdr%2Fx    ] o.a.s.c.Overseer processMessage: queueSize: 1, message = {
   [junit4]   2>   "core":"control_collection_shard1_replica_n1",
   [junit4]   2>   "roles":null,
   [junit4]   2>   "base_url":"http://127.0.0.1:45030/fdr/x",
   [junit4]   2>   "node_name":"127.0.0.1:45030_fdr%2Fx",
   [junit4]   2>   "numShards":"1",
   [junit4]   2>   "state":"down",
   [junit4]   2>   "shard":"shard1",
   [junit4]   2>   "collection":"control_collection",
   [junit4]   2>   "type":"NRT",
   [junit4]   2>   "operation":"state"} current state version: 0
   [junit4]   2> 3023223 DEBUG (OverseerStateUpdate-72786512746840068-127.0.0.1:45030_fdr%2Fx-n_0000000000) [n:127.0.0.1:45030_fdr%2Fx    ] o.a.s.c.o.ReplicaMutator Update state numShards=1 message={
   [junit4]   2>   "core":"control_collection_shard1_replica_n1",
   [junit4]   2>   "roles":null,
   [junit4]   2>   "base_url":"http://127.0.0.1:45030/fdr/x",
   [junit4]   2>   "node_name":"127.0.0.1:45030_fdr%2Fx",
   [junit4]   2>   "numShards":"1",
   [junit4]   2>   "state":"down",
   [junit4]   2>   "shard":"shard1",
   [junit4]   2>   "collection":"control_collection",
   [junit4]   2>   "type":"NRT",
   [junit4]   2>   "operation":"state"}
   [junit4]   2> 3023225 DEBUG (OverseerStateUpdate-72786512746840068-127.0.0.1:45030_fdr%2Fx-n_0000000000) [n:127.0.0.1:45030_fdr%2Fx    ] o.a.s.c.o.ReplicaMutator Will update state for replica: core_node2:{"core":"control_collection_shard1_replica_n1","base_url":"http://127.0.0.1:45030/fdr/x","node_name":"127.0.0.1:45030_fdr%2Fx","state":"down","type":"NRT"}
   [junit4]   2> 3023225 DEBUG (OverseerStateUpdate-72786512746840068-127.0.0.1:45030_fdr%2Fx-n_0000000000) [n:127.0.0.1:45030_fdr%2Fx    ] o.a.s.c.o.ReplicaMutator Collection is now: DocCollection(control_collection//collections/control_collection/state.json/0)={
   [junit4]   2>   "pullReplicas":"0",
   [junit4]   2>   "replicationFactor":"1",
   [junit4]   2>   "router":{"name":"compositeId"},
   [junit4]   2>   "maxShardsPerNode":"1",
   [junit4]   2>   "autoAddReplicas":"false",
   [junit4]   2>   "nrtReplicas":"1",
   [junit4]   2>   "tlogReplicas":"0",
   [junit4]   2>   "shards":{"shard1":{
   [junit4]   2>       "range":"80000000-7fffffff",
   [junit4]   2>       "state":"active",
   [junit4]   2>       "replicas":{"core_node2":{
   [junit4]   2>           "core":"control_collection_shard1_replica_n1",
   [junit4]   2>           "base_url":"http://127.0.0.1:45030/fdr/x",
   [junit4]   2>           "node_name":"127.0.0.1:45030_fdr%2Fx",
   [junit4]   2>           "state":"down",
   [junit4]   2>           "type":"NRT"}}}}}
   [junit4]   2> 3023326 DEBUG (OverseerStateUpdate-72786512746840068-127.0.0.1:45030_fdr%2Fx-n_0000000000) [n:127.0.0.1:45030_fdr%2Fx    ] o.a.s.c.o.ZkStateWriter going to update_collection /collections/control_collection/state.json version: 0
   [junit4]   2> 3024240 INFO  (qtp492727898-48885) [n:127.0.0.1:45030_fdr%2Fx c:control_collection s:shard1  x:control_collection_shard1_replica_n1] o.a.s.c.SolrConfig Using Lucene MatchVersion: 8.1.0
   [junit4]   2> 3024258 INFO  (qtp492727898-48885) [n:127.0.0.1:45030_fdr%2Fx c:control_collection s:shard1  x:control_collection_shard1_replica_n1] o.a.s.s.IndexSchema [control_collection_shard1_replica_n1] Schema name=test
   [junit4]   2> 3024383 INFO  (qtp492727898-48885) [n:127.0.0.1:45030_fdr%2Fx c:control_collection s:shard1  x:control_collection_shard1_replica_n1] o.a.s.s.IndexSchema Loaded schema test/1.6 with uniqueid field id
   [junit4]   2> 3024409 INFO  (qtp492727898-48885) [n:127.0.0.1:45030_fdr%2Fx c:control_collection s:shard1  x:control_collection_shard1_replica_n1] o.a.s.c.CoreContainer Creating SolrCore 'control_collection_shard1_replica_n1' using configuration from collection control_collection, trusted=true
   [junit4]   2> 3024409 INFO  (qtp492727898-48885) [n:127.0.0.1:45030_fdr%2Fx c:control_collection s:shard1  x:control_collection_shard1_replica_n1] o.a.s.m.r.SolrJmxReporter JMX monitoring for 'solr.core.control_collection.shard1.replica_n1' (registry 'solr.core.control_collection.shard1.replica_n1') enabled at server: com.sun.jmx.mbeanserver.JmxMBeanServer@4ca16c27
   [junit4]   2> 3024410 INFO  (qtp492727898-48885) [n:127.0.0.1:45030_fdr%2Fx c:control_collection s:shard1  x:control_collection_shard1_replica_n1] o.a.s.c.SolrCore [[control_collection_shard1_replica_n1] ] Opening new SolrCore at [/x1/jenkins/jenkins-slave/workspace/Lucene-Solr-NightlyTests-8.x/checkout/solr/build/solr-core/test/J0/temp/solr.cloud.api.collections.ShardSplitTest_8AC25117A864E334-001/control-001/cores/control_collection_shard1_replica_n1], dataDir=[/x1/jenkins/jenkins-slave/workspace/Lucene-Solr-NightlyTests-8.x/checkout/solr/build/solr-core/test/J0/temp/solr.cloud.api.collections.ShardSplitTest_8AC25117A864E334-001/control-001/cores/control_collection_shard1_replica_n1/data/]
   [junit4]   2> 3024413 INFO  (qtp492727898-48885) [n:127.0.0.1:45030_fdr%2Fx c:control_collection s:shard1  x:control_collection_shard1_replica_n1] o.a.s.u.RandomMergePolicy RandomMergePolicy wrapping class org.apache.lucene.index.LogByteSizeMergePolicy: [LogByteSizeMergePolicy: minMergeSize=1677721, mergeFactor=36, maxMergeSize=2147483648, maxMergeSizeForForcedMerge=9223372036854775807, calibrateSizeByDeletes=true, maxMergeDocs=2147483647, maxCFSSegmentSizeMB=8.796093022207999E12, noCFSRatio=0.11959816062311629]
   [junit4]   2> 3024440 WARN  (qtp492727898-48885) [n:127.0.0.1:45030_fdr%2Fx c:control_collection s:shard1  x:control_collection_shard1_replica_n1] o.a.s.c.RequestHandlers INVALID paramSet a in requestHandler {type = requestHandler,name = /dump,class = DumpRequestHandler,attributes = {initParams=a, name=/dump, class=DumpRequestHandler},args = {defaults={a=A,b=B}}}
   [junit4]   2> 3024563 INFO  (qtp492727898-48885) [n:127.0.0.1:45030_fdr%2Fx c:control_collection s:shard1  x:control_collection_shard1_replica_n1] o.a.s.u.UpdateHandler Using UpdateLog implementation: org.apache.solr.update.UpdateLog
   [junit4]   2> 3024563 INFO  (qtp492727898-48885) [n:127.0.0.1:45030_fdr%2Fx c:control_collection s:shard1  x:control_collection_shard1_replica_n1] o.a.s.u.UpdateLog Initializing UpdateLog: dataDir= defaultSyncLevel=FLUSH numRecordsToKeep=100 maxNumLogsToKeep=10 numVersionBuckets=65536
   [junit4]   2> 3024566 INFO  (qtp492727898-48885) [n:127.0.0.1:45030_fdr%2Fx c:control_collection s:shard1  x:control_collection_shard1_replica_n1] o.a.s.u.CommitTracker Hard AutoCommit: disabled
   [junit4]   2> 3024566 INFO  (qtp492727898-48885) [n:127.0.0.1:45030_fdr%2Fx c:control_collection s:shard1  x:control_collection_shard1_replica_n1] o.a.s.u.CommitTracker Soft AutoCommit: disabled
   [junit4]   2> 3024567 INFO  (qtp492727898-48885) [n:127.0.0.1:45030_fdr%2Fx c:control_collection s:shard1  x:control_collection_shard1_replica_n1] o.a.s.u.RandomMergePolicy RandomMergePolicy wrapping class org.apache.lucene.index.LogByteSizeMergePolicy: [LogByteSizeMergePolicy: minMergeSize=1677721, mergeFactor=25, maxMergeSize=2147483648, maxMergeSizeForForcedMerge=9223372036854775807, calibrateSizeByDeletes=false, maxMergeDocs=2147483647, maxCFSSegmentSizeMB=8.796093022207999E12, noCFSRatio=0.0]
   [junit4]   2> 3024568 INFO  (qtp492727898-48885) [n:127.0.0.1:45030_fdr%2Fx c:control_collection s:shard1  x:control_collection_shard1_replica_n1] o.a.s.s.SolrIndexSearcher Opening [Searcher@214dc130[control_collection_shard1_replica_n1] main]
   [junit4]   2> 3024569 INFO  (qtp492727898-48885) [n:127.0.0.1:45030_fdr%2Fx c:control_collection s:shard1  x:control_collection_shard1_replica_n1] o.a.s.r.ManagedResourceStorage Configured ZooKeeperStorageIO with znodeBase: /configs/conf1
   [junit4]   2> 3024570 INFO  (qtp492727898-48885) [n:127.0.0.1:45030_fdr%2Fx c:control_collection s:shard1  x:control_collection_shard1_replica_n1] o.a.s.r.ManagedResourceStorage Loaded null at path _rest_managed.json using ZooKeeperStorageIO:path=/configs/conf1
   [junit4]   2> 3024570 INFO  (qtp492727898-48885) [n:127.0.0.1:45030_fdr%2Fx c:control_collection s:shard1  x:control_collection_shard1_replica_n1] o.a.s.h.ReplicationHandler Commits will be reserved for 10000ms.
   [junit4]   2> 3024570 INFO  (qtp492727898-48885) [n:127.0.0.1:45030_fdr%2Fx c:control_collection s:shard1  x:control_collection_shard1_replica_n1] o.a.s.u.UpdateLog Could not find max version in index or recent updates, using new clock 1625279858541068288
   [junit4]   2> 3024576 INFO  (searcherExecutor-13968-thread-1-processing-n:127.0.0.1:45030_fdr%2Fx x:control_collection_shard1_replica_n1 c:control_collection s:shard1) [n:127.0.0.1:45030_fdr%2Fx c:control_collection s:shard1  x:control_collection_shard1_replica_n1] o.a.s.c.SolrCore [control_collection_shard1_replica_n1] Registered new searcher Searcher@214dc130[control_collection_shard1_replica_n1] main{ExitableDirectoryReader(UninvertingDirectoryReader())}
   [junit4]   2> 3024594 INFO  (qtp492727898-48885) [n:127.0.0.1:45030_fdr%2Fx c:control_collection s:shard1  x:control_collection_shard1_replica_n1] o.a.s.c.ZkShardTerms Successful update of terms at /collections/control_collection/terms/shard1 to Terms{values={core_node2=0}, version=0}
   [junit4]   2> 3024594 INFO  (qtp492727898-48885) [n:127.0.0.1:45030_fdr%2Fx c:control_collection s:shard1  x:control_collection_shard1_replica_n1] o.a.s.c.ShardLeaderElectionContextBase make sure parent is created /collections/control_collection/leaders/shard1
   [junit4]   2> 3024598 INFO  (qtp492727898-48885) [n:127.0.0.1:45030_fdr%2Fx c:control_collection s:shard1  x:control_collection_shard1_replica_n1] o.a.s.c.ShardLeaderElectionContext Enough replicas found to continue.
   [junit4]   2> 3024598 INFO  (qtp492727898-48885) [n:127.0.0.1:45030_fdr%2Fx c:control_collection s:shard1  x:control_collection_shard1_replica_n1] o.a.s.c.ShardLeaderElectionContext I may be the new leader - try and sync
   [junit4]   2> 3024598 INFO  (qtp492727898-48885) [n:127.0.0.1:45030_fdr%2Fx c:control_collection s:shard1  x:control_collection_shard1_replica_n1] o.a.s.c.SyncStrategy Sync replicas to http://127.0.0.1:45030/fdr/x/control_collection_shard1_replica_n1/
   [junit4]   2> 3024598 INFO  (qtp492727898-48885) [n:127.0.0.1:45030_fdr%2Fx c:control_collection s:shard1  x:control_collection_shard1_replica_n1] o.a.s.c.SyncStrategy Sync Success - now sync replicas to me
   [junit4]   2> 3024598 INFO  (qtp492727898-48885) [n:127.0.0.1:45030_fdr%2Fx c:control_collection s:shard1  x:control_collection_shard1_replica_n1] o.a.s.c.SyncStrategy http://127.0.0.1:45030/fdr/x/control_collection_shard1_replica_n1/ has no replicas
   [junit4]   2> 3024598 INFO  (qtp492727898-48885) [n:127.0.0.1:45030_fdr%2Fx c:control_collection s:shard1  x:control_collection_shard1_replica_n1] o.a.s.c.ShardLeaderElectionContextBase Creating leader registration node /collections/control_collection/leaders/shard1/leader after winning as /collections/control_collection/leader_elect/shard1/election/72786512746840068-core_node2-n_0000000000
   [junit4]   2> 3024600 INFO  (qtp492727898-48885) [n:127.0.0.1:45030_fdr%2Fx c:control_collection s:shard1  x:control_collection_shard1_replica_n1] o.a.s.c.ShardLeaderElectionContext I am the new leader: http://127.0.0.1:45030/fdr/x/control_collection_shard1_replica_n1/ shard1
   [junit4]   2> 3024601 DEBUG (OverseerStateUpdate-72786512746840068-127.0.0.1:45030_fdr%2Fx-n_0000000000) [n:127.0.0.1:45030_fdr%2Fx    ] o.a.s.c.Overseer processMessage: queueSize: 1, message = {
   [junit4]   2>   "operation":"leader",
   [junit4]   2>   "shard":"shard1",
   [junit4]   2>   "collection":"control_collection",
   [junit4]   2>   "base_url":"http://127.0.0.1:45030/fdr/x",
   [junit4]   2>   "core":"control_collection_shard1_replica_n1",
   [junit4]   2>   "state":"active"} current state version: 0
   [junit4]   2> 3024702 DEBUG (OverseerStateUpdate-72786512746840068-127.0.0.1:45030_fdr%2Fx-n_0000000000) [n:127.0.0.1:45030_fdr%2Fx    ] o.a.s.c.o.ZkStateWriter going to update_collection /collections/control_collection/state.json version: 1
   [junit4]   2> 3024702 INFO  (zkCallback-15093-thread-1) [    ] o.a.s.c.c.ZkStateReader A cluster state change: [WatchedEvent state:SyncConnected type:NodeDataChanged path:/collections/control_collection/state.json] for collection [control_collection] has occurred - updating... (live nodes size: [1])
   [junit4]   2> 3024702 INFO  (zkCallback-15093-thread-2) [    ] o.a.s.c.c.ZkStateReader A cluster state change: [WatchedEvent state:SyncConnected type:NodeDataChanged path:/collections/control_collection/state.json] for collection [control_collection] has occurred - updating... (live nodes size: [1])
   [junit4]   2> 3024703 INFO  (qtp492727898-48885) [n:127.0.0.1:45030_fdr%2Fx c:control_collection s:shard1  x:control_collection_shard1_replica_n1] o.a.s.c.ZkController I am the leader, no recovery necessary
   [junit4]   2> 3024704 DEBUG (OverseerStateUpdate-72786512746840068-127.0.0.1:45030_fdr%2Fx-n_0000000000) [n:127.0.0.1:45030_fdr%2Fx    ] o.a.s.c.Overseer processMessage: queueSize: 1, message = {
   [junit4]   2>   "core":"control_collection_shard1_replica_n1",
   [junit4]   2>   "core_node_name":"core_node2",
   [junit4]   2>   "roles":null,
   [junit4]   2>   "base_url":"http://127.0.0.1:45030/fdr/x",
   [junit4]   2>   "node_name":"127.0.0.1:45030_fdr%2Fx",
   [junit4]   2>   "numShards":"1",
   [junit4]   2>   "state":"active",
   [junit4]   2>   "shard":"shard1",
   [junit4]   2>   "collection":"control_collection",
   [junit4]   2>   "type":"NRT",
   [junit4]   2>   "operation":"state"} current state version: 0
   [junit4]   2> 3024704 DEBUG (OverseerStateUpdate-72786512746840068-127.0.0.1:45030_fdr%2Fx-n_0000000000) [n:127.0.0.1:45030_fdr%2Fx    ] o.a.s.c.o.ReplicaMutator Update state numShards=1 message={
   [junit4]   2>   "core":"control_collection_shard1_replica_n1",
   [junit4]   2>   "core_node_name":"core_node2",
   [junit4]   2>   "roles":null,
   [junit4]   2>   "base_url":"http://127.0.0.1:45030/fdr/x",
   [junit4]   2>   "node_name":"127.0.0.1:45030_fdr%2Fx",
   [junit4]   2>   "numShards":"1",
   [junit4]   2>   "state":"active",
   [junit4]   2>   "shard":"shard1",
   [junit4]   2>   "collection":"control_collection",
   [junit4]   2>   "type":"NRT",
   [junit4]   2>   "operation":"state"}
   [junit4]   2> 3024704 DEBUG (OverseerStateUpdate-72786512746840068-127.0.0.1:45030_fdr%2Fx-n_0000000000) [n:127.0.0.1:45030_fdr%2Fx    ] o.a.s.c.o.ReplicaMutator Will update state for replica: core_node2:{"core":"control_collection_shard1_replica_n1","base_url":"http://127.0.0.1:45030/fdr/x","node_name":"127.0.0.1:45030_fdr%2Fx","state":"active","type":"NRT","leader":"true"}
   [junit4]   2> 3024704 DEBUG (OverseerStateUpdate-72786512746840068-127.0.0.1:45030_fdr%2Fx-n_0000000000) [n:127.0.0.1:45030_fdr%2Fx    ] o.a.s.c.o.ReplicaMutator Collection is now: DocCollection(control_collection//collections/control_collection/state.json/2)={
   [junit4]   2>   "pullReplicas":"0",
   [junit4]   2>   "replicationFactor":"1",
   [junit4]   2>   "router":{"name":"compositeId"},
   [junit4]   2>   "maxShardsPerNode":"1",
   [junit4]   2>   "autoAddReplicas":"false",
   [junit4]   2>   "nrtReplicas":"1",
   [junit4]   2>   "tlogReplicas":"0",
   [junit4]   2>   "shards":{"shard1":{
   [junit4]   2>       "range":"80000000-7fffffff",
   [junit4]   2>       "state":"active",
   [junit4]   2>       "replicas":{"core_node2":{
   [junit4]   2>           "core":"control_collection_shard1_replica_n1",
   [junit4]   2>           "base_url":"http://127.0.0.1:45030/fdr/x",
   [junit4]   2>           "node_name":"127.0.0.1:45030_fdr%2Fx",
   [junit4]   2>           "state":"active",
   [junit4]   2>           "type":"NRT",
   [junit4]   2>           "leader":"true"}}}}}
   [junit4]   2> 3024705 INFO  (qtp492727898-48885) [n:127.0.0.1:45030_fdr%2Fx c:control_collection s:shard1  x:control_collection_shard1_replica_n1] o.a.s.s.HttpSolrCall [admin] webapp=null path=/admin/cores params={qt=/admin/cores&collection.configName=conf1&newCollection=true&name=control_collection_shard1_replica_n1&action=CREATE&numShards=1&collection=control_collection&shard=shard1&wt=javabin&version=2&replicaType=NRT} status=0 QTime=1485
   [junit4]   2> 3024705 DEBUG (OverseerThreadFactory-13963-thread-1-processing-n:127.0.0.1:45030_fdr%2Fx) [n:127.0.0.1:45030_fdr%2Fx    ] o.a.s.c.a.c.CreateCollectionCmd Finished create command on all shards for collection: control_collection
   [junit4]   2> 3024706 DEBUG (OverseerThreadFactory-13963-thread-1-processing-n:127.0.0.1:45030_fdr%2Fx) [n:127.0.0.1:45030_fdr%2Fx    ] o.a.s.c.OverseerTaskProcessor Completed task:[/overseer/collection-queue-work/qn-0000000000]
   [junit4]   2> 3024707 DEBUG (OverseerThreadFactory-13963-thread-1-processing-n:127.0.0.1:45030_fdr%2Fx) [n:127.0.0.1:45030_fdr%2Fx    ] o.a.s.c.OverseerTaskProcessor Marked task [/overseer/collection-queue-work/qn-0000000000] as completed.
   [junit4]   2> 3024707 DEBUG (OverseerThreadFactory-13963-thread-1-processing-n:127.0.0.1:45030_fdr%2Fx) [n:127.0.0.1:45030_fdr%2Fx    ] o.a.s.c.OverseerTaskProcessor RunningTasks: []
   [junit4]   2> 3024707 DEBUG (OverseerThreadFactory-13963-thread-1-processing-n:127.0.0.1:45030_fdr%2Fx) [n:127.0.0.1:45030_fdr%2Fx    ] o.a.s.c.OverseerTaskProcessor BlockedTasks: []
   [junit4]   2> 3024707 DEBUG (OverseerThreadFactory-13963-thread-1-processing-n:127.0.0.1:45030_fdr%2Fx) [n:127.0.0.1:45030_fdr%2Fx    ] o.a.s.c.OverseerTaskProcessor CompletedTasks: [/overseer/collection-queue-work/qn-0000000000]
   [junit4]   2> 3024707 INFO  (OverseerThreadFactory-13963-thread-1-processing-n:127.0.0.1:45030_fdr%2Fx) [n:127.0.0.1:45030_fdr%2Fx    ] o.a.s.c.OverseerTaskProcessor RunningZKTasks: [/overseer/collection-queue-work/qn-0000000000]
   [junit4]   2> 3024707 DEBUG (OverseerThreadFactory-13963-thread-1-processing-n:127.0.0.1:45030_fdr%2Fx) [n:127.0.0.1:45030_fdr%2Fx    ] o.a.s.c.OverseerTaskProcessor Overseer Collection Message Handler: Message id:/overseer/collection-queue-work/qn-0000000000 complete, response:{success={127.0.0.1:45030_fdr%2Fx={responseHeader={status=0,QTime=1485},core=control_collection_shard1_replica_n1}}}
   [junit4]   2> 3024709 INFO  (qtp492727898-48882) [n:127.0.0.1:45030_fdr%2Fx    ] o.a.s.h.a.CollectionsHandler Wait for new collection to be active for at most 45 seconds. Check all shard replicas
   [junit4]   2> 3024805 DEBUG (OverseerStateUpdate-72786512746840068-127.0.0.1:45030_fdr%2Fx-n_0000000000) [n:127.0.0.1:45030_fdr%2Fx    ] o.a.s.c.o.ZkStateWriter going to update_collection /collections/control_collection/state.json version: 2
   [junit4]   2> 3024806 INFO  (zkCallback-15093-thread-2) [    ] o.a.s.c.c.ZkStateReader A cluster state change: [WatchedEvent state:SyncConnected type:NodeDataChanged path:/collections/control_collection/state.json] for collection [control_collection] has occurred - updating... (live nodes size: [1])
   [junit4]   2> 3024806 INFO  (zkCallback-15093-thread-1) [    ] o.a.s.c.c.ZkStateReader A cluster state change: [WatchedEvent state:SyncConnected type:NodeDataChanged path:/collections/control_collection/state.json] for collection [control_collection] has occurred - updating... (live nodes size: [1])
   [junit4]   2> 3024806 INFO  (zkCallback-15093-thread-3) [    ] o.a.s.c.c.ZkStateReader A cluster state change: [WatchedEvent state:SyncConnected type:NodeDataChanged path:/collections/control_collection/state.json] for collection [control_collection] has occurred - updating... (live nodes size: [1])
   [junit4]   2> 3024807 INFO  (qtp492727898-48882) [n:127.0.0.1:45030_fdr%2Fx    ] o.a.s.s.HttpSolrCall [admin] webapp=null path=/admin/collections params={collection.configName=conf1&name=control_collection&nrtReplicas=1&action=CREATE&numShards=1&createNodeSet=127.0.0.1:45030_fdr%252Fx&wt=javabin&version=2} status=0 QTime=1709
   [junit4]   2> 3024895 INFO  (zkConnectionManagerCallback-15113-thread-1) [    ] o.a.s.c.c.ConnectionManager zkClient has connected
   [junit4]   2> 3024897 INFO  (TEST-ShardSplitTest.testSplitLocking-seed#[8AC25117A864E334]) [    ] o.a.s.c.c.ZkStateReader Updated live nodes from ZooKeeper... (0) -> (1)
   [junit4]   2> 3024899 INFO  (TEST-ShardSplitTest.testSplitLocking-seed#[8AC25117A864E334]) [    ] o.a.s.c.s.i.ZkClientClusterStateProvider Cluster at 127.0.0.1:45205/solr ready
   [junit4]   2> 3024899 INFO  (TEST-ShardSplitTest.testSplitLocking-seed#[8AC25117A864E334]) [    ] o.a.s.c.ChaosMonkey monkey: init - expire sessions:false cause connection loss:false
   [junit4]   2> 3024900 INFO  (qtp492727898-48885) [n:127.0.0.1:45030_fdr%2Fx    ] o.a.s.h.a.CollectionsHandler Invoked Collection Action :create with params collection.configName=conf1&name=collection1&nrtReplicas=1&action=CREATE&numShards=2&createNodeSet=&stateFormat=2&wt=javabin&version=2 and sendToOCPQueue=true
   [junit4]   2> 3024903 DEBUG (OverseerCollectionConfigSetProcessor-72786512746840068-127.0.0.1:45030_fdr%2Fx-n_0000000000) [n:127.0.0.1:45030_fdr%2Fx    ] o.a.s.c.OverseerTaskProcessor Got 1 tasks from work-queue : [[org.apache.solr.cloud.OverseerTaskQueue$QueueEvent@2e684ed1]]
   [junit4]   2> 3024903 DEBUG (OverseerCollectionConfigSetProcessor-72786512746840068-127.0.0.1:45030_fdr%2Fx-n_0000000000) [n:127.0.0.1:45030_fdr%2Fx    ] o.a.s.c.OverseerTaskProcessor Marked task [/overseer/collection-queue-work/qn-0000000002] as running
   [junit4]   2> 3024903 DEBUG (OverseerCollectionConfigSetProcessor-72786512746840068-127.0.0.1:45030_fdr%2Fx-n_0000000000) [n:127.0.0.1:45030_fdr%2Fx    ] o.a.s.c.OverseerTaskProcessor Overseer Collection Message Handler: Get the message id:/overseer/collection-queue-work/qn-0000000002 message:{
   [junit4]   2>   "name":"collection1",
   [junit4]   2>   "fromApi":"true",
   [junit4]   2>   "collection.configName":"conf1",
   [junit4]   2>   "numShards":"2",
   [junit4]   2>   "createNodeSet":"",
   [junit4]   2>   "stateFormat":"2",
   [junit4]   2>   "nrtReplicas":"1",
   [junit4]   2>   "replicationFactor":"1",
   [junit4]   2>   "operation":"create"}
   [junit4]   2> 3024924 DEBUG (OverseerCollectionConfigSetProcessor-72786512746840068-127.0.0.1:45030_fdr%2Fx-n_0000000000) [n:127.0.0.1:45030_fdr%2Fx    ] o.a.s.c.OverseerTaskProcessor Cleaning up work-queue. #Running tasks: 1 #Completed tasks: 1
   [junit4]   2> 3024924 DEBUG (OverseerThreadFactory-13963-thread-2-processing-n:127.0.0.1:45030_fdr%2Fx) [n:127.0.0.1:45030_fdr%2Fx    ] o.a.s.c.OverseerTaskProcessor Runner processing /overseer/collection-queue-work/qn-0000000002
   [junit4]   2> 3024924 DEBUG (OverseerThreadFactory-13963-thread-2-processing-n:127.0.0.1:45030_fdr%2Fx) [n:127.0.0.1:45030_fdr%2Fx    ] o.a.s.c.a.c.OverseerCollectionMessageHandler OverseerCollectionMessageHandler.processMessage : create , {
   [junit4]   2>   "name":"collection1",
   [junit4]   2>   "fromApi":"true",
   [junit4]   2>   "collection.configName":"conf1",
   [junit4]   2>   "numShards":"2",
   [junit4]   2>   "createNodeSet":"",
   [junit4]   2>   "stateFormat":"2",
   [junit4]   2>   "nrtReplicas":"1",
   [junit4]   2>   "replicationFactor":"1",
   [junit4]   2>   "operation":"create"}
   [junit4]   2> 3024924 INFO  (OverseerCollectionConfigSetProcessor-72786512746840068-127.0.0.1:45030_fdr%2Fx-n_0000000000) [n:127.0.0.1:45030_fdr%2Fx    ] o.a.s.c.OverseerTaskQueue Response ZK path: /overseer/collection-queue-work/qnr-0000000000 doesn't exist.  Requestor may have disconnected from ZooKeeper
   [junit4]   2> 3024924 INFO  (OverseerThreadFactory-13963-thread-2-processing-n:127.0.0.1:45030_fdr%2Fx) [n:127.0.0.1:45030_fdr%2Fx    ] o.a.s.c.a.c.CreateCollectionCmd Create collection collection1
   [junit4]   2> 3024924 DEBUG (OverseerCollectionConfigSetProcessor-72786512746840068-127.0.0.1:45030_fdr%2Fx-n_0000000000) [n:127.0.0.1:45030_fdr%2Fx    ] o.a.s.c.OverseerTaskProcessor RunningTasks: [/overseer/collection-queue-work/qn-0000000002]
   [junit4]   2> 3024924 DEBUG (OverseerCollectionConfigSetProcessor-72786512746840068-127.0.0.1:45030_fdr%2Fx-n_0000000000) [n:127.0.0.1:45030_fdr%2Fx    ] o.a.s.c.OverseerTaskProcessor BlockedTasks: []
   [junit4]   2> 3024924 DEBUG (OverseerCollectionConfigSetProcessor-72786512746840068-127.0.0.1:45030_fdr%2Fx-n_0000000000) [n:127.0.0.1:45030_fdr%2Fx    ] o.a.s.c.OverseerTaskProcessor CompletedTasks: []
   [junit4]   2> 3024924 INFO  (OverseerCollectionConfigSetProcessor-72786512746840068-127.0.0.1:45030_fdr%2Fx-n_0000000000) [n:127.0.0.1:45030_fdr%2Fx    ] o.a.s.c.OverseerTaskProcessor RunningZKTasks: [/overseer/collection-queue-work/qn-0000000002]
   [junit4]   2> 3024925 DEBUG (OverseerThreadFactory-13963-thread-2-processing-n:127.0.0.1:45030_fdr%2Fx) [n:127.0.0.1:45030_fdr%2Fx    ] o.a.s.c.a.c.OverseerCollectionMessageHandler creating collections conf node /collections/collection1
   [junit4]   2> 3024940 DEBUG (OverseerThreadFactory-13963-thread-2-processing-n:127.0.0.1:45030_fdr%2Fx) [n:127.0.0.1:45030_fdr%2Fx    ] o.a.s.c.a.c.CreateCollectionCmd Check for collection zkNode:collection1
   [junit4]   2> 3024940 DEBUG (OverseerThreadFactory-13963-thread-2-processing-n:127.0.0.1:45030_fdr%2Fx) [n:127.0.0.1:45030_fdr%2Fx    ] o.a.s.c.a.c.CreateCollectionCmd Collection zkNode exists
   [junit4]   2> 3024942 DEBUG (OverseerStateUpdate-72786512746840068-127.0.0.1:45030_fdr%2Fx-n_0000000000) [n:127.0.0.1:45030_fdr%2Fx    ] o.a.s.c.Overseer processMessage: queueSize: 1, message = {
   [junit4]   2>   "name":"collection1",
   [junit4]   2>   "fromApi":"true",
   [junit4]   2>   "collection.configName":"conf1",
   [junit4]   2>   "numShards":"2",
   [junit4]   2>   "createNodeSet":"",
   [junit4]   2>   "stateFormat":"2",
   [junit4]   2>   "nrtReplicas":"1",
   [junit4]   2>   "replicationFactor":"1",
   [junit4]   2>   "operation":"create"} current state version: 0
   [junit4]   2> 3024942 DEBUG (OverseerStateUpdate-72786512746840068-127.0.0.1:45030_fdr%2Fx-n_0000000000) [n:127.0.0.1:45030_fdr%2Fx    ] o.a.s.c.o.ClusterStateMutator building a new cName: collection1
   [junit4]   2> 3025043 DEBUG (OverseerStateUpdate-72786512746840068-127.0.0.1:45030_fdr%2Fx-n_0000000000) [n:127.0.0.1:45030_fdr%2Fx    ] o.a.s.c.o.ZkStateWriter going to create_collection /collections/collection1/state.json
   [junit4]   2> 3025144 WARN  (OverseerThreadFactory-13963-thread-2-processing-n:127.0.0.1:45030_fdr%2Fx) [n:127.0.0.1:45030_fdr%2Fx    ] o.a.s.c.a.c.CreateCollectionCmd It is unusual to create a collection (collection1) without cores.
   [junit4]   2> 3025144 DEBUG (OverseerThreadFactory-13963-thread-2-processing-n:127.0.0.1:45030_fdr%2Fx) [n:127.0.0.1:45030_fdr%2Fx    ] o.a.s.c.a.c.CreateCollectionCmd Finished create command for collection: collection1
   [junit4]   2> 3025144 DEBUG (OverseerThreadFactory-13963-thread-2-processing-n:127.0.0.1:45030_fdr%2Fx) [n:127.0.0.1:45030_fdr%2Fx    ] o.a.s.c.OverseerTaskProcessor Completed task:[/overseer/collection-queue-work/qn-0000000002]
   [junit4]   2> 3025145 DEBUG (OverseerThreadFactory-13963-thread-2-processing-n:127.0.0.1:45030_fdr%2Fx) [n:127.0.0.1:45030_fdr%2Fx    ] o.a.s.c.OverseerTaskProcessor Marked task [/overseer/collection-queue-work/qn-0000000002] as completed.
   [junit4]   2> 3025145 DEBUG (OverseerThreadFactory-13963-thread-2-processing-n:127.0.0.1:45030_fdr%2Fx) [n:127.0.0.1:45030_fdr%2Fx    ] o.a.s.c.OverseerTaskProcessor RunningTasks: []
   [junit4]   2> 3025145 DEBUG (OverseerThreadFactory-13963-thread-2-processing-n:127.0.0.1:45030_fdr%2Fx) [n:127.0.0.1:45030_fdr%2Fx    ] o.a.s.c.OverseerTaskProcessor BlockedTasks: []
   [junit4]   2> 3025145 DEBUG (OverseerThreadFactory-13963-thread-2-processing-n:127.0.0.1:45030_fdr%2Fx) [n:127.0.0.1:45030_fdr%2Fx    ] o.a.s.c.OverseerTaskProcessor CompletedTasks: [/overseer/collection-queue-work/qn-0000000002]
   [junit4]   2> 3025145 INFO  (OverseerThreadFactory-13963-thread-2-processing-n:127.0.0.1:45030_fdr%2Fx) [n:127.0.0.1:45030_fdr%2Fx    ] o.a.s.c.OverseerTaskProcessor RunningZKTasks: [/overseer/collection-queue-work/qn-0000000002]
   [junit4]   2> 3025145 DEBUG (OverseerThreadFactory-13963-thread-2-processing-n:127.0.0.1:45030_fdr%2Fx) [n:127.0.0.1:45030_fdr%2Fx    ] o.a.s.c.OverseerTaskProcessor Overseer Collection Message Handler: Message id:/overseer/collection-queue-work/qn-0000000002 complete, response:{}
   [junit4]   2> 3025146 INFO  (qtp492727898-48885) [n:127.0.0.1:45030_fdr%2Fx    ] o.a.s.h.a.CollectionsHandler Wait for new collection to be active for at most 45 seconds. Check all shard replicas
   [junit4]   2> 3025146 INFO  (qtp492727898-48885) [n:127.0.0.1:45030_fdr%2Fx    ] o.a.s.s.HttpSolrCall [admin] webapp=null path=/admin/collections params={collection.configName=conf1&name=collection1&nrtReplicas=1&action=CREATE&numShards=2&createNodeSet=&stateFormat=2&wt=javabin&version=2} status=0 QTime=246
   [junit4]   2> 3025147 INFO  (TEST-ShardSplitTest.testSplitLocking-seed#[8AC25117A864E334]) [    ] o.a.s.c.AbstractFullDistribZkTestBase Creating jetty instances pullReplicaCount=0 numOtherReplicas=4
   [junit4]   2> 3025361 INFO  (TEST-ShardSplitTest.testSplitLocking-seed#[8AC25117A864E334]) [    ] o.a.s.c.AbstractFullDistribZkTestBase create jetty 1 in directory /x1/jenkins/jenkins-slave/workspace/Lucene-Solr-NightlyTests-8.x/checkout/solr/build/solr-core/test/J0/temp/solr.cloud.api.collections.ShardSplitTest_8AC25117A864E334-001/shard-1-001 of type NRT
   [junit4]   2> 3025395 WARN  (closeThreadPool-15114-thread-1) [    ] o.e.j.s.AbstractConnector Ignoring deprecated socket close linger time
   [junit4]   2> 3025395 INFO  (closeThreadPool-15114-thread-1) [    ] o.a.s.c.s.e.JettySolrRunner Start Jetty (original configured port=0)
   [junit4]   2> 3025395 INFO  (closeThreadPool-15114-thread-1) [    ] o.a.s.c.s.e.JettySolrRunner Trying to start Jetty on port 0 try number 1 ...
   [junit4]   2> 3025395 INFO  (closeThreadPool-15114-thread-1) [    ] o.e.j.s.Server jetty-9.4.14.v20181114; built: 2018-11-14T21:20:31.478Z; git: c4550056e785fb5665914545889f21dc136ad9e6; jvm 1.8.0_191-b12
   [junit4]   2> 3025455 INFO  (closeThreadPool-15114-thread-1) [    ] o.e.j.s.session DefaultSessionIdManager workerName=node0
   [junit4]   2> 3025455 INFO  (closeThreadPool-15114-thread-1) [    ] o.e.j.s.session No SessionScavenger set, using defaults
   [junit4]   2> 3025455 INFO  (closeThreadPool-15114-thread-1) [    ] o.e.j.s.session node0 Scavenging every 660000ms
   [junit4]   2> 3025461 INFO  (closeThreadPool-15114-thread-1) [    ] o.e.j.s.h.ContextHandler Started o.e.j.s.ServletContextHandler@5c539aca{/fdr/x,null,AVAILABLE}
   [junit4]   2> 3025462 INFO  (closeThreadPool-15114-thread-1) [    ] o.e.j.s.AbstractConnector Started ServerConnector@26a2bd4a{HTTP/1.1,[http/1.1, h2c]}{127.0.0.1:35638}
   [junit4]   2> 3025462 INFO  (closeThreadPool-15114-thread-1) [    ] o.e.j.s.Server Started @3025526ms
   [junit4]   2> 3025462 INFO  (closeThreadPool-15114-thread-1) [    ] o.a.s.c.s.e.JettySolrRunner Jetty properties: {solr.data.dir=/x1/jenkins/jenkins-slave/workspace/Lucene-Solr-NightlyTests-8.x/checkout/solr/build/solr-core/test/J0/temp/solr.cloud.api.collections.ShardSplitTest_8AC25117A864E334-001/tempDir-001/jetty1, solrconfig=solrconfig.xml, hostContext=/fdr/x, hostPort=35638, coreRootDirectory=/x1/jenkins/jenkins-slave/workspace/Lucene-Solr-NightlyTests-8.x/checkout/solr/build/solr-core/test/J0/../../../../../../../../../../../x1/jenkins/jenkins-slave/workspace/Lucene-Solr-NightlyTests-8.x/checkout/solr/build/solr-core/test/J0/temp/solr.cloud.api.collections.ShardSplitTest_8AC25117A864E334-001/shard-1-001/cores}
   [junit4]   2> 3025462 ERROR (closeThreadPool-15114-thread-1) [    ] o.a.s.u.StartupLoggingUtils Missing Java Option solr.log.dir. Logging may be missing or incomplete.
   [junit4]   2> 3025462 INFO  (closeThreadPool-15114-thread-1) [    ] o.a.s.s.SolrDispatchFilter Using logger factory org.apache.logging.slf4j.Log4jLoggerFactory
   [junit4]   2> 3025462 INFO  (closeThreadPool-15114-thread-1) [    ] o.a.s.s.SolrDispatchFilter  ___      _       Welcome to Apache Solr™ version 8.1.0
   [junit4]   2> 3025462 INFO  (closeThreadPool-15114-thread-1) [    ] o.a.s.s.SolrDispatchFilter / __| ___| |_ _   Starting in cloud mode on port null
   [junit4]   2> 3025462 INFO  (closeThreadPool-15114-thread-1) [    ] o.a.s.s.SolrDispatchFilter \__ \/ _ \ | '_|  Install dir: null
   [junit4]   2> 3025463 INFO  (closeThreadPool-15114-thread-1) [    ] o.a.s.s.SolrDispatchFilter |___/\___/_|_|    Start time: 2019-02-12T16:07:38.955Z
   [junit4]   2> 3025491 INFO  (zkConnectionManagerCallback-15116-thread-1) [    ] o.a.s.c.c.ConnectionManager zkClient has connected
   [junit4]   2> 3025498 INFO  (closeThreadPool-15114-thread-1) [    ] o.a.s.s.SolrDispatchFilter Loading solr.xml from SolrHome (not found in ZooKeeper)
   [junit4]   2> 3025498 INFO  (closeThreadPool-15114-thread-1) [    ] o.a.s.c.SolrXmlConfig Loading container configuration from /x1/jenkins/jenkins-slave/workspace/Lucene-Solr-NightlyTests-8.x/checkout/solr/build/solr-core/test/J0/temp/solr.cloud.api.collections.ShardSplitTest_8AC25117A864E334-001/shard-1-001/solr.xml
   [junit4]   2> 3025503 INFO  (closeThreadPool-15114-thread-1) [    ] o.a.s.c.SolrXmlConfig Configuration parameter autoReplicaFailoverWorkLoopDelay is ignored
   [junit4]   2> 3025503 INFO  (closeThreadPool-15114-thread-1) [    ] o.a.s.c.SolrXmlConfig Configuration parameter autoReplicaFailoverBadNodeExpiration is ignored
   [junit4]   2> 3025505 INFO  (closeThreadPool-15114-thread-1) [    ] o.a.s.c.SolrXmlConfig MBean server found: com.sun.jmx.mbeanserver.JmxMBeanServer@4ca16c27, but no JMX reporters were configured - adding default JMX reporter.
   [junit4]   2> 3025664 INFO  (TEST-ShardSplitTest.testSplitLocking-seed#[8AC25117A864E334]) [    ] o.a.s.c.AbstractFullDistribZkTestBase create jetty 2 in directory /x1/jenkins/jenkins-slave/workspace/Lucene-Solr-NightlyTests-8.x/checkout/solr/build/solr-core/test/J0/temp/solr.cloud.api.collections.ShardSplitTest_8AC25117A864E334-001/shard-2-001 of type NRT
   [junit4]   2> 3025665 WARN  (closeThreadPool-15114-thread-2) [    ] o.e.j.s.AbstractConnector Ignoring deprecated socket close linger time
   [junit4]   2> 3025665 INFO  (closeThreadPool-15114-thread-2) [    ] o.a.s.c.s.e.JettySolrRunner Start Jetty (original configured port=0)
   [junit4]   2> 3025665 INFO  (closeThreadPool-15114-thread-2) [    ] o.a.s.c.s.e.JettySolrRunner Trying to start Jetty on port 0 tr

[...truncated too long message...]

vy-availability-check:
[loadresource] Do not set property disallowed.ivy.jars.list as its length is 0.

-ivy-fail-disallowed-ivy-version:

ivy-fail:

ivy-configure:
[ivy:configure] :: loading settings :: file = /x1/jenkins/jenkins-slave/workspace/Lucene-Solr-NightlyTests-8.x/checkout/lucene/top-level-ivy-settings.xml

resolve:

ivy-availability-check:
[loadresource] Do not set property disallowed.ivy.jars.list as its length is 0.

-ivy-fail-disallowed-ivy-version:

ivy-fail:

ivy-fail:

ivy-configure:
[ivy:configure] :: loading settings :: file = /x1/jenkins/jenkins-slave/workspace/Lucene-Solr-NightlyTests-8.x/checkout/lucene/top-level-ivy-settings.xml

resolve:

ivy-availability-check:
[loadresource] Do not set property disallowed.ivy.jars.list as its length is 0.

-ivy-fail-disallowed-ivy-version:

ivy-fail:

ivy-configure:
[ivy:configure] :: loading settings :: file = /x1/jenkins/jenkins-slave/workspace/Lucene-Solr-NightlyTests-8.x/checkout/lucene/top-level-ivy-settings.xml

resolve:

ivy-availability-check:
[loadresource] Do not set property disallowed.ivy.jars.list as its length is 0.

-ivy-fail-disallowed-ivy-version:

ivy-fail:

ivy-fail:

ivy-configure:
[ivy:configure] :: loading settings :: file = /x1/jenkins/jenkins-slave/workspace/Lucene-Solr-NightlyTests-8.x/checkout/lucene/top-level-ivy-settings.xml

resolve:

ivy-availability-check:
[loadresource] Do not set property disallowed.ivy.jars.list as its length is 0.

-ivy-fail-disallowed-ivy-version:

ivy-fail:

ivy-fail:

ivy-configure:
[ivy:configure] :: loading settings :: file = /x1/jenkins/jenkins-slave/workspace/Lucene-Solr-NightlyTests-8.x/checkout/lucene/top-level-ivy-settings.xml

resolve:

ivy-availability-check:
[loadresource] Do not set property disallowed.ivy.jars.list as its length is 0.

-ivy-fail-disallowed-ivy-version:

ivy-fail:

ivy-fail:

ivy-configure:
[ivy:configure] :: loading settings :: file = /x1/jenkins/jenkins-slave/workspace/Lucene-Solr-NightlyTests-8.x/checkout/lucene/top-level-ivy-settings.xml

resolve:

ivy-availability-check:
[loadresource] Do not set property disallowed.ivy.jars.list as its length is 0.

-ivy-fail-disallowed-ivy-version:

ivy-fail:

ivy-fail:

ivy-configure:
[ivy:configure] :: loading settings :: file = /x1/jenkins/jenkins-slave/workspace/Lucene-Solr-NightlyTests-8.x/checkout/lucene/top-level-ivy-settings.xml

resolve:

ivy-availability-check:
[loadresource] Do not set property disallowed.ivy.jars.list as its length is 0.

-ivy-fail-disallowed-ivy-version:

ivy-fail:

ivy-fail:

ivy-configure:
[ivy:configure] :: loading settings :: file = /x1/jenkins/jenkins-slave/workspace/Lucene-Solr-NightlyTests-8.x/checkout/lucene/top-level-ivy-settings.xml

resolve:

ivy-availability-check:
[loadresource] Do not set property disallowed.ivy.jars.list as its length is 0.

-ivy-fail-disallowed-ivy-version:

ivy-fail:

ivy-fail:

ivy-configure:
[ivy:configure] :: loading settings :: file = /x1/jenkins/jenkins-slave/workspace/Lucene-Solr-NightlyTests-8.x/checkout/lucene/top-level-ivy-settings.xml

resolve:

ivy-availability-check:
[loadresource] Do not set property disallowed.ivy.jars.list as its length is 0.

-ivy-fail-disallowed-ivy-version:

ivy-fail:

ivy-fail:

ivy-configure:
[ivy:configure] :: loading settings :: file = /x1/jenkins/jenkins-slave/workspace/Lucene-Solr-NightlyTests-8.x/checkout/lucene/top-level-ivy-settings.xml

resolve:

ivy-availability-check:
[loadresource] Do not set property disallowed.ivy.jars.list as its length is 0.

-ivy-fail-disallowed-ivy-version:

ivy-fail:

ivy-fail:

ivy-configure:
[ivy:configure] :: loading settings :: file = /x1/jenkins/jenkins-slave/workspace/Lucene-Solr-NightlyTests-8.x/checkout/lucene/top-level-ivy-settings.xml

resolve:

ivy-availability-check:
[loadresource] Do not set property disallowed.ivy.jars.list as its length is 0.

-ivy-fail-disallowed-ivy-version:

ivy-fail:

ivy-fail:

ivy-configure:
[ivy:configure] :: loading settings :: file = /x1/jenkins/jenkins-slave/workspace/Lucene-Solr-NightlyTests-8.x/checkout/lucene/top-level-ivy-settings.xml

resolve:

ivy-availability-check:
[loadresource] Do not set property disallowed.ivy.jars.list as its length is 0.

-ivy-fail-disallowed-ivy-version:

ivy-fail:

ivy-fail:

ivy-configure:
[ivy:configure] :: loading settings :: file = /x1/jenkins/jenkins-slave/workspace/Lucene-Solr-NightlyTests-8.x/checkout/lucene/top-level-ivy-settings.xml

resolve:

jar-checksums:
    [mkdir] Created dir: /x1/jenkins/jenkins-slave/workspace/Lucene-Solr-NightlyTests-8.x/checkout/solr/null1834804323
     [copy] Copying 237 files to /x1/jenkins/jenkins-slave/workspace/Lucene-Solr-NightlyTests-8.x/checkout/solr/null1834804323
   [delete] Deleting directory /x1/jenkins/jenkins-slave/workspace/Lucene-Solr-NightlyTests-8.x/checkout/solr/null1834804323

check-working-copy:
[ivy:cachepath] :: resolving dependencies :: org.eclipse.jgit#org.eclipse.jgit-caller;working
[ivy:cachepath] confs: [default]
[ivy:cachepath] found org.eclipse.jgit#org.eclipse.jgit;4.6.0.201612231935-r in public
[ivy:cachepath] found com.jcraft#jsch;0.1.53 in public
[ivy:cachepath] found com.googlecode.javaewah#JavaEWAH;1.1.6 in public
[ivy:cachepath] found org.apache.httpcomponents#httpclient;4.3.6 in public
[ivy:cachepath] found org.apache.httpcomponents#httpcore;4.3.3 in public
[ivy:cachepath] found commons-logging#commons-logging;1.1.3 in public
[ivy:cachepath] found commons-codec#commons-codec;1.6 in public
[ivy:cachepath] found org.slf4j#slf4j-api;1.7.2 in public
[ivy:cachepath] :: resolution report :: resolve 62ms :: artifacts dl 6ms
        ---------------------------------------------------------------------
        |                  |            modules            ||   artifacts   |
        |       conf       | number| search|dwnlded|evicted|| number|dwnlded|
        ---------------------------------------------------------------------
        |      default     |   8   |   0   |   0   |   0   ||   8   |   0   |
        ---------------------------------------------------------------------
[wc-checker] Initializing working copy...
[wc-checker] SLF4J: Failed to load class "org.slf4j.impl.StaticLoggerBinder".
[wc-checker] SLF4J: Defaulting to no-operation (NOP) logger implementation
[wc-checker] SLF4J: See http://www.slf4j.org/codes.html#StaticLoggerBinder for further details.
[wc-checker] Checking working copy status...

-jenkins-base:

BUILD SUCCESSFUL
Total time: 272 minutes 13 seconds
Archiving artifacts
java.lang.InterruptedException: no matches found within 10000
        at hudson.FilePath$ValidateAntFileMask.hasMatch(FilePath.java:2847)
        at hudson.FilePath$ValidateAntFileMask.invoke(FilePath.java:2726)
        at hudson.FilePath$ValidateAntFileMask.invoke(FilePath.java:2707)
        at hudson.FilePath$FileCallableWrapper.call(FilePath.java:3086)
Also:   hudson.remoting.Channel$CallSiteStackTrace: Remote call to lucene
                at hudson.remoting.Channel.attachCallSiteStackTrace(Channel.java:1741)
                at hudson.remoting.UserRequest$ExceptionResponse.retrieve(UserRequest.java:357)
                at hudson.remoting.Channel.call(Channel.java:955)
                at hudson.FilePath.act(FilePath.java:1072)
                at hudson.FilePath.act(FilePath.java:1061)
                at hudson.FilePath.validateAntFileMask(FilePath.java:2705)
                at hudson.tasks.ArtifactArchiver.perform(ArtifactArchiver.java:243)
                at hudson.tasks.BuildStepCompatibilityLayer.perform(BuildStepCompatibilityLayer.java:81)
                at hudson.tasks.BuildStepMonitor$1.perform(BuildStepMonitor.java:20)
                at hudson.model.AbstractBuild$AbstractBuildExecution.perform(AbstractBuild.java:744)
                at hudson.model.AbstractBuild$AbstractBuildExecution.performAllBuildSteps(AbstractBuild.java:690)
                at hudson.model.Build$BuildExecution.post2(Build.java:186)
                at hudson.model.AbstractBuild$AbstractBuildExecution.post(AbstractBuild.java:635)
                at hudson.model.Run.execute(Run.java:1835)
                at hudson.model.FreeStyleBuild.run(FreeStyleBuild.java:43)
                at hudson.model.ResourceController.execute(ResourceController.java:97)
                at hudson.model.Executor.run(Executor.java:429)
Caused: hudson.FilePath$TunneledInterruptedException
        at hudson.FilePath$FileCallableWrapper.call(FilePath.java:3088)
        at hudson.remoting.UserRequest.perform(UserRequest.java:212)
        at hudson.remoting.UserRequest.perform(UserRequest.java:54)
        at hudson.remoting.Request$2.run(Request.java:369)
        at hudson.remoting.InterceptingExecutorService$1.call(InterceptingExecutorService.java:72)
        at java.util.concurrent.FutureTask.run(FutureTask.java:266)
        at java.util.concurrent.ThreadPoolExecutor.runWorker(ThreadPoolExecutor.java:1142)
        at java.util.concurrent.ThreadPoolExecutor$Worker.run(ThreadPoolExecutor.java:617)
        at java.lang.Thread.run(Thread.java:748)
Caused: java.lang.InterruptedException: java.lang.InterruptedException: no matches found within 10000
        at hudson.FilePath.act(FilePath.java:1074)
        at hudson.FilePath.act(FilePath.java:1061)
        at hudson.FilePath.validateAntFileMask(FilePath.java:2705)
        at hudson.tasks.ArtifactArchiver.perform(ArtifactArchiver.java:243)
        at hudson.tasks.BuildStepCompatibilityLayer.perform(BuildStepCompatibilityLayer.java:81)
        at hudson.tasks.BuildStepMonitor$1.perform(BuildStepMonitor.java:20)
        at hudson.model.AbstractBuild$AbstractBuildExecution.perform(AbstractBuild.java:744)
        at hudson.model.AbstractBuild$AbstractBuildExecution.performAllBuildSteps(AbstractBuild.java:690)
        at hudson.model.Build$BuildExecution.post2(Build.java:186)
        at hudson.model.AbstractBuild$AbstractBuildExecution.post(AbstractBuild.java:635)
        at hudson.model.Run.execute(Run.java:1835)
        at hudson.model.FreeStyleBuild.run(FreeStyleBuild.java:43)
        at hudson.model.ResourceController.execute(ResourceController.java:97)
        at hudson.model.Executor.run(Executor.java:429)
No artifacts found that match the file pattern "**/*.events,heapdumps/**,**/hs_err_pid*". Configuration error?
Recording test results
Build step 'Publish JUnit test result report' changed build result to UNSTABLE
Email was triggered for: Unstable (Test Failures)
Sending email for trigger: Unstable (Test Failures)


---------------------------------------------------------------------
To unsubscribe, e-mail: [hidden email]
For additional commands, e-mail: [hidden email]
Reply | Threaded
Open this post in threaded view
|

[JENKINS] Lucene-Solr-NightlyTests-8.x - Build # 22 - Still Unstable

Apache Jenkins Server-2
Build: https://builds.apache.org/job/Lucene-Solr-NightlyTests-8.x/22/

3 tests failed.
FAILED:  org.apache.lucene.analysis.core.TestRandomChains.testRandomChainsWithLargeStrings

Error Message:
stage 3: inconsistent endOffset at pos=1: 20 vs 32; token=ndhwtmqirh<SOUTHEAST_ASIAN>srtauoosva fjroolbsmmfr

Stack Trace:
java.lang.IllegalStateException: stage 3: inconsistent endOffset at pos=1: 20 vs 32; token=ndhwtmqirh<SOUTHEAST_ASIAN>srtauoosva fjroolbsmmfr
        at __randomizedtesting.SeedInfo.seed([1FA0C906E679E3CF:75FB7617BF37C33C]:0)
        at org.apache.lucene.analysis.ValidatingTokenFilter.incrementToken(ValidatingTokenFilter.java:146)
        at org.apache.lucene.analysis.miscellaneous.ConditionalTokenFilter.incrementToken(ConditionalTokenFilter.java:174)
        at org.apache.lucene.analysis.ValidatingTokenFilter.incrementToken(ValidatingTokenFilter.java:77)
        at org.apache.lucene.analysis.BaseTokenStreamTestCase.checkAnalysisConsistency(BaseTokenStreamTestCase.java:746)
        at org.apache.lucene.analysis.BaseTokenStreamTestCase.checkRandomData(BaseTokenStreamTestCase.java:657)
        at org.apache.lucene.analysis.BaseTokenStreamTestCase.checkRandomData(BaseTokenStreamTestCase.java:559)
        at org.apache.lucene.analysis.core.TestRandomChains.testRandomChainsWithLargeStrings(TestRandomChains.java:899)
        at sun.reflect.NativeMethodAccessorImpl.invoke0(Native Method)
        at sun.reflect.NativeMethodAccessorImpl.invoke(NativeMethodAccessorImpl.java:62)
        at sun.reflect.DelegatingMethodAccessorImpl.invoke(DelegatingMethodAccessorImpl.java:43)
        at java.lang.reflect.Method.invoke(Method.java:498)
        at com.carrotsearch.randomizedtesting.RandomizedRunner.invoke(RandomizedRunner.java:1750)
        at com.carrotsearch.randomizedtesting.RandomizedRunner$8.evaluate(RandomizedRunner.java:938)
        at com.carrotsearch.randomizedtesting.RandomizedRunner$9.evaluate(RandomizedRunner.java:974)
        at com.carrotsearch.randomizedtesting.RandomizedRunner$10.evaluate(RandomizedRunner.java:988)
        at org.apache.lucene.util.TestRuleSetupTeardownChained$1.evaluate(TestRuleSetupTeardownChained.java:49)
        at org.apache.lucene.util.AbstractBeforeAfterRule$1.evaluate(AbstractBeforeAfterRule.java:45)
        at org.apache.lucene.util.TestRuleThreadAndTestName$1.evaluate(TestRuleThreadAndTestName.java:48)
        at org.apache.lucene.util.TestRuleIgnoreAfterMaxFailures$1.evaluate(TestRuleIgnoreAfterMaxFailures.java:64)
        at org.apache.lucene.util.TestRuleMarkFailure$1.evaluate(TestRuleMarkFailure.java:47)
        at com.carrotsearch.randomizedtesting.rules.StatementAdapter.evaluate(StatementAdapter.java:36)
        at com.carrotsearch.randomizedtesting.ThreadLeakControl$StatementRunner.run(ThreadLeakControl.java:368)
        at com.carrotsearch.randomizedtesting.ThreadLeakControl.forkTimeoutingTask(ThreadLeakControl.java:817)
        at com.carrotsearch.randomizedtesting.ThreadLeakControl$3.evaluate(ThreadLeakControl.java:468)
        at com.carrotsearch.randomizedtesting.RandomizedRunner.runSingleTest(RandomizedRunner.java:947)
        at com.carrotsearch.randomizedtesting.RandomizedRunner$5.evaluate(RandomizedRunner.java:832)
        at com.carrotsearch.randomizedtesting.RandomizedRunner$6.evaluate(RandomizedRunner.java:883)
        at com.carrotsearch.randomizedtesting.RandomizedRunner$7.evaluate(RandomizedRunner.java:894)
        at org.apache.lucene.util.AbstractBeforeAfterRule$1.evaluate(AbstractBeforeAfterRule.java:45)
        at com.carrotsearch.randomizedtesting.rules.StatementAdapter.evaluate(StatementAdapter.java:36)
        at org.apache.lucene.util.TestRuleStoreClassName$1.evaluate(TestRuleStoreClassName.java:41)
        at com.carrotsearch.randomizedtesting.rules.NoShadowingOrOverridesOnMethodsRule$1.evaluate(NoShadowingOrOverridesOnMethodsRule.java:40)
        at com.carrotsearch.randomizedtesting.rules.NoShadowingOrOverridesOnMethodsRule$1.evaluate(NoShadowingOrOverridesOnMethodsRule.java:40)
        at com.carrotsearch.randomizedtesting.rules.StatementAdapter.evaluate(StatementAdapter.java:36)
        at com.carrotsearch.randomizedtesting.rules.StatementAdapter.evaluate(StatementAdapter.java:36)
        at com.carrotsearch.randomizedtesting.rules.StatementAdapter.evaluate(StatementAdapter.java:36)
        at org.apache.lucene.util.TestRuleAssertionsRequired$1.evaluate(TestRuleAssertionsRequired.java:53)
        at org.apache.lucene.util.TestRuleMarkFailure$1.evaluate(TestRuleMarkFailure.java:47)
        at org.apache.lucene.util.TestRuleIgnoreAfterMaxFailures$1.evaluate(TestRuleIgnoreAfterMaxFailures.java:64)
        at org.apache.lucene.util.TestRuleIgnoreTestSuites$1.evaluate(TestRuleIgnoreTestSuites.java:54)
        at com.carrotsearch.randomizedtesting.rules.StatementAdapter.evaluate(StatementAdapter.java:36)
        at com.carrotsearch.randomizedtesting.ThreadLeakControl$StatementRunner.run(ThreadLeakControl.java:368)
        at java.lang.Thread.run(Thread.java:748)


FAILED:  junit.framework.TestSuite.org.apache.solr.cloud.ChaosMonkeyNothingIsSafeWithPullReplicasTest

Error Message:
ObjectTracker found 6 object(s) that were not released!!! [InternalHttpClient, MMapDirectory, MMapDirectory, MMapDirectory, SolrCore, MMapDirectory] org.apache.solr.common.util.ObjectReleaseTracker$ObjectTrackerException: org.apache.http.impl.client.InternalHttpClient  at org.apache.solr.common.util.ObjectReleaseTracker.track(ObjectReleaseTracker.java:42)  at org.apache.solr.client.solrj.impl.HttpClientUtil.createClient(HttpClientUtil.java:321)  at org.apache.solr.client.solrj.impl.HttpClientUtil.createClient(HttpClientUtil.java:330)  at org.apache.solr.handler.IndexFetcher.createHttpClient(IndexFetcher.java:230)  at org.apache.solr.handler.IndexFetcher.<init>(IndexFetcher.java:272)  at org.apache.solr.handler.ReplicationHandler.doFetch(ReplicationHandler.java:420)  at org.apache.solr.cloud.RecoveryStrategy.replicate(RecoveryStrategy.java:237)  at org.apache.solr.cloud.RecoveryStrategy.doReplicateOnlyRecovery(RecoveryStrategy.java:382)  at org.apache.solr.cloud.RecoveryStrategy.doRecovery(RecoveryStrategy.java:328)  at org.apache.solr.cloud.RecoveryStrategy.run(RecoveryStrategy.java:307)  at com.codahale.metrics.InstrumentedExecutorService$InstrumentedRunnable.run(InstrumentedExecutorService.java:176)  at java.util.concurrent.Executors$RunnableAdapter.call(Executors.java:511)  at java.util.concurrent.FutureTask.run(FutureTask.java:266)  at org.apache.solr.common.util.ExecutorUtil$MDCAwareThreadPoolExecutor.lambda$execute$0(ExecutorUtil.java:209)  at java.util.concurrent.ThreadPoolExecutor.runWorker(ThreadPoolExecutor.java:1149)  at java.util.concurrent.ThreadPoolExecutor$Worker.run(ThreadPoolExecutor.java:624)  at java.lang.Thread.run(Thread.java:748)  org.apache.solr.common.util.ObjectReleaseTracker$ObjectTrackerException: org.apache.lucene.store.MMapDirectory  at org.apache.solr.common.util.ObjectReleaseTracker.track(ObjectReleaseTracker.java:42)  at org.apache.solr.core.CachingDirectoryFactory.get(CachingDirectoryFactory.java:348)  at org.apache.solr.core.SolrCore.getNewIndexDir(SolrCore.java:367)  at org.apache.solr.core.SolrCore.initIndex(SolrCore.java:746)  at org.apache.solr.core.SolrCore.<init>(SolrCore.java:975)  at org.apache.solr.core.SolrCore.<init>(SolrCore.java:882)  at org.apache.solr.core.CoreContainer.createFromDescriptor(CoreContainer.java:1189)  at org.apache.solr.core.CoreContainer.create(CoreContainer.java:1099)  at org.apache.solr.handler.admin.CoreAdminOperation.lambda$static$0(CoreAdminOperation.java:92)  at org.apache.solr.handler.admin.CoreAdminOperation.execute(CoreAdminOperation.java:360)  at org.apache.solr.handler.admin.CoreAdminHandler$CallInfo.call(CoreAdminHandler.java:395)  at org.apache.solr.handler.admin.CoreAdminHandler.handleRequestBody(CoreAdminHandler.java:180)  at org.apache.solr.handler.RequestHandlerBase.handleRequest(RequestHandlerBase.java:199)  at org.apache.solr.servlet.HttpSolrCall.handleAdmin(HttpSolrCall.java:736)  at org.apache.solr.servlet.HttpSolrCall.handleAdminRequest(HttpSolrCall.java:717)  at org.apache.solr.servlet.HttpSolrCall.call(HttpSolrCall.java:496)  at org.apache.solr.servlet.SolrDispatchFilter.doFilter(SolrDispatchFilter.java:394)  at org.apache.solr.servlet.SolrDispatchFilter.doFilter(SolrDispatchFilter.java:340)  at org.eclipse.jetty.servlet.ServletHandler$CachedChain.doFilter(ServletHandler.java:1610)  at org.apache.solr.client.solrj.embedded.JettySolrRunner$DebugFilter.doFilter(JettySolrRunner.java:164)  at org.eclipse.jetty.servlet.ServletHandler$CachedChain.doFilter(ServletHandler.java:1610)  at org.eclipse.jetty.servlet.ServletHandler.doHandle(ServletHandler.java:540)  at org.eclipse.jetty.server.handler.ScopedHandler.nextHandle(ScopedHandler.java:255)  at org.eclipse.jetty.server.session.SessionHandler.doHandle(SessionHandler.java:1588)  at org.eclipse.jetty.server.handler.ScopedHandler.nextHandle(ScopedHandler.java:255)  at org.eclipse.jetty.server.handler.ContextHandler.doHandle(ContextHandler.java:1345)  at org.eclipse.jetty.server.handler.ScopedHandler.nextScope(ScopedHandler.java:203)  at org.eclipse.jetty.servlet.ServletHandler.doScope(ServletHandler.java:480)  at org.eclipse.jetty.server.session.SessionHandler.doScope(SessionHandler.java:1557)  at org.eclipse.jetty.server.handler.ScopedHandler.nextScope(ScopedHandler.java:201)  at org.eclipse.jetty.server.handler.ContextHandler.doScope(ContextHandler.java:1247)  at org.eclipse.jetty.server.handler.ScopedHandler.handle(ScopedHandler.java:144)  at org.eclipse.jetty.server.handler.gzip.GzipHandler.handle(GzipHandler.java:703)  at org.eclipse.jetty.server.handler.HandlerWrapper.handle(HandlerWrapper.java:132)  at org.eclipse.jetty.server.Server.handle(Server.java:502)  at org.eclipse.jetty.server.HttpChannel.handle(HttpChannel.java:364)  at org.eclipse.jetty.server.HttpChannel.run(HttpChannel.java:305)  at org.eclipse.jetty.util.thread.QueuedThreadPool.runJob(QueuedThreadPool.java:765)  at org.eclipse.jetty.util.thread.QueuedThreadPool$2.run(QueuedThreadPool.java:683)  at java.lang.Thread.run(Thread.java:748)  org.apache.solr.common.util.ObjectReleaseTracker$ObjectTrackerException: org.apache.lucene.store.MMapDirectory  at org.apache.solr.common.util.ObjectReleaseTracker.track(ObjectReleaseTracker.java:42)  at org.apache.solr.core.CachingDirectoryFactory.get(CachingDirectoryFactory.java:348)  at org.apache.solr.core.SolrCore.initSnapshotMetaDataManager(SolrCore.java:516)  at org.apache.solr.core.SolrCore.<init>(SolrCore.java:967)  at org.apache.solr.core.SolrCore.<init>(SolrCore.java:882)  at org.apache.solr.core.CoreContainer.createFromDescriptor(CoreContainer.java:1189)  at org.apache.solr.core.CoreContainer.create(CoreContainer.java:1099)  at org.apache.solr.handler.admin.CoreAdminOperation.lambda$static$0(CoreAdminOperation.java:92)  at org.apache.solr.handler.admin.CoreAdminOperation.execute(CoreAdminOperation.java:360)  at org.apache.solr.handler.admin.CoreAdminHandler$CallInfo.call(CoreAdminHandler.java:395)  at org.apache.solr.handler.admin.CoreAdminHandler.handleRequestBody(CoreAdminHandler.java:180)  at org.apache.solr.handler.RequestHandlerBase.handleRequest(RequestHandlerBase.java:199)  at org.apache.solr.servlet.HttpSolrCall.handleAdmin(HttpSolrCall.java:736)  at org.apache.solr.servlet.HttpSolrCall.handleAdminRequest(HttpSolrCall.java:717)  at org.apache.solr.servlet.HttpSolrCall.call(HttpSolrCall.java:496)  at org.apache.solr.servlet.SolrDispatchFilter.doFilter(SolrDispatchFilter.java:394)  at org.apache.solr.servlet.SolrDispatchFilter.doFilter(SolrDispatchFilter.java:340)  at org.eclipse.jetty.servlet.ServletHandler$CachedChain.doFilter(ServletHandler.java:1610)  at org.apache.solr.client.solrj.embedded.JettySolrRunner$DebugFilter.doFilter(JettySolrRunner.java:164)  at org.eclipse.jetty.servlet.ServletHandler$CachedChain.doFilter(ServletHandler.java:1610)  at org.eclipse.jetty.servlet.ServletHandler.doHandle(ServletHandler.java:540)  at org.eclipse.jetty.server.handler.ScopedHandler.nextHandle(ScopedHandler.java:255)  at org.eclipse.jetty.server.session.SessionHandler.doHandle(SessionHandler.java:1588)  at org.eclipse.jetty.server.handler.ScopedHandler.nextHandle(ScopedHandler.java:255)  at org.eclipse.jetty.server.handler.ContextHandler.doHandle(ContextHandler.java:1345)  at org.eclipse.jetty.server.handler.ScopedHandler.nextScope(ScopedHandler.java:203)  at org.eclipse.jetty.servlet.ServletHandler.doScope(ServletHandler.java:480)  at org.eclipse.jetty.server.session.SessionHandler.doScope(SessionHandler.java:1557)  at org.eclipse.jetty.server.handler.ScopedHandler.nextScope(ScopedHandler.java:201)  at org.eclipse.jetty.server.handler.ContextHandler.doScope(ContextHandler.java:1247)  at org.eclipse.jetty.server.handler.ScopedHandler.handle(ScopedHandler.java:144)  at org.eclipse.jetty.server.handler.gzip.GzipHandler.handle(GzipHandler.java:703)  at org.eclipse.jetty.server.handler.HandlerWrapper.handle(HandlerWrapper.java:132)  at org.eclipse.jetty.server.Server.handle(Server.java:502)  at org.eclipse.jetty.server.HttpChannel.handle(HttpChannel.java:364)  at org.eclipse.jetty.server.HttpChannel.run(HttpChannel.java:305)  at org.eclipse.jetty.util.thread.QueuedThreadPool.runJob(QueuedThreadPool.java:765)  at org.eclipse.jetty.util.thread.QueuedThreadPool$2.run(QueuedThreadPool.java:683)  at java.lang.Thread.run(Thread.java:748)  org.apache.solr.common.util.ObjectReleaseTracker$ObjectTrackerException: org.apache.lucene.store.MMapDirectory  at org.apache.solr.common.util.ObjectReleaseTracker.track(ObjectReleaseTracker.java:42)  at org.apache.solr.core.CachingDirectoryFactory.get(CachingDirectoryFactory.java:348)  at org.apache.solr.handler.IndexFetcher.fetchLatestIndex(IndexFetcher.java:509)  at org.apache.solr.handler.IndexFetcher.fetchLatestIndex(IndexFetcher.java:351)  at org.apache.solr.handler.ReplicationHandler.doFetch(ReplicationHandler.java:424)  at org.apache.solr.handler.ReplicationHandler.lambda$setupPolling$13(ReplicationHandler.java:1193)  at java.util.concurrent.Executors$RunnableAdapter.call(Executors.java:511)  at java.util.concurrent.FutureTask.runAndReset(FutureTask.java:308)  at java.util.concurrent.ScheduledThreadPoolExecutor$ScheduledFutureTask.access$301(ScheduledThreadPoolExecutor.java:180)  at java.util.concurrent.ScheduledThreadPoolExecutor$ScheduledFutureTask.run(ScheduledThreadPoolExecutor.java:294)  at java.util.concurrent.ThreadPoolExecutor.runWorker(ThreadPoolExecutor.java:1149)  at java.util.concurrent.ThreadPoolExecutor$Worker.run(ThreadPoolExecutor.java:624)  at java.lang.Thread.run(Thread.java:748)  org.apache.solr.common.util.ObjectReleaseTracker$ObjectTrackerException: org.apache.solr.core.SolrCore  at org.apache.solr.common.util.ObjectReleaseTracker.track(ObjectReleaseTracker.java:42)  at org.apache.solr.core.SolrCore.<init>(SolrCore.java:1062)  at org.apache.solr.core.SolrCore.<init>(SolrCore.java:882)  at org.apache.solr.core.CoreContainer.createFromDescriptor(CoreContainer.java:1189)  at org.apache.solr.core.CoreContainer.create(CoreContainer.java:1099)  at org.apache.solr.handler.admin.CoreAdminOperation.lambda$static$0(CoreAdminOperation.java:92)  at org.apache.solr.handler.admin.CoreAdminOperation.execute(CoreAdminOperation.java:360)  at org.apache.solr.handler.admin.CoreAdminHandler$CallInfo.call(CoreAdminHandler.java:395)  at org.apache.solr.handler.admin.CoreAdminHandler.handleRequestBody(CoreAdminHandler.java:180)  at org.apache.solr.handler.RequestHandlerBase.handleRequest(RequestHandlerBase.java:199)  at org.apache.solr.servlet.HttpSolrCall.handleAdmin(HttpSolrCall.java:736)  at org.apache.solr.servlet.HttpSolrCall.handleAdminRequest(HttpSolrCall.java:717)  at org.apache.solr.servlet.HttpSolrCall.call(HttpSolrCall.java:496)  at org.apache.solr.servlet.SolrDispatchFilter.doFilter(SolrDispatchFilter.java:394)  at org.apache.solr.servlet.SolrDispatchFilter.doFilter(SolrDispatchFilter.java:340)  at org.eclipse.jetty.servlet.ServletHandler$CachedChain.doFilter(ServletHandler.java:1610)  at org.apache.solr.client.solrj.embedded.JettySolrRunner$DebugFilter.doFilter(JettySolrRunner.java:164)  at org.eclipse.jetty.servlet.ServletHandler$CachedChain.doFilter(ServletHandler.java:1610)  at org.eclipse.jetty.servlet.ServletHandler.doHandle(ServletHandler.java:540)  at org.eclipse.jetty.server.handler.ScopedHandler.nextHandle(ScopedHandler.java:255)  at org.eclipse.jetty.server.session.SessionHandler.doHandle(SessionHandler.java:1588)  at org.eclipse.jetty.server.handler.ScopedHandler.nextHandle(ScopedHandler.java:255)  at org.eclipse.jetty.server.handler.ContextHandler.doHandle(ContextHandler.java:1345)  at org.eclipse.jetty.server.handler.ScopedHandler.nextScope(ScopedHandler.java:203)  at org.eclipse.jetty.servlet.ServletHandler.doScope(ServletHandler.java:480)  at org.eclipse.jetty.server.session.SessionHandler.doScope(SessionHandler.java:1557)  at org.eclipse.jetty.server.handler.ScopedHandler.nextScope(ScopedHandler.java:201)  at org.eclipse.jetty.server.handler.ContextHandler.doScope(ContextHandler.java:1247)  at org.eclipse.jetty.server.handler.ScopedHandler.handle(ScopedHandler.java:144)  at org.eclipse.jetty.server.handler.gzip.GzipHandler.handle(GzipHandler.java:703)  at org.eclipse.jetty.server.handler.HandlerWrapper.handle(HandlerWrapper.java:132)  at org.eclipse.jetty.server.Server.handle(Server.java:502)  at org.eclipse.jetty.server.HttpChannel.handle(HttpChannel.java:364)  at org.eclipse.jetty.server.HttpChannel.run(HttpChannel.java:305)  at org.eclipse.jetty.util.thread.QueuedThreadPool.runJob(QueuedThreadPool.java:765)  at org.eclipse.jetty.util.thread.QueuedThreadPool$2.run(QueuedThreadPool.java:683)  at java.lang.Thread.run(Thread.java:748)  org.apache.solr.common.util.ObjectReleaseTracker$ObjectTrackerException: org.apache.lucene.store.MMapDirectory  at org.apache.solr.common.util.ObjectReleaseTracker.track(ObjectReleaseTracker.java:42)  at org.apache.solr.core.CachingDirectoryFactory.get(CachingDirectoryFactory.java:348)  at org.apache.solr.update.SolrIndexWriter.create(SolrIndexWriter.java:95)  at org.apache.solr.core.SolrCore.initIndex(SolrCore.java:778)  at org.apache.solr.core.SolrCore.<init>(SolrCore.java:975)  at org.apache.solr.core.SolrCore.<init>(SolrCore.java:882)  at org.apache.solr.core.CoreContainer.createFromDescriptor(CoreContainer.java:1189)  at org.apache.solr.core.CoreContainer.create(CoreContainer.java:1099)  at org.apache.solr.handler.admin.CoreAdminOperation.lambda$static$0(CoreAdminOperation.java:92)  at org.apache.solr.handler.admin.CoreAdminOperation.execute(CoreAdminOperation.java:360)  at org.apache.solr.handler.admin.CoreAdminHandler$CallInfo.call(CoreAdminHandler.java:395)  at org.apache.solr.handler.admin.CoreAdminHandler.handleRequestBody(CoreAdminHandler.java:180)  at org.apache.solr.handler.RequestHandlerBase.handleRequest(RequestHandlerBase.java:199)  at org.apache.solr.servlet.HttpSolrCall.handleAdmin(HttpSolrCall.java:736)  at org.apache.solr.servlet.HttpSolrCall.handleAdminRequest(HttpSolrCall.java:717)  at org.apache.solr.servlet.HttpSolrCall.call(HttpSolrCall.java:496)  at org.apache.solr.servlet.SolrDispatchFilter.doFilter(SolrDispatchFilter.java:394)  at org.apache.solr.servlet.SolrDispatchFilter.doFilter(SolrDispatchFilter.java:340)  at org.eclipse.jetty.servlet.ServletHandler$CachedChain.doFilter(ServletHandler.java:1610)  at org.apache.solr.client.solrj.embedded.JettySolrRunner$DebugFilter.doFilter(JettySolrRunner.java:164)  at org.eclipse.jetty.servlet.ServletHandler$CachedChain.doFilter(ServletHandler.java:1610)  at org.eclipse.jetty.servlet.ServletHandler.doHandle(ServletHandler.java:540)  at org.eclipse.jetty.server.handler.ScopedHandler.nextHandle(ScopedHandler.java:255)  at org.eclipse.jetty.server.session.SessionHandler.doHandle(SessionHandler.java:1588)  at org.eclipse.jetty.server.handler.ScopedHandler.nextHandle(ScopedHandler.java:255)  at org.eclipse.jetty.server.handler.ContextHandler.doHandle(ContextHandler.java:1345)  at org.eclipse.jetty.server.handler.ScopedHandler.nextScope(ScopedHandler.java:203)  at org.eclipse.jetty.servlet.ServletHandler.doScope(ServletHandler.java:480)  at org.eclipse.jetty.server.session.SessionHandler.doScope(SessionHandler.java:1557)  at org.eclipse.jetty.server.handler.ScopedHandler.nextScope(ScopedHandler.java:201)  at org.eclipse.jetty.server.handler.ContextHandler.doScope(ContextHandler.java:1247)  at org.eclipse.jetty.server.handler.ScopedHandler.handle(ScopedHandler.java:144)  at org.eclipse.jetty.server.handler.gzip.GzipHandler.handle(GzipHandler.java:703)  at org.eclipse.jetty.server.handler.HandlerWrapper.handle(HandlerWrapper.java:132)  at org.eclipse.jetty.server.Server.handle(Server.java:502)  at org.eclipse.jetty.server.HttpChannel.handle(HttpChannel.java:364)  at org.eclipse.jetty.server.HttpChannel.run(HttpChannel.java:305)  at org.eclipse.jetty.util.thread.QueuedThreadPool.runJob(QueuedThreadPool.java:765)  at org.eclipse.jetty.util.thread.QueuedThreadPool$2.run(QueuedThreadPool.java:683)  at java.lang.Thread.run(Thread.java:748)   expected null, but was:<ObjectTracker found 6 object(s) that were not released!!! [InternalHttpClient, MMapDirectory, MMapDirectory, MMapDirectory, SolrCore, MMapDirectory] org.apache.solr.common.util.ObjectReleaseTracker$ObjectTrackerException: org.apache.http.impl.client.InternalHttpClient  at org.apache.solr.common.util.ObjectReleaseTracker.track(ObjectReleaseTracker.java:42)  at org.apache.solr.client.solrj.impl.HttpClientUtil.createClient(HttpClientUtil.java:321)  at org.apache.solr.client.solrj.impl.HttpClientUtil.createClient(HttpClientUtil.java:330)  at org.apache.solr.handler.IndexFetcher.createHttpClient(IndexFetcher.java:230)  at org.apache.solr.handler.IndexFetcher.<init>(IndexFetcher.java:272)  at org.apache.solr.handler.ReplicationHandler.doFetch(ReplicationHandler.java:420)  at org.apache.solr.cloud.RecoveryStrategy.replicate(RecoveryStrategy.java:237)  at org.apache.solr.cloud.RecoveryStrategy.doReplicateOnlyRecovery(RecoveryStrategy.java:382)  at org.apache.solr.cloud.RecoveryStrategy.doRecovery(RecoveryStrategy.java:328)  at org.apache.solr.cloud.RecoveryStrategy.run(RecoveryStrategy.java:307)  at com.codahale.metrics.InstrumentedExecutorService$InstrumentedRunnable.run(InstrumentedExecutorService.java:176)  at java.util.concurrent.Executors$RunnableAdapter.call(Executors.java:511)  at java.util.concurrent.FutureTask.run(FutureTask.java:266)  at org.apache.solr.common.util.ExecutorUtil$MDCAwareThreadPoolExecutor.lambda$execute$0(ExecutorUtil.java:209)  at java.util.concurrent.ThreadPoolExecutor.runWorker(ThreadPoolExecutor.java:1149)  at java.util.concurrent.ThreadPoolExecutor$Worker.run(ThreadPoolExecutor.java:624)  at java.lang.Thread.run(Thread.java:748)  org.apache.solr.common.util.ObjectReleaseTracker$ObjectTrackerException: org.apache.lucene.store.MMapDirectory  at org.apache.solr.common.util.ObjectReleaseTracker.track(ObjectReleaseTracker.java:42)  at org.apache.solr.core.CachingDirectoryFactory.get(CachingDirectoryFactory.java:348)  at org.apache.solr.core.SolrCore.getNewIndexDir(SolrCore.java:367)  at org.apache.solr.core.SolrCore.initIndex(SolrCore.java:746)  at org.apache.solr.core.SolrCore.<init>(SolrCore.java:975)  at org.apache.solr.core.SolrCore.<init>(SolrCore.java:882)  at org.apache.solr.core.CoreContainer.createFromDescriptor(CoreContainer.java:1189)  at org.apache.solr.core.CoreContainer.create(CoreContainer.java:1099)  at org.apache.solr.handler.admin.CoreAdminOperation.lambda$static$0(CoreAdminOperation.java:92)  at org.apache.solr.handler.admin.CoreAdminOperation.execute(CoreAdminOperation.java:360)  at org.apache.solr.handler.admin.CoreAdminHandler$CallInfo.call(CoreAdminHandler.java:395)  at org.apache.solr.handler.admin.CoreAdminHandler.handleRequestBody(CoreAdminHandler.java:180)  at org.apache.solr.handler.RequestHandlerBase.handleRequest(RequestHandlerBase.java:199)  at org.apache.solr.servlet.HttpSolrCall.handleAdmin(HttpSolrCall.java:736)  at org.apache.solr.servlet.HttpSolrCall.handleAdminRequest(HttpSolrCall.java:717)  at org.apache.solr.servlet.HttpSolrCall.call(HttpSolrCall.java:496)  at org.apache.solr.servlet.SolrDispatchFilter.doFilter(SolrDispatchFilter.java:394)  at org.apache.solr.servlet.SolrDispatchFilter.doFilter(SolrDispatchFilter.java:340)  at org.eclipse.jetty.servlet.ServletHandler$CachedChain.doFilter(ServletHandler.java:1610)  at org.apache.solr.client.solrj.embedded.JettySolrRunner$DebugFilter.doFilter(JettySolrRunner.java:164)  at org.eclipse.jetty.servlet.ServletHandler$CachedChain.doFilter(ServletHandler.java:1610)  at org.eclipse.jetty.servlet.ServletHandler.doHandle(ServletHandler.java:540)  at org.eclipse.jetty.server.handler.ScopedHandler.nextHandle(ScopedHandler.java:255)  at org.eclipse.jetty.server.session.SessionHandler.doHandle(SessionHandler.java:1588)  at org.eclipse.jetty.server.handler.ScopedHandler.nextHandle(ScopedHandler.java:255)  at org.eclipse.jetty.server.handler.ContextHandler.doHandle(ContextHandler.java:1345)  at org.eclipse.jetty.server.handler.ScopedHandler.nextScope(ScopedHandler.java:203)  at org.eclipse.jetty.servlet.ServletHandler.doScope(ServletHandler.java:480)  at org.eclipse.jetty.server.session.SessionHandler.doScope(SessionHandler.java:1557)  at org.eclipse.jetty.server.handler.ScopedHandler.nextScope(ScopedHandler.java:201)  at org.eclipse.jetty.server.handler.ContextHandler.doScope(ContextHandler.java:1247)  at org.eclipse.jetty.server.handler.ScopedHandler.handle(ScopedHandler.java:144)  at org.eclipse.jetty.server.handler.gzip.GzipHandler.handle(GzipHandler.java:703)  at org.eclipse.jetty.server.handler.HandlerWrapper.handle(HandlerWrapper.java:132)  at org.eclipse.jetty.server.Server.handle(Server.java:502)  at org.eclipse.jetty.server.HttpChannel.handle(HttpChannel.java:364)  at org.eclipse.jetty.server.HttpChannel.run(HttpChannel.java:305)  at org.eclipse.jetty.util.thread.QueuedThreadPool.runJob(QueuedThreadPool.java:765)  at org.eclipse.jetty.util.thread.QueuedThreadPool$2.run(QueuedThreadPool.java:683)  at java.lang.Thread.run(Thread.java:748)  org.apache.solr.common.util.ObjectReleaseTracker$ObjectTrackerException: org.apache.lucene.store.MMapDirectory  at org.apache.solr.common.util.ObjectReleaseTracker.track(ObjectReleaseTracker.java:42)  at org.apache.solr.core.CachingDirectoryFactory.get(CachingDirectoryFactory.java:348)  at org.apache.solr.core.SolrCore.initSnapshotMetaDataManager(SolrCore.java:516)  at org.apache.solr.core.SolrCore.<init>(SolrCore.java:967)  at org.apache.solr.core.SolrCore.<init>(SolrCore.java:882)  at org.apache.solr.core.CoreContainer.createFromDescriptor(CoreContainer.java:1189)  at org.apache.solr.core.CoreContainer.create(CoreContainer.java:1099)  at org.apache.solr.handler.admin.CoreAdminOperation.lambda$static$0(CoreAdminOperation.java:92)  at org.apache.solr.handler.admin.CoreAdminOperation.execute(CoreAdminOperation.java:360)  at org.apache.solr.handler.admin.CoreAdminHandler$CallInfo.call(CoreAdminHandler.java:395)  at org.apache.solr.handler.admin.CoreAdminHandler.handleRequestBody(CoreAdminHandler.java:180)  at org.apache.solr.handler.RequestHandlerBase.handleRequest(RequestHandlerBase.java:199)  at org.apache.solr.servlet.HttpSolrCall.handleAdmin(HttpSolrCall.java:736)  at org.apache.solr.servlet.HttpSolrCall.handleAdminRequest(HttpSolrCall.java:717)  at org.apache.solr.servlet.HttpSolrCall.call(HttpSolrCall.java:496)  at org.apache.solr.servlet.SolrDispatchFilter.doFilter(SolrDispatchFilter.java:394)  at org.apache.solr.servlet.SolrDispatchFilter.doFilter(SolrDispatchFilter.java:340)  at org.eclipse.jetty.servlet.ServletHandler$CachedChain.doFilter(ServletHandler.java:1610)  at org.apache.solr.client.solrj.embedded.JettySolrRunner$DebugFilter.doFilter(JettySolrRunner.java:164)  at org.eclipse.jetty.servlet.ServletHandler$CachedChain.doFilter(ServletHandler.java:1610)  at org.eclipse.jetty.servlet.ServletHandler.doHandle(ServletHandler.java:540)  at org.eclipse.jetty.server.handler.ScopedHandler.nextHandle(ScopedHandler.java:255)  at org.eclipse.jetty.server.session.SessionHandler.doHandle(SessionHandler.java:1588)  at org.eclipse.jetty.server.handler.ScopedHandler.nextHandle(ScopedHandler.java:255)  at org.eclipse.jetty.server.handler.ContextHandler.doHandle(ContextHandler.java:1345)  at org.eclipse.jetty.server.handler.ScopedHandler.nextScope(ScopedHandler.java:203)  at org.eclipse.jetty.servlet.ServletHandler.doScope(ServletHandler.java:480)  at org.eclipse.jetty.server.session.SessionHandler.doScope(SessionHandler.java:1557)  at org.eclipse.jetty.server.handler.ScopedHandler.nextScope(ScopedHandler.java:201)  at org.eclipse.jetty.server.handler.ContextHandler.doScope(ContextHandler.java:1247)  at org.eclipse.jetty.server.handler.ScopedHandler.handle(ScopedHandler.java:144)  at org.eclipse.jetty.server.handler.gzip.GzipHandler.handle(GzipHandler.java:703)  at org.eclipse.jetty.server.handler.HandlerWrapper.handle(HandlerWrapper.java:132)  at org.eclipse.jetty.server.Server.handle(Server.java:502)  at org.eclipse.jetty.server.HttpChannel.handle(HttpChannel.java:364)  at org.eclipse.jetty.server.HttpChannel.run(HttpChannel.java:305)  at org.eclipse.jetty.util.thread.QueuedThreadPool.runJob(QueuedThreadPool.java:765)  at org.eclipse.jetty.util.thread.QueuedThreadPool$2.run(QueuedThreadPool.java:683)  at java.lang.Thread.run(Thread.java:748)  org.apache.solr.common.util.ObjectReleaseTracker$ObjectTrackerException: org.apache.lucene.store.MMapDirectory  at org.apache.solr.common.util.ObjectReleaseTracker.track(ObjectReleaseTracker.java:42)  at org.apache.solr.core.CachingDirectoryFactory.get(CachingDirectoryFactory.java:348)  at org.apache.solr.handler.IndexFetcher.fetchLatestIndex(IndexFetcher.java:509)  at org.apache.solr.handler.IndexFetcher.fetchLatestIndex(IndexFetcher.java:351)  at org.apache.solr.handler.ReplicationHandler.doFetch(ReplicationHandler.java:424)  at org.apache.solr.handler.ReplicationHandler.lambda$setupPolling$13(ReplicationHandler.java:1193)  at java.util.concurrent.Executors$RunnableAdapter.call(Executors.java:511)  at java.util.concurrent.FutureTask.runAndReset(FutureTask.java:308)  at java.util.concurrent.ScheduledThreadPoolExecutor$ScheduledFutureTask.access$301(ScheduledThreadPoolExecutor.java:180)  at java.util.concurrent.ScheduledThreadPoolExecutor$ScheduledFutureTask.run(ScheduledThreadPoolExecutor.java:294)  at java.util.concurrent.ThreadPoolExecutor.runWorker(ThreadPoolExecutor.java:1149)  at java.util.concurrent.ThreadPoolExecutor$Worker.run(ThreadPoolExecutor.java:624)  at java.lang.Thread.run(Thread.java:748)  org.apache.solr.common.util.ObjectReleaseTracker$ObjectTrackerException: org.apache.solr.core.SolrCore  at org.apache.solr.common.util.ObjectReleaseTracker.track(ObjectReleaseTracker.java:42)  at org.apache.solr.core.SolrCore.<init>(SolrCore.java:1062)  at org.apache.solr.core.SolrCore.<init>(SolrCore.java:882)  at org.apache.solr.core.CoreContainer.createFromDescriptor(CoreContainer.java:1189)  at org.apache.solr.core.CoreContainer.create(CoreContainer.java:1099)  at org.apache.solr.handler.admin.CoreAdminOperation.lambda$static$0(CoreAdminOperation.java:92)  at org.apache.solr.handler.admin.CoreAdminOperation.execute(CoreAdminOperation.java:360)  at org.apache.solr.handler.admin.CoreAdminHandler$CallInfo.call(CoreAdminHandler.java:395)  at org.apache.solr.handler.admin.CoreAdminHandler.handleRequestBody(CoreAdminHandler.java:180)  at org.apache.solr.handler.RequestHandlerBase.handleRequest(RequestHandlerBase.java:199)  at org.apache.solr.servlet.HttpSolrCall.handleAdmin(HttpSolrCall.java:736)  at org.apache.solr.servlet.HttpSolrCall.handleAdminRequest(HttpSolrCall.java:717)  at org.apache.solr.servlet.HttpSolrCall.call(HttpSolrCall.java:496)  at org.apache.solr.servlet.SolrDispatchFilter.doFilter(SolrDispatchFilter.java:394)  at org.apache.solr.servlet.SolrDispatchFilter.doFilter(SolrDispatchFilter.java:340)  at org.eclipse.jetty.servlet.ServletHandler$CachedChain.doFilter(ServletHandler.java:1610)  at org.apache.solr.client.solrj.embedded.JettySolrRunner$DebugFilter.doFilter(JettySolrRunner.java:164)  at org.eclipse.jetty.servlet.ServletHandler$CachedChain.doFilter(ServletHandler.java:1610)  at org.eclipse.jetty.servlet.ServletHandler.doHandle(ServletHandler.java:540)  at org.eclipse.jetty.server.handler.ScopedHandler.nextHandle(ScopedHandler.java:255)  at org.eclipse.jetty.server.session.SessionHandler.doHandle(SessionHandler.java:1588)  at org.eclipse.jetty.server.handler.ScopedHandler.nextHandle(ScopedHandler.java:255)  at org.eclipse.jetty.server.handler.ContextHandler.doHandle(ContextHandler.java:1345)  at org.eclipse.jetty.server.handler.ScopedHandler.nextScope(ScopedHandler.java:203)  at org.eclipse.jetty.servlet.ServletHandler.doScope(ServletHandler.java:480)  at org.eclipse.jetty.server.session.SessionHandler.doScope(SessionHandler.java:1557)  at org.eclipse.jetty.server.handler.ScopedHandler.nextScope(ScopedHandler.java:201)  at org.eclipse.jetty.server.handler.ContextHandler.doScope(ContextHandler.java:1247)  at org.eclipse.jetty.server.handler.ScopedHandler.handle(ScopedHandler.java:144)  at org.eclipse.jetty.server.handler.gzip.GzipHandler.handle(GzipHandler.java:703)  at org.eclipse.jetty.server.handler.HandlerWrapper.handle(HandlerWrapper.java:132)  at org.eclipse.jetty.server.Server.handle(Server.java:502)  at org.eclipse.jetty.server.HttpChannel.handle(HttpChannel.java:364)  at org.eclipse.jetty.server.HttpChannel.run(HttpChannel.java:305)  at org.eclipse.jetty.util.thread.QueuedThreadPool.runJob(QueuedThreadPool.java:765)  at org.eclipse.jetty.util.thread.QueuedThreadPool$2.run(QueuedThreadPool.java:683)  at java.lang.Thread.run(Thread.java:748)  org.apache.solr.common.util.ObjectReleaseTracker$ObjectTrackerException: org.apache.lucene.store.MMapDirectory  at org.apache.solr.common.util.ObjectReleaseTracker.track(ObjectReleaseTracker.java:42)  at org.apache.solr.core.CachingDirectoryFactory.get(CachingDirectoryFactory.java:348)  at org.apache.solr.update.SolrIndexWriter.create(SolrIndexWriter.java:95)  at org.apache.solr.core.SolrCore.initIndex(SolrCore.java:778)  at org.apache.solr.core.SolrCore.<init>(SolrCore.java:975)  at org.apache.solr.core.SolrCore.<init>(SolrCore.java:882)  at org.apache.solr.core.CoreContainer.createFromDescriptor(CoreContainer.java:1189)  at org.apache.solr.core.CoreContainer.create(CoreContainer.java:1099)  at org.apache.solr.handler.admin.CoreAdminOperation.lambda$static$0(CoreAdminOperation.java:92)  at org.apache.solr.handler.admin.CoreAdminOperation.execute(CoreAdminOperation.java:360)  at org.apache.solr.handler.admin.CoreAdminHandler$CallInfo.call(CoreAdminHandler.java:395)  at org.apache.solr.handler.admin.CoreAdminHandler.handleRequestBody(CoreAdminHandler.java:180)  at org.apache.solr.handler.RequestHandlerBase.handleRequest(RequestHandlerBase.java:199)  at org.apache.solr.servlet.HttpSolrCall.handleAdmin(HttpSolrCall.java:736)  at org.apache.solr.servlet.HttpSolrCall.handleAdminRequest(HttpSolrCall.java:717)  at org.apache.solr.servlet.HttpSolrCall.call(HttpSolrCall.java:496)  at org.apache.solr.servlet.SolrDispatchFilter.doFilter(SolrDispatchFilter.java:394)  at org.apache.solr.servlet.SolrDispatchFilter.doFilter(SolrDispatchFilter.java:340)  at org.eclipse.jetty.servlet.ServletHandler$CachedChain.doFilter(ServletHandler.java:1610)  at org.apache.solr.client.solrj.embedded.JettySolrRunner$DebugFilter.doFilter(JettySolrRunner.java:164)  at org.eclipse.jetty.servlet.ServletHandler$CachedChain.doFilter(ServletHandler.java:1610)  at org.eclipse.jetty.servlet.ServletHandler.doHandle(ServletHandler.java:540)  at org.eclipse.jetty.server.handler.ScopedHandler.nextHandle(ScopedHandler.java:255)  at org.eclipse.jetty.server.session.SessionHandler.doHandle(SessionHandler.java:1588)  at org.eclipse.jetty.server.handler.ScopedHandler.nextHandle(ScopedHandler.java:255)  at org.eclipse.jetty.server.handler.ContextHandler.doHandle(ContextHandler.java:1345)  at org.eclipse.jetty.server.handler.ScopedHandler.nextScope(ScopedHandler.java:203)  at org.eclipse.jetty.servlet.ServletHandler.doScope(ServletHandler.java:480)  at org.eclipse.jetty.server.session.SessionHandler.doScope(SessionHandler.java:1557)  at org.eclipse.jetty.server.handler.ScopedHandler.nextScope(ScopedHandler.java:201)  at org.eclipse.jetty.server.handler.ContextHandler.doScope(ContextHandler.java:1247)  at org.eclipse.jetty.server.handler.ScopedHandler.handle(ScopedHandler.java:144)  at org.eclipse.jetty.server.handler.gzip.GzipHandler.handle(GzipHandler.java:703)  at org.eclipse.jetty.server.handler.HandlerWrapper.handle(HandlerWrapper.java:132)  at org.eclipse.jetty.server.Server.handle(Server.java:502)  at org.eclipse.jetty.server.HttpChannel.handle(HttpChannel.java:364)  at org.eclipse.jetty.server.HttpChannel.run(HttpChannel.java:305)  at org.eclipse.jetty.util.thread.QueuedThreadPool.runJob(QueuedThreadPool.java:765)  at org.eclipse.jetty.util.thread.QueuedThreadPool$2.run(QueuedThreadPool.java:683)  at java.lang.Thread.run(Thread.java:748)  >

Stack Trace:
java.lang.AssertionError: ObjectTracker found 6 object(s) that were not released!!! [InternalHttpClient, MMapDirectory, MMapDirectory, MMapDirectory, SolrCore, MMapDirectory]
org.apache.solr.common.util.ObjectReleaseTracker$ObjectTrackerException: org.apache.http.impl.client.InternalHttpClient
        at org.apache.solr.common.util.ObjectReleaseTracker.track(ObjectReleaseTracker.java:42)
        at org.apache.solr.client.solrj.impl.HttpClientUtil.createClient(HttpClientUtil.java:321)
        at org.apache.solr.client.solrj.impl.HttpClientUtil.createClient(HttpClientUtil.java:330)
        at org.apache.solr.handler.IndexFetcher.createHttpClient(IndexFetcher.java:230)
        at org.apache.solr.handler.IndexFetcher.<init>(IndexFetcher.java:272)
        at org.apache.solr.handler.ReplicationHandler.doFetch(ReplicationHandler.java:420)
        at org.apache.solr.cloud.RecoveryStrategy.replicate(RecoveryStrategy.java:237)
        at org.apache.solr.cloud.RecoveryStrategy.doReplicateOnlyRecovery(RecoveryStrategy.java:382)
        at org.apache.solr.cloud.RecoveryStrategy.doRecovery(RecoveryStrategy.java:328)
        at org.apache.solr.cloud.RecoveryStrategy.run(RecoveryStrategy.java:307)
        at com.codahale.metrics.InstrumentedExecutorService$InstrumentedRunnable.run(InstrumentedExecutorService.java:176)
        at java.util.concurrent.Executors$RunnableAdapter.call(Executors.java:511)
        at java.util.concurrent.FutureTask.run(FutureTask.java:266)
        at org.apache.solr.common.util.ExecutorUtil$MDCAwareThreadPoolExecutor.lambda$execute$0(ExecutorUtil.java:209)
        at java.util.concurrent.ThreadPoolExecutor.runWorker(ThreadPoolExecutor.java:1149)
        at java.util.concurrent.ThreadPoolExecutor$Worker.run(ThreadPoolExecutor.java:624)
        at java.lang.Thread.run(Thread.java:748)

org.apache.solr.common.util.ObjectReleaseTracker$ObjectTrackerException: org.apache.lucene.store.MMapDirectory
        at org.apache.solr.common.util.ObjectReleaseTracker.track(ObjectReleaseTracker.java:42)
        at org.apache.solr.core.CachingDirectoryFactory.get(CachingDirectoryFactory.java:348)
        at org.apache.solr.core.SolrCore.getNewIndexDir(SolrCore.java:367)
        at org.apache.solr.core.SolrCore.initIndex(SolrCore.java:746)
        at org.apache.solr.core.SolrCore.<init>(SolrCore.java:975)
        at org.apache.solr.core.SolrCore.<init>(SolrCore.java:882)
        at org.apache.solr.core.CoreContainer.createFromDescriptor(CoreContainer.java:1189)
        at org.apache.solr.core.CoreContainer.create(CoreContainer.java:1099)
        at org.apache.solr.handler.admin.CoreAdminOperation.lambda$static$0(CoreAdminOperation.java:92)
        at org.apache.solr.handler.admin.CoreAdminOperation.execute(CoreAdminOperation.java:360)
        at org.apache.solr.handler.admin.CoreAdminHandler$CallInfo.call(CoreAdminHandler.java:395)
        at org.apache.solr.handler.admin.CoreAdminHandler.handleRequestBody(CoreAdminHandler.java:180)
        at org.apache.solr.handler.RequestHandlerBase.handleRequest(RequestHandlerBase.java:199)
        at org.apache.solr.servlet.HttpSolrCall.handleAdmin(HttpSolrCall.java:736)
        at org.apache.solr.servlet.HttpSolrCall.handleAdminRequest(HttpSolrCall.java:717)
        at org.apache.solr.servlet.HttpSolrCall.call(HttpSolrCall.java:496)
        at org.apache.solr.servlet.SolrDispatchFilter.doFilter(SolrDispatchFilter.java:394)
        at org.apache.solr.servlet.SolrDispatchFilter.doFilter(SolrDispatchFilter.java:340)
        at org.eclipse.jetty.servlet.ServletHandler$CachedChain.doFilter(ServletHandler.java:1610)
        at org.apache.solr.client.solrj.embedded.JettySolrRunner$DebugFilter.doFilter(JettySolrRunner.java:164)
        at org.eclipse.jetty.servlet.ServletHandler$CachedChain.doFilter(ServletHandler.java:1610)
        at org.eclipse.jetty.servlet.ServletHandler.doHandle(ServletHandler.java:540)
        at org.eclipse.jetty.server.handler.ScopedHandler.nextHandle(ScopedHandler.java:255)
        at org.eclipse.jetty.server.session.SessionHandler.doHandle(SessionHandler.java:1588)
        at org.eclipse.jetty.server.handler.ScopedHandler.nextHandle(ScopedHandler.java:255)
        at org.eclipse.jetty.server.handler.ContextHandler.doHandle(ContextHandler.java:1345)
        at org.eclipse.jetty.server.handler.ScopedHandler.nextScope(ScopedHandler.java:203)
        at org.eclipse.jetty.servlet.ServletHandler.doScope(ServletHandler.java:480)
        at org.eclipse.jetty.server.session.SessionHandler.doScope(SessionHandler.java:1557)
        at org.eclipse.jetty.server.handler.ScopedHandler.nextScope(ScopedHandler.java:201)
        at org.eclipse.jetty.server.handler.ContextHandler.doScope(ContextHandler.java:1247)
        at org.eclipse.jetty.server.handler.ScopedHandler.handle(ScopedHandler.java:144)
        at org.eclipse.jetty.server.handler.gzip.GzipHandler.handle(GzipHandler.java:703)
        at org.eclipse.jetty.server.handler.HandlerWrapper.handle(HandlerWrapper.java:132)
        at org.eclipse.jetty.server.Server.handle(Server.java:502)
        at org.eclipse.jetty.server.HttpChannel.handle(HttpChannel.java:364)
        at org.eclipse.jetty.server.HttpChannel.run(HttpChannel.java:305)
        at org.eclipse.jetty.util.thread.QueuedThreadPool.runJob(QueuedThreadPool.java:765)
        at org.eclipse.jetty.util.thread.QueuedThreadPool$2.run(QueuedThreadPool.java:683)
        at java.lang.Thread.run(Thread.java:748)

org.apache.solr.common.util.ObjectReleaseTracker$ObjectTrackerException: org.apache.lucene.store.MMapDirectory
        at org.apache.solr.common.util.ObjectReleaseTracker.track(ObjectReleaseTracker.java:42)
        at org.apache.solr.core.CachingDirectoryFactory.get(CachingDirectoryFactory.java:348)
        at org.apache.solr.core.SolrCore.initSnapshotMetaDataManager(SolrCore.java:516)
        at org.apache.solr.core.SolrCore.<init>(SolrCore.java:967)
        at org.apache.solr.core.SolrCore.<init>(SolrCore.java:882)
        at org.apache.solr.core.CoreContainer.createFromDescriptor(CoreContainer.java:1189)
        at org.apache.solr.core.CoreContainer.create(CoreContainer.java:1099)
        at org.apache.solr.handler.admin.CoreAdminOperation.lambda$static$0(CoreAdminOperation.java:92)
        at org.apache.solr.handler.admin.CoreAdminOperation.execute(CoreAdminOperation.java:360)
        at org.apache.solr.handler.admin.CoreAdminHandler$CallInfo.call(CoreAdminHandler.java:395)
        at org.apache.solr.handler.admin.CoreAdminHandler.handleRequestBody(CoreAdminHandler.java:180)
        at org.apache.solr.handler.RequestHandlerBase.handleRequest(RequestHandlerBase.java:199)
        at org.apache.solr.servlet.HttpSolrCall.handleAdmin(HttpSolrCall.java:736)
        at org.apache.solr.servlet.HttpSolrCall.handleAdminRequest(HttpSolrCall.java:717)
        at org.apache.solr.servlet.HttpSolrCall.call(HttpSolrCall.java:496)
        at org.apache.solr.servlet.SolrDispatchFilter.doFilter(SolrDispatchFilter.java:394)
        at org.apache.solr.servlet.SolrDispatchFilter.doFilter(SolrDispatchFilter.java:340)
        at org.eclipse.jetty.servlet.ServletHandler$CachedChain.doFilter(ServletHandler.java:1610)
        at org.apache.solr.client.solrj.embedded.JettySolrRunner$DebugFilter.doFilter(JettySolrRunner.java:164)
        at org.eclipse.jetty.servlet.ServletHandler$CachedChain.doFilter(ServletHandler.java:1610)
        at org.eclipse.jetty.servlet.ServletHandler.doHandle(ServletHandler.java:540)
        at org.eclipse.jetty.server.handler.ScopedHandler.nextHandle(ScopedHandler.java:255)
        at org.eclipse.jetty.server.session.SessionHandler.doHandle(SessionHandler.java:1588)
        at org.eclipse.jetty.server.handler.ScopedHandler.nextHandle(ScopedHandler.java:255)
        at org.eclipse.jetty.server.handler.ContextHandler.doHandle(ContextHandler.java:1345)
        at org.eclipse.jetty.server.handler.ScopedHandler.nextScope(ScopedHandler.java:203)
        at org.eclipse.jetty.servlet.ServletHandler.doScope(ServletHandler.java:480)
        at org.eclipse.jetty.server.session.SessionHandler.doScope(SessionHandler.java:1557)
        at org.eclipse.jetty.server.handler.ScopedHandler.nextScope(ScopedHandler.java:201)
        at org.eclipse.jetty.server.handler.ContextHandler.doScope(ContextHandler.java:1247)
        at org.eclipse.jetty.server.handler.ScopedHandler.handle(ScopedHandler.java:144)
        at org.eclipse.jetty.server.handler.gzip.GzipHandler.handle(GzipHandler.java:703)
        at org.eclipse.jetty.server.handler.HandlerWrapper.handle(HandlerWrapper.java:132)
        at org.eclipse.jetty.server.Server.handle(Server.java:502)
        at org.eclipse.jetty.server.HttpChannel.handle(HttpChannel.java:364)
        at org.eclipse.jetty.server.HttpChannel.run(HttpChannel.java:305)
        at org.eclipse.jetty.util.thread.QueuedThreadPool.runJob(QueuedThreadPool.java:765)
        at org.eclipse.jetty.util.thread.QueuedThreadPool$2.run(QueuedThreadPool.java:683)
        at java.lang.Thread.run(Thread.java:748)

org.apache.solr.common.util.ObjectReleaseTracker$ObjectTrackerException: org.apache.lucene.store.MMapDirectory
        at org.apache.solr.common.util.ObjectReleaseTracker.track(ObjectReleaseTracker.java:42)
        at org.apache.solr.core.CachingDirectoryFactory.get(CachingDirectoryFactory.java:348)
        at org.apache.solr.handler.IndexFetcher.fetchLatestIndex(IndexFetcher.java:509)
        at org.apache.solr.handler.IndexFetcher.fetchLatestIndex(IndexFetcher.java:351)
        at org.apache.solr.handler.ReplicationHandler.doFetch(ReplicationHandler.java:424)
        at org.apache.solr.handler.ReplicationHandler.lambda$setupPolling$13(ReplicationHandler.java:1193)
        at java.util.concurrent.Executors$RunnableAdapter.call(Executors.java:511)
        at java.util.concurrent.FutureTask.runAndReset(FutureTask.java:308)
        at java.util.concurrent.ScheduledThreadPoolExecutor$ScheduledFutureTask.access$301(ScheduledThreadPoolExecutor.java:180)
        at java.util.concurrent.ScheduledThreadPoolExecutor$ScheduledFutureTask.run(ScheduledThreadPoolExecutor.java:294)
        at java.util.concurrent.ThreadPoolExecutor.runWorker(ThreadPoolExecutor.java:1149)
        at java.util.concurrent.ThreadPoolExecutor$Worker.run(ThreadPoolExecutor.java:624)
        at java.lang.Thread.run(Thread.java:748)

org.apache.solr.common.util.ObjectReleaseTracker$ObjectTrackerException: org.apache.solr.core.SolrCore
        at org.apache.solr.common.util.ObjectReleaseTracker.track(ObjectReleaseTracker.java:42)
        at org.apache.solr.core.SolrCore.<init>(SolrCore.java:1062)
        at org.apache.solr.core.SolrCore.<init>(SolrCore.java:882)
        at org.apache.solr.core.CoreContainer.createFromDescriptor(CoreContainer.java:1189)
        at org.apache.solr.core.CoreContainer.create(CoreContainer.java:1099)
        at org.apache.solr.handler.admin.CoreAdminOperation.lambda$static$0(CoreAdminOperation.java:92)
        at org.apache.solr.handler.admin.CoreAdminOperation.execute(CoreAdminOperation.java:360)
        at org.apache.solr.handler.admin.CoreAdminHandler$CallInfo.call(CoreAdminHandler.java:395)
        at org.apache.solr.handler.admin.CoreAdminHandler.handleRequestBody(CoreAdminHandler.java:180)
        at org.apache.solr.handler.RequestHandlerBase.handleRequest(RequestHandlerBase.java:199)
        at org.apache.solr.servlet.HttpSolrCall.handleAdmin(HttpSolrCall.java:736)
        at org.apache.solr.servlet.HttpSolrCall.handleAdminRequest(HttpSolrCall.java:717)
        at org.apache.solr.servlet.HttpSolrCall.call(HttpSolrCall.java:496)
        at org.apache.solr.servlet.SolrDispatchFilter.doFilter(SolrDispatchFilter.java:394)
        at org.apache.solr.servlet.SolrDispatchFilter.doFilter(SolrDispatchFilter.java:340)
        at org.eclipse.jetty.servlet.ServletHandler$CachedChain.doFilter(ServletHandler.java:1610)
        at org.apache.solr.client.solrj.embedded.JettySolrRunner$DebugFilter.doFilter(JettySolrRunner.java:164)
        at org.eclipse.jetty.servlet.ServletHandler$CachedChain.doFilter(ServletHandler.java:1610)
        at org.eclipse.jetty.servlet.ServletHandler.doHandle(ServletHandler.java:540)
        at org.eclipse.jetty.server.handler.ScopedHandler.nextHandle(ScopedHandler.java:255)
        at org.eclipse.jetty.server.session.SessionHandler.doHandle(SessionHandler.java:1588)
        at org.eclipse.jetty.server.handler.ScopedHandler.nextHandle(ScopedHandler.java:255)
        at org.eclipse.jetty.server.handler.ContextHandler.doHandle(ContextHandler.java:1345)
        at org.eclipse.jetty.server.handler.ScopedHandler.nextScope(ScopedHandler.java:203)
        at org.eclipse.jetty.servlet.ServletHandler.doScope(ServletHandler.java:480)
        at org.eclipse.jetty.server.session.SessionHandler.doScope(SessionHandler.java:1557)
        at org.eclipse.jetty.server.handler.ScopedHandler.nextScope(ScopedHandler.java:201)
        at org.eclipse.jetty.server.handler.ContextHandler.doScope(ContextHandler.java:1247)
        at org.eclipse.jetty.server.handler.ScopedHandler.handle(ScopedHandler.java:144)
        at org.eclipse.jetty.server.handler.gzip.GzipHandler.handle(GzipHandler.java:703)
        at org.eclipse.jetty.server.handler.HandlerWrapper.handle(HandlerWrapper.java:132)
        at org.eclipse.jetty.server.Server.handle(Server.java:502)
        at org.eclipse.jetty.server.HttpChannel.handle(HttpChannel.java:364)
        at org.eclipse.jetty.server.HttpChannel.run(HttpChannel.java:305)
        at org.eclipse.jetty.util.thread.QueuedThreadPool.runJob(QueuedThreadPool.java:765)
        at org.eclipse.jetty.util.thread.QueuedThreadPool$2.run(QueuedThreadPool.java:683)
        at java.lang.Thread.run(Thread.java:748)

org.apache.solr.common.util.ObjectReleaseTracker$ObjectTrackerException: org.apache.lucene.store.MMapDirectory
        at org.apache.solr.common.util.ObjectReleaseTracker.track(ObjectReleaseTracker.java:42)
        at org.apache.solr.core.CachingDirectoryFactory.get(CachingDirectoryFactory.java:348)
        at org.apache.solr.update.SolrIndexWriter.create(SolrIndexWriter.java:95)
        at org.apache.solr.core.SolrCore.initIndex(SolrCore.java:778)
        at org.apache.solr.core.SolrCore.<init>(SolrCore.java:975)
        at org.apache.solr.core.SolrCore.<init>(SolrCore.java:882)
        at org.apache.solr.core.CoreContainer.createFromDescriptor(CoreContainer.java:1189)
        at org.apache.solr.core.CoreContainer.create(CoreContainer.java:1099)
        at org.apache.solr.handler.admin.CoreAdminOperation.lambda$static$0(CoreAdminOperation.java:92)
        at org.apache.solr.handler.admin.CoreAdminOperation.execute(CoreAdminOperation.java:360)
        at org.apache.solr.handler.admin.CoreAdminHandler$CallInfo.call(CoreAdminHandler.java:395)
        at org.apache.solr.handler.admin.CoreAdminHandler.handleRequestBody(CoreAdminHandler.java:180)
        at org.apache.solr.handler.RequestHandlerBase.handleRequest(RequestHandlerBase.java:199)
        at org.apache.solr.servlet.HttpSolrCall.handleAdmin(HttpSolrCall.java:736)
        at org.apache.solr.servlet.HttpSolrCall.handleAdminRequest(HttpSolrCall.java:717)
        at org.apache.solr.servlet.HttpSolrCall.call(HttpSolrCall.java:496)
        at org.apache.solr.servlet.SolrDispatchFilter.doFilter(SolrDispatchFilter.java:394)
        at org.apache.solr.servlet.SolrDispatchFilter.doFilter(SolrDispatchFilter.java:340)
        at org.eclipse.jetty.servlet.ServletHandler$CachedChain.doFilter(ServletHandler.java:1610)
        at org.apache.solr.client.solrj.embedded.JettySolrRunner$DebugFilter.doFilter(JettySolrRunner.java:164)
        at org.eclipse.jetty.servlet.ServletHandler$CachedChain.doFilter(ServletHandler.java:1610)
        at org.eclipse.jetty.servlet.ServletHandler.doHandle(ServletHandler.java:540)
        at org.eclipse.jetty.server.handler.ScopedHandler.nextHandle(ScopedHandler.java:255)
        at org.eclipse.jetty.server.session.SessionHandler.doHandle(SessionHandler.java:1588)
        at org.eclipse.jetty.server.handler.ScopedHandler.nextHandle(ScopedHandler.java:255)
        at org.eclipse.jetty.server.handler.ContextHandler.doHandle(ContextHandler.java:1345)
        at org.eclipse.jetty.server.handler.ScopedHandler.nextScope(ScopedHandler.java:203)
        at org.eclipse.jetty.servlet.ServletHandler.doScope(ServletHandler.java:480)
        at org.eclipse.jetty.server.session.SessionHandler.doScope(SessionHandler.java:1557)
        at org.eclipse.jetty.server.handler.ScopedHandler.nextScope(ScopedHandler.java:201)
        at org.eclipse.jetty.server.handler.ContextHandler.doScope(ContextHandler.java:1247)
        at org.eclipse.jetty.server.handler.ScopedHandler.handle(ScopedHandler.java:144)
        at org.eclipse.jetty.server.handler.gzip.GzipHandler.handle(GzipHandler.java:703)
        at org.eclipse.jetty.server.handler.HandlerWrapper.handle(HandlerWrapper.java:132)
        at org.eclipse.jetty.server.Server.handle(Server.java:502)
        at org.eclipse.jetty.server.HttpChannel.handle(HttpChannel.java:364)
        at org.eclipse.jetty.server.HttpChannel.run(HttpChannel.java:305)
        at org.eclipse.jetty.util.thread.QueuedThreadPool.runJob(QueuedThreadPool.java:765)
        at org.eclipse.jetty.util.thread.QueuedThreadPool$2.run(QueuedThreadPool.java:683)
        at java.lang.Thread.run(Thread.java:748)

 expected null, but was:<ObjectTracker found 6 object(s) that were not released!!! [InternalHttpClient, MMapDirectory, MMapDirectory, MMapDirectory, SolrCore, MMapDirectory]
org.apache.solr.common.util.ObjectReleaseTracker$ObjectTrackerException: org.apache.http.impl.client.InternalHttpClient
        at org.apache.solr.common.util.ObjectReleaseTracker.track(ObjectReleaseTracker.java:42)
        at org.apache.solr.client.solrj.impl.HttpClientUtil.createClient(HttpClientUtil.java:321)
        at org.apache.solr.client.solrj.impl.HttpClientUtil.createClient(HttpClientUtil.java:330)
        at org.apache.solr.handler.IndexFetcher.createHttpClient(IndexFetcher.java:230)
        at org.apache.solr.handler.IndexFetcher.<init>(IndexFetcher.java:272)
        at org.apache.solr.handler.ReplicationHandler.doFetch(ReplicationHandler.java:420)
        at org.apache.solr.cloud.RecoveryStrategy.replicate(RecoveryStrategy.java:237)
        at org.apache.solr.cloud.RecoveryStrategy.doReplicateOnlyRecovery(RecoveryStrategy.java:382)
        at org.apache.solr.cloud.RecoveryStrategy.doRecovery(RecoveryStrategy.java:328)
        at org.apache.solr.cloud.RecoveryStrategy.run(RecoveryStrategy.java:307)
        at com.codahale.metrics.InstrumentedExecutorService$InstrumentedRunnable.run(InstrumentedExecutorService.java:176)
        at java.util.concurrent.Executors$RunnableAdapter.call(Executors.java:511)
        at java.util.concurrent.FutureTask.run(FutureTask.java:266)
        at org.apache.solr.common.util.ExecutorUtil$MDCAwareThreadPoolExecutor.lambda$execute$0(ExecutorUtil.java:209)
        at java.util.concurrent.ThreadPoolExecutor.runWorker(ThreadPoolExecutor.java:1149)
        at java.util.concurrent.ThreadPoolExecutor$Worker.run(ThreadPoolExecutor.java:624)
        at java.lang.Thread.run(Thread.java:748)

org.apache.solr.common.util.ObjectReleaseTracker$ObjectTrackerException: org.apache.lucene.store.MMapDirectory
        at org.apache.solr.common.util.ObjectReleaseTracker.track(ObjectReleaseTracker.java:42)
        at org.apache.solr.core.CachingDirectoryFactory.get(CachingDirectoryFactory.java:348)
        at org.apache.solr.core.SolrCore.getNewIndexDir(SolrCore.java:367)
        at org.apache.solr.core.SolrCore.initIndex(SolrCore.java:746)
        at org.apache.solr.core.SolrCore.<init>(SolrCore.java:975)
        at org.apache.solr.core.SolrCore.<init>(SolrCore.java:882)
        at org.apache.solr.core.CoreContainer.createFromDescriptor(CoreContainer.java:1189)
        at org.apache.solr.core.CoreContainer.create(CoreContainer.java:1099)
        at org.apache.solr.handler.admin.CoreAdminOperation.lambda$static$0(CoreAdminOperation.java:92)
        at org.apache.solr.handler.admin.CoreAdminOperation.execute(CoreAdminOperation.java:360)
        at org.apache.solr.handler.admin.CoreAdminHandler$CallInfo.call(CoreAdminHandler.java:395)
        at org.apache.solr.handler.admin.CoreAdminHandler.handleRequestBody(CoreAdminHandler.java:180)
        at org.apache.solr.handler.RequestHandlerBase.handleRequest(RequestHandlerBase.java:199)
        at org.apache.solr.servlet.HttpSolrCall.handleAdmin(HttpSolrCall.java:736)
        at org.apache.solr.servlet.HttpSolrCall.handleAdminRequest(HttpSolrCall.java:717)
        at org.apache.solr.servlet.HttpSolrCall.call(HttpSolrCall.java:496)
        at org.apache.solr.servlet.SolrDispatchFilter.doFilter(SolrDispatchFilter.java:394)
        at org.apache.solr.servlet.SolrDispatchFilter.doFilter(SolrDispatchFilter.java:340)
        at org.eclipse.jetty.servlet.ServletHandler$CachedChain.doFilter(ServletHandler.java:1610)
        at org.apache.solr.client.solrj.embedded.JettySolrRunner$DebugFilter.doFilter(JettySolrRunner.java:164)
        at org.eclipse.jetty.servlet.ServletHandler$CachedChain.doFilter(ServletHandler.java:1610)
        at org.eclipse.jetty.servlet.ServletHandler.doHandle(ServletHandler.java:540)
        at org.eclipse.jetty.server.handler.ScopedHandler.nextHandle(ScopedHandler.java:255)
        at org.eclipse.jetty.server.session.SessionHandler.doHandle(SessionHandler.java:1588)
        at org.eclipse.jetty.server.handler.ScopedHandler.nextHandle(ScopedHandler.java:255)
        at org.eclipse.jetty.server.handler.ContextHandler.doHandle(ContextHandler.java:1345)
        at org.eclipse.jetty.server.handler.ScopedHandler.nextScope(ScopedHandler.java:203)
        at org.eclipse.jetty.servlet.ServletHandler.doScope(ServletHandler.java:480)
        at org.eclipse.jetty.server.session.SessionHandler.doScope(SessionHandler.java:1557)
        at org.eclipse.jetty.server.handler.ScopedHandler.nextScope(ScopedHandler.java:201)
        at org.eclipse.jetty.server.handler.ContextHandler.doScope(ContextHandler.java:1247)
        at org.eclipse.jetty.server.handler.ScopedHandler.handle(ScopedHandler.java:144)
        at org.eclipse.jetty.server.handler.gzip.GzipHandler.handle(GzipHandler.java:703)
        at org.eclipse.jetty.server.handler.HandlerWrapper.handle(HandlerWrapper.java:132)
        at org.eclipse.jetty.server.Server.handle(Server.java:502)
        at org.eclipse.jetty.server.HttpChannel.handle(HttpChannel.java:364)
        at org.eclipse.jetty.server.HttpChannel.run(HttpChannel.java:305)
        at org.eclipse.jetty.util.thread.QueuedThreadPool.runJob(QueuedThreadPool.java:765)
        at org.eclipse.jetty.util.thread.QueuedThreadPool$2.run(QueuedThreadPool.java:683)
        at java.lang.Thread.run(Thread.java:748)

org.apache.solr.common.util.ObjectReleaseTracker$ObjectTrackerException: org.apache.lucene.store.MMapDirectory
        at org.apache.solr.common.util.ObjectReleaseTracker.track(ObjectReleaseTracker.java:42)
        at org.apache.solr.core.CachingDirectoryFactory.get(CachingDirectoryFactory.java:348)
        at org.apache.solr.core.SolrCore.initSnapshotMetaDataManager(SolrCore.java:516)
        at org.apache.solr.core.SolrCore.<init>(SolrCore.java:967)
        at org.apache.solr.core.SolrCore.<init>(SolrCore.java:882)
        at org.apache.solr.core.CoreContainer.createFromDescriptor(CoreContainer.java:1189)
        at org.apache.solr.core.CoreContainer.create(CoreContainer.java:1099)
        at org.apache.solr.handler.admin.CoreAdminOperation.lambda$static$0(CoreAdminOperation.java:92)
        at org.apache.solr.handler.admin.CoreAdminOperation.execute(CoreAdminOperation.java:360)
        at org.apache.solr.handler.admin.CoreAdminHandler$CallInfo.call(CoreAdminHandler.java:395)
        at org.apache.solr.handler.admin.CoreAdminHandler.handleRequestBody(CoreAdminHandler.java:180)
        at org.apache.solr.handler.RequestHandlerBase.handleRequest(RequestHandlerBase.java:199)
        at org.apache.solr.servlet.HttpSolrCall.handleAdmin(HttpSolrCall.java:736)
        at org.apache.solr.servlet.HttpSolrCall.handleAdminRequest(HttpSolrCall.java:717)
        at org.apache.solr.servlet.HttpSolrCall.call(HttpSolrCall.java:496)
        at org.apache.solr.servlet.SolrDispatchFilter.doFilter(SolrDispatchFilter.java:394)
        at org.apache.solr.servlet.SolrDispatchFilter.doFilter(SolrDispatchFilter.java:340)
        at org.eclipse.jetty.servlet.ServletHandler$CachedChain.doFilter(ServletHandler.java:1610)
        at org.apache.solr.client.solrj.embedded.JettySolrRunner$DebugFilter.doFilter(JettySolrRunner.java:164)
        at org.eclipse.jetty.servlet.ServletHandler$CachedChain.doFilter(ServletHandler.java:1610)
        at org.eclipse.jetty.servlet.ServletHandler.doHandle(ServletHandler.java:540)
        at org.eclipse.jetty.server.handler.ScopedHandler.nextHandle(ScopedHandler.java:255)
        at org.eclipse.jetty.server.session.SessionHandler.doHandle(SessionHandler.java:1588)
        at org.eclipse.jetty.server.handler.ScopedHandler.nextHandle(ScopedHandler.java:255)
        at org.eclipse.jetty.server.handler.ContextHandler.doHandle(ContextHandler.java:1345)
        at org.eclipse.jetty.server.handler.ScopedHandler.nextScope(ScopedHandler.java:203)
        at org.eclipse.jetty.servlet.ServletHandler.doScope(ServletHandler.java:480)
        at org.eclipse.jetty.server.session.SessionHandler.doScope(SessionHandler.java:1557)
        at org.eclipse.jetty.server.handler.ScopedHandler.nextScope(ScopedHandler.java:201)
        at org.eclipse.jetty.server.handler.ContextHandler.doScope(ContextHandler.java:1247)
        at org.eclipse.jetty.server.handler.ScopedHandler.handle(ScopedHandler.java:144)
        at org.eclipse.jetty.server.handler.gzip.GzipHandler.handle(GzipHandler.java:703)
        at org.eclipse.jetty.server.handler.HandlerWrapper.handle(HandlerWrapper.java:132)
        at org.eclipse.jetty.server.Server.handle(Server.java:502)
        at org.eclipse.jetty.server.HttpChannel.handle(HttpChannel.java:364)
        at org.eclipse.jetty.server.HttpChannel.run(HttpChannel.java:305)
        at org.eclipse.jetty.util.thread.QueuedThreadPool.runJob(QueuedThreadPool.java:765)
        at org.eclipse.jetty.util.thread.QueuedThreadPool$2.run(QueuedThreadPool.java:683)
        at java.lang.Thread.run(Thread.java:748)

org.apache.solr.common.util.ObjectReleaseTracker$ObjectTrackerException: org.apache.lucene.store.MMapDirectory
        at org.apache.solr.common.util.ObjectReleaseTracker.track(ObjectReleaseTracker.java:42)
        at org.apache.solr.core.CachingDirectoryFactory.get(CachingDirectoryFactory.java:348)
        at org.apache.solr.handler.IndexFetcher.fetchLatestIndex(IndexFetcher.java:509)
        at org.apache.solr.handler.IndexFetcher.fetchLatestIndex(IndexFetcher.java:351)
        at org.apache.solr.handler.ReplicationHandler.doFetch(ReplicationHandler.java:424)
        at org.apache.solr.handler.ReplicationHandler.lambda$setupPolling$13(ReplicationHandler.java:1193)
        at java.util.concurrent.Executors$RunnableAdapter.call(Executors.java:511)
        at java.util.concurrent.FutureTask.runAndReset(FutureTask.java:308)
        at java.util.concurrent.ScheduledThreadPoolExecutor$ScheduledFutureTask.access$301(ScheduledThreadPoolExecutor.java:180)
        at java.util.concurrent.ScheduledThreadPoolExecutor$ScheduledFutureTask.run(ScheduledThreadPoolExecutor.java:294)
        at java.util.concurrent.ThreadPoolExecutor.runWorker(ThreadPoolExecutor.java:1149)
        at java.util.concurrent.ThreadPoolExecutor$Worker.run(ThreadPoolExecutor.java:624)
        at java.lang.Thread.run(Thread.java:748)

org.apache.solr.common.util.ObjectReleaseTracker$ObjectTrackerException: org.apache.solr.core.SolrCore
        at org.apache.solr.common.util.ObjectReleaseTracker.track(ObjectReleaseTracker.java:42)
        at org.apache.solr.core.SolrCore.<init>(SolrCore.java:1062)
        at org.apache.solr.core.SolrCore.<init>(SolrCore.java:882)
        at org.apache.solr.core.CoreContainer.createFromDescriptor(CoreContainer.java:1189)
        at org.apache.solr.core.CoreContainer.create(CoreContainer.java:1099)
        at org.apache.solr.handler.admin.CoreAdminOperation.lambda$static$0(CoreAdminOperation.java:92)
        at org.apache.solr.handler.admin.CoreAdminOperation.execute(CoreAdminOperation.java:360)
        at org.apache.solr.handler.admin.CoreAdminHandler$CallInfo.call(CoreAdminHandler.java:395)
        at org.apache.solr.handler.admin.CoreAdminHandler.handleRequestBody(CoreAdminHandler.java:180)
        at org.apache.solr.handler.RequestHandlerBase.handleRequest(RequestHandlerBase.java:199)
        at org.apache.solr.servlet.HttpSolrCall.handleAdmin(HttpSolrCall.java:736)
        at org.apache.solr.servlet.HttpSolrCall.handleAdminRequest(HttpSolrCall.java:717)
        at org.apache.solr.servlet.HttpSolrCall.call(HttpSolrCall.java:496)
        at org.apache.solr.servlet.SolrDispatchFilter.doFilter(SolrDispatchFilter.java:394)
        at org.apache.solr.servlet.SolrDispatchFilter.doFilter(SolrDispatchFilter.java:340)
        at org.eclipse.jetty.servlet.ServletHandler$CachedChain.doFilter(ServletHandler.java:1610)
        at org.apache.solr.client.solrj.embedded.JettySolrRunner$DebugFilter.doFilter(JettySolrRunner.java:164)
        at org.eclipse.jetty.servlet.ServletHandler$CachedChain.doFilter(ServletHandler.java:1610)
        at org.eclipse.jetty.servlet.ServletHandler.doHandle(ServletHandler.java:540)
        at org.eclipse.jetty.server.handler.ScopedHandler.nextHandle(ScopedHandler.java:255)
        at org.eclipse.jetty.server.session.SessionHandler.doHandle(SessionHandler.java:1588)
        at org.eclipse.jetty.server.handler.ScopedHandler.nextHandle(ScopedHandler.java:255)
        at org.eclipse.jetty.server.handler.ContextHandler.doHandle(ContextHandler.java:1345)
        at org.eclipse.jetty.server.handler.ScopedHandler.nextScope(ScopedHandler.java:203)
        at org.eclipse.jetty.servlet.ServletHandler.doScope(ServletHandler.java:480)
        at org.eclipse.jetty.server.session.SessionHandler.doScope(SessionHandler.java:1557)
        at org.eclipse.jetty.server.handler.ScopedHandler.nextScope(ScopedHandler.java:201)
        at org.eclipse.jetty.server.handler.ContextHandler.doScope(ContextHandler.java:1247)
        at org.eclipse.jetty.server.handler.ScopedHandler.handle(ScopedHandler.java:144)
        at org.eclipse.jetty.server.handler.gzip.GzipHandler.handle(GzipHandler.java:703)
        at org.eclipse.jetty.server.handler.HandlerWrapper.handle(HandlerWrapper.java:132)
        at org.eclipse.jetty.server.Server.handle(Server.java:502)
        at org.eclipse.jetty.server.HttpChannel.handle(HttpChannel.java:364)
        at org.eclipse.jetty.server.HttpChannel.run(HttpChannel.java:305)
        at org.eclipse.jetty.util.thread.QueuedThreadPool.runJob(QueuedThreadPool.java:765)
        at org.eclipse.jetty.util.thread.QueuedThreadPool$2.run(QueuedThreadPool.java:683)
        at java.lang.Thread.run(Thread.java:748)

org.apache.solr.common.util.ObjectReleaseTracker$ObjectTrackerException: org.apache.lucene.store.MMapDirectory
        at org.apache.solr.common.util.ObjectReleaseTracker.track(ObjectReleaseTracker.java:42)
        at org.apache.solr.core.CachingDirectoryFactory.get(CachingDirectoryFactory.java:348)
        at org.apache.solr.update.SolrIndexWriter.create(SolrIndexWriter.java:95)
        at org.apache.solr.core.SolrCore.initIndex(SolrCore.java:778)
        at org.apache.solr.core.SolrCore.<init>(SolrCore.java:975)
        at org.apache.solr.core.SolrCore.<init>(SolrCore.java:882)
        at org.apache.solr.core.CoreContainer.createFromDescriptor(CoreContainer.java:1189)
        at org.apache.solr.core.CoreContainer.create(CoreContainer.java:1099)
        at org.apache.solr.handler.admin.CoreAdminOperation.lambda$static$0(CoreAdminOperation.java:92)
        at org.apache.solr.handler.admin.CoreAdminOperation.execute(CoreAdminOperation.java:360)
        at org.apache.solr.handler.admin.CoreAdminHandler$CallInfo.call(CoreAdminHandler.java:395)
        at org.apache.solr.handler.admin.CoreAdminHandler.handleRequestBody(CoreAdminHandler.java:180)
        at org.apache.solr.handler.RequestHandlerBase.handleRequest(RequestHandlerBase.java:199)
        at org.apache.solr.servlet.HttpSolrCall.handleAdmin(HttpSolrCall.java:736)
        at org.apache.solr.servlet.HttpSolrCall.handleAdminRequest(HttpSolrCall.java:717)
        at org.apache.solr.servlet.HttpSolrCall.call(HttpSolrCall.java:496)
        at org.apache.solr.servlet.SolrDispatchFilter.doFilter(SolrDispatchFilter.java:394)
        at org.apache.solr.servlet.SolrDispatchFilter.doFilter(SolrDispatchFilter.java:340)
        at org.eclipse.jetty.servlet.ServletHandler$CachedChain.doFilter(ServletHandler.java:1610)
        at org.apache.solr.client.solrj.embedded.JettySolrRunner$DebugFilter.doFilter(JettySolrRunner.java:164)
        at org.eclipse.jetty.servlet.ServletHandler$CachedChain.doFilter(ServletHandler.java:1610)
        at org.eclipse.jetty.servlet.ServletHandler.doHandle(ServletHandler.java:540)
        at org.eclipse.jetty.server.handler.ScopedHandler.nextHandle(ScopedHandler.java:255)
        at org.eclipse.jetty.server.session.SessionHandler.doHandle(SessionHandler.java:1588)
        at org.eclipse.jetty.server.handler.ScopedHandler.nextHandle(ScopedHandler.java:255)
        at org.eclipse.jetty.server.handler.ContextHandler.doHandle(ContextHandler.java:1345)
        at org.eclipse.jetty.server.handler.ScopedHandler.nextScope(ScopedHandler.java:203)
        at org.eclipse.jetty.servlet.ServletHandler.doScope(ServletHandler.java:480)
        at org.eclipse.jetty.server.session.SessionHandler.doScope(SessionHandler.java:1557)
        at org.eclipse.jetty.server.handler.ScopedHandler.nextScope(ScopedHandler.java:201)
        at org.eclipse.jetty.server.handler.ContextHandler.doScope(ContextHandler.java:1247)
        at org.eclipse.jetty.server.handler.ScopedHandler.handle(ScopedHandler.java:144)
        at org.eclipse.jetty.server.handler.gzip.GzipHandler.handle(GzipHandler.java:703)
        at org.eclipse.jetty.server.handler.HandlerWrapper.handle(HandlerWrapper.java:132)
        at org.eclipse.jetty.server.Server.handle(Server.java:502)
        at org.eclipse.jetty.server.HttpChannel.handle(HttpChannel.java:364)
        at org.eclipse.jetty.server.HttpChannel.run(HttpChannel.java:305)
        at org.eclipse.jetty.util.thread.QueuedThreadPool.runJob(QueuedThreadPool.java:765)
        at org.eclipse.jetty.util.thread.QueuedThreadPool$2.run(QueuedThreadPool.java:683)
        at java.lang.Thread.run(Thread.java:748)

>
        at __randomizedtesting.SeedInfo.seed([8CD419C75192D3FB]:0)
        at org.junit.Assert.fail(Assert.java:88)
        at org.junit.Assert.failNotNull(Assert.java:755)
        at org.junit.Assert.assertNull(Assert.java:737)
        at org.apache.solr.SolrTestCaseJ4.teardownTestCases(SolrTestCaseJ4.java:322)
        at sun.reflect.GeneratedMethodAccessor42.invoke(Unknown Source)
        at sun.reflect.DelegatingMethodAccessorImpl.invoke(DelegatingMethodAccessorImpl.java:43)
        at java.lang.reflect.Method.invoke(Method.java:498)
        at com.carrotsearch.randomizedtesting.RandomizedRunner.invoke(RandomizedRunner.java:1750)
        at com.carrotsearch.randomizedtesting.RandomizedRunner$7.evaluate(RandomizedRunner.java:901)
        at com.carrotsearch.randomizedtesting.rules.StatementAdapter.evaluate(StatementAdapter.java:36)
        at com.carrotsearch.randomizedtesting.rules.SystemPropertiesRestoreRule$1.evaluate(SystemPropertiesRestoreRule.java:57)
        at org.apache.lucene.util.AbstractBeforeAfterRule$1.evaluate(AbstractBeforeAfterRule.java:45)
        at com.carrotsearch.randomizedtesting.rules.StatementAdapter.evaluate(StatementAdapter.java:36)
        at org.apache.lucene.util.TestRuleStoreClassName$1.evaluate(TestRuleStoreClassName.java:41)
        at com.carrotsearch.randomizedtesting.rules.NoShadowingOrOverridesOnMethodsRule$1.evaluate(NoShadowingOrOverridesOnMethodsRule.java:40)
        at com.carrotsearch.randomizedtesting.rules.NoShadowingOrOverridesOnMethodsRule$1.evaluate(NoShadowingOrOverridesOnMethodsRule.java:40)
        at com.carrotsearch.randomizedtesting.rules.StatementAdapter.evaluate(StatementAdapter.java:36)
        at com.carrotsearch.randomizedtesting.rules.StatementAdapter.evaluate(StatementAdapter.java:36)
        at com.carrotsearch.randomizedtesting.rules.StatementAdapter.evaluate(StatementAdapter.java:36)
        at org.apache.lucene.util.TestRuleAssertionsRequired$1.evaluate(TestRuleAssertionsRequired.java:53)
        at org.apache.lucene.util.TestRuleMarkFailure$1.evaluate(TestRuleMarkFailure.java:47)
        at org.apache.lucene.util.TestRuleIgnoreAfterMaxFailures$1.evaluate(TestRuleIgnoreAfterMaxFailures.java:64)
        at org.apache.lucene.util.TestRuleIgnoreTestSuites$1.evaluate(TestRuleIgnoreTestSuites.java:54)
        at com.carrotsearch.randomizedtesting.rules.StatementAdapter.evaluate(StatementAdapter.java:36)
        at com.carrotsearch.randomizedtesting.ThreadLeakControl$StatementRunner.run(ThreadLeakControl.java:368)
        at java.lang.Thread.run(Thread.java:748)


FAILED:  org.apache.solr.cloud.cdcr.CdcrReplicationHandlerTest.testReplicationWithBufferedUpdates

Error Message:
Error from server at http://127.0.0.1:40508/kai: ADDREPLICA failed to create replica

Stack Trace:
org.apache.solr.client.solrj.impl.HttpSolrClient$RemoteSolrException: Error from server at http://127.0.0.1:40508/kai: ADDREPLICA failed to create replica
        at __randomizedtesting.SeedInfo.seed([8CD419C75192D3FB:5FDD49D914014F6C]:0)
        at org.apache.solr.client.solrj.impl.HttpSolrClient.executeMethod(HttpSolrClient.java:650)
        at org.apache.solr.client.solrj.impl.HttpSolrClient.request(HttpSolrClient.java:256)
        at org.apache.solr.client.solrj.impl.HttpSolrClient.request(HttpSolrClient.java:245)
        at org.apache.solr.client.solrj.impl.LBSolrClient.doRequest(LBSolrClient.java:368)
        at org.apache.solr.client.solrj.impl.LBSolrClient.request(LBSolrClient.java:296)
        at org.apache.solr.client.solrj.impl.LBHttpSolrClient.request(LBHttpSolrClient.java:213)
        at org.apache.solr.client.solrj.impl.CloudSolrClient.sendRequest(CloudSolrClient.java:1110)
        at org.apache.solr.client.solrj.impl.CloudSolrClient.requestWithRetryOnStaleState(CloudSolrClient.java:884)
        at org.apache.solr.client.solrj.impl.CloudSolrClient.request(CloudSolrClient.java:817)
        at org.apache.solr.client.solrj.SolrRequest.process(SolrRequest.java:207)
        at org.apache.solr.client.solrj.SolrRequest.process(SolrRequest.java:224)
        at org.apache.solr.cloud.cdcr.BaseCdcrDistributedZkTest.startServers(BaseCdcrDistributedZkTest.java:594)
        at org.apache.solr.cloud.cdcr.BaseCdcrDistributedZkTest.createSourceCollection(BaseCdcrDistributedZkTest.java:352)
        at org.apache.solr.cloud.cdcr.BaseCdcrDistributedZkTest.baseBefore(BaseCdcrDistributedZkTest.java:178)
        at sun.reflect.NativeMethodAccessorImpl.invoke0(Native Method)
        at sun.reflect.NativeMethodAccessorImpl.invoke(NativeMethodAccessorImpl.java:62)
        at sun.reflect.DelegatingMethodAccessorImpl.invoke(DelegatingMethodAccessorImpl.java:43)
        at java.lang.reflect.Method.invoke(Method.java:498)
        at com.carrotsearch.randomizedtesting.RandomizedRunner.invoke(RandomizedRunner.java:1750)
        at com.carrotsearch.randomizedtesting.RandomizedRunner$9.evaluate(RandomizedRunner.java:972)
        at com.carrotsearch.randomizedtesting.RandomizedRunner$10.evaluate(RandomizedRunner.java:988)
        at org.apache.solr.BaseDistributedSearchTestCase$ShardsRepeatRule$ShardsFixedStatement.callStatement(BaseDistributedSearchTestCase.java:1082)
        at org.apache.solr.BaseDistributedSearchTestCase$ShardsRepeatRule$ShardsStatement.evaluate(BaseDistributedSearchTestCase.java:1054)
        at com.carrotsearch.randomizedtesting.rules.SystemPropertiesRestoreRule$1.evaluate(SystemPropertiesRestoreRule.java:57)
        at org.apache.lucene.util.TestRuleSetupTeardownChained$1.evaluate(TestRuleSetupTeardownChained.java:49)
        at org.apache.lucene.util.AbstractBeforeAfterRule$1.evaluate(AbstractBeforeAfterRule.java:45)
        at org.apache.lucene.util.TestRuleThreadAndTestName$1.evaluate(TestRuleThreadAndTestName.java:48)
        at org.apache.lucene.util.TestRuleIgnoreAfterMaxFailures$1.evaluate(TestRuleIgnoreAfterMaxFailures.java:64)
        at org.apache.lucene.util.TestRuleMarkFailure$1.evaluate(TestRuleMarkFailure.java:47)
        at com.carrotsearch.randomizedtesting.rules.StatementAdapter.evaluate(StatementAdapter.java:36)
        at com.carrotsearch.randomizedtesting.ThreadLeakControl$StatementRunner.run(ThreadLeakControl.java:368)
        at com.carrotsearch.randomizedtesting.ThreadLeakControl.forkTimeoutingTask(ThreadLeakControl.java:817)
        at com.carrotsearch.randomizedtesting.ThreadLeakControl$3.evaluate(ThreadLeakControl.java:468)
        at com.carrotsearch.randomizedtesting.RandomizedRunner.runSingleTest(RandomizedRunner.java:947)
        at com.carrotsearch.randomizedtesting.RandomizedRunner$5.evaluate(RandomizedRunner.java:832)
        at com.carrotsearch.randomizedtesting.RandomizedRunner$6.evaluate(RandomizedRunner.java:883)
        at com.carrotsearch.randomizedtesting.RandomizedRunner$7.evaluate(RandomizedRunner.java:894)
        at com.carrotsearch.randomizedtesting.rules.StatementAdapter.evaluate(StatementAdapter.java:36)
        at com.carrotsearch.randomizedtesting.rules.SystemPropertiesRestoreRule$1.evaluate(SystemPropertiesRestoreRule.java:57)
        at org.apache.lucene.util.AbstractBeforeAfterRule$1.evaluate(AbstractBeforeAfterRule.java:45)
        at com.carrotsearch.randomizedtesting.rules.StatementAdapter.evaluate(StatementAdapter.java:36)
        at org.apache.lucene.util.TestRuleStoreClassName$1.evaluate(TestRuleStoreClassName.java:41)
        at com.carrotsearch.randomizedtesting.rules.NoShadowingOrOverridesOnMethodsRule$1.evaluate(NoShadowingOrOverridesOnMethodsRule.java:40)
        at com.carrotsearch.randomizedtesting.rules.NoShadowingOrOverridesOnMethodsRule$1.evaluate(NoShadowingOrOverridesOnMethodsRule.java:40)
        at com.carrotsearch.randomizedtesting.rules.StatementAdapter.evaluate(StatementAdapter.java:36)
        at com.carrotsearch.randomizedtesting.rules.StatementAdapter.evaluate(StatementAdapter.java:36)
        at com.carrotsearch.randomizedtesting.rules.StatementAdapter.evaluate(StatementAdapter.java:36)
        at org.apache.lucene.util.TestRuleAssertionsRequired$1.evaluate(TestRuleAssertionsRequired.java:53)
        at org.apache.lucene.util.TestRuleMarkFailure$1.evaluate(TestRuleMarkFailure.java:47)
        at org.apache.lucene.util.TestRuleIgnoreAfterMaxFailures$1.evaluate(TestRuleIgnoreAfterMaxFailures.java:64)
        at org.apache.lucene.util.TestRuleIgnoreTestSuites$1.evaluate(TestRuleIgnoreTestSuites.java:54)
        at com.carrotsearch.randomizedtesting.rules.StatementAdapter.evaluate(StatementAdapter.java:36)
        at com.carrotsearch.randomizedtesting.ThreadLeakControl$StatementRunner.run(ThreadLeakControl.java:368)
        at java.lang.Thread.run(Thread.java:748)




Build Log:
[...truncated 3860 lines...]
   [junit4] Suite: org.apache.lucene.analysis.core.TestRandomChains
   [junit4]   2> stage 0: ndhwtmqirh<[0-10] +1> srtauoosva<[11-20] +1> fjroolbsmmfr<[21-32] +1>
   [junit4]   2> stage 1: ndhwtmqirh<[0-10] +1> ndhwtmqirh srtauoosva<[0-20] +0> srtauoosva<[11-20] +1> srtauoosva fjroolbsmmfr<[11-32] +0>
   [junit4]   2> stage 2: ndhwtmqirh<[0-10] +1> ndhwtmqirh srtauoosva<[0-20] +0> srtauoosva<[11-20] +1> srtauoosva fjroolbsmmfr<[11-32] +0>
   [junit4]   2> stage 3: ndhwtmqirh<SOUTHEAST_ASIAN>srtauoosva<[0-20] +1> ndhwtmqirh<SOUTHEAST_ASIAN>srtauoosva fjroolbsmmfr<[0-32] +0>
   [junit4]   2> TEST FAIL: useCharFilter=true text='ndhwtmqirh srtauosva fjrolbsmmfr \u2a50\u2acd\u2aea\u2a05 p '
   [junit4]   2> Exception from random analyzer:
   [junit4]   2> charfilters=
   [junit4]   2>   org.apache.lucene.analysis.charfilter.MappingCharFilter(org.apache.lucene.analysis.charfilter.NormalizeCharMap@629e28cc, java.io.StringReader@863b8df)
   [junit4]   2>   org.apache.lucene.analysis.charfilter.HTMLStripCharFilter(org.apache.lucene.analysis.charfilter.MappingCharFilter@6f212045, [])
   [junit4]   2> tokenizer=
   [junit4]   2>   org.apache.lucene.analysis.core.UnicodeWhitespaceTokenizer(org.apache.lucene.util.AttributeFactory$1@58238e25, 45)
   [junit4]   2> filters=
   [junit4]   2>   org.apache.lucene.analysis.shingle.ShingleFilter(ValidatingTokenFilter@735b4e54 term=,bytes=[],startOffset=0,endOffset=0,positionIncrement=1,positionLength=1,type=word,termFrequency=1, am)
   [junit4]   2>   Conditional:org.apache.lucene.analysis.standard.ClassicFilter(OneTimeWrapper@3c34ff61 term=,bytes=[],startOffset=0,endOffset=0,positionIncrement=1,positionLength=1,type=word,termFrequency=1)
   [junit4]   2>   org.apache.lucene.analysis.shingle.FixedShingleFilter(ValidatingTokenFilter@2e6c33f8 term=,bytes=[],startOffset=0,endOffset=0,positionIncrement=1,positionLength=1,type=word,termFrequency=1, 2, <SOUTHEAST_ASIAN>, )
   [junit4]   2>   Conditional:org.apache.lucene.analysis.miscellaneous.TrimFilter(OneTimeWrapper@531b2923 term=,bytes=[],startOffset=0,endOffset=0,positionIncrement=1,positionLength=1,type=word,termFrequency=1)
   [junit4]   2> NOTE: download the large Jenkins line-docs file by running 'ant get-jenkins-line-docs' in the lucene directory.
   [junit4]   2> NOTE: reproduce with: ant test  -Dtestcase=TestRandomChains -Dtests.method=testRandomChainsWithLargeStrings -Dtests.seed=1FA0C906E679E3CF -Dtests.multiplier=2 -Dtests.nightly=true -Dtests.slow=true -Dtests.linedocsfile=/home/jenkins/jenkins-slave/workspace/Lucene-Solr-NightlyTests-8.x/test-data/enwiki.random.lines.txt -Dtests.locale=de-GR -Dtests.timezone=Asia/Yakutsk -Dtests.asserts=true -Dtests.file.encoding=UTF-8
   [junit4] ERROR   0.64s J2 | TestRandomChains.testRandomChainsWithLargeStrings <<<
   [junit4]    > Throwable #1: java.lang.IllegalStateException: stage 3: inconsistent endOffset at pos=1: 20 vs 32; token=ndhwtmqirh<SOUTHEAST_ASIAN>srtauoosva fjroolbsmmfr
   [junit4]    > at __randomizedtesting.SeedInfo.seed([1FA0C906E679E3CF:75FB7617BF37C33C]:0)
   [junit4]    > at org.apache.lucene.analysis.ValidatingTokenFilter.incrementToken(ValidatingTokenFilter.java:146)
   [junit4]    > at org.apache.lucene.analysis.miscellaneous.ConditionalTokenFilter.incrementToken(ConditionalTokenFilter.java:174)
   [junit4]    > at org.apache.lucene.analysis.ValidatingTokenFilter.incrementToken(ValidatingTokenFilter.java:77)
   [junit4]    > at org.apache.lucene.analysis.BaseTokenStreamTestCase.checkAnalysisConsistency(BaseTokenStreamTestCase.java:746)
   [junit4]    > at org.apache.lucene.analysis.BaseTokenStreamTestCase.checkRandomData(BaseTokenStreamTestCase.java:657)
   [junit4]    > at org.apache.lucene.analysis.BaseTokenStreamTestCase.checkRandomData(BaseTokenStreamTestCase.java:559)
   [junit4]    > at org.apache.lucene.analysis.core.TestRandomChains.testRandomChainsWithLargeStrings(TestRandomChains.java:899)
   [junit4]    > at java.lang.Thread.run(Thread.java:748)
   [junit4]   2> NOTE: leaving temporary files on disk at: /home/jenkins/jenkins-slave/workspace/Lucene-Solr-NightlyTests-8.x/checkout/lucene/build/analysis/common/test/J2/temp/lucene.analysis.core.TestRandomChains_1FA0C906E679E3CF-001
   [junit4]   2> NOTE: test params are: codec=Asserting(Lucene80): {dummy=FST50}, docValues:{}, maxPointsInLeafNode=325, maxMBSortInHeap=7.450630694285625, sim=Asserting(org.apache.lucene.search.similarities.AssertingSimilarity@7593c51d), locale=de-GR, timezone=Asia/Yakutsk
   [junit4]   2> NOTE: Linux 4.4.0-112-generic amd64/Oracle Corporation 1.8.0_191 (64-bit)/cpus=4,threads=1,free=15113816,total=299892736
   [junit4]   2> NOTE: All tests run in this JVM: [TestFlattenGraphFilter, TestFilesystemResourceLoader, TestPorterStemFilterFactory, TestReverseStringFilterFactory, TestPatternReplaceCharFilterFactory, TestArabicNormalizationFilter, TestNorwegianMinimalStemFilter, TestIrishLowerCaseFilter, TestMultiWordSynonyms, TestBengaliFilters, TestBulgarianStemFilterFactory, ShingleAnalyzerWrapperTest, TestCharTokenizers, TestLatvianAnalyzer, TestGermanLightStemFilter, TestTypeTokenFilter, TestAnalyzers, TestBrazilianAnalyzer, TestTurkishLowerCaseFilterFactory, TestSoraniAnalyzer, TestApostropheFilterFactory, TestSwedishAnalyzer, TestFingerprintFilter, TestSerbianNormalizationRegularFilter, TestUAX29URLEmailAnalyzer, TestDecimalDigitFilterFactory, TestDelimitedPayloadTokenFilterFactory, TestStrangeOvergeneration, TestLimitTokenCountFilter, TestHindiNormalizer, TestSynonymGraphFilter, TestDoubleEscape, TestSpanishLightStemFilterFactory, TestGermanStemFilter, TestCollationKeyAnalyzer, TestKStemFilterFactory, TestKeepCase, TestItalianLightStemFilterFactory, TestSimplePatternTokenizer, TestWikipediaTokenizerFactory, TestCzechStemmer, TestRussianLightStemFilter, TestPortugueseAnalyzer, TestEnglishAnalyzer, TestHyphenatedWordsFilter, TestTeeSinkTokenFilter, TestCaseInsensitive, TestGalicianMinimalStemFilter, TestMorphData, TestMappingCharFilterFactory, TestCJKAnalyzer, TestCJKBigramFilter, TestCJKBigramFilterFactory, TestSoraniNormalizationFilter, TestSoraniNormalizationFilterFactory, TestSoraniStemFilter, TestSoraniStemFilterFactory, CommonGramsFilterTest, TestCommonGramsFilterFactory, TestCommonGramsQueryFilterFactory, TestCompoundWordTokenFilter, TestDictionaryCompoundWordTokenFilterFactory, TestKeywordAnalyzer, TestKeywordTokenizer, TestRandomChains]
   [junit4] Completed [189/291 (1!)] on J2 in 212.88s, 2 tests, 1 error <<< FAILURES!

[...truncated 9549 lines...]
   [junit4] Suite: org.apache.solr.cloud.cdcr.CdcrReplicationHandlerTest
   [junit4]   2> 63101 INFO  (SUITE-CdcrReplicationHandlerTest-seed#[8CD419C75192D3FB]-worker) [    ] o.a.s.SolrTestCaseJ4 SecureRandom sanity checks: test.solr.allowed.securerandom=null & java.security.egd=file:/dev/./urandom
   [junit4]   2> Creating dataDir: /home/jenkins/jenkins-slave/workspace/Lucene-Solr-NightlyTests-8.x/checkout/solr/build/solr-core/test/J1/temp/solr.cloud.cdcr.CdcrReplicationHandlerTest_8CD419C75192D3FB-001/init-core-data-001
   [junit4]   2> 63304 INFO  (SUITE-CdcrReplicationHandlerTest-seed#[8CD419C75192D3FB]-worker) [    ] o.a.s.SolrTestCaseJ4 Using PointFields (NUMERIC_POINTS_SYSPROP=true) w/NUMERIC_DOCVALUES_SYSPROP=false
   [junit4]   2> 63504 INFO  (SUITE-CdcrReplicationHandlerTest-seed#[8CD419C75192D3FB]-worker) [    ] o.e.j.u.log Logging initialized @63831ms to org.eclipse.jetty.util.log.Slf4jLog
   [junit4]   2> 63575 INFO  (SUITE-CdcrReplicationHandlerTest-seed#[8CD419C75192D3FB]-worker) [    ] o.a.s.SolrTestCaseJ4 Randomized ssl (false) and clientAuth (true) via: @org.apache.solr.util.RandomizeSSL(reason=, ssl=NaN, value=NaN, clientAuth=NaN)
   [junit4]   2> 63688 INFO  (SUITE-CdcrReplicationHandlerTest-seed#[8CD419C75192D3FB]-worker) [    ] o.a.s.BaseDistributedSearchTestCase Setting hostContext system property: /kai/
   [junit4]   2> 63905 INFO  (TEST-CdcrReplicationHandlerTest.testReplicationWithBufferedUpdates-seed#[8CD419C75192D3FB]) [    ] o.a.s.c.ZkTestServer STARTING ZK TEST SERVER
   [junit4]   2> 63920 INFO  (ZkTestServer Run Thread) [    ] o.a.s.c.ZkTestServer client port:0.0.0.0/0.0.0.0:0
   [junit4]   2> 63921 INFO  (ZkTestServer Run Thread) [    ] o.a.s.c.ZkTestServer Starting server
   [junit4]   2> 64304 INFO  (TEST-CdcrReplicationHandlerTest.testReplicationWithBufferedUpdates-seed#[8CD419C75192D3FB]) [    ] o.a.s.c.ZkTestServer start zk server on port:44946
   [junit4]   2> 64308 INFO  (TEST-CdcrReplicationHandlerTest.testReplicationWithBufferedUpdates-seed#[8CD419C75192D3FB]) [    ] o.a.s.c.ZkTestServer parse host and port list: 127.0.0.1:44946
   [junit4]   2> 64325 INFO  (TEST-CdcrReplicationHandlerTest.testReplicationWithBufferedUpdates-seed#[8CD419C75192D3FB]) [    ] o.a.s.c.ZkTestServer connecting to 127.0.0.1 44946
   [junit4]   2> 65269 INFO  (zkConnectionManagerCallback-3-thread-1) [    ] o.a.s.c.c.ConnectionManager zkClient has connected
   [junit4]   2> 65443 INFO  (zkConnectionManagerCallback-5-thread-1) [    ] o.a.s.c.c.ConnectionManager zkClient has connected
   [junit4]   2> 65616 INFO  (TEST-CdcrReplicationHandlerTest.testReplicationWithBufferedUpdates-seed#[8CD419C75192D3FB]) [    ] o.a.s.c.ZkTestServer put /home/jenkins/jenkins-slave/workspace/Lucene-Solr-NightlyTests-8.x/checkout/solr/core/src/test-files/solr/collection1/conf/solrconfig-cdcr.xml to /configs/conf1/solrconfig.xml
   [junit4]   2> 65741 INFO  (TEST-CdcrReplicationHandlerTest.testReplicationWithBufferedUpdates-seed#[8CD419C75192D3FB]) [    ] o.a.s.c.ZkTestServer put /home/jenkins/jenkins-slave/workspace/Lucene-Solr-NightlyTests-8.x/checkout/solr/core/src/test-files/solr/collection1/conf/schema15.xml to /configs/conf1/schema.xml
   [junit4]   2> 65762 INFO  (TEST-CdcrReplicationHandlerTest.testReplicationWithBufferedUpdates-seed#[8CD419C75192D3FB]) [    ] o.a.s.c.ZkTestServer put /home/jenkins/jenkins-slave/workspace/Lucene-Solr-NightlyTests-8.x/checkout/solr/core/src/test-files/solr/collection1/conf/solrconfig.snippet.randomindexconfig.xml to /configs/conf1/solrconfig.snippet.randomindexconfig.xml
   [junit4]   2> 65814 INFO  (TEST-CdcrReplicationHandlerTest.testReplicationWithBufferedUpdates-seed#[8CD419C75192D3FB]) [    ] o.a.s.c.ZkTestServer put /home/jenkins/jenkins-slave/workspace/Lucene-Solr-NightlyTests-8.x/checkout/solr/core/src/test-files/solr/collection1/conf/stopwords.txt to /configs/conf1/stopwords.txt
   [junit4]   2> 65832 INFO  (TEST-CdcrReplicationHandlerTest.testReplicationWithBufferedUpdates-seed#[8CD419C75192D3FB]) [    ] o.a.s.c.ZkTestServer put /home/jenkins/jenkins-slave/workspace/Lucene-Solr-NightlyTests-8.x/checkout/solr/core/src/test-files/solr/collection1/conf/protwords.txt to /configs/conf1/protwords.txt
   [junit4]   2> 65869 INFO  (TEST-CdcrReplicationHandlerTest.testReplicationWithBufferedUpdates-seed#[8CD419C75192D3FB]) [    ] o.a.s.c.ZkTestServer put /home/jenkins/jenkins-slave/workspace/Lucene-Solr-NightlyTests-8.x/checkout/solr/core/src/test-files/solr/collection1/conf/currency.xml to /configs/conf1/currency.xml
   [junit4]   2> 65887 INFO  (TEST-CdcrReplicationHandlerTest.testReplicationWithBufferedUpdates-seed#[8CD419C75192D3FB]) [    ] o.a.s.c.ZkTestServer put /home/jenkins/jenkins-slave/workspace/Lucene-Solr-NightlyTests-8.x/checkout/solr/core/src/test-files/solr/collection1/conf/enumsConfig.xml to /configs/conf1/enumsConfig.xml
   [junit4]   2> 65922 INFO  (TEST-CdcrReplicationHandlerTest.testReplicationWithBufferedUpdates-seed#[8CD419C75192D3FB]) [    ] o.a.s.c.ZkTestServer put /home/jenkins/jenkins-slave/workspace/Lucene-Solr-NightlyTests-8.x/checkout/solr/core/src/test-files/solr/collection1/conf/open-exchange-rates.json to /configs/conf1/open-exchange-rates.json
   [junit4]   2> 65925 INFO  (TEST-CdcrReplicationHandlerTest.testReplicationWithBufferedUpdates-seed#[8CD419C75192D3FB]) [    ] o.a.s.c.ZkTestServer put /home/jenkins/jenkins-slave/workspace/Lucene-Solr-NightlyTests-8.x/checkout/solr/core/src/test-files/solr/collection1/conf/mapping-ISOLatin1Accent.txt to /configs/conf1/mapping-ISOLatin1Accent.txt
   [junit4]   2> 65979 INFO  (TEST-CdcrReplicationHandlerTest.testReplicationWithBufferedUpdates-seed#[8CD419C75192D3FB]) [    ] o.a.s.c.ZkTestServer put /home/jenkins/jenkins-slave/workspace/Lucene-Solr-NightlyTests-8.x/checkout/solr/core/src/test-files/solr/collection1/conf/old_synonyms.txt to /configs/conf1/old_synonyms.txt
   [junit4]   2> 66030 INFO  (TEST-CdcrReplicationHandlerTest.testReplicationWithBufferedUpdates-seed#[8CD419C75192D3FB]) [    ] o.a.s.c.ZkTestServer put /home/jenkins/jenkins-slave/workspace/Lucene-Solr-NightlyTests-8.x/checkout/solr/core/src/test-files/solr/collection1/conf/synonyms.txt to /configs/conf1/synonyms.txt
   [junit4]   2> 66112 INFO  (TEST-CdcrReplicationHandlerTest.testReplicationWithBufferedU

[...truncated too long message...]

source] Do not set property disallowed.ivy.jars.list as its length is 0.

-ivy-fail-disallowed-ivy-version:

ivy-fail:

ivy-configure:
[ivy:configure] :: loading settings :: file = /home/jenkins/jenkins-slave/workspace/Lucene-Solr-NightlyTests-8.x/checkout/lucene/top-level-ivy-settings.xml

resolve:

ivy-availability-check:
[loadresource] Do not set property disallowed.ivy.jars.list as its length is 0.

-ivy-fail-disallowed-ivy-version:

ivy-fail:

ivy-fail:

ivy-configure:
[ivy:configure] :: loading settings :: file = /home/jenkins/jenkins-slave/workspace/Lucene-Solr-NightlyTests-8.x/checkout/lucene/top-level-ivy-settings.xml

resolve:

ivy-availability-check:
[loadresource] Do not set property disallowed.ivy.jars.list as its length is 0.

-ivy-fail-disallowed-ivy-version:

ivy-fail:

ivy-configure:
[ivy:configure] :: loading settings :: file = /home/jenkins/jenkins-slave/workspace/Lucene-Solr-NightlyTests-8.x/checkout/lucene/top-level-ivy-settings.xml

resolve:

ivy-availability-check:
[loadresource] Do not set property disallowed.ivy.jars.list as its length is 0.

-ivy-fail-disallowed-ivy-version:

ivy-fail:

ivy-fail:

ivy-configure:
[ivy:configure] :: loading settings :: file = /home/jenkins/jenkins-slave/workspace/Lucene-Solr-NightlyTests-8.x/checkout/lucene/top-level-ivy-settings.xml

resolve:

ivy-availability-check:
[loadresource] Do not set property disallowed.ivy.jars.list as its length is 0.

-ivy-fail-disallowed-ivy-version:

ivy-fail:

ivy-fail:

ivy-configure:
[ivy:configure] :: loading settings :: file = /home/jenkins/jenkins-slave/workspace/Lucene-Solr-NightlyTests-8.x/checkout/lucene/top-level-ivy-settings.xml

resolve:

ivy-availability-check:
[loadresource] Do not set property disallowed.ivy.jars.list as its length is 0.

-ivy-fail-disallowed-ivy-version:

ivy-fail:

ivy-fail:

ivy-configure:
[ivy:configure] :: loading settings :: file = /home/jenkins/jenkins-slave/workspace/Lucene-Solr-NightlyTests-8.x/checkout/lucene/top-level-ivy-settings.xml

resolve:

ivy-availability-check:
[loadresource] Do not set property disallowed.ivy.jars.list as its length is 0.

-ivy-fail-disallowed-ivy-version:

ivy-fail:

ivy-fail:

ivy-configure:
[ivy:configure] :: loading settings :: file = /home/jenkins/jenkins-slave/workspace/Lucene-Solr-NightlyTests-8.x/checkout/lucene/top-level-ivy-settings.xml

resolve:

ivy-availability-check:
[loadresource] Do not set property disallowed.ivy.jars.list as its length is 0.

-ivy-fail-disallowed-ivy-version:

ivy-fail:

ivy-fail:

ivy-configure:
[ivy:configure] :: loading settings :: file = /home/jenkins/jenkins-slave/workspace/Lucene-Solr-NightlyTests-8.x/checkout/lucene/top-level-ivy-settings.xml

resolve:

ivy-availability-check:
[loadresource] Do not set property disallowed.ivy.jars.list as its length is 0.

-ivy-fail-disallowed-ivy-version:

ivy-fail:

ivy-fail:

ivy-configure:
[ivy:configure] :: loading settings :: file = /home/jenkins/jenkins-slave/workspace/Lucene-Solr-NightlyTests-8.x/checkout/lucene/top-level-ivy-settings.xml

resolve:

ivy-availability-check:
[loadresource] Do not set property disallowed.ivy.jars.list as its length is 0.

-ivy-fail-disallowed-ivy-version:

ivy-fail:

ivy-fail:

ivy-configure:
[ivy:configure] :: loading settings :: file = /home/jenkins/jenkins-slave/workspace/Lucene-Solr-NightlyTests-8.x/checkout/lucene/top-level-ivy-settings.xml

resolve:

ivy-availability-check:
[loadresource] Do not set property disallowed.ivy.jars.list as its length is 0.

-ivy-fail-disallowed-ivy-version:

ivy-fail:

ivy-fail:

ivy-configure:
[ivy:configure] :: loading settings :: file = /home/jenkins/jenkins-slave/workspace/Lucene-Solr-NightlyTests-8.x/checkout/lucene/top-level-ivy-settings.xml

resolve:

ivy-availability-check:
[loadresource] Do not set property disallowed.ivy.jars.list as its length is 0.

-ivy-fail-disallowed-ivy-version:

ivy-fail:

ivy-fail:

ivy-configure:
[ivy:configure] :: loading settings :: file = /home/jenkins/jenkins-slave/workspace/Lucene-Solr-NightlyTests-8.x/checkout/lucene/top-level-ivy-settings.xml

resolve:

ivy-availability-check:
[loadresource] Do not set property disallowed.ivy.jars.list as its length is 0.

-ivy-fail-disallowed-ivy-version:

ivy-fail:

ivy-fail:

ivy-configure:
[ivy:configure] :: loading settings :: file = /home/jenkins/jenkins-slave/workspace/Lucene-Solr-NightlyTests-8.x/checkout/lucene/top-level-ivy-settings.xml

resolve:

jar-checksums:
    [mkdir] Created dir: /home/jenkins/jenkins-slave/workspace/Lucene-Solr-NightlyTests-8.x/checkout/solr/null363925522
     [copy] Copying 237 files to /home/jenkins/jenkins-slave/workspace/Lucene-Solr-NightlyTests-8.x/checkout/solr/null363925522
   [delete] Deleting directory /home/jenkins/jenkins-slave/workspace/Lucene-Solr-NightlyTests-8.x/checkout/solr/null363925522

check-working-copy:
[ivy:cachepath] :: resolving dependencies :: org.eclipse.jgit#org.eclipse.jgit-caller;working
[ivy:cachepath] confs: [default]
[ivy:cachepath] found org.eclipse.jgit#org.eclipse.jgit;4.6.0.201612231935-r in public
[ivy:cachepath] found com.jcraft#jsch;0.1.53 in public
[ivy:cachepath] found com.googlecode.javaewah#JavaEWAH;1.1.6 in public
[ivy:cachepath] found org.apache.httpcomponents#httpclient;4.3.6 in public
[ivy:cachepath] found org.apache.httpcomponents#httpcore;4.3.3 in public
[ivy:cachepath] found commons-logging#commons-logging;1.1.3 in public
[ivy:cachepath] found commons-codec#commons-codec;1.6 in public
[ivy:cachepath] found org.slf4j#slf4j-api;1.7.2 in public
[ivy:cachepath] :: resolution report :: resolve 36ms :: artifacts dl 4ms
        ---------------------------------------------------------------------
        |                  |            modules            ||   artifacts   |
        |       conf       | number| search|dwnlded|evicted|| number|dwnlded|
        ---------------------------------------------------------------------
        |      default     |   8   |   0   |   0   |   0   ||   8   |   0   |
        ---------------------------------------------------------------------
[wc-checker] Initializing working copy...
[wc-checker] SLF4J: Failed to load class "org.slf4j.impl.StaticLoggerBinder".
[wc-checker] SLF4J: Defaulting to no-operation (NOP) logger implementation
[wc-checker] SLF4J: See http://www.slf4j.org/codes.html#StaticLoggerBinder for further details.
[wc-checker] Checking working copy status...

-jenkins-base:

BUILD SUCCESSFUL
Total time: 557 minutes 23 seconds
Archiving artifacts
java.lang.InterruptedException: no matches found within 10000
        at hudson.FilePath$ValidateAntFileMask.hasMatch(FilePath.java:2847)
        at hudson.FilePath$ValidateAntFileMask.invoke(FilePath.java:2726)
        at hudson.FilePath$ValidateAntFileMask.invoke(FilePath.java:2707)
        at hudson.FilePath$FileCallableWrapper.call(FilePath.java:3086)
Also:   hudson.remoting.Channel$CallSiteStackTrace: Remote call to lucene2
                at hudson.remoting.Channel.attachCallSiteStackTrace(Channel.java:1741)
                at hudson.remoting.UserRequest$ExceptionResponse.retrieve(UserRequest.java:357)
                at hudson.remoting.Channel.call(Channel.java:955)
                at hudson.FilePath.act(FilePath.java:1072)
                at hudson.FilePath.act(FilePath.java:1061)
                at hudson.FilePath.validateAntFileMask(FilePath.java:2705)
                at hudson.tasks.ArtifactArchiver.perform(ArtifactArchiver.java:243)
                at hudson.tasks.BuildStepCompatibilityLayer.perform(BuildStepCompatibilityLayer.java:81)
                at hudson.tasks.BuildStepMonitor$1.perform(BuildStepMonitor.java:20)
                at hudson.model.AbstractBuild$AbstractBuildExecution.perform(AbstractBuild.java:744)
                at hudson.model.AbstractBuild$AbstractBuildExecution.performAllBuildSteps(AbstractBuild.java:690)
                at hudson.model.Build$BuildExecution.post2(Build.java:186)
                at hudson.model.AbstractBuild$AbstractBuildExecution.post(AbstractBuild.java:635)
                at hudson.model.Run.execute(Run.java:1835)
                at hudson.model.FreeStyleBuild.run(FreeStyleBuild.java:43)
                at hudson.model.ResourceController.execute(ResourceController.java:97)
                at hudson.model.Executor.run(Executor.java:429)
Caused: hudson.FilePath$TunneledInterruptedException
        at hudson.FilePath$FileCallableWrapper.call(FilePath.java:3088)
        at hudson.remoting.UserRequest.perform(UserRequest.java:212)
        at hudson.remoting.UserRequest.perform(UserRequest.java:54)
        at hudson.remoting.Request$2.run(Request.java:369)
        at hudson.remoting.InterceptingExecutorService$1.call(InterceptingExecutorService.java:72)
        at java.util.concurrent.FutureTask.run(FutureTask.java:266)
        at java.util.concurrent.ThreadPoolExecutor.runWorker(ThreadPoolExecutor.java:1142)
        at java.util.concurrent.ThreadPoolExecutor$Worker.run(ThreadPoolExecutor.java:617)
        at java.lang.Thread.run(Thread.java:748)
Caused: java.lang.InterruptedException: java.lang.InterruptedException: no matches found within 10000
        at hudson.FilePath.act(FilePath.java:1074)
        at hudson.FilePath.act(FilePath.java:1061)
        at hudson.FilePath.validateAntFileMask(FilePath.java:2705)
        at hudson.tasks.ArtifactArchiver.perform(ArtifactArchiver.java:243)
        at hudson.tasks.BuildStepCompatibilityLayer.perform(BuildStepCompatibilityLayer.java:81)
        at hudson.tasks.BuildStepMonitor$1.perform(BuildStepMonitor.java:20)
        at hudson.model.AbstractBuild$AbstractBuildExecution.perform(AbstractBuild.java:744)
        at hudson.model.AbstractBuild$AbstractBuildExecution.performAllBuildSteps(AbstractBuild.java:690)
        at hudson.model.Build$BuildExecution.post2(Build.java:186)
        at hudson.model.AbstractBuild$AbstractBuildExecution.post(AbstractBuild.java:635)
        at hudson.model.Run.execute(Run.java:1835)
        at hudson.model.FreeStyleBuild.run(FreeStyleBuild.java:43)
        at hudson.model.ResourceController.execute(ResourceController.java:97)
        at hudson.model.Executor.run(Executor.java:429)
No artifacts found that match the file pattern "**/*.events,heapdumps/**,**/hs_err_pid*". Configuration error?
Recording test results
Build step 'Publish JUnit test result report' changed build result to UNSTABLE
Email was triggered for: Unstable (Test Failures)
Sending email for trigger: Unstable (Test Failures)


---------------------------------------------------------------------
To unsubscribe, e-mail: [hidden email]
For additional commands, e-mail: [hidden email]