[JENKINS] Lucene-Solr-NightlyTests-master - Build # 1477 - Still unstable

classic Classic list List threaded Threaded
1 message Options
Reply | Threaded
Open this post in threaded view
|

[JENKINS] Lucene-Solr-NightlyTests-master - Build # 1477 - Still unstable

Apache Jenkins Server-2
Build: https://builds.apache.org/job/Lucene-Solr-NightlyTests-master/1477/

9 tests failed.
FAILED:  junit.framework.TestSuite.org.apache.solr.analytics.facet.PivotFacetTest

Error Message:
1 thread leaked from SUITE scope at org.apache.solr.analytics.facet.PivotFacetTest:     1) Thread[id=86, name=qtp1670977856-86, state=TIMED_WAITING, group=TGRP-PivotFacetTest]         at sun.misc.Unsafe.park(Native Method)         at java.util.concurrent.locks.LockSupport.parkNanos(LockSupport.java:215)         at java.util.concurrent.locks.AbstractQueuedSynchronizer$ConditionObject.await(AbstractQueuedSynchronizer.java:2163)         at org.eclipse.jetty.util.thread.ReservedThreadExecutor$ReservedThread.reservedWait(ReservedThreadExecutor.java:308)         at org.eclipse.jetty.util.thread.ReservedThreadExecutor$ReservedThread.run(ReservedThreadExecutor.java:373)         at org.eclipse.jetty.util.thread.QueuedThreadPool.runJob(QueuedThreadPool.java:708)         at org.eclipse.jetty.util.thread.QueuedThreadPool$2.run(QueuedThreadPool.java:626)         at java.lang.Thread.run(Thread.java:748)

Stack Trace:
com.carrotsearch.randomizedtesting.ThreadLeakError: 1 thread leaked from SUITE scope at org.apache.solr.analytics.facet.PivotFacetTest:
   1) Thread[id=86, name=qtp1670977856-86, state=TIMED_WAITING, group=TGRP-PivotFacetTest]
        at sun.misc.Unsafe.park(Native Method)
        at java.util.concurrent.locks.LockSupport.parkNanos(LockSupport.java:215)
        at java.util.concurrent.locks.AbstractQueuedSynchronizer$ConditionObject.await(AbstractQueuedSynchronizer.java:2163)
        at org.eclipse.jetty.util.thread.ReservedThreadExecutor$ReservedThread.reservedWait(ReservedThreadExecutor.java:308)
        at org.eclipse.jetty.util.thread.ReservedThreadExecutor$ReservedThread.run(ReservedThreadExecutor.java:373)
        at org.eclipse.jetty.util.thread.QueuedThreadPool.runJob(QueuedThreadPool.java:708)
        at org.eclipse.jetty.util.thread.QueuedThreadPool$2.run(QueuedThreadPool.java:626)
        at java.lang.Thread.run(Thread.java:748)
        at __randomizedtesting.SeedInfo.seed([AB2FBF1BD9FB8131]:0)


FAILED:  junit.framework.TestSuite.org.apache.solr.analytics.facet.PivotFacetTest

Error Message:
There are still zombie threads that couldn't be terminated:    1) Thread[id=86, name=qtp1670977856-86, state=TIMED_WAITING, group=TGRP-PivotFacetTest]         at sun.misc.Unsafe.park(Native Method)         at java.util.concurrent.locks.LockSupport.parkNanos(LockSupport.java:215)         at java.util.concurrent.locks.AbstractQueuedSynchronizer$ConditionObject.await(AbstractQueuedSynchronizer.java:2163)         at org.eclipse.jetty.util.thread.ReservedThreadExecutor$ReservedThread.reservedWait(ReservedThreadExecutor.java:308)         at org.eclipse.jetty.util.thread.ReservedThreadExecutor$ReservedThread.run(ReservedThreadExecutor.java:373)         at org.eclipse.jetty.util.thread.QueuedThreadPool.runJob(QueuedThreadPool.java:708)         at org.eclipse.jetty.util.thread.QueuedThreadPool$2.run(QueuedThreadPool.java:626)         at java.lang.Thread.run(Thread.java:748)

Stack Trace:
com.carrotsearch.randomizedtesting.ThreadLeakError: There are still zombie threads that couldn't be terminated:
   1) Thread[id=86, name=qtp1670977856-86, state=TIMED_WAITING, group=TGRP-PivotFacetTest]
        at sun.misc.Unsafe.park(Native Method)
        at java.util.concurrent.locks.LockSupport.parkNanos(LockSupport.java:215)
        at java.util.concurrent.locks.AbstractQueuedSynchronizer$ConditionObject.await(AbstractQueuedSynchronizer.java:2163)
        at org.eclipse.jetty.util.thread.ReservedThreadExecutor$ReservedThread.reservedWait(ReservedThreadExecutor.java:308)
        at org.eclipse.jetty.util.thread.ReservedThreadExecutor$ReservedThread.run(ReservedThreadExecutor.java:373)
        at org.eclipse.jetty.util.thread.QueuedThreadPool.runJob(QueuedThreadPool.java:708)
        at org.eclipse.jetty.util.thread.QueuedThreadPool$2.run(QueuedThreadPool.java:626)
        at java.lang.Thread.run(Thread.java:748)
        at __randomizedtesting.SeedInfo.seed([AB2FBF1BD9FB8131]:0)


FAILED:  org.apache.solr.cloud.MultiThreadedOCPTest.test

Error Message:


Stack Trace:
java.lang.AssertionError
        at __randomizedtesting.SeedInfo.seed([CA17488FAA956331:4243775504690EC9]:0)
        at org.junit.Assert.fail(Assert.java:92)
        at org.junit.Assert.assertTrue(Assert.java:43)
        at org.junit.Assert.assertTrue(Assert.java:54)
        at org.apache.solr.cloud.MultiThreadedOCPTest.testFillWorkQueue(MultiThreadedOCPTest.java:112)
        at org.apache.solr.cloud.MultiThreadedOCPTest.test(MultiThreadedOCPTest.java:67)
        at sun.reflect.NativeMethodAccessorImpl.invoke0(Native Method)
        at sun.reflect.NativeMethodAccessorImpl.invoke(NativeMethodAccessorImpl.java:62)
        at sun.reflect.DelegatingMethodAccessorImpl.invoke(DelegatingMethodAccessorImpl.java:43)
        at java.lang.reflect.Method.invoke(Method.java:498)
        at com.carrotsearch.randomizedtesting.RandomizedRunner.invoke(RandomizedRunner.java:1737)
        at com.carrotsearch.randomizedtesting.RandomizedRunner$8.evaluate(RandomizedRunner.java:934)
        at com.carrotsearch.randomizedtesting.RandomizedRunner$9.evaluate(RandomizedRunner.java:970)
        at com.carrotsearch.randomizedtesting.RandomizedRunner$10.evaluate(RandomizedRunner.java:984)
        at org.apache.solr.BaseDistributedSearchTestCase$ShardsRepeatRule$ShardsFixedStatement.callStatement(BaseDistributedSearchTestCase.java:993)
        at org.apache.solr.BaseDistributedSearchTestCase$ShardsRepeatRule$ShardsStatement.evaluate(BaseDistributedSearchTestCase.java:968)
        at com.carrotsearch.randomizedtesting.rules.SystemPropertiesRestoreRule$1.evaluate(SystemPropertiesRestoreRule.java:57)
        at org.apache.lucene.util.TestRuleSetupTeardownChained$1.evaluate(TestRuleSetupTeardownChained.java:49)
        at org.apache.lucene.util.AbstractBeforeAfterRule$1.evaluate(AbstractBeforeAfterRule.java:45)
        at org.apache.lucene.util.TestRuleThreadAndTestName$1.evaluate(TestRuleThreadAndTestName.java:48)
        at org.apache.lucene.util.TestRuleIgnoreAfterMaxFailures$1.evaluate(TestRuleIgnoreAfterMaxFailures.java:64)
        at org.apache.lucene.util.TestRuleMarkFailure$1.evaluate(TestRuleMarkFailure.java:47)
        at com.carrotsearch.randomizedtesting.rules.StatementAdapter.evaluate(StatementAdapter.java:36)
        at com.carrotsearch.randomizedtesting.ThreadLeakControl$StatementRunner.run(ThreadLeakControl.java:368)
        at com.carrotsearch.randomizedtesting.ThreadLeakControl.forkTimeoutingTask(ThreadLeakControl.java:817)
        at com.carrotsearch.randomizedtesting.ThreadLeakControl$3.evaluate(ThreadLeakControl.java:468)
        at com.carrotsearch.randomizedtesting.RandomizedRunner.runSingleTest(RandomizedRunner.java:943)
        at com.carrotsearch.randomizedtesting.RandomizedRunner$5.evaluate(RandomizedRunner.java:829)
        at com.carrotsearch.randomizedtesting.RandomizedRunner$6.evaluate(RandomizedRunner.java:879)
        at com.carrotsearch.randomizedtesting.RandomizedRunner$7.evaluate(RandomizedRunner.java:890)
        at com.carrotsearch.randomizedtesting.rules.StatementAdapter.evaluate(StatementAdapter.java:36)
        at com.carrotsearch.randomizedtesting.rules.SystemPropertiesRestoreRule$1.evaluate(SystemPropertiesRestoreRule.java:57)
        at org.apache.lucene.util.AbstractBeforeAfterRule$1.evaluate(AbstractBeforeAfterRule.java:45)
        at com.carrotsearch.randomizedtesting.rules.StatementAdapter.evaluate(StatementAdapter.java:36)
        at org.apache.lucene.util.TestRuleStoreClassName$1.evaluate(TestRuleStoreClassName.java:41)
        at com.carrotsearch.randomizedtesting.rules.NoShadowingOrOverridesOnMethodsRule$1.evaluate(NoShadowingOrOverridesOnMethodsRule.java:40)
        at com.carrotsearch.randomizedtesting.rules.NoShadowingOrOverridesOnMethodsRule$1.evaluate(NoShadowingOrOverridesOnMethodsRule.java:40)
        at com.carrotsearch.randomizedtesting.rules.StatementAdapter.evaluate(StatementAdapter.java:36)
        at com.carrotsearch.randomizedtesting.rules.StatementAdapter.evaluate(StatementAdapter.java:36)
        at com.carrotsearch.randomizedtesting.rules.StatementAdapter.evaluate(StatementAdapter.java:36)
        at org.apache.lucene.util.TestRuleAssertionsRequired$1.evaluate(TestRuleAssertionsRequired.java:53)
        at org.apache.lucene.util.TestRuleMarkFailure$1.evaluate(TestRuleMarkFailure.java:47)
        at org.apache.lucene.util.TestRuleIgnoreAfterMaxFailures$1.evaluate(TestRuleIgnoreAfterMaxFailures.java:64)
        at org.apache.lucene.util.TestRuleIgnoreTestSuites$1.evaluate(TestRuleIgnoreTestSuites.java:54)
        at com.carrotsearch.randomizedtesting.rules.StatementAdapter.evaluate(StatementAdapter.java:36)
        at com.carrotsearch.randomizedtesting.ThreadLeakControl$StatementRunner.run(ThreadLeakControl.java:368)
        at java.lang.Thread.run(Thread.java:748)


FAILED:  org.apache.solr.cloud.api.collections.HdfsCollectionsAPIDistributedZkTest.testDeleteNonExistentCollection

Error Message:
Collection creation after a bad delete failed null Live Nodes: [127.0.0.1:32773_solr, 127.0.0.1:41251_solr, 127.0.0.1:45071_solr, 127.0.0.1:46396_solr] Last available state: null

Stack Trace:
java.lang.AssertionError: Collection creation after a bad delete failed
null
Live Nodes: [127.0.0.1:32773_solr, 127.0.0.1:41251_solr, 127.0.0.1:45071_solr, 127.0.0.1:46396_solr]
Last available state: null
        at __randomizedtesting.SeedInfo.seed([CA17488FAA956331:2D3058B2BDF61CC8]:0)
        at org.junit.Assert.fail(Assert.java:93)
        at org.apache.solr.cloud.SolrCloudTestCase.waitForState(SolrCloudTestCase.java:269)
        at org.apache.solr.cloud.api.collections.CollectionsAPIDistributedZkTest.testDeleteNonExistentCollection(CollectionsAPIDistributedZkTest.java:366)
        at sun.reflect.NativeMethodAccessorImpl.invoke0(Native Method)
        at sun.reflect.NativeMethodAccessorImpl.invoke(NativeMethodAccessorImpl.java:62)
        at sun.reflect.DelegatingMethodAccessorImpl.invoke(DelegatingMethodAccessorImpl.java:43)
        at java.lang.reflect.Method.invoke(Method.java:498)
        at com.carrotsearch.randomizedtesting.RandomizedRunner.invoke(RandomizedRunner.java:1737)
        at com.carrotsearch.randomizedtesting.RandomizedRunner$8.evaluate(RandomizedRunner.java:934)
        at com.carrotsearch.randomizedtesting.RandomizedRunner$9.evaluate(RandomizedRunner.java:970)
        at com.carrotsearch.randomizedtesting.RandomizedRunner$10.evaluate(RandomizedRunner.java:984)
        at com.carrotsearch.randomizedtesting.rules.SystemPropertiesRestoreRule$1.evaluate(SystemPropertiesRestoreRule.java:57)
        at org.apache.lucene.util.TestRuleSetupTeardownChained$1.evaluate(TestRuleSetupTeardownChained.java:49)
        at org.apache.lucene.util.AbstractBeforeAfterRule$1.evaluate(AbstractBeforeAfterRule.java:45)
        at org.apache.lucene.util.TestRuleThreadAndTestName$1.evaluate(TestRuleThreadAndTestName.java:48)
        at org.apache.lucene.util.TestRuleIgnoreAfterMaxFailures$1.evaluate(TestRuleIgnoreAfterMaxFailures.java:64)
        at org.apache.lucene.util.TestRuleMarkFailure$1.evaluate(TestRuleMarkFailure.java:47)
        at com.carrotsearch.randomizedtesting.rules.StatementAdapter.evaluate(StatementAdapter.java:36)
        at com.carrotsearch.randomizedtesting.ThreadLeakControl$StatementRunner.run(ThreadLeakControl.java:368)
        at com.carrotsearch.randomizedtesting.ThreadLeakControl.forkTimeoutingTask(ThreadLeakControl.java:817)
        at com.carrotsearch.randomizedtesting.ThreadLeakControl$3.evaluate(ThreadLeakControl.java:468)
        at com.carrotsearch.randomizedtesting.RandomizedRunner.runSingleTest(RandomizedRunner.java:943)
        at com.carrotsearch.randomizedtesting.RandomizedRunner$5.evaluate(RandomizedRunner.java:829)
        at com.carrotsearch.randomizedtesting.RandomizedRunner$6.evaluate(RandomizedRunner.java:879)
        at com.carrotsearch.randomizedtesting.RandomizedRunner$7.evaluate(RandomizedRunner.java:890)
        at com.carrotsearch.randomizedtesting.rules.StatementAdapter.evaluate(StatementAdapter.java:36)
        at com.carrotsearch.randomizedtesting.rules.SystemPropertiesRestoreRule$1.evaluate(SystemPropertiesRestoreRule.java:57)
        at org.apache.lucene.util.AbstractBeforeAfterRule$1.evaluate(AbstractBeforeAfterRule.java:45)
        at com.carrotsearch.randomizedtesting.rules.StatementAdapter.evaluate(StatementAdapter.java:36)
        at org.apache.lucene.util.TestRuleStoreClassName$1.evaluate(TestRuleStoreClassName.java:41)
        at com.carrotsearch.randomizedtesting.rules.NoShadowingOrOverridesOnMethodsRule$1.evaluate(NoShadowingOrOverridesOnMethodsRule.java:40)
        at com.carrotsearch.randomizedtesting.rules.NoShadowingOrOverridesOnMethodsRule$1.evaluate(NoShadowingOrOverridesOnMethodsRule.java:40)
        at com.carrotsearch.randomizedtesting.rules.StatementAdapter.evaluate(StatementAdapter.java:36)
        at com.carrotsearch.randomizedtesting.rules.StatementAdapter.evaluate(StatementAdapter.java:36)
        at com.carrotsearch.randomizedtesting.rules.StatementAdapter.evaluate(StatementAdapter.java:36)
        at org.apache.lucene.util.TestRuleAssertionsRequired$1.evaluate(TestRuleAssertionsRequired.java:53)
        at org.apache.lucene.util.TestRuleMarkFailure$1.evaluate(TestRuleMarkFailure.java:47)
        at org.apache.lucene.util.TestRuleIgnoreAfterMaxFailures$1.evaluate(TestRuleIgnoreAfterMaxFailures.java:64)
        at org.apache.lucene.util.TestRuleIgnoreTestSuites$1.evaluate(TestRuleIgnoreTestSuites.java:54)
        at com.carrotsearch.randomizedtesting.rules.StatementAdapter.evaluate(StatementAdapter.java:36)
        at com.carrotsearch.randomizedtesting.ThreadLeakControl$StatementRunner.run(ThreadLeakControl.java:368)
        at java.lang.Thread.run(Thread.java:748)


FAILED:  org.apache.solr.cloud.autoscaling.sim.TestTriggerIntegration.testCooldown

Error Message:


Stack Trace:
java.lang.NullPointerException
        at __randomizedtesting.SeedInfo.seed([CA17488FAA956331:FBA9256BD43F16C3]:0)
        at org.apache.solr.cloud.autoscaling.sim.TestTriggerIntegration.testCooldown(TestTriggerIntegration.java:1086)
        at sun.reflect.NativeMethodAccessorImpl.invoke0(Native Method)
        at sun.reflect.NativeMethodAccessorImpl.invoke(NativeMethodAccessorImpl.java:62)
        at sun.reflect.DelegatingMethodAccessorImpl.invoke(DelegatingMethodAccessorImpl.java:43)
        at java.lang.reflect.Method.invoke(Method.java:498)
        at com.carrotsearch.randomizedtesting.RandomizedRunner.invoke(RandomizedRunner.java:1737)
        at com.carrotsearch.randomizedtesting.RandomizedRunner$8.evaluate(RandomizedRunner.java:934)
        at com.carrotsearch.randomizedtesting.RandomizedRunner$9.evaluate(RandomizedRunner.java:970)
        at com.carrotsearch.randomizedtesting.RandomizedRunner$10.evaluate(RandomizedRunner.java:984)
        at com.carrotsearch.randomizedtesting.rules.SystemPropertiesRestoreRule$1.evaluate(SystemPropertiesRestoreRule.java:57)
        at org.apache.lucene.util.TestRuleSetupTeardownChained$1.evaluate(TestRuleSetupTeardownChained.java:49)
        at org.apache.lucene.util.AbstractBeforeAfterRule$1.evaluate(AbstractBeforeAfterRule.java:45)
        at org.apache.lucene.util.TestRuleThreadAndTestName$1.evaluate(TestRuleThreadAndTestName.java:48)
        at org.apache.lucene.util.TestRuleIgnoreAfterMaxFailures$1.evaluate(TestRuleIgnoreAfterMaxFailures.java:64)
        at org.apache.lucene.util.TestRuleMarkFailure$1.evaluate(TestRuleMarkFailure.java:47)
        at com.carrotsearch.randomizedtesting.rules.StatementAdapter.evaluate(StatementAdapter.java:36)
        at com.carrotsearch.randomizedtesting.ThreadLeakControl$StatementRunner.run(ThreadLeakControl.java:368)
        at com.carrotsearch.randomizedtesting.ThreadLeakControl.forkTimeoutingTask(ThreadLeakControl.java:817)
        at com.carrotsearch.randomizedtesting.ThreadLeakControl$3.evaluate(ThreadLeakControl.java:468)
        at com.carrotsearch.randomizedtesting.RandomizedRunner.runSingleTest(RandomizedRunner.java:943)
        at com.carrotsearch.randomizedtesting.RandomizedRunner$5.evaluate(RandomizedRunner.java:829)
        at com.carrotsearch.randomizedtesting.RandomizedRunner$6.evaluate(RandomizedRunner.java:879)
        at com.carrotsearch.randomizedtesting.RandomizedRunner$7.evaluate(RandomizedRunner.java:890)
        at com.carrotsearch.randomizedtesting.rules.StatementAdapter.evaluate(StatementAdapter.java:36)
        at com.carrotsearch.randomizedtesting.rules.SystemPropertiesRestoreRule$1.evaluate(SystemPropertiesRestoreRule.java:57)
        at org.apache.lucene.util.AbstractBeforeAfterRule$1.evaluate(AbstractBeforeAfterRule.java:45)
        at com.carrotsearch.randomizedtesting.rules.StatementAdapter.evaluate(StatementAdapter.java:36)
        at org.apache.lucene.util.TestRuleStoreClassName$1.evaluate(TestRuleStoreClassName.java:41)
        at com.carrotsearch.randomizedtesting.rules.NoShadowingOrOverridesOnMethodsRule$1.evaluate(NoShadowingOrOverridesOnMethodsRule.java:40)
        at com.carrotsearch.randomizedtesting.rules.NoShadowingOrOverridesOnMethodsRule$1.evaluate(NoShadowingOrOverridesOnMethodsRule.java:40)
        at com.carrotsearch.randomizedtesting.rules.StatementAdapter.evaluate(StatementAdapter.java:36)
        at com.carrotsearch.randomizedtesting.rules.StatementAdapter.evaluate(StatementAdapter.java:36)
        at com.carrotsearch.randomizedtesting.rules.StatementAdapter.evaluate(StatementAdapter.java:36)
        at org.apache.lucene.util.TestRuleAssertionsRequired$1.evaluate(TestRuleAssertionsRequired.java:53)
        at org.apache.lucene.util.TestRuleMarkFailure$1.evaluate(TestRuleMarkFailure.java:47)
        at org.apache.lucene.util.TestRuleIgnoreAfterMaxFailures$1.evaluate(TestRuleIgnoreAfterMaxFailures.java:64)
        at org.apache.lucene.util.TestRuleIgnoreTestSuites$1.evaluate(TestRuleIgnoreTestSuites.java:54)
        at com.carrotsearch.randomizedtesting.rules.StatementAdapter.evaluate(StatementAdapter.java:36)
        at com.carrotsearch.randomizedtesting.ThreadLeakControl$StatementRunner.run(ThreadLeakControl.java:368)
        at java.lang.Thread.run(Thread.java:748)


FAILED:  org.apache.solr.cloud.autoscaling.sim.TestTriggerIntegration.testSearchRate

Error Message:
The trigger did not fire at all

Stack Trace:
java.lang.AssertionError: The trigger did not fire at all
        at __randomizedtesting.SeedInfo.seed([CA17488FAA956331:975F56066553C57E]:0)
        at org.junit.Assert.fail(Assert.java:93)
        at org.junit.Assert.assertTrue(Assert.java:43)
        at org.apache.solr.cloud.autoscaling.sim.TestTriggerIntegration.testSearchRate(TestTriggerIntegration.java:1178)
        at sun.reflect.NativeMethodAccessorImpl.invoke0(Native Method)
        at sun.reflect.NativeMethodAccessorImpl.invoke(NativeMethodAccessorImpl.java:62)
        at sun.reflect.DelegatingMethodAccessorImpl.invoke(DelegatingMethodAccessorImpl.java:43)
        at java.lang.reflect.Method.invoke(Method.java:498)
        at com.carrotsearch.randomizedtesting.RandomizedRunner.invoke(RandomizedRunner.java:1737)
        at com.carrotsearch.randomizedtesting.RandomizedRunner$8.evaluate(RandomizedRunner.java:934)
        at com.carrotsearch.randomizedtesting.RandomizedRunner$9.evaluate(RandomizedRunner.java:970)
        at com.carrotsearch.randomizedtesting.RandomizedRunner$10.evaluate(RandomizedRunner.java:984)
        at com.carrotsearch.randomizedtesting.rules.SystemPropertiesRestoreRule$1.evaluate(SystemPropertiesRestoreRule.java:57)
        at org.apache.lucene.util.TestRuleSetupTeardownChained$1.evaluate(TestRuleSetupTeardownChained.java:49)
        at org.apache.lucene.util.AbstractBeforeAfterRule$1.evaluate(AbstractBeforeAfterRule.java:45)
        at org.apache.lucene.util.TestRuleThreadAndTestName$1.evaluate(TestRuleThreadAndTestName.java:48)
        at org.apache.lucene.util.TestRuleIgnoreAfterMaxFailures$1.evaluate(TestRuleIgnoreAfterMaxFailures.java:64)
        at org.apache.lucene.util.TestRuleMarkFailure$1.evaluate(TestRuleMarkFailure.java:47)
        at com.carrotsearch.randomizedtesting.rules.StatementAdapter.evaluate(StatementAdapter.java:36)
        at com.carrotsearch.randomizedtesting.ThreadLeakControl$StatementRunner.run(ThreadLeakControl.java:368)
        at com.carrotsearch.randomizedtesting.ThreadLeakControl.forkTimeoutingTask(ThreadLeakControl.java:817)
        at com.carrotsearch.randomizedtesting.ThreadLeakControl$3.evaluate(ThreadLeakControl.java:468)
        at com.carrotsearch.randomizedtesting.RandomizedRunner.runSingleTest(RandomizedRunner.java:943)
        at com.carrotsearch.randomizedtesting.RandomizedRunner$5.evaluate(RandomizedRunner.java:829)
        at com.carrotsearch.randomizedtesting.RandomizedRunner$6.evaluate(RandomizedRunner.java:879)
        at com.carrotsearch.randomizedtesting.RandomizedRunner$7.evaluate(RandomizedRunner.java:890)
        at com.carrotsearch.randomizedtesting.rules.StatementAdapter.evaluate(StatementAdapter.java:36)
        at com.carrotsearch.randomizedtesting.rules.SystemPropertiesRestoreRule$1.evaluate(SystemPropertiesRestoreRule.java:57)
        at org.apache.lucene.util.AbstractBeforeAfterRule$1.evaluate(AbstractBeforeAfterRule.java:45)
        at com.carrotsearch.randomizedtesting.rules.StatementAdapter.evaluate(StatementAdapter.java:36)
        at org.apache.lucene.util.TestRuleStoreClassName$1.evaluate(TestRuleStoreClassName.java:41)
        at com.carrotsearch.randomizedtesting.rules.NoShadowingOrOverridesOnMethodsRule$1.evaluate(NoShadowingOrOverridesOnMethodsRule.java:40)
        at com.carrotsearch.randomizedtesting.rules.NoShadowingOrOverridesOnMethodsRule$1.evaluate(NoShadowingOrOverridesOnMethodsRule.java:40)
        at com.carrotsearch.randomizedtesting.rules.StatementAdapter.evaluate(StatementAdapter.java:36)
        at com.carrotsearch.randomizedtesting.rules.StatementAdapter.evaluate(StatementAdapter.java:36)
        at com.carrotsearch.randomizedtesting.rules.StatementAdapter.evaluate(StatementAdapter.java:36)
        at org.apache.lucene.util.TestRuleAssertionsRequired$1.evaluate(TestRuleAssertionsRequired.java:53)
        at org.apache.lucene.util.TestRuleMarkFailure$1.evaluate(TestRuleMarkFailure.java:47)
        at org.apache.lucene.util.TestRuleIgnoreAfterMaxFailures$1.evaluate(TestRuleIgnoreAfterMaxFailures.java:64)
        at org.apache.lucene.util.TestRuleIgnoreTestSuites$1.evaluate(TestRuleIgnoreTestSuites.java:54)
        at com.carrotsearch.randomizedtesting.rules.StatementAdapter.evaluate(StatementAdapter.java:36)
        at com.carrotsearch.randomizedtesting.ThreadLeakControl$StatementRunner.run(ThreadLeakControl.java:368)
        at java.lang.Thread.run(Thread.java:748)


FAILED:  junit.framework.TestSuite.org.apache.solr.util.TestSolrCLIRunExample

Error Message:
ObjectTracker found 1 object(s) that were not released!!! [TransactionLog] org.apache.solr.common.util.ObjectReleaseTracker$ObjectTrackerException: org.apache.solr.update.TransactionLog  at org.apache.solr.common.util.ObjectReleaseTracker.track(ObjectReleaseTracker.java:42)  at org.apache.solr.update.TransactionLog.<init>(TransactionLog.java:190)  at org.apache.solr.update.UpdateLog.newTransactionLog(UpdateLog.java:448)  at org.apache.solr.update.UpdateLog.ensureLog(UpdateLog.java:1261)  at org.apache.solr.update.UpdateLog.add(UpdateLog.java:534)  at org.apache.solr.update.UpdateLog.add(UpdateLog.java:519)  at org.apache.solr.update.DirectUpdateHandler2.doNormalUpdate(DirectUpdateHandler2.java:352)  at org.apache.solr.update.DirectUpdateHandler2.addDoc0(DirectUpdateHandler2.java:271)  at org.apache.solr.update.DirectUpdateHandler2.addDoc(DirectUpdateHandler2.java:221)  at org.apache.solr.update.processor.RunUpdateProcessor.processAdd(RunUpdateProcessorFactory.java:67)  at org.apache.solr.update.processor.UpdateRequestProcessor.processAdd(UpdateRequestProcessor.java:55)  at org.apache.solr.update.processor.DistributedUpdateProcessor.doLocalAdd(DistributedUpdateProcessor.java:965)  at org.apache.solr.update.processor.DistributedUpdateProcessor.versionAdd(DistributedUpdateProcessor.java:1176)  at org.apache.solr.update.processor.DistributedUpdateProcessor.processAdd(DistributedUpdateProcessor.java:624)  at org.apache.solr.update.processor.UpdateRequestProcessor.processAdd(UpdateRequestProcessor.java:55)  at org.apache.solr.update.processor.AddSchemaFieldsUpdateProcessorFactory$AddSchemaFieldsUpdateProcessor.processAdd(AddSchemaFieldsUpdateProcessorFactory.java:475)  at org.apache.solr.update.processor.UpdateRequestProcessor.processAdd(UpdateRequestProcessor.java:55)  at org.apache.solr.update.processor.FieldMutatingUpdateProcessor.processAdd(FieldMutatingUpdateProcessor.java:118)  at org.apache.solr.update.processor.UpdateRequestProcessor.processAdd(UpdateRequestProcessor.java:55)  at org.apache.solr.update.processor.FieldMutatingUpdateProcessor.processAdd(FieldMutatingUpdateProcessor.java:118)  at org.apache.solr.update.processor.UpdateRequestProcessor.processAdd(UpdateRequestProcessor.java:55)  at org.apache.solr.update.processor.FieldMutatingUpdateProcessor.processAdd(FieldMutatingUpdateProcessor.java:118)  at org.apache.solr.update.processor.UpdateRequestProcessor.processAdd(UpdateRequestProcessor.java:55)  at org.apache.solr.update.processor.FieldMutatingUpdateProcessor.processAdd(FieldMutatingUpdateProcessor.java:118)  at org.apache.solr.update.processor.UpdateRequestProcessor.processAdd(UpdateRequestProcessor.java:55)  at org.apache.solr.update.processor.FieldNameMutatingUpdateProcessorFactory$1.processAdd(FieldNameMutatingUpdateProcessorFactory.java:75)  at org.apache.solr.update.processor.UpdateRequestProcessor.processAdd(UpdateRequestProcessor.java:55)  at org.apache.solr.update.processor.FieldMutatingUpdateProcessor.processAdd(FieldMutatingUpdateProcessor.java:118)  at org.apache.solr.update.processor.UpdateRequestProcessor.processAdd(UpdateRequestProcessor.java:55)  at org.apache.solr.update.processor.AbstractDefaultValueUpdateProcessorFactory$DefaultValueUpdateProcessor.processAdd(AbstractDefaultValueUpdateProcessorFactory.java:92)  at org.apache.solr.handler.loader.JavabinLoader$1.update(JavabinLoader.java:98)  at org.apache.solr.client.solrj.request.JavaBinUpdateRequestCodec$1.readOuterMostDocIterator(JavaBinUpdateRequestCodec.java:188)  at org.apache.solr.client.solrj.request.JavaBinUpdateRequestCodec$1.readIterator(JavaBinUpdateRequestCodec.java:144)  at org.apache.solr.common.util.JavaBinCodec.readObject(JavaBinCodec.java:311)  at org.apache.solr.common.util.JavaBinCodec.readVal(JavaBinCodec.java:256)  at org.apache.solr.client.solrj.request.JavaBinUpdateRequestCodec$1.readNamedList(JavaBinUpdateRequestCodec.java:130)  at org.apache.solr.common.util.JavaBinCodec.readObject(JavaBinCodec.java:276)  at org.apache.solr.common.util.JavaBinCodec.readVal(JavaBinCodec.java:256)  at org.apache.solr.common.util.JavaBinCodec.unmarshal(JavaBinCodec.java:178)  at org.apache.solr.client.solrj.request.JavaBinUpdateRequestCodec.unmarshal(JavaBinUpdateRequestCodec.java:195)  at org.apache.solr.handler.loader.JavabinLoader.parseAndLoadDocs(JavabinLoader.java:109)  at org.apache.solr.handler.loader.JavabinLoader.load(JavabinLoader.java:55)  at org.apache.solr.handler.UpdateRequestHandler$1.load(UpdateRequestHandler.java:97)  at org.apache.solr.handler.ContentStreamHandlerBase.handleRequestBody(ContentStreamHandlerBase.java:68)  at org.apache.solr.handler.RequestHandlerBase.handleRequest(RequestHandlerBase.java:195)  at org.apache.solr.core.SolrCore.execute(SolrCore.java:2503)  at org.apache.solr.servlet.HttpSolrCall.execute(HttpSolrCall.java:711)  at org.apache.solr.servlet.HttpSolrCall.call(HttpSolrCall.java:517)  at org.apache.solr.servlet.SolrDispatchFilter.doFilter(SolrDispatchFilter.java:380)  at org.apache.solr.servlet.SolrDispatchFilter.doFilter(SolrDispatchFilter.java:326)  at org.eclipse.jetty.servlet.ServletHandler$CachedChain.doFilter(ServletHandler.java:1637)  at org.apache.solr.client.solrj.embedded.JettySolrRunner$DebugFilter.doFilter(JettySolrRunner.java:139)  at org.eclipse.jetty.servlet.ServletHandler$CachedChain.doFilter(ServletHandler.java:1637)  at org.eclipse.jetty.servlet.ServletHandler.doHandle(ServletHandler.java:533)  at org.eclipse.jetty.server.handler.ScopedHandler.nextHandle(ScopedHandler.java:188)  at org.eclipse.jetty.server.session.SessionHandler.doHandle(SessionHandler.java:1595)  at org.eclipse.jetty.server.handler.ScopedHandler.nextHandle(ScopedHandler.java:188)  at org.eclipse.jetty.server.handler.ContextHandler.doHandle(ContextHandler.java:1253)  at org.eclipse.jetty.server.handler.ScopedHandler.nextScope(ScopedHandler.java:168)  at org.eclipse.jetty.servlet.ServletHandler.doScope(ServletHandler.java:473)  at org.eclipse.jetty.server.session.SessionHandler.doScope(SessionHandler.java:1564)  at org.eclipse.jetty.server.handler.ScopedHandler.nextScope(ScopedHandler.java:166)  at org.eclipse.jetty.server.handler.ContextHandler.doScope(ContextHandler.java:1155)  at org.eclipse.jetty.server.handler.ScopedHandler.handle(ScopedHandler.java:141)  at org.eclipse.jetty.server.handler.gzip.GzipHandler.handle(GzipHandler.java:455)  at org.eclipse.jetty.server.handler.HandlerWrapper.handle(HandlerWrapper.java:132)  at org.eclipse.jetty.server.Server.handle(Server.java:530)  at org.eclipse.jetty.server.HttpChannel.handle(HttpChannel.java:347)  at org.eclipse.jetty.server.HttpConnection.onFillable(HttpConnection.java:256)  at org.eclipse.jetty.io.AbstractConnection$ReadCallback.succeeded(AbstractConnection.java:279)  at org.eclipse.jetty.io.FillInterest.fillable(FillInterest.java:102)  at org.eclipse.jetty.io.ChannelEndPoint$2.run(ChannelEndPoint.java:124)  at org.eclipse.jetty.util.thread.strategy.EatWhatYouKill.doProduce(EatWhatYouKill.java:247)  at org.eclipse.jetty.util.thread.strategy.EatWhatYouKill.produce(EatWhatYouKill.java:140)  at org.eclipse.jetty.util.thread.strategy.EatWhatYouKill.run(EatWhatYouKill.java:131)  at org.eclipse.jetty.util.thread.ReservedThreadExecutor$ReservedThread.run(ReservedThreadExecutor.java:382)  at org.eclipse.jetty.util.thread.QueuedThreadPool.runJob(QueuedThreadPool.java:708)  at org.eclipse.jetty.util.thread.QueuedThreadPool$2.run(QueuedThreadPool.java:626)  at java.lang.Thread.run(Thread.java:748)  

Stack Trace:
java.lang.AssertionError: ObjectTracker found 1 object(s) that were not released!!! [TransactionLog]
org.apache.solr.common.util.ObjectReleaseTracker$ObjectTrackerException: org.apache.solr.update.TransactionLog
        at org.apache.solr.common.util.ObjectReleaseTracker.track(ObjectReleaseTracker.java:42)
        at org.apache.solr.update.TransactionLog.<init>(TransactionLog.java:190)
        at org.apache.solr.update.UpdateLog.newTransactionLog(UpdateLog.java:448)
        at org.apache.solr.update.UpdateLog.ensureLog(UpdateLog.java:1261)
        at org.apache.solr.update.UpdateLog.add(UpdateLog.java:534)
        at org.apache.solr.update.UpdateLog.add(UpdateLog.java:519)
        at org.apache.solr.update.DirectUpdateHandler2.doNormalUpdate(DirectUpdateHandler2.java:352)
        at org.apache.solr.update.DirectUpdateHandler2.addDoc0(DirectUpdateHandler2.java:271)
        at org.apache.solr.update.DirectUpdateHandler2.addDoc(DirectUpdateHandler2.java:221)
        at org.apache.solr.update.processor.RunUpdateProcessor.processAdd(RunUpdateProcessorFactory.java:67)
        at org.apache.solr.update.processor.UpdateRequestProcessor.processAdd(UpdateRequestProcessor.java:55)
        at org.apache.solr.update.processor.DistributedUpdateProcessor.doLocalAdd(DistributedUpdateProcessor.java:965)
        at org.apache.solr.update.processor.DistributedUpdateProcessor.versionAdd(DistributedUpdateProcessor.java:1176)
        at org.apache.solr.update.processor.DistributedUpdateProcessor.processAdd(DistributedUpdateProcessor.java:624)
        at org.apache.solr.update.processor.UpdateRequestProcessor.processAdd(UpdateRequestProcessor.java:55)
        at org.apache.solr.update.processor.AddSchemaFieldsUpdateProcessorFactory$AddSchemaFieldsUpdateProcessor.processAdd(AddSchemaFieldsUpdateProcessorFactory.java:475)
        at org.apache.solr.update.processor.UpdateRequestProcessor.processAdd(UpdateRequestProcessor.java:55)
        at org.apache.solr.update.processor.FieldMutatingUpdateProcessor.processAdd(FieldMutatingUpdateProcessor.java:118)
        at org.apache.solr.update.processor.UpdateRequestProcessor.processAdd(UpdateRequestProcessor.java:55)
        at org.apache.solr.update.processor.FieldMutatingUpdateProcessor.processAdd(FieldMutatingUpdateProcessor.java:118)
        at org.apache.solr.update.processor.UpdateRequestProcessor.processAdd(UpdateRequestProcessor.java:55)
        at org.apache.solr.update.processor.FieldMutatingUpdateProcessor.processAdd(FieldMutatingUpdateProcessor.java:118)
        at org.apache.solr.update.processor.UpdateRequestProcessor.processAdd(UpdateRequestProcessor.java:55)
        at org.apache.solr.update.processor.FieldMutatingUpdateProcessor.processAdd(FieldMutatingUpdateProcessor.java:118)
        at org.apache.solr.update.processor.UpdateRequestProcessor.processAdd(UpdateRequestProcessor.java:55)
        at org.apache.solr.update.processor.FieldNameMutatingUpdateProcessorFactory$1.processAdd(FieldNameMutatingUpdateProcessorFactory.java:75)
        at org.apache.solr.update.processor.UpdateRequestProcessor.processAdd(UpdateRequestProcessor.java:55)
        at org.apache.solr.update.processor.FieldMutatingUpdateProcessor.processAdd(FieldMutatingUpdateProcessor.java:118)
        at org.apache.solr.update.processor.UpdateRequestProcessor.processAdd(UpdateRequestProcessor.java:55)
        at org.apache.solr.update.processor.AbstractDefaultValueUpdateProcessorFactory$DefaultValueUpdateProcessor.processAdd(AbstractDefaultValueUpdateProcessorFactory.java:92)
        at org.apache.solr.handler.loader.JavabinLoader$1.update(JavabinLoader.java:98)
        at org.apache.solr.client.solrj.request.JavaBinUpdateRequestCodec$1.readOuterMostDocIterator(JavaBinUpdateRequestCodec.java:188)
        at org.apache.solr.client.solrj.request.JavaBinUpdateRequestCodec$1.readIterator(JavaBinUpdateRequestCodec.java:144)
        at org.apache.solr.common.util.JavaBinCodec.readObject(JavaBinCodec.java:311)
        at org.apache.solr.common.util.JavaBinCodec.readVal(JavaBinCodec.java:256)
        at org.apache.solr.client.solrj.request.JavaBinUpdateRequestCodec$1.readNamedList(JavaBinUpdateRequestCodec.java:130)
        at org.apache.solr.common.util.JavaBinCodec.readObject(JavaBinCodec.java:276)
        at org.apache.solr.common.util.JavaBinCodec.readVal(JavaBinCodec.java:256)
        at org.apache.solr.common.util.JavaBinCodec.unmarshal(JavaBinCodec.java:178)
        at org.apache.solr.client.solrj.request.JavaBinUpdateRequestCodec.unmarshal(JavaBinUpdateRequestCodec.java:195)
        at org.apache.solr.handler.loader.JavabinLoader.parseAndLoadDocs(JavabinLoader.java:109)
        at org.apache.solr.handler.loader.JavabinLoader.load(JavabinLoader.java:55)
        at org.apache.solr.handler.UpdateRequestHandler$1.load(UpdateRequestHandler.java:97)
        at org.apache.solr.handler.ContentStreamHandlerBase.handleRequestBody(ContentStreamHandlerBase.java:68)
        at org.apache.solr.handler.RequestHandlerBase.handleRequest(RequestHandlerBase.java:195)
        at org.apache.solr.core.SolrCore.execute(SolrCore.java:2503)
        at org.apache.solr.servlet.HttpSolrCall.execute(HttpSolrCall.java:711)
        at org.apache.solr.servlet.HttpSolrCall.call(HttpSolrCall.java:517)
        at org.apache.solr.servlet.SolrDispatchFilter.doFilter(SolrDispatchFilter.java:380)
        at org.apache.solr.servlet.SolrDispatchFilter.doFilter(SolrDispatchFilter.java:326)
        at org.eclipse.jetty.servlet.ServletHandler$CachedChain.doFilter(ServletHandler.java:1637)
        at org.apache.solr.client.solrj.embedded.JettySolrRunner$DebugFilter.doFilter(JettySolrRunner.java:139)
        at org.eclipse.jetty.servlet.ServletHandler$CachedChain.doFilter(ServletHandler.java:1637)
        at org.eclipse.jetty.servlet.ServletHandler.doHandle(ServletHandler.java:533)
        at org.eclipse.jetty.server.handler.ScopedHandler.nextHandle(ScopedHandler.java:188)
        at org.eclipse.jetty.server.session.SessionHandler.doHandle(SessionHandler.java:1595)
        at org.eclipse.jetty.server.handler.ScopedHandler.nextHandle(ScopedHandler.java:188)
        at org.eclipse.jetty.server.handler.ContextHandler.doHandle(ContextHandler.java:1253)
        at org.eclipse.jetty.server.handler.ScopedHandler.nextScope(ScopedHandler.java:168)
        at org.eclipse.jetty.servlet.ServletHandler.doScope(ServletHandler.java:473)
        at org.eclipse.jetty.server.session.SessionHandler.doScope(SessionHandler.java:1564)
        at org.eclipse.jetty.server.handler.ScopedHandler.nextScope(ScopedHandler.java:166)
        at org.eclipse.jetty.server.handler.ContextHandler.doScope(ContextHandler.java:1155)
        at org.eclipse.jetty.server.handler.ScopedHandler.handle(ScopedHandler.java:141)
        at org.eclipse.jetty.server.handler.gzip.GzipHandler.handle(GzipHandler.java:455)
        at org.eclipse.jetty.server.handler.HandlerWrapper.handle(HandlerWrapper.java:132)
        at org.eclipse.jetty.server.Server.handle(Server.java:530)
        at org.eclipse.jetty.server.HttpChannel.handle(HttpChannel.java:347)
        at org.eclipse.jetty.server.HttpConnection.onFillable(HttpConnection.java:256)
        at org.eclipse.jetty.io.AbstractConnection$ReadCallback.succeeded(AbstractConnection.java:279)
        at org.eclipse.jetty.io.FillInterest.fillable(FillInterest.java:102)
        at org.eclipse.jetty.io.ChannelEndPoint$2.run(ChannelEndPoint.java:124)
        at org.eclipse.jetty.util.thread.strategy.EatWhatYouKill.doProduce(EatWhatYouKill.java:247)
        at org.eclipse.jetty.util.thread.strategy.EatWhatYouKill.produce(EatWhatYouKill.java:140)
        at org.eclipse.jetty.util.thread.strategy.EatWhatYouKill.run(EatWhatYouKill.java:131)
        at org.eclipse.jetty.util.thread.ReservedThreadExecutor$ReservedThread.run(ReservedThreadExecutor.java:382)
        at org.eclipse.jetty.util.thread.QueuedThreadPool.runJob(QueuedThreadPool.java:708)
        at org.eclipse.jetty.util.thread.QueuedThreadPool$2.run(QueuedThreadPool.java:626)
        at java.lang.Thread.run(Thread.java:748)


        at __randomizedtesting.SeedInfo.seed([CA17488FAA956331]:0)
        at org.junit.Assert.fail(Assert.java:93)
        at org.junit.Assert.assertTrue(Assert.java:43)
        at org.junit.Assert.assertNull(Assert.java:551)
        at org.apache.solr.SolrTestCaseJ4.teardownTestCases(SolrTestCaseJ4.java:295)
        at sun.reflect.NativeMethodAccessorImpl.invoke0(Native Method)
        at sun.reflect.NativeMethodAccessorImpl.invoke(NativeMethodAccessorImpl.java:62)
        at sun.reflect.DelegatingMethodAccessorImpl.invoke(DelegatingMethodAccessorImpl.java:43)
        at java.lang.reflect.Method.invoke(Method.java:498)
        at com.carrotsearch.randomizedtesting.RandomizedRunner.invoke(RandomizedRunner.java:1737)
        at com.carrotsearch.randomizedtesting.RandomizedRunner$7.evaluate(RandomizedRunner.java:897)
        at com.carrotsearch.randomizedtesting.rules.StatementAdapter.evaluate(StatementAdapter.java:36)
        at com.carrotsearch.randomizedtesting.rules.SystemPropertiesRestoreRule$1.evaluate(SystemPropertiesRestoreRule.java:57)
        at org.apache.lucene.util.AbstractBeforeAfterRule$1.evaluate(AbstractBeforeAfterRule.java:45)
        at com.carrotsearch.randomizedtesting.rules.StatementAdapter.evaluate(StatementAdapter.java:36)
        at org.apache.lucene.util.TestRuleStoreClassName$1.evaluate(TestRuleStoreClassName.java:41)
        at com.carrotsearch.randomizedtesting.rules.NoShadowingOrOverridesOnMethodsRule$1.evaluate(NoShadowingOrOverridesOnMethodsRule.java:40)
        at com.carrotsearch.randomizedtesting.rules.NoShadowingOrOverridesOnMethodsRule$1.evaluate(NoShadowingOrOverridesOnMethodsRule.java:40)
        at com.carrotsearch.randomizedtesting.rules.StatementAdapter.evaluate(StatementAdapter.java:36)
        at com.carrotsearch.randomizedtesting.rules.StatementAdapter.evaluate(StatementAdapter.java:36)
        at com.carrotsearch.randomizedtesting.rules.StatementAdapter.evaluate(StatementAdapter.java:36)
        at org.apache.lucene.util.TestRuleAssertionsRequired$1.evaluate(TestRuleAssertionsRequired.java:53)
        at org.apache.lucene.util.TestRuleMarkFailure$1.evaluate(TestRuleMarkFailure.java:47)
        at org.apache.lucene.util.TestRuleIgnoreAfterMaxFailures$1.evaluate(TestRuleIgnoreAfterMaxFailures.java:64)
        at org.apache.lucene.util.TestRuleIgnoreTestSuites$1.evaluate(TestRuleIgnoreTestSuites.java:54)
        at com.carrotsearch.randomizedtesting.rules.StatementAdapter.evaluate(StatementAdapter.java:36)
        at com.carrotsearch.randomizedtesting.ThreadLeakControl$StatementRunner.run(ThreadLeakControl.java:368)
        at java.lang.Thread.run(Thread.java:748)


FAILED:  org.apache.solr.cloud.autoscaling.TriggerIntegrationTest.testMetricTrigger

Error Message:


Stack Trace:
java.lang.NullPointerException
        at __randomizedtesting.SeedInfo.seed([CA17488FAA956331:701B7F00F57DB57E]:0)
        at org.apache.solr.cloud.autoscaling.TriggerIntegrationTest.testMetricTrigger(TriggerIntegrationTest.java:1565)
        at sun.reflect.NativeMethodAccessorImpl.invoke0(Native Method)
        at sun.reflect.NativeMethodAccessorImpl.invoke(NativeMethodAccessorImpl.java:62)
        at sun.reflect.DelegatingMethodAccessorImpl.invoke(DelegatingMethodAccessorImpl.java:43)
        at java.lang.reflect.Method.invoke(Method.java:498)
        at com.carrotsearch.randomizedtesting.RandomizedRunner.invoke(RandomizedRunner.java:1737)
        at com.carrotsearch.randomizedtesting.RandomizedRunner$8.evaluate(RandomizedRunner.java:934)
        at com.carrotsearch.randomizedtesting.RandomizedRunner$9.evaluate(RandomizedRunner.java:970)
        at com.carrotsearch.randomizedtesting.RandomizedRunner$10.evaluate(RandomizedRunner.java:984)
        at com.carrotsearch.randomizedtesting.rules.SystemPropertiesRestoreRule$1.evaluate(SystemPropertiesRestoreRule.java:57)
        at org.apache.lucene.util.TestRuleSetupTeardownChained$1.evaluate(TestRuleSetupTeardownChained.java:49)
        at org.apache.lucene.util.AbstractBeforeAfterRule$1.evaluate(AbstractBeforeAfterRule.java:45)
        at org.apache.lucene.util.TestRuleThreadAndTestName$1.evaluate(TestRuleThreadAndTestName.java:48)
        at org.apache.lucene.util.TestRuleIgnoreAfterMaxFailures$1.evaluate(TestRuleIgnoreAfterMaxFailures.java:64)
        at org.apache.lucene.util.TestRuleMarkFailure$1.evaluate(TestRuleMarkFailure.java:47)
        at com.carrotsearch.randomizedtesting.rules.StatementAdapter.evaluate(StatementAdapter.java:36)
        at com.carrotsearch.randomizedtesting.ThreadLeakControl$StatementRunner.run(ThreadLeakControl.java:368)
        at com.carrotsearch.randomizedtesting.ThreadLeakControl.forkTimeoutingTask(ThreadLeakControl.java:817)
        at com.carrotsearch.randomizedtesting.ThreadLeakControl$3.evaluate(ThreadLeakControl.java:468)
        at com.carrotsearch.randomizedtesting.RandomizedRunner.runSingleTest(RandomizedRunner.java:943)
        at com.carrotsearch.randomizedtesting.RandomizedRunner$5.evaluate(RandomizedRunner.java:829)
        at com.carrotsearch.randomizedtesting.RandomizedRunner$6.evaluate(RandomizedRunner.java:879)
        at com.carrotsearch.randomizedtesting.RandomizedRunner$7.evaluate(RandomizedRunner.java:890)
        at com.carrotsearch.randomizedtesting.rules.StatementAdapter.evaluate(StatementAdapter.java:36)
        at com.carrotsearch.randomizedtesting.rules.SystemPropertiesRestoreRule$1.evaluate(SystemPropertiesRestoreRule.java:57)
        at org.apache.lucene.util.AbstractBeforeAfterRule$1.evaluate(AbstractBeforeAfterRule.java:45)
        at com.carrotsearch.randomizedtesting.rules.StatementAdapter.evaluate(StatementAdapter.java:36)
        at org.apache.lucene.util.TestRuleStoreClassName$1.evaluate(TestRuleStoreClassName.java:41)
        at com.carrotsearch.randomizedtesting.rules.NoShadowingOrOverridesOnMethodsRule$1.evaluate(NoShadowingOrOverridesOnMethodsRule.java:40)
        at com.carrotsearch.randomizedtesting.rules.NoShadowingOrOverridesOnMethodsRule$1.evaluate(NoShadowingOrOverridesOnMethodsRule.java:40)
        at com.carrotsearch.randomizedtesting.rules.StatementAdapter.evaluate(StatementAdapter.java:36)
        at com.carrotsearch.randomizedtesting.rules.StatementAdapter.evaluate(StatementAdapter.java:36)
        at com.carrotsearch.randomizedtesting.rules.StatementAdapter.evaluate(StatementAdapter.java:36)
        at org.apache.lucene.util.TestRuleAssertionsRequired$1.evaluate(TestRuleAssertionsRequired.java:53)
        at org.apache.lucene.util.TestRuleMarkFailure$1.evaluate(TestRuleMarkFailure.java:47)
        at org.apache.lucene.util.TestRuleIgnoreAfterMaxFailures$1.evaluate(TestRuleIgnoreAfterMaxFailures.java:64)
        at org.apache.lucene.util.TestRuleIgnoreTestSuites$1.evaluate(TestRuleIgnoreTestSuites.java:54)
        at com.carrotsearch.randomizedtesting.rules.StatementAdapter.evaluate(StatementAdapter.java:36)
        at com.carrotsearch.randomizedtesting.ThreadLeakControl$StatementRunner.run(ThreadLeakControl.java:368)
        at java.lang.Thread.run(Thread.java:748)


FAILED:  org.apache.solr.cloud.ReplaceNodeNoTargetTest.test

Error Message:


Stack Trace:
java.lang.AssertionError
        at __randomizedtesting.SeedInfo.seed([CA17488FAA956331:4243775504690EC9]:0)
        at org.junit.Assert.fail(Assert.java:92)
        at org.junit.Assert.assertTrue(Assert.java:43)
        at org.junit.Assert.assertTrue(Assert.java:54)
        at org.apache.solr.cloud.ReplaceNodeNoTargetTest.test(ReplaceNodeNoTargetTest.java:92)
        at sun.reflect.NativeMethodAccessorImpl.invoke0(Native Method)
        at sun.reflect.NativeMethodAccessorImpl.invoke(NativeMethodAccessorImpl.java:62)
        at sun.reflect.DelegatingMethodAccessorImpl.invoke(DelegatingMethodAccessorImpl.java:43)
        at java.lang.reflect.Method.invoke(Method.java:498)
        at com.carrotsearch.randomizedtesting.RandomizedRunner.invoke(RandomizedRunner.java:1737)
        at com.carrotsearch.randomizedtesting.RandomizedRunner$8.evaluate(RandomizedRunner.java:934)
        at com.carrotsearch.randomizedtesting.RandomizedRunner$9.evaluate(RandomizedRunner.java:970)
        at com.carrotsearch.randomizedtesting.RandomizedRunner$10.evaluate(RandomizedRunner.java:984)
        at com.carrotsearch.randomizedtesting.rules.SystemPropertiesRestoreRule$1.evaluate(SystemPropertiesRestoreRule.java:57)
        at org.apache.lucene.util.TestRuleSetupTeardownChained$1.evaluate(TestRuleSetupTeardownChained.java:49)
        at org.apache.lucene.util.AbstractBeforeAfterRule$1.evaluate(AbstractBeforeAfterRule.java:45)
        at org.apache.lucene.util.TestRuleThreadAndTestName$1.evaluate(TestRuleThreadAndTestName.java:48)
        at org.apache.lucene.util.TestRuleIgnoreAfterMaxFailures$1.evaluate(TestRuleIgnoreAfterMaxFailures.java:64)
        at org.apache.lucene.util.TestRuleMarkFailure$1.evaluate(TestRuleMarkFailure.java:47)
        at com.carrotsearch.randomizedtesting.rules.StatementAdapter.evaluate(StatementAdapter.java:36)
        at com.carrotsearch.randomizedtesting.ThreadLeakControl$StatementRunner.run(ThreadLeakControl.java:368)
        at com.carrotsearch.randomizedtesting.ThreadLeakControl.forkTimeoutingTask(ThreadLeakControl.java:817)
        at com.carrotsearch.randomizedtesting.ThreadLeakControl$3.evaluate(ThreadLeakControl.java:468)
        at com.carrotsearch.randomizedtesting.RandomizedRunner.runSingleTest(RandomizedRunner.java:943)
        at com.carrotsearch.randomizedtesting.RandomizedRunner$5.evaluate(RandomizedRunner.java:829)
        at com.carrotsearch.randomizedtesting.RandomizedRunner$6.evaluate(RandomizedRunner.java:879)
        at com.carrotsearch.randomizedtesting.RandomizedRunner$7.evaluate(RandomizedRunner.java:890)
        at com.carrotsearch.randomizedtesting.rules.StatementAdapter.evaluate(StatementAdapter.java:36)
        at com.carrotsearch.randomizedtesting.rules.SystemPropertiesRestoreRule$1.evaluate(SystemPropertiesRestoreRule.java:57)
        at org.apache.lucene.util.AbstractBeforeAfterRule$1.evaluate(AbstractBeforeAfterRule.java:45)
        at com.carrotsearch.randomizedtesting.rules.StatementAdapter.evaluate(StatementAdapter.java:36)
        at org.apache.lucene.util.TestRuleStoreClassName$1.evaluate(TestRuleStoreClassName.java:41)
        at com.carrotsearch.randomizedtesting.rules.NoShadowingOrOverridesOnMethodsRule$1.evaluate(NoShadowingOrOverridesOnMethodsRule.java:40)
        at com.carrotsearch.randomizedtesting.rules.NoShadowingOrOverridesOnMethodsRule$1.evaluate(NoShadowingOrOverridesOnMethodsRule.java:40)
        at com.carrotsearch.randomizedtesting.rules.StatementAdapter.evaluate(StatementAdapter.java:36)
        at com.carrotsearch.randomizedtesting.rules.StatementAdapter.evaluate(StatementAdapter.java:36)
        at com.carrotsearch.randomizedtesting.rules.StatementAdapter.evaluate(StatementAdapter.java:36)
        at org.apache.lucene.util.TestRuleAssertionsRequired$1.evaluate(TestRuleAssertionsRequired.java:53)
        at org.apache.lucene.util.TestRuleMarkFailure$1.evaluate(TestRuleMarkFailure.java:47)
        at org.apache.lucene.util.TestRuleIgnoreAfterMaxFailures$1.evaluate(TestRuleIgnoreAfterMaxFailures.java:64)
        at org.apache.lucene.util.TestRuleIgnoreTestSuites$1.evaluate(TestRuleIgnoreTestSuites.java:54)
        at com.carrotsearch.randomizedtesting.rules.StatementAdapter.evaluate(StatementAdapter.java:36)
        at com.carrotsearch.randomizedtesting.ThreadLeakControl$StatementRunner.run(ThreadLeakControl.java:368)
        at java.lang.Thread.run(Thread.java:748)




Build Log:
[...truncated 13524 lines...]
   [junit4] Suite: org.apache.solr.cloud.api.collections.HdfsCollectionsAPIDistributedZkTest
   [junit4]   2> 1375210 INFO  (SUITE-HdfsCollectionsAPIDistributedZkTest-seed#[CA17488FAA956331]-worker) [    ] o.a.s.SolrTestCaseJ4 SecureRandom sanity checks: test.solr.allowed.securerandom=null & java.security.egd=file:/dev/./urandom
   [junit4]   2> Creating dataDir: /home/jenkins/jenkins-slave/workspace/Lucene-Solr-NightlyTests-master/checkout/solr/build/solr-core/test/J1/temp/solr.cloud.api.collections.HdfsCollectionsAPIDistributedZkTest_CA17488FAA956331-001/init-core-data-001
   [junit4]   2> 1375213 WARN  (SUITE-HdfsCollectionsAPIDistributedZkTest-seed#[CA17488FAA956331]-worker) [    ] o.a.s.SolrTestCaseJ4 startTrackingSearchers: numOpens=11 numCloses=11
   [junit4]   2> 1375213 INFO  (SUITE-HdfsCollectionsAPIDistributedZkTest-seed#[CA17488FAA956331]-worker) [    ] o.a.s.SolrTestCaseJ4 Using PointFields (NUMERIC_POINTS_SYSPROP=true) w/NUMERIC_DOCVALUES_SYSPROP=true
   [junit4]   2> 1375214 INFO  (SUITE-HdfsCollectionsAPIDistributedZkTest-seed#[CA17488FAA956331]-worker) [    ] o.a.s.SolrTestCaseJ4 Randomized ssl (true) and clientAuth (true) via: @org.apache.solr.util.RandomizeSSL(reason=, ssl=NaN, value=NaN, clientAuth=NaN)
   [junit4]   2> 1375216 INFO  (SUITE-HdfsCollectionsAPIDistributedZkTest-seed#[CA17488FAA956331]-worker) [    ] o.a.s.c.MiniSolrCloudCluster Starting cluster of 4 servers in /home/jenkins/jenkins-slave/workspace/Lucene-Solr-NightlyTests-master/checkout/solr/build/solr-core/test/J1/temp/solr.cloud.api.collections.HdfsCollectionsAPIDistributedZkTest_CA17488FAA956331-001/tempDir-001
   [junit4]   2> 1375224 INFO  (SUITE-HdfsCollectionsAPIDistributedZkTest-seed#[CA17488FAA956331]-worker) [    ] o.a.s.c.ZkTestServer STARTING ZK TEST SERVER
   [junit4]   2> 1375225 INFO  (Thread-1041) [    ] o.a.s.c.ZkTestServer client port:0.0.0.0/0.0.0.0:0
   [junit4]   2> 1375225 INFO  (Thread-1041) [    ] o.a.s.c.ZkTestServer Starting server
   [junit4]   2> 1375227 ERROR (Thread-1041) [    ] o.a.z.s.ZooKeeperServer ZKShutdownHandler is not registered, so ZooKeeper server won't take any action on ERROR or SHUTDOWN server state changes
   [junit4]   2> 1375325 INFO  (SUITE-HdfsCollectionsAPIDistributedZkTest-seed#[CA17488FAA956331]-worker) [    ] o.a.s.c.ZkTestServer start zk server on port:43626
   [junit4]   2> 1375327 INFO  (zkConnectionManagerCallback-486-thread-1) [    ] o.a.s.c.c.ConnectionManager zkClient has connected
   [junit4]   2> 1375333 INFO  (jetty-launcher-483-thread-2) [    ] o.e.j.s.Server jetty-9.4.8.v20171121, build timestamp: 2017-11-21T13:27:37-08:00, git hash: 82b8fb23f757335bb3329d540ce37a2a2615f0a8
   [junit4]   2> 1375333 INFO  (jetty-launcher-483-thread-1) [    ] o.e.j.s.Server jetty-9.4.8.v20171121, build timestamp: 2017-11-21T13:27:37-08:00, git hash: 82b8fb23f757335bb3329d540ce37a2a2615f0a8
   [junit4]   2> 1375335 INFO  (jetty-launcher-483-thread-3) [    ] o.e.j.s.Server jetty-9.4.8.v20171121, build timestamp: 2017-11-21T13:27:37-08:00, git hash: 82b8fb23f757335bb3329d540ce37a2a2615f0a8
   [junit4]   2> 1375376 INFO  (jetty-launcher-483-thread-4) [    ] o.e.j.s.Server jetty-9.4.8.v20171121, build timestamp: 2017-11-21T13:27:37-08:00, git hash: 82b8fb23f757335bb3329d540ce37a2a2615f0a8
   [junit4]   2> 1375377 INFO  (jetty-launcher-483-thread-1) [    ] o.e.j.s.session DefaultSessionIdManager workerName=node0
   [junit4]   2> 1375377 INFO  (jetty-launcher-483-thread-1) [    ] o.e.j.s.session No SessionScavenger set, using defaults
   [junit4]   2> 1375377 INFO  (jetty-launcher-483-thread-1) [    ] o.e.j.s.session Scavenging every 660000ms
   [junit4]   2> 1375378 INFO  (jetty-launcher-483-thread-1) [    ] o.e.j.s.h.ContextHandler Started o.e.j.s.ServletContextHandler@7ca3e6ab{/solr,null,AVAILABLE}
   [junit4]   2> 1375380 INFO  (jetty-launcher-483-thread-3) [    ] o.e.j.s.session DefaultSessionIdManager workerName=node0
   [junit4]   2> 1375380 INFO  (jetty-launcher-483-thread-3) [    ] o.e.j.s.session No SessionScavenger set, using defaults
   [junit4]   2> 1375380 INFO  (jetty-launcher-483-thread-3) [    ] o.e.j.s.session Scavenging every 600000ms
   [junit4]   2> 1375380 INFO  (jetty-launcher-483-thread-3) [    ] o.e.j.s.h.ContextHandler Started o.e.j.s.ServletContextHandler@3174dbf6{/solr,null,AVAILABLE}
   [junit4]   2> 1375381 INFO  (jetty-launcher-483-thread-3) [    ] o.e.j.s.AbstractConnector Started ServerConnector@75850cba{SSL,[ssl, http/1.1]}{127.0.0.1:41251}
   [junit4]   2> 1375381 INFO  (jetty-launcher-483-thread-3) [    ] o.e.j.s.Server Started @1380476ms
   [junit4]   2> 1375381 INFO  (jetty-launcher-483-thread-3) [    ] o.a.s.c.s.e.JettySolrRunner Jetty properties: {hostContext=/solr, hostPort=41251}
   [junit4]   2> 1375382 ERROR (jetty-launcher-483-thread-3) [    ] o.a.s.u.StartupLoggingUtils Missing Java Option solr.log.dir. Logging may be missing or incomplete.
   [junit4]   2> 1375382 INFO  (jetty-launcher-483-thread-3) [    ] o.a.s.s.SolrDispatchFilter  ___      _       Welcome to Apache Solr? version 8.0.0
   [junit4]   2> 1375382 INFO  (jetty-launcher-483-thread-3) [    ] o.a.s.s.SolrDispatchFilter / __| ___| |_ _   Starting in cloud mode on port null
   [junit4]   2> 1375382 INFO  (jetty-launcher-483-thread-3) [    ] o.a.s.s.SolrDispatchFilter \__ \/ _ \ | '_|  Install dir: null
   [junit4]   2> 1375382 INFO  (jetty-launcher-483-thread-3) [    ] o.a.s.s.SolrDispatchFilter |___/\___/_|_|    Start time: 2018-02-13T13:43:29.403Z
   [junit4]   2> 1375436 INFO  (jetty-launcher-483-thread-1) [    ] o.e.j.s.AbstractConnector Started ServerConnector@1c4edcb7{SSL,[ssl, http/1.1]}{127.0.0.1:46396}
   [junit4]   2> 1375436 INFO  (jetty-launcher-483-thread-1) [    ] o.e.j.s.Server Started @1380531ms
   [junit4]   2> 1375436 INFO  (jetty-launcher-483-thread-1) [    ] o.a.s.c.s.e.JettySolrRunner Jetty properties: {hostContext=/solr, hostPort=46396}
   [junit4]   2> 1375436 ERROR (jetty-launcher-483-thread-1) [    ] o.a.s.u.StartupLoggingUtils Missing Java Option solr.log.dir. Logging may be missing or incomplete.
   [junit4]   2> 1375437 INFO  (jetty-launcher-483-thread-1) [    ] o.a.s.s.SolrDispatchFilter  ___      _       Welcome to Apache Solr? version 8.0.0
   [junit4]   2> 1375437 INFO  (jetty-launcher-483-thread-1) [    ] o.a.s.s.SolrDispatchFilter / __| ___| |_ _   Starting in cloud mode on port null
   [junit4]   2> 1375437 INFO  (jetty-launcher-483-thread-1) [    ] o.a.s.s.SolrDispatchFilter \__ \/ _ \ | '_|  Install dir: null
   [junit4]   2> 1375437 INFO  (jetty-launcher-483-thread-1) [    ] o.a.s.s.SolrDispatchFilter |___/\___/_|_|    Start time: 2018-02-13T13:43:29.458Z
   [junit4]   2> 1375437 INFO  (jetty-launcher-483-thread-2) [    ] o.e.j.s.session DefaultSessionIdManager workerName=node0
   [junit4]   2> 1375437 INFO  (jetty-launcher-483-thread-2) [    ] o.e.j.s.session No SessionScavenger set, using defaults
   [junit4]   2> 1375437 INFO  (jetty-launcher-483-thread-2) [    ] o.e.j.s.session Scavenging every 660000ms
   [junit4]   2> 1375439 INFO  (zkConnectionManagerCallback-490-thread-1) [    ] o.a.s.c.c.ConnectionManager zkClient has connected
   [junit4]   2> 1375448 INFO  (jetty-launcher-483-thread-1) [    ] o.a.s.s.SolrDispatchFilter solr.xml found in ZooKeeper. Loading...
   [junit4]   2> 1375452 INFO  (jetty-launcher-483-thread-1) [    ] o.a.s.c.SolrXmlConfig Configuration parameter autoReplicaFailoverWorkLoopDelay is ignored
   [junit4]   2> 1375480 INFO  (jetty-launcher-483-thread-1) [    ] o.a.s.c.SolrXmlConfig Configuration parameter autoReplicaFailoverBadNodeExpiration is ignored
   [junit4]   2> 1375465 INFO  (zkConnectionManagerCallback-488-thread-1) [    ] o.a.s.c.c.ConnectionManager zkClient has connected
   [junit4]   2> 1375465 INFO  (jetty-launcher-483-thread-4) [    ] o.e.j.s.session DefaultSessionIdManager workerName=node0
   [junit4]   2> 1375480 INFO  (jetty-launcher-483-thread-4) [    ] o.e.j.s.session No SessionScavenger set, using defaults
   [junit4]   2> 1375480 INFO  (jetty-launcher-483-thread-2) [    ] o.e.j.s.h.ContextHandler Started o.e.j.s.ServletContextHandler@6ff1d8bb{/solr,null,AVAILABLE}
   [junit4]   2> 1375480 INFO  (jetty-launcher-483-thread-4) [    ] o.e.j.s.session Scavenging every 600000ms
   [junit4]   2> 1375486 INFO  (jetty-launcher-483-thread-3) [    ] o.a.s.s.SolrDispatchFilter solr.xml found in ZooKeeper. Loading...
   [junit4]   2> 1375486 INFO  (jetty-launcher-483-thread-4) [    ] o.e.j.s.h.ContextHandler Started o.e.j.s.ServletContextHandler@51783b73{/solr,null,AVAILABLE}
   [junit4]   2> 1375486 INFO  (jetty-launcher-483-thread-2) [    ] o.e.j.s.AbstractConnector Started ServerConnector@1c3e076c{SSL,[ssl, http/1.1]}{127.0.0.1:45071}
   [junit4]   2> 1375486 INFO  (jetty-launcher-483-thread-2) [    ] o.e.j.s.Server Started @1380581ms
   [junit4]   2> 1375486 INFO  (jetty-launcher-483-thread-2) [    ] o.a.s.c.s.e.JettySolrRunner Jetty properties: {hostContext=/solr, hostPort=45071}
   [junit4]   2> 1375487 INFO  (jetty-launcher-483-thread-4) [    ] o.e.j.s.AbstractConnector Started ServerConnector@1f29da0f{SSL,[ssl, http/1.1]}{127.0.0.1:32773}
   [junit4]   2> 1375487 ERROR (jetty-launcher-483-thread-2) [    ] o.a.s.u.StartupLoggingUtils Missing Java Option solr.log.dir. Logging may be missing or incomplete.
   [junit4]   2> 1375487 INFO  (jetty-launcher-483-thread-4) [    ] o.e.j.s.Server Started @1380582ms
   [junit4]   2> 1375487 INFO  (jetty-launcher-483-thread-4) [    ] o.a.s.c.s.e.JettySolrRunner Jetty properties: {hostContext=/solr, hostPort=32773}
   [junit4]   2> 1375487 INFO  (jetty-launcher-483-thread-2) [    ] o.a.s.s.SolrDispatchFilter  ___      _       Welcome to Apache Solr? version 8.0.0
   [junit4]   2> 1375487 INFO  (jetty-launcher-483-thread-2) [    ] o.a.s.s.SolrDispatchFilter / __| ___| |_ _   Starting in cloud mode on port null
   [junit4]   2> 1375487 INFO  (jetty-launcher-483-thread-2) [    ] o.a.s.s.SolrDispatchFilter \__ \/ _ \ | '_|  Install dir: null
   [junit4]   2> 1375487 INFO  (jetty-launcher-483-thread-2) [    ] o.a.s.s.SolrDispatchFilter |___/\___/_|_|    Start time: 2018-02-13T13:43:29.508Z
   [junit4]   2> 1375487 ERROR (jetty-launcher-483-thread-4) [    ] o.a.s.u.StartupLoggingUtils Missing Java Option solr.log.dir. Logging may be missing or incomplete.
   [junit4]   2> 1375487 INFO  (jetty-launcher-483-thread-4) [    ] o.a.s.s.SolrDispatchFilter  ___      _       Welcome to Apache Solr? version 8.0.0
   [junit4]   2> 1375487 INFO  (jetty-launcher-483-thread-4) [    ] o.a.s.s.SolrDispatchFilter / __| ___| |_ _   Starting in cloud mode on port null
   [junit4]   2> 1375487 INFO  (jetty-launcher-483-thread-4) [    ] o.a.s.s.SolrDispatchFilter \__ \/ _ \ | '_|  Install dir: null
   [junit4]   2> 1375487 INFO  (jetty-launcher-483-thread-4) [    ] o.a.s.s.SolrDispatchFilter |___/\___/_|_|    Start time: 2018-02-13T13:43:29.508Z
   [junit4]   2> 1375489 INFO  (jetty-launcher-483-thread-3) [    ] o.a.s.c.SolrXmlConfig Configuration parameter autoReplicaFailoverWorkLoopDelay is ignored
   [junit4]   2> 1375489 INFO  (jetty-launcher-483-thread-3) [    ] o.a.s.c.SolrXmlConfig Configuration parameter autoReplicaFailoverBadNodeExpiration is ignored
   [junit4]   2> 1375586 INFO  (zkConnectionManagerCallback-492-thread-1) [    ] o.a.s.c.c.ConnectionManager zkClient has connected
   [junit4]   2> 1375589 INFO  (jetty-launcher-483-thread-1) [    ] o.a.s.c.ZkContainer Zookeeper client=127.0.0.1:43626/solr
   [junit4]   2> 1375589 INFO  (jetty-launcher-483-thread-2) [    ] o.a.s.s.SolrDispatchFilter solr.xml found in ZooKeeper. Loading...
   [junit4]   2> 1375589 INFO  (zkConnectionManagerCallback-494-thread-1) [    ] o.a.s.c.c.ConnectionManager zkClient has connected
   [junit4]   2> 1375590 INFO  (jetty-launcher-483-thread-3) [    ] o.a.s.c.ZkContainer Zookeeper client=127.0.0.1:43626/solr
   [junit4]   2> 1375592 INFO  (jetty-launcher-483-thread-2) [    ] o.a.s.c.SolrXmlConfig Configuration parameter autoReplicaFailoverWorkLoopDelay is ignored
   [junit4]   2> 1375646 INFO  (jetty-launcher-483-thread-2) [    ] o.a.s.c.SolrXmlConfig Configuration parameter autoReplicaFailoverBadNodeExpiration is ignored
   [junit4]   2> 1375647 INFO  (jetty-launcher-483-thread-4) [    ] o.a.s.s.SolrDispatchFilter solr.xml found in ZooKeeper. Loading...
   [junit4]   2> 1375651 INFO  (jetty-launcher-483-thread-4) [    ] o.a.s.c.SolrXmlConfig Configuration parameter autoReplicaFailoverWorkLoopDelay is ignored
   [junit4]   2> 1375651 INFO  (jetty-launcher-483-thread-4) [    ] o.a.s.c.SolrXmlConfig Configuration parameter autoReplicaFailoverBadNodeExpiration is ignored
   [junit4]   2> 1375670 INFO  (zkConnectionManagerCallback-502-thread-1) [    ] o.a.s.c.c.ConnectionManager zkClient has connected
   [junit4]   2> 1375715 INFO  (zkConnectionManagerCallback-499-thread-1) [    ] o.a.s.c.c.ConnectionManager zkClient has connected
   [junit4]   2> 1375749 INFO  (jetty-launcher-483-thread-2) [    ] o.a.s.c.ZkContainer Zookeeper client=127.0.0.1:43626/solr
   [junit4]   2> 1375776 INFO  (jetty-launcher-483-thread-4) [    ] o.a.s.c.ZkContainer Zookeeper client=127.0.0.1:43626/solr
   [junit4]   2> 1375819 INFO  (zkConnectionManagerCallback-506-thread-1) [    ] o.a.s.c.c.ConnectionManager zkClient has connected
   [junit4]   2> 1375820 INFO  (zkConnectionManagerCallback-512-thread-1-processing-n:127.0.0.1:46396_solr) [n:127.0.0.1:46396_solr    ] o.a.s.c.c.ConnectionManager zkClient has connected
   [junit4]   2> 1375851 INFO  (zkConnectionManagerCallback-508-thread-1-processing-n:127.0.0.1:41251_solr) [n:127.0.0.1:41251_solr    ] o.a.s.c.c.ConnectionManager zkClient has connected
   [junit4]   2> 1375854 INFO  (zkConnectionManagerCallback-514-thread-1) [    ] o.a.s.c.c.ConnectionManager zkClient has connected
   [junit4]   2> 1375994 INFO  (zkConnectionManagerCallback-516-thread-1-processing-n:127.0.0.1:45071_solr) [n:127.0.0.1:45071_solr    ] o.a.s.c.c.ConnectionManager zkClient has connected
   [junit4]   2> 1376038 INFO  (zkConnectionManagerCallback-520-thread-1-processing-n:127.0.0.1:32773_solr) [n:127.0.0.1:32773_solr    ] o.a.s.c.c.ConnectionManager zkClient has connected
   [junit4]   2> 1376153 INFO  (jetty-launcher-483-thread-3) [n:127.0.0.1:41251_solr    ] o.a.s.c.Overseer Overseer (id=null) closing
   [junit4]   2> 1376154 INFO  (jetty-launcher-483-thread-3) [n:127.0.0.1:41251_solr    ] o.a.s.c.OverseerElectionContext I am going to be the leader 127.0.0.1:41251_solr
   [junit4]   2> 1376168 INFO  (jetty-launcher-483-thread-3) [n:127.0.0.1:41251_solr    ] o.a.s.c.Overseer Overseer (id=72114401310146568-127.0.0.1:41251_solr-n_0000000000) starting
   [junit4]   2> 1376224 INFO  (jetty-launcher-483-thread-3) [n:127.0.0.1:41251_solr    ] o.a.s.c.ZkController Register node as live in ZooKeeper:/live_nodes/127.0.0.1:41251_solr
   [junit4]   2> 1376246 INFO  (OverseerStateUpdate-72114401310146568-127.0.0.1:41251_solr-n_0000000000) [n:127.0.0.1:41251_solr    ] o.a.s.c.c.ZkStateReader Updated live nodes from ZooKeeper... (0) -> (1)
   [junit4]   2> 1376530 INFO  (jetty-launcher-483-thread-3) [n:127.0.0.1:41251_solr    ] o.a.s.m.r.SolrJmxReporter JMX monitoring for 'solr.node' (registry 'solr.node') enabled at server: com.sun.jmx.mbeanserver.JmxMBeanServer@13e22cfc
   [junit4]   2> 1376567 INFO  (jetty-launcher-483-thread-3) [n:127.0.0.1:41251_solr    ] o.a.s.m.r.SolrJmxReporter JMX monitoring for 'solr.jvm' (registry 'solr.jvm') enabled at server: com.sun.jmx.mbeanserver.JmxMBeanServer@13e22cfc
   [junit4]   2> 1376567 INFO  (jetty-launcher-483-thread-3) [n:127.0.0.1:41251_solr    ] o.a.s.m.r.SolrJmxReporter JMX monitoring for 'solr.jetty' (registry 'solr.jetty') enabled at server: com.sun.jmx.mbeanserver.JmxMBeanServer@13e22cfc
   [junit4]   2> 1376587 INFO  (jetty-launcher-483-thread-3) [n:127.0.0.1:41251_solr    ] o.a.s.c.CorePropertiesLocator Found 0 core definitions underneath /home/jenkins/jenkins-slave/workspace/Lucene-Solr-NightlyTests-master/checkout/solr/build/solr-core/test/J1/temp/solr.cloud.api.collections.HdfsCollectionsAPIDistributedZkTest_CA17488FAA956331-001/tempDir-001/node3
   [junit4]   2> 1376968 INFO  (jetty-launcher-483-thread-2) [n:127.0.0.1:45071_solr    ] o.a.s.c.c.ZkStateReader Updated live nodes from ZooKeeper... (0) -> (1)
   [junit4]   2> 1377033 INFO  (jetty-launcher-483-thread-1) [n:127.0.0.1:46396_solr    ] o.a.s.c.c.ZkStateReader Updated live nodes from ZooKeeper... (0) -> (1)
   [junit4]   2> 1377034 INFO  (jetty-launcher-483-thread-2) [n:127.0.0.1:45071_solr    ] o.a.s.c.Overseer Overseer (id=null) closing
   [junit4]   2> 1377037 INFO  (jetty-launcher-483-thread-2) [n:127.0.0.1:45071_solr    ] o.a.s.c.ZkController Register node as live in ZooKeeper:/live_nodes/127.0.0.1:45071_solr
   [junit4]   2> 1377050 INFO  (jetty-launcher-483-thread-1) [n:127.0.0.1:46396_solr    ] o.a.s.c.Overseer Overseer (id=null) closing
   [junit4]   2> 1377086 INFO  (zkCallback-511-thread-1-processing-n:127.0.0.1:46396_solr) [n:127.0.0.1:46396_solr    ] o.a.s.c.c.ZkStateReader Updated live nodes from ZooKeeper... (1) -> (2)
   [junit4]   2> 1377114 INFO  (zkCallback-507-thread-2-processing-n:127.0.0.1:41251_solr) [n:127.0.0.1:41251_solr    ] o.a.s.c.c.ZkStateReader Updated live nodes from ZooKeeper... (1) -> (2)
   [junit4]   2> 1377127 INFO  (zkCallback-515-thread-1-processing-n:127.0.0.1:45071_solr) [n:127.0.0.1:45071_solr    ] o.a.s.c.c.ZkStateReader Updated live nodes from ZooKeeper... (1) -> (2)
   [junit4]   2> 1377129 INFO  (jetty-launcher-483-thread-1) [n:127.0.0.1:46396_solr    ] o.a.s.c.ZkController Register node as live in ZooKeeper:/live_nodes/127.0.0.1:46396_solr
   [junit4]   2> 1377130 INFO  (zkCallback-515-thread-1-processing-n:127.0.0.1:45071_solr) [n:127.0.0.1:45071_solr    ] o.a.s.c.c.ZkStateReader Updated live nodes from ZooKeeper... (2) -> (3)
   [junit4]   2> 1377134 INFO  (zkCallback-507-thread-2-processing-n:127.0.0.1:41251_solr) [n:127.0.0.1:41251_solr    ] o.a.s.c.c.ZkStateReader Updated live nodes from ZooKeeper... (2) -> (3)
   [junit4]   2> 1377175 INFO  (zkCallback-511-thread-1-processing-n:127.0.0.1:46396_solr) [n:127.0.0.1:46396_solr    ] o.a.s.c.c.ZkStateReader Updated live nodes from ZooKeeper... (2) -> (3)
   [junit4]   2> 1377362 INFO  (jetty-launcher-483-thread-1) [n:127.0.0.1:46396_solr    ] o.a.s.m.r.SolrJmxReporter JMX monitoring for 'solr.node' (registry 'solr.node') enabled at server: com.sun.jmx.mbeanserver.JmxMBeanServer@13e22cfc
   [junit4]   2> 1377412 INFO  (jetty-launcher-483-thread-1) [n:127.0.0.1:46396_solr    ] o.a.s.m.r.SolrJmxReporter JMX monitoring for 'solr.jvm' (registry 'solr.jvm') enabled at server: com.sun.jmx.mbeanserver.JmxMBeanServer@13e22cfc
   [junit4]   2> 1377413 INFO  (jetty-launcher-483-thread-1) [n:127.0.0.1:46396_solr    ] o.a.s.m.r.SolrJmxReporter JMX monitoring for 'solr.jetty' (registry 'solr.jetty') enabled at server: com.sun.jmx.mbeanserver.JmxMBeanServer@13e22cfc
   [junit4]   2> 1377414 INFO  (jetty-launcher-483-thread-1) [n:127.0.0.1:46396_solr    ] o.a.s.c.CorePropertiesLocator Found 0 core definitions underneath /home/jenkins/jenkins-slave/workspace/Lucene-Solr-NightlyTests-master/checkout/solr/build/solr-core/test/J1/temp/solr.cloud.api.collections.HdfsCollectionsAPIDistributedZkTest_CA17488FAA956331-001/tempDir-001/node1
   [junit4]   2> 1377421 INFO  (jetty-launcher-483-thread-2) [n:127.0.0.1:45071_solr    ] o.a.s.m.r.SolrJmxReporter JMX monitoring for 'solr.node' (registry 'solr.node') enabled at server: com.sun.jmx.mbeanserver.JmxMBeanServer@13e22cfc
   [junit4]   2> 1377459 INFO  (jetty-launcher-483-thread-2) [n:127.0.0.1:45071_solr    ] o.a.s.m.r.SolrJmxReporter JMX monitoring for 'solr.jvm' (registry 'solr.jvm') enabled at server: com.sun.jmx.mbeanserver.JmxMBeanServer@13e22cfc
   [junit4]   2> 1377459 INFO  (jetty-launcher-483-thread-2) [n:127.0.0.1:45071_solr    ] o.a.s.m.r.SolrJmxReporter JMX monitoring for 'solr.jetty' (registry 'solr.jetty') enabled at server: com.sun.jmx.mbeanserver.JmxMBeanServer@13e22cfc
   [junit4]   2> 1377473 INFO  (jetty-launcher-483-thread-2) [n:127.0.0.1:45071_solr    ] o.a.s.c.CorePropertiesLocator Found 0 core definitions underneath /home/jenkins/jenkins-slave/workspace/Lucene-Solr-NightlyTests-master/checkout/solr/build/solr-core/test/J1/temp/solr.cloud.api.collections.HdfsCollectionsAPIDistributedZkTest_CA17488FAA956331-001/tempDir-001/node2
   [junit4]   2> 1377594 INFO  (jetty-launcher-483-thread-4) [n:127.0.0.1:32773_solr    ] o.a.s.c.c.ZkStateReader Updated live nodes from ZooKeeper... (0) -> (3)
   [junit4]   2> 1377596 INFO  (jetty-launcher-483-thread-4) [n:127.0.0.1:32773_solr    ] o.a.s.c.Overseer Overseer (id=null) closing
   [junit4]   2> 1377597 INFO  (jetty-launcher-483-thread-4) [n:127.0.0.1:32773_solr    ] o.a.s.c.ZkController Register node as live in ZooKeeper:/live_nodes/127.0.0.1:32773_solr
   [junit4]   2> 1377805 INFO  (zkCallback-511-thread-1-processing-n:127.0.0.1:46396_solr) [n:127.0.0.1:46396_solr    ] o.a.s.c.c.ZkStateReader Updated live nodes from ZooKeeper... (3) -> (4)
   [junit4]   2> 1377806 INFO  (zkCallback-507-thread-2-processing-n:127.0.0.1:41251_solr) [n:127.0.0.1:41251_solr    ] o.a.s.c.c.ZkStateReader Updated live nodes from ZooKeeper... (3) -> (4)
   [junit4]   2> 1377915 INFO  (zkCallback-515-thread-1-processing-n:127.0.0.1:45071_solr) [n:127.0.0.1:45071_solr    ] o.a.s.c.c.ZkStateReader Updated live nodes from ZooKeeper... (3) -> (4)
   [junit4]   2> 1377952 INFO  (zkCallback-519-thread-1-processing-n:127.0.0.1:32773_solr) [n:127.0.0.1:32773_solr    ] o.a.s.c.c.ZkStateReader Updated live nodes from ZooKeeper... (3) -> (4)
   [junit4]   2> 1378225 INFO  (jetty-launcher-483-thread-4) [n:127.0.0.1:32773_solr    ] o.a.s.m.r.SolrJmxReporter JMX monitoring for 'solr.node' (registry 'solr.node') enabled at server: com.sun.jmx.mbeanserver.JmxMBeanServer@13e22cfc
   [junit4]   2> 1378262 INFO  (jetty-launcher-483-thread-4) [n:127.0.0.1:32773_solr    ] o.a.s.m.r.SolrJmxReporter JMX monitoring for 'solr.jvm' (registry 'solr.jvm') enabled at server: com.sun.jmx.mbeanserver.JmxMBeanServer@13e22cfc
   [junit4]   2> 1378262 INFO  (jetty-launcher-483-thread-4) [n:127.0.0.1:32773_solr    ] o.a.s.m.r.SolrJmxReporter JMX monitoring for 'solr.jetty' (registry 'solr.jetty') enabled at server: com.sun.jmx.mbeanserver.JmxMBeanServer@13e22cfc
   [junit4]   2> 1378264 INFO  (jetty-launcher-483-thread-4) [n:127.0.0.1:32773_solr    ] o.a.s.c.CorePropertiesLocator Found 0 core definitions underneath /home/jenkins/jenkins-slave/workspace/Lucene-Solr-NightlyTests-master/checkout/solr/build/solr-core/test/J1/temp/solr.cloud.api.collections.HdfsCollectionsAPIDistributedZkTest_CA17488FAA956331-001/tempDir-001/node4
   [junit4]   2> 1378657 INFO  (zkConnectionManagerCallback-528-thread-1) [    ] o.a.s.c.c.ConnectionManager zkClient has connected
   [junit4]   2> 1378754 INFO  (zkConnectionManagerCallback-532-thread-1) [    ] o.a.s.c.c.ConnectionManager zkClient has connected
   [junit4]   2> 1378787 INFO  (SUITE-HdfsCollectionsAPIDistributedZkTest-seed#[CA17488FAA956331]-worker) [    ] o.a.s.c.c.ZkStateReader Updated live nodes from ZooKeeper... (0) -> (4)
   [junit4]   2> 1378787 INFO  (SUITE-HdfsCollectionsAPIDistributedZkTest-seed#[CA17488FAA956331]-worker) [    ] o.a.s.c.s.i.ZkClientClusterStateProvider Cluster at 127.0.0.1:43626/solr ready
   [junit4]   1> Formatting using clusterid: testClusterID
   [junit4]   2> 1379267 WARN  (SUITE-HdfsCollectionsAPIDistributedZkTest-seed#[CA17488FAA956331]-worker) [    ] o.a.h.m.i.MetricsConfig Cannot locate configuration: tried hadoop-metrics2-namenode.properties,hadoop-metrics2.properties
   [junit4]   2> 1379375 WARN  (SUITE-HdfsCollectionsAPIDistributedZkTest-seed#[CA17488FAA956331]-worker) [    ] o.a.h.h.HttpRequestLog Jetty request log can only be enabled using Log4j
   [junit4]   2> 1379390 INFO  (SUITE-HdfsCollectionsAPIDistributedZkTest-seed#[CA17488FAA956331]-worker) [    ] o.m.log jetty-6.1.26
   [junit4]   2> 1379457 INFO  (SUITE-HdfsCollectionsAPIDistributedZkTest-seed#[CA17488FAA956331]-worker) [    ] o.m.log Extract jar:file:/home/jenkins/.ivy2/cache/org.apache.hadoop/hadoop-hdfs/tests/hadoop-hdfs-2.7.4-tests.jar!/webapps/hdfs to ./temp/Jetty_lucene2.us.west_apache_org_35075_hdfs____ve3me/webapp
   [junit4]   2> 1380464 INFO  (SUITE-HdfsCollectionsAPIDistributedZkTest-seed#[CA17488FAA956331]-worker) [    ] o.m.log Started HttpServer2$[hidden email]:35075
   [junit4]   2> 1381379 WARN  (SUITE-HdfsCollectionsAPIDistributedZkTest-seed#[CA17488FAA956331]-worker) [    ] o.a.h.h.HttpRequestLog Jetty request log can only be enabled using Log4j
   [junit4]   2> 1381380 INFO  (SUITE-HdfsCollectionsAPIDistributedZkTest-seed#[CA17488FAA956331]-worker) [    ] o.m.log jetty-6.1.26
   [junit4]   2> 1381530 INFO  (SUITE-HdfsCollectionsAPIDistributedZkTest-seed#[CA17488FAA956331]-worker) [    ] o.m.log Extract jar:file:/home/jenkins/.ivy2/cache/org.apache.hadoop/hadoop-hdfs/tests/hadoop-hdfs-2.7.4-tests.jar!/webapps/datanode to ./temp/Jetty_localhost_35575_datanode____.9l3s6g/webapp
   [junit4]   2> 1382409 INFO  (SUITE-HdfsCollectionsAPIDistributedZkTest-seed#[CA17488FAA956331]-worker) [    ] o.m.log Started HttpServer2$SelectChannelConnectorWithSafeStartup@localhost:35575
   [junit4]   2> 1382806 ERROR (DataNode: [[[DISK]file:/home/jenkins/jenkins-slave/workspace/Lucene-Solr-NightlyTests-master/checkout/solr/build/solr-core/test/J1/temp/solr.cloud.api.collections.HdfsCollectionsAPIDistributedZkTest_CA17488FAA956331-001/tempDir-002/hdfsBaseDir/data/data1/, [DISK]file:/home/jenkins/jenkins-slave/workspace/Lucene-Solr-NightlyTests-master/checkout/solr/build/solr-core/test/J1/temp/solr.cloud.api.collections.HdfsCollectionsAPIDistributedZkTest_CA17488FAA956331-001/tempDir-002/hdfsBaseDir/data/data2/]]  heartbeating to lucene2-us-west.apache.org/127.0.0.1:41028) [    ] o.a.h.h.s.d.DirectoryScanner dfs.datanode.directoryscan.throttle.limit.ms.per.sec set to value below 1 ms/sec. Assuming default value of 1000
   [junit4]   2> 1382829 INFO  (Block report processor) [    ] BlockStateChange BLOCK* processReport 0x3145dbe36515f: from storage DS-eacd9b61-f444-4c48-9974-e420d8d1eb32 node DatanodeRegistration(127.0.0.1:45512, datanodeUuid=e9b037eb-676d-468d-8d9d-c06d2ab5fee7, infoPort=43997, infoSecurePort=0, ipcPort=46454, storageInfo=lv=-56;cid=testClusterID;nsid=145798916;c=0), blocks: 0, hasStaleStorage: true, processing time: 0 msecs
   [junit4]   2> 1382829 INFO  (Block report processor) [    ] BlockStateChange BLOCK* processReport 0x3145dbe36515f: from storage DS-a2c4bbbb-7e31-43cb-9dd6-82613b155dc8 node DatanodeRegistration(127.0.0.1:45512, datanodeUuid=e9b037eb-676d-468d-8d9d-c06d2ab5fee7, infoPort=43997, infoSecurePort=0, ipcPort=46454, storageInfo=lv=-56;cid=testClusterID;nsid=145798916;c=0), blocks: 0, hasStaleStorage: false, processing time: 0 msecs
   [junit4]   2> 1383055 INFO  (TEST-HdfsCollectionsAPIDistributedZkTest.testCreateNodeSet-seed#[CA17488FAA956331]) [    ] o.a.s.SolrTestCaseJ4 ###Starting testCreateNodeSet
   [junit4]   2> 1383068 INFO  (TEST-HdfsCollectionsAPIDistributedZkTest.testCreateNodeSet-seed#[CA17488FAA956331]) [    ] o.a.s.c.c.ZkStateReader Updated live nodes from ZooKeeper... (0) -> (4)
   [junit4]   2> 1383255 INFO  (qtp47740153-2904) [n:127.0.0.1:41251_solr    ] o.a.s.h.a.CollectionsHandler Invoked Collection Action :create with params replicationFactor=1&collection.configName=conf&name=nodeset_collection&nrtReplicas=1&action=CREATE&numShards=2&createNodeSet=https://127.0.0.1:41251/solr,https://127.0.0.1:32773/solr&wt=javabin&version=2 and sendToOCPQueue=true
   [junit4]   2> 1383258 INFO  (OverseerThreadFactory-805-thread-1-processing-n:127.0.0.1:41251_solr) [n:127.0.0.1:41251_solr    ] o.a.s.c.a.c.CreateCollectionCmd Create collection nodeset_collection
   [junit4]   2> 1383267 WARN  (OverseerThreadFactory-805-thread-1-processing-n:127.0.0.1:41251_solr) [n:127.0.0.1:41251_solr    ] o.a.s.c.a.c.CreateCollectionCmd It is unusual to create a collection (nodeset_collection) without cores.
   [junit4]   2> 1383372 INFO  (qtp47740153-2904) [n:127.0.0.1:41251_solr    ] o.a.s.h.a.CollectionsHandler Wait for new collection to be active for at most 30 seconds. Check all shard replicas
   [junit4]   2> 1383372 INFO  (qtp47740153-2904) [n:127.0.0.1:41251_solr    ] o.a.s.s.HttpSolrCall [admin] webapp=null path=/admin/collections params={replicationFactor=1&collection.configName=conf&name=nodeset_collection&nrtReplicas=1&action=CREATE&numShards=2&createNodeSet=https://127.0.0.1:41251/solr,https://127.0.0.1:32773/solr&wt=javabin&version=2} status=0 QTime=116
   [junit4]   2> 1383373 INFO  (TEST-HdfsCollectionsAPIDistributedZkTest.testCreateNodeSet-seed#[CA17488FAA956331]) [    ] o.a.s.SolrTestCaseJ4 ###Ending testCreateNodeSet
   [junit4]   2> 1383373 INFO  (OverseerCollectionConfigSetProcessor-72114401310146568-127.0.0.1:41251_solr-n_0000000000) [n:127.0.0.1:41251_solr    ] o.a.s.c.OverseerTaskQueue Response ZK path: /overseer/collection-queue-work/qnr-0000000000 doesn't exist.  Requestor may have disconnected from ZooKeeper
   [junit4]   2> 1383563 INFO  (TEST-HdfsCollectionsAPIDistributedZkTest.testCollectionReload-seed#[CA17488FAA956331]) [    ] o.a.s.SolrTestCaseJ4 ###Starting testCollectionReload
   [junit4]   2> 1383564 INFO  (TEST-HdfsCollectionsAPIDistributedZkTest.testCollectionReload-seed#[CA17488FAA956331]) [    ] o.a.s.c.c.ZkStateReader Updated live nodes from ZooKeeper... (0) -> (4)
   [junit4]   2> 1383566 INFO  (qtp47740153-2906) [n:127.0.0.1:41251_solr    ] o.a.s.h.a.CollectionsHandler Invoked Collection Action :delete with params name=nodeset_collection&action=DELETE&wt=javabin&version=2 and sendToOCPQueue=true
   [junit4]   2> 1383589 INFO  (OverseerThreadFactory-805-thread-2-processing-n:127.0.0.1:41251_solr) [n:127.0.0.1:41251_solr    ] o.a.s.c.a.c.OverseerCollectionMessageHandler Executing Collection Cmd : action=UNLOAD&deleteInstanceDir=true&deleteDataDir=true
   [junit4]   2> 1384311 INFO  (qtp47740153-2906) [n:127.0.0.1:41251_solr    ] o.a.s.s.HttpSolrCall [admin] webapp=null path=/admin/collections params={name=nodeset_collection&action=DELETE&wt=javabin&version=2} status=0 QTime=744
   [junit4]   2> 1384312 INFO  (qtp47740153-2904) [n:127.0.0.1:41251_solr    ] o.a.s.h.a.CollectionsHandler Invoked Collection Action :create with params replicationFactor=2&collection.configName=conf&name=reloaded_collection&nrtReplicas=2&action=CREATE&numShards=2&wt=javabin&version=2 and sendToOCPQueue=true
   [junit4]   2> 1384313 INFO  (OverseerThreadFactory-805-thread-3-processing-n:127.0.0.1:41251_solr) [n:127.0.0.1:41251_solr    ] o.a.s.c.a.c.CreateCollectionCmd Create collection reloaded_collection
   [junit4]   2> 1384314 INFO  (OverseerCollectionConfigSetProcessor-72114401310146568-127.0.0.1:41251_solr-n_0000000000) [n:127.0.0.1:41251_solr    ] o.a.s.c.OverseerTaskQueue Response ZK path: /overseer/collection-queue-work/qnr-0000000002 doesn't exist.  Requestor may have disconnected from ZooKeeper
   [junit4]   2> 1384438 INFO  (OverseerStateUpdate-72114401310146568-127.0.0.1:41251_solr-n_0000000000) [n:127.0.0.1:41251_solr    ] o.a.s.c.o.SliceMutator createReplica() {
   [junit4]   2>   "operation":"ADDREPLICA",
   [junit4]   2>   "collection":"reloaded_collection",
   [junit4]   2>   "shard":"shard1",
   [junit4]   2>   "core":"reloaded_collection_shard1_replica_n1",
   [junit4]   2>   "state":"down",
   [junit4]   2>   "base_url":"https://127.0.0.1:45071/solr",
   [junit4]   2>   "type":"NRT",
   [junit4]   2>   "waitForFinalState":"false"}
   [junit4]   2> 1384460 INFO  (OverseerStateUpdate-72114401310146568-127.0.0.1:41251_solr-n_0000000000) [n:127.0.0.1:41251_solr    ] o.a.s.c.o.SliceMutator createReplica() {
   [junit4]   2>   "operation":"ADDREPLICA",
   [junit4]   2>   "collection":"reloaded_collection",
   [junit4]   2>   "shard":"shard1",
   [junit4]   2>   "core":"reloaded_collection_shard1_replica_n2",
   [junit4]   2>   "state":"down",
   [junit4]   2>   "base_url":"https://127.0.0.1:32773/solr",
   [junit4]   2>   "type":"NRT",
   [junit4]   2>   "waitForFinalState":"false"}
   [junit4]   2> 1384462 INFO  (OverseerStateUpdate-72114401310146568-127.0.0.1:41251_solr-n_0000000000) [n:127.0.0.1:41251_solr    ] o.a.s.c.o.SliceMutator createReplica() {
   [junit4]   2>   "operation":"ADDREPLICA",
   [junit4]   2>   "collection":"reloaded_collection",
   [junit4]   2>   "shard":"shard2",
   [junit4]   2>   "core":"reloaded_collection_shard2_replica_n4",
   [junit4]   2>   "state":"down",
   [junit4]   2>   "base_url":"https://127.0.0.1:41251/solr",
   [junit4]   2>   "type":"NRT",
   [junit4]   2>   "waitForFinalState":"false"}
   [junit4]   2> 1384485 INFO  (OverseerStateUpdate-72114401310146568-127.0.0.1:41251_solr-n_0000000000) [n:127.0.0.1:41251_solr    ] o.a.s.c.o.SliceMutator createReplica() {
   [junit4]   2>   "operation":"ADDREPLICA",
   [junit4]   2>   "collection":"reloaded_collection",
   [junit4]   2>   "shard":"shard2",
   [junit4]   2>   "core":"reloaded_collection_shard2_replica_n6",
   [junit4]   2>   "state":"down",
   [junit4]   2>   "base_url":"https://127.0.0.1:46396/solr",
   [junit4]   2>   "type":"NRT",
   [junit4]   2>   "waitForFinalState":"false"}
   [junit4]   2> 1385238 INFO  (qtp47740153-2908) [n:127.0.0.1:41251_solr    ] o.a.s.h.a.CoreAdminOperation core create command qt=/admin/cores&coreNodeName=core_node7&collection.configName=conf&newCollection=true&name=reloaded_collection_shard2_replica_n4&action=CREATE&numShards=2&collection=reloaded_collection&shard=shard2&wt=javabin&version=2&replicaType=NRT
   [junit4]   2> 1385294 INFO  (qtp47740153-2908) [n:127.0.0.1:41251_solr    ] o.a.s.c.TransientSolrCoreCacheDefault Allocating transient cache for 2147483647 transient cores
   [junit4]   2> 1385661 INFO  (zkCallback-507-thread-2-processing-n:127.0.0.1:41251_solr) [n:127.0.0.1:41251_solr    ] o.a.s.c.c.ZkStateReader A cluster state change: [WatchedEvent state:SyncConnected type:NodeDataChanged path:/collections/reloaded_collection/state.json] for collection [reloaded_collection] has occurred - updating... (live nodes size: [4])
   [junit4]   2> 1385661 INFO  (zkCallback-507-thread-1-processing-n:127.0.0.1:41251_solr) [n:127.0.0.1:41251_solr    ] o.a.s.c.c.ZkStateReader A cluster state change: [WatchedEvent state:SyncConnected type:NodeDataChanged path:/collections/reloaded_collection/state.json] for collection [reloaded_collection] has occurred - updating... (live nodes size: [4])
   [junit4]   2> 1385677 INFO  (qtp1518645936-2892) [n:127.0.0.1:45071_solr    ] o.a.s.h.a.CoreAdminOperation core create command qt=/admin/cores&coreNodeName=core_node3&collection.configName=conf&newCollection=true&name=reloaded_collection_shard1_replica_n1&action=CREATE&numShards=2&collection=reloaded_collection&shard=shard1&wt=javabin&version=2&replicaType=NRT
   [junit4]   2> 1385677 INFO  (qtp1518645936-2892) [n:127.0.0.1:45071_solr    ] o.a.s.c.TransientSolrCoreCacheDefault Allocating transient cache for 2147483647 transient cores
   [junit4]   2> 1385677 INFO  (qtp822675201-2918) [n:127.0.0.1:32773_solr    ] o.a.s.h.a.CoreAdminOperation core create command qt=/admin/cores&coreNodeName=core_node5&collection.configName=conf&newCollection=true&name=reloaded_collection_shard1_replica_n2&action=CREATE&numShards=2&collection=reloaded_collection&shard=shard1&wt=javabin&version=2&replicaType=NRT
   [junit4]   2> 1385678 INFO  (qtp822675201-2918) [n:127.0.0.1:32773_solr    ] o.a.s.c.TransientSolrCoreCacheDefault Allocating transient cache for 2147483647 transient cores
   [junit4]   2> 1386016 INFO  (qtp1248387469-2897) [n:127.0.0.1:46396_solr    ] o.a.s.h.a.CoreAdminOperation core create command qt=/admin/cores&coreNodeName=core_node8&collection.configName=conf&newCollection=true&name=reloaded_collection_shard2_replica_n6&action=CREATE&numShards=2&collection=reloaded_collection&shard=shard2&wt=javabin&version=2&replicaType=NRT
   [junit4]   2> 1386017 INFO  (qtp1248387469-2897) [n:127.0.0.1:46396_solr    ] o.a.s.c.TransientSolrCoreCacheDefault Allocating transient cache for 2147483647 transient cores
   [junit4]   2> 1386136 INFO  (zkCallback-511-thread-1-processing-n:127.0.0.1:46396_solr) [n:127.0.0.1:46396_solr    ] o.a.s.c.c.ZkStateReader A cluster state change: [WatchedEvent state:SyncConnected type:NodeDataChanged path:/collections/reloaded_collection/state.json] for collection [reloaded_collection] has occurred - updating... (live nodes size: [4])
   [junit4]   2> 1386136 INFO  (zkCallback-519-thread-1-processing-n:127.0.0.1:32773_solr) [n:127.0.0.1:32773_solr    ] o.a.s.c.c.ZkStateReader A cluster state change: [WatchedEvent state:SyncConnected type:NodeDataChanged path:/collections/reloaded_collection/state.json] for collection [reloaded_collection] has occurred - updating... (live nodes size: [4])
   [junit4]   2> 1386136 INFO  (zkCallback-515-thread-1-processing-n:127.0.0.1:45071_solr) [n:127.0.0.1:45071_solr    ] o.a.s.c.c.ZkStateReader A cluster state change: [WatchedEvent state:SyncConnected type:NodeDataChanged path:/collections/reloaded_collection/state.json] for collection [reloaded_collection] has occurred - updating... (live nodes size: [4])
   [junit4]   2> 1386136 INFO  (zkCallback-507-thread-1-processing-n:127.0.0.1:41251_solr) [n:127.0.0.1:41251_solr    ] o.a.s.c.c.ZkStateReader A cluster state change: [WatchedEvent state:SyncConnected type:NodeDataChanged path:/collections/reloaded_collection/state.json] for collection [reloaded_collection] has occurred - updating... (live nodes size: [4])
   [junit4]   2> 1386136 INFO  (zkCallback-507-thread-2-processing-n:127.0.0.1:41251_solr) [n:127.0.0.1:41251_solr    ] o.a.s.c.c.ZkStateReader A cluster state change: [WatchedEvent state:SyncConnected type:NodeDataChanged path:/collections/reloaded_collection/state.json] for collection [reloaded_collection] has occurred - updating... (live nodes size: [4])
   [junit4]   2> 1386138 INFO  (zkCallback-511-thread-2-processing-n:127.0.0.1:46396_solr) [n:127.0.0.1:46396_solr    ] o.a.s.c.c.ZkStateReader A cluster state change: [WatchedEvent state:SyncConnected type:NodeDataChanged path:/collections/reloaded_collection/state.json] for collection [reloaded_collection] has occurred - updating... (live nodes size: [4])
   [junit4]   2> 1386138 INFO  (zkCallback-519-thread-2-processing-n:127.0.0.1:32773_solr) [n:127.0.0.1:32773_solr    ] o.a.s.c.c.ZkStateReader A cluster state change: [WatchedEvent state:SyncConnected type:NodeDataChanged path:/collections/reloaded_collection/state.json] for collection [reloaded_collection] has occurred - updating... (live nodes size: [4])
   [junit4]   2> 1386139 INFO  (zkCallback-515-thread-2-processing-n:127.0.0.1:45071_solr) [n:127.0.0.1:45071_solr    ] o.a.s.c.c.ZkStateReader A cluster state change: [WatchedEvent state:SyncConnected type:NodeDataChanged path:/collections/reloaded_collection/state.json] for collection [reloaded_collection] has occurred - updating... (live nodes size: [4])
   [junit4]   2> 1386482 INFO  (qtp47740153-2908) [n:127.0.0.1:41251_solr c:reloaded_collection s:shard2 r:core_node7 x:reloaded_collection_shard2_replica_n4] o.a.s.c.SolrConfig Using Lucene MatchVersion: 8.0.0
   [junit4]   2> 1386515 INFO  (qtp47740153-2908) [n:127.0.0.1:41251_solr c:reloaded_collection s:shard2 r:core_node7 x:reloaded_collection_shard2_replica_n4] o.a.s.s.IndexSchema [reloaded_collection_shard2_replica_n4] Schema name=minimal
   [junit4]   2> 1386535 INFO  (qtp47740153-2908) [n:127.0.0.1:41251_solr c:reloaded_collection s:shard2 r:core_node7 x:reloaded_collection_shard2_replica_n4] o.a.s.s.IndexSchema Loaded schema minimal/1.1 with uniqueid field id
   [junit4]   2> 1386535 INFO  (qtp47740153-2908) [n:127.0.0.1:41251_solr c:reloaded_collection s:shard2 r:core_node7 x:reloaded_collection_shard2_replica_n4] o.a.s.c.CoreContainer Creating SolrCore 'reloaded_collection_shard2_replica_n4' using configuration from collection reloaded_collection, trusted=true
   [junit4]   2> 1386536 INFO  (qtp47740153-2908) [n:127.0.0.1:41251_solr c:reloaded_collection s:shard2 r:core_node7 x:reloaded_collection_shard2_replica_n4] o.a.s.m.r.SolrJmxReporter JMX monitoring for 'solr.core.reloaded_collection.shard2.replica_n4' (registry 'solr.core.reloaded_collection.shard2.replica_n4') enabled at server: com.sun.jmx.mbeanserver.JmxMBeanServer@13e22cfc
   [junit4]   2> 1386572 INFO  (qtp47740153-2908) [n:127.0.0.1:41251_solr c:reloaded_collection s:shard2 r:core_node7 x:reloaded_collection_shard2_replica_n4] o.a.s.c.HdfsDirectoryFactory solr.hdfs.home=hdfs://lucene2-us-west.apache.org:41028/data
   [junit4]   2> 1386572 INFO  (qtp47740153-2908) [n:127.0.0.1:41251_solr c:reloaded_collection s:shard2 r:core_node7 x:reloaded_collection_shard2_replica_n4] o.a.s.c.HdfsDirectoryFactory Solr Kerberos Authentication disabled
   [junit4]   2> 1386573 INFO  (qtp47740153-2908) [n:127.0.0.1:41251_solr c:reloaded_collection s:shard2 r:core_node7 x:reloaded_collection_shard2_replica_n4] o.a.s.c.SolrCore solr.RecoveryStrategy.Builder
   [junit4]   2> 1386573 INFO  (qtp47740153-2908) [n:127.0.0.1:41251_solr c:reloaded_collection s:shard2 r:core_node7 x:reloaded_collection_shard2_replica_n4] o.a.s.c.SolrCore [[reloaded_collection_shard2_replica_n4] ] Opening new SolrCore at [/home/jenkins/jenkins-slave/workspace/Lucene-Solr-NightlyTests-master/checkout/solr/build/solr-core/test/J1/temp/solr.cloud.api.collections.HdfsCollectionsAPIDistributedZkTest_CA17488FAA956331-001/tempDir-001/node3/reloaded_collection_shard2_replica_n4], dataDir=[hdfs://lucene2-us-west.apache.org:41028/data/reloaded_collection/core_node7/data/]
   [junit4]   2> 1386586 INFO  (qtp47740153-2908) [n:127.0.0.1:41251_solr c:reloaded_collection s:shard2 r:core_node7 x:reloaded_collection_shard2_replica_n4] o.a.s.c.HdfsDirectoryFactory creating directory factory for path hdfs://lucene2-us-west.apache.org:41028/data/reloaded_collection/core_node7/data/snapshot_metadata
   [junit4]   2> 1386625 INFO  (qtp47740153-2908) [n:127.0.0.1:41251_solr c:reloaded_collection s:shard2 r:core_node7 x:reloaded_collection_shard2_replica_n4] o.a.s.c.HdfsDirectoryFactory Number of slabs of block cache [1] with direct memory allocation set to [true]
   [junit4]   2> 1386625 INFO  (qtp47740153-2908) [n:127.0.0.1:41251_solr c:reloaded_collection s:shard2 r:core_node7 x:reloaded_c

[...truncated too long message...]

esTest, TestMaxScoreQueryParser, CurrencyFieldTypeTest, SolrRequestParserTest, AssignTest, TestJavabinTupleStreamParser, DeleteLastCustomShardedReplicaTest, SimpleFacetsTest, SolrJmxReporterTest, TestDocumentBuilder, ChaosMonkeyNothingIsSafeTest, TestHighlightDedupGrouping, TestCSVResponseWriter, SpatialHeatmapFacetsTest, CloudExitableDirectoryReaderTest, MigrateRouteKeyTest, TestSchemaNameResource, RequestHandlersTest, TestSchemaVersionResource, TestMergePolicyConfig, NodeMutatorTest, TestFieldCacheSortRandom, TestBinaryField, TestStressLucene, SpellCheckCollatorWithCollapseTest, TestRawTransformer, HdfsRecoverLeaseTest, ExitableDirectoryReaderTest, TestSolrCoreSnapshots, TestLRUStatsCache, TestFieldCache, TestExtendedDismaxParser, SpellCheckCollatorTest, PropertiesRequestHandlerTest, ZkNodePropsTest, OutputWriterTest, BlobRepositoryCloudTest, TestDistributedSearch, TestSubQueryTransformerDistrib, TestClusterStateMutator, OpenCloseCoreStressTest, TestLegacyTerms, CursorPagingTest, TestExecutePlanAction, SolrPluginUtilsTest, TestConfigSetsAPIZkFailure, TestSolrCloudWithDelegationTokens, TestSystemCollAutoCreate, EchoParamsTest, AutoscalingHistoryHandlerTest, CreateCollectionCleanupTest, TestFileDictionaryLookup, UninvertDocValuesMergePolicyTest, StatsReloadRaceTest, TestRemoteStreaming, OpenExchangeRatesOrgProviderTest, FieldAnalysisRequestHandlerTest, TestStressCloudBlindAtomicUpdates, TestConfig, TestNodeAddedTrigger, OverseerStatusTest, TestPHPSerializedResponseWriter, BinaryUpdateRequestHandlerTest, TestImpersonationWithHadoopAuth, CoreMergeIndexesAdminHandlerTest, TestSolrQueryParser, TestPivotHelperCode, TestNumericRangeQuery64, SpellingQueryConverterTest, UUIDFieldTest, TestManagedStopFilterFactory, TestConfigsApi, ReplaceNodeTest, TestReqParamsAPI, BitVectorTest, TestMacroExpander, ChaosMonkeySafeLeaderTest, SyncSliceTest, ShardRoutingTest, ClusterStateUpdateTest, LeaderElectionTest, ZkSolrClientTest, TestZkChroot, TestRandomDVFaceting, TestStressVersions, TestRangeQuery, LeaderInitiatedRecoveryOnShardRestartTest, MoveReplicaHDFSFailoverTest, OverriddenZkACLAndCredentialsProvidersTest, OverseerCollectionConfigSetProcessorTest, OverseerModifyCollectionTest, RecoveryAfterSoftCommitTest, ReplicationFactorTest, RestartWhileUpdatingTest, TestDeleteCollectionOnDownNodes, TestDownShardTolerantSearch, TestLeaderElectionZkExpiry, TestLockTree, TestMiniSolrCloudClusterSSL, TestPullReplicaErrorHandling, TestRandomRequestDistribution, TestRequestForwarding, TestSSLRandomization, TestTolerantUpdateProcessorRandomCloud, CollectionReloadTest, ConcurrentDeleteAndCreateCollectionTest, AutoAddReplicasPlanActionTest, HttpTriggerListenerTest, MetricTriggerTest, NodeAddedTriggerTest, NodeLostTriggerTest, SystemLogListenerTest, TriggerIntegrationTest]
   [junit4] Completed [606/776 (6!)] on J0 in 206.84s, 14 tests, 1 error <<< FAILURES!

[...truncated 3749 lines...]
   [junit4] Suite: org.apache.solr.analytics.facet.PivotFacetTest
   [junit4]   2> Creating dataDir: /home/jenkins/jenkins-slave/workspace/Lucene-Solr-NightlyTests-master/checkout/solr/build/contrib/solr-analytics/test/J0/temp/solr.analytics.facet.PivotFacetTest_AB2FBF1BD9FB8131-001/init-core-data-001
   [junit4]   2> Feb 13, 2018 4:19:43 PM com.carrotsearch.randomizedtesting.ThreadLeakControl checkThreadLeaks
   [junit4]   2> WARNING: Will linger awaiting termination of 2 leaked thread(s).
   [junit4]   2> Feb 13, 2018 4:20:03 PM com.carrotsearch.randomizedtesting.ThreadLeakControl checkThreadLeaks
   [junit4]   2> SEVERE: 1 thread leaked from SUITE scope at org.apache.solr.analytics.facet.PivotFacetTest:
   [junit4]   2>    1) Thread[id=86, name=qtp1670977856-86, state=TIMED_WAITING, group=TGRP-PivotFacetTest]
   [junit4]   2>         at sun.misc.Unsafe.park(Native Method)
   [junit4]   2>         at java.util.concurrent.locks.LockSupport.parkNanos(LockSupport.java:215)
   [junit4]   2>         at java.util.concurrent.locks.AbstractQueuedSynchronizer$ConditionObject.await(AbstractQueuedSynchronizer.java:2163)
   [junit4]   2>         at org.eclipse.jetty.util.thread.ReservedThreadExecutor$ReservedThread.reservedWait(ReservedThreadExecutor.java:308)
   [junit4]   2>         at org.eclipse.jetty.util.thread.ReservedThreadExecutor$ReservedThread.run(ReservedThreadExecutor.java:373)
   [junit4]   2>         at org.eclipse.jetty.util.thread.QueuedThreadPool.runJob(QueuedThreadPool.java:708)
   [junit4]   2>         at org.eclipse.jetty.util.thread.QueuedThreadPool$2.run(QueuedThreadPool.java:626)
   [junit4]   2>         at java.lang.Thread.run(Thread.java:748)
   [junit4]   2> Feb 13, 2018 4:20:03 PM com.carrotsearch.randomizedtesting.ThreadLeakControl tryToInterruptAll
   [junit4]   2> INFO: Starting to interrupt leaked threads:
   [junit4]   2>    1) Thread[id=86, name=qtp1670977856-86, state=TIMED_WAITING, group=TGRP-PivotFacetTest]
   [junit4]   2> Feb 13, 2018 4:20:06 PM com.carrotsearch.randomizedtesting.ThreadLeakControl tryToInterruptAll
   [junit4]   2> SEVERE: There are still zombie threads that couldn't be terminated:
   [junit4]   2>    1) Thread[id=86, name=qtp1670977856-86, state=TIMED_WAITING, group=TGRP-PivotFacetTest]
   [junit4]   2>         at sun.misc.Unsafe.park(Native Method)
   [junit4]   2>         at java.util.concurrent.locks.LockSupport.parkNanos(LockSupport.java:215)
   [junit4]   2>         at java.util.concurrent.locks.AbstractQueuedSynchronizer$ConditionObject.await(AbstractQueuedSynchronizer.java:2163)
   [junit4]   2>         at org.eclipse.jetty.util.thread.ReservedThreadExecutor$ReservedThread.reservedWait(ReservedThreadExecutor.java:308)
   [junit4]   2>         at org.eclipse.jetty.util.thread.ReservedThreadExecutor$ReservedThread.run(ReservedThreadExecutor.java:373)
   [junit4]   2>         at org.eclipse.jetty.util.thread.QueuedThreadPool.runJob(QueuedThreadPool.java:708)
   [junit4]   2>         at org.eclipse.jetty.util.thread.QueuedThreadPool$2.run(QueuedThreadPool.java:626)
   [junit4]   2>         at java.lang.Thread.run(Thread.java:748)
   [junit4]   2> NOTE: test params are: codec=HighCompressionCompressingStoredFields(storedFieldsFormat=CompressingStoredFieldsFormat(compressionMode=HIGH_COMPRESSION, chunkSize=30672, maxDocsPerChunk=9, blockSize=4), termVectorsFormat=CompressingTermVectorsFormat(compressionMode=HIGH_COMPRESSION, chunkSize=30672, blockSize=4)), sim=Asserting(org.apache.lucene.search.similarities.AssertingSimilarity@19ef2fee), locale=fi-FI, timezone=Brazil/Acre
   [junit4]   2> NOTE: Linux 4.4.0-112-generic amd64/Oracle Corporation 1.8.0_152 (64-bit)/cpus=4,threads=2,free=127954744,total=311427072
   [junit4]   2> NOTE: All tests run in this JVM: [FilterFunctionTest, LTFunctionTest, CastingIntValueTest, CastingStringValueStreamTest, CastingBooleanValueStreamTest, LegacyFieldFacetTest, StringCastFunctionTest, GTFunctionTest, NegateFunctionTest, DateMathFunctionTest, PivotFacetTest]
   [junit4]   2> NOTE: download the large Jenkins line-docs file by running 'ant get-jenkins-line-docs' in the lucene directory.
   [junit4]   2> NOTE: reproduce with: ant test  -Dtestcase=PivotFacetTest -Dtests.seed=AB2FBF1BD9FB8131 -Dtests.multiplier=2 -Dtests.nightly=true -Dtests.slow=true -Dtests.linedocsfile=/home/jenkins/jenkins-slave/workspace/Lucene-Solr-NightlyTests-master/test-data/enwiki.random.lines.txt -Dtests.locale=fi-FI -Dtests.timezone=Brazil/Acre -Dtests.asserts=true -Dtests.file.encoding=US-ASCII
   [junit4] ERROR   0.00s J0 | PivotFacetTest (suite) <<<
   [junit4]    > Throwable #1: com.carrotsearch.randomizedtesting.ThreadLeakError: 1 thread leaked from SUITE scope at org.apache.solr.analytics.facet.PivotFacetTest:
   [junit4]    >    1) Thread[id=86, name=qtp1670977856-86, state=TIMED_WAITING, group=TGRP-PivotFacetTest]
   [junit4]    >         at sun.misc.Unsafe.park(Native Method)
   [junit4]    >         at java.util.concurrent.locks.LockSupport.parkNanos(LockSupport.java:215)
   [junit4]    >         at java.util.concurrent.locks.AbstractQueuedSynchronizer$ConditionObject.await(AbstractQueuedSynchronizer.java:2163)
   [junit4]    >         at org.eclipse.jetty.util.thread.ReservedThreadExecutor$ReservedThread.reservedWait(ReservedThreadExecutor.java:308)
   [junit4]    >         at org.eclipse.jetty.util.thread.ReservedThreadExecutor$ReservedThread.run(ReservedThreadExecutor.java:373)
   [junit4]    >         at org.eclipse.jetty.util.thread.QueuedThreadPool.runJob(QueuedThreadPool.java:708)
   [junit4]    >         at org.eclipse.jetty.util.thread.QueuedThreadPool$2.run(QueuedThreadPool.java:626)
   [junit4]    >         at java.lang.Thread.run(Thread.java:748)
   [junit4]    > at __randomizedtesting.SeedInfo.seed([AB2FBF1BD9FB8131]:0)Throwable #2: com.carrotsearch.randomizedtesting.ThreadLeakError: There are still zombie threads that couldn't be terminated:
   [junit4]    >    1) Thread[id=86, name=qtp1670977856-86, state=TIMED_WAITING, group=TGRP-PivotFacetTest]
   [junit4]    >         at sun.misc.Unsafe.park(Native Method)
   [junit4]    >         at java.util.concurrent.locks.LockSupport.parkNanos(LockSupport.java:215)
   [junit4]    >         at java.util.concurrent.locks.AbstractQueuedSynchronizer$ConditionObject.await(AbstractQueuedSynchronizer.java:2163)
   [junit4]    >         at org.eclipse.jetty.util.thread.ReservedThreadExecutor$ReservedThread.reservedWait(ReservedThreadExecutor.java:308)
   [junit4]    >         at org.eclipse.jetty.util.thread.ReservedThreadExecutor$ReservedThread.run(ReservedThreadExecutor.java:373)
   [junit4]    >         at org.eclipse.jetty.util.thread.QueuedThreadPool.runJob(QueuedThreadPool.java:708)
   [junit4]    >         at org.eclipse.jetty.util.thread.QueuedThreadPool$2.run(QueuedThreadPool.java:626)
   [junit4]    >         at java.lang.Thread.run(Thread.java:748)
   [junit4]    > at __randomizedtesting.SeedInfo.seed([AB2FBF1BD9FB8131]:0)
   [junit4] Completed [76/78 (1!)] on J0 in 63.14s, 1 test, 2 errors <<< FAILURES!

[...truncated 45220 lines...]


---------------------------------------------------------------------
To unsubscribe, e-mail: [hidden email]
For additional commands, e-mail: [hidden email]