[JENKINS] Lucene-Solr-NightlyTests-master - Build # 1607 - Unstable

classic Classic list List threaded Threaded
6 messages Options
Reply | Threaded
Open this post in threaded view
|

[JENKINS] Lucene-Solr-NightlyTests-master - Build # 1607 - Unstable

Apache Jenkins Server-2
Build: https://builds.apache.org/job/Lucene-Solr-NightlyTests-master/1607/

1 tests failed.
FAILED:  junit.framework.TestSuite.org.apache.solr.cloud.LeaderTragicEventTest

Error Message:
ObjectTracker found 1 object(s) that were not released!!! [MockDirectoryWrapper] org.apache.solr.common.util.ObjectReleaseTracker$ObjectTrackerException: org.apache.lucene.store.MockDirectoryWrapper  at org.apache.solr.common.util.ObjectReleaseTracker.track(ObjectReleaseTracker.java:42)  at org.apache.solr.core.CachingDirectoryFactory.get(CachingDirectoryFactory.java:348)  at org.apache.solr.update.SolrIndexWriter.create(SolrIndexWriter.java:95)  at org.apache.solr.core.SolrCore.initIndex(SolrCore.java:768)  at org.apache.solr.core.SolrCore.<init>(SolrCore.java:960)  at org.apache.solr.core.SolrCore.<init>(SolrCore.java:869)  at org.apache.solr.core.CoreContainer.createFromDescriptor(CoreContainer.java:1140)  at org.apache.solr.core.CoreContainer.create(CoreContainer.java:1050)  at org.apache.solr.handler.admin.CoreAdminOperation.lambda$static$0(CoreAdminOperation.java:92)  at org.apache.solr.handler.admin.CoreAdminOperation.execute(CoreAdminOperation.java:360)  at org.apache.solr.handler.admin.CoreAdminHandler$CallInfo.call(CoreAdminHandler.java:395)  at org.apache.solr.handler.admin.CoreAdminHandler.handleRequestBody(CoreAdminHandler.java:180)  at org.apache.solr.handler.RequestHandlerBase.handleRequest(RequestHandlerBase.java:199)  at org.apache.solr.servlet.HttpSolrCall.handleAdmin(HttpSolrCall.java:734)  at org.apache.solr.servlet.HttpSolrCall.handleAdminRequest(HttpSolrCall.java:715)  at org.apache.solr.servlet.HttpSolrCall.call(HttpSolrCall.java:496)  at org.apache.solr.servlet.SolrDispatchFilter.doFilter(SolrDispatchFilter.java:377)  at org.apache.solr.servlet.SolrDispatchFilter.doFilter(SolrDispatchFilter.java:323)  at org.eclipse.jetty.servlet.ServletHandler$CachedChain.doFilter(ServletHandler.java:1642)  at org.apache.solr.client.solrj.embedded.JettySolrRunner$DebugFilter.doFilter(JettySolrRunner.java:139)  at org.eclipse.jetty.servlet.ServletHandler$CachedChain.doFilter(ServletHandler.java:1642)  at org.eclipse.jetty.servlet.ServletHandler.doHandle(ServletHandler.java:533)  at org.eclipse.jetty.server.handler.ScopedHandler.nextHandle(ScopedHandler.java:255)  at org.eclipse.jetty.server.session.SessionHandler.doHandle(SessionHandler.java:1595)  at org.eclipse.jetty.server.handler.ScopedHandler.nextHandle(ScopedHandler.java:255)  at org.eclipse.jetty.server.handler.ContextHandler.doHandle(ContextHandler.java:1317)  at org.eclipse.jetty.server.handler.ScopedHandler.nextScope(ScopedHandler.java:203)  at org.eclipse.jetty.servlet.ServletHandler.doScope(ServletHandler.java:473)  at org.eclipse.jetty.server.session.SessionHandler.doScope(SessionHandler.java:1564)  at org.eclipse.jetty.server.handler.ScopedHandler.nextScope(ScopedHandler.java:201)  at org.eclipse.jetty.server.handler.ContextHandler.doScope(ContextHandler.java:1219)  at org.eclipse.jetty.server.handler.ScopedHandler.handle(ScopedHandler.java:144)  at org.eclipse.jetty.server.handler.gzip.GzipHandler.handle(GzipHandler.java:674)  at org.eclipse.jetty.server.handler.HandlerWrapper.handle(HandlerWrapper.java:132)  at org.eclipse.jetty.server.Server.handle(Server.java:531)  at org.eclipse.jetty.server.HttpChannel.handle(HttpChannel.java:352)  at org.eclipse.jetty.server.HttpConnection.onFillable(HttpConnection.java:260)  at org.eclipse.jetty.io.AbstractConnection$ReadCallback.succeeded(AbstractConnection.java:281)  at org.eclipse.jetty.io.FillInterest.fillable(FillInterest.java:102)  at org.eclipse.jetty.io.ChannelEndPoint$2.run(ChannelEndPoint.java:118)  at org.eclipse.jetty.util.thread.QueuedThreadPool.runJob(QueuedThreadPool.java:762)  at org.eclipse.jetty.util.thread.QueuedThreadPool$2.run(QueuedThreadPool.java:680)  at java.lang.Thread.run(Thread.java:748)  

Stack Trace:
java.lang.AssertionError: ObjectTracker found 1 object(s) that were not released!!! [MockDirectoryWrapper]
org.apache.solr.common.util.ObjectReleaseTracker$ObjectTrackerException: org.apache.lucene.store.MockDirectoryWrapper
        at org.apache.solr.common.util.ObjectReleaseTracker.track(ObjectReleaseTracker.java:42)
        at org.apache.solr.core.CachingDirectoryFactory.get(CachingDirectoryFactory.java:348)
        at org.apache.solr.update.SolrIndexWriter.create(SolrIndexWriter.java:95)
        at org.apache.solr.core.SolrCore.initIndex(SolrCore.java:768)
        at org.apache.solr.core.SolrCore.<init>(SolrCore.java:960)
        at org.apache.solr.core.SolrCore.<init>(SolrCore.java:869)
        at org.apache.solr.core.CoreContainer.createFromDescriptor(CoreContainer.java:1140)
        at org.apache.solr.core.CoreContainer.create(CoreContainer.java:1050)
        at org.apache.solr.handler.admin.CoreAdminOperation.lambda$static$0(CoreAdminOperation.java:92)
        at org.apache.solr.handler.admin.CoreAdminOperation.execute(CoreAdminOperation.java:360)
        at org.apache.solr.handler.admin.CoreAdminHandler$CallInfo.call(CoreAdminHandler.java:395)
        at org.apache.solr.handler.admin.CoreAdminHandler.handleRequestBody(CoreAdminHandler.java:180)
        at org.apache.solr.handler.RequestHandlerBase.handleRequest(RequestHandlerBase.java:199)
        at org.apache.solr.servlet.HttpSolrCall.handleAdmin(HttpSolrCall.java:734)
        at org.apache.solr.servlet.HttpSolrCall.handleAdminRequest(HttpSolrCall.java:715)
        at org.apache.solr.servlet.HttpSolrCall.call(HttpSolrCall.java:496)
        at org.apache.solr.servlet.SolrDispatchFilter.doFilter(SolrDispatchFilter.java:377)
        at org.apache.solr.servlet.SolrDispatchFilter.doFilter(SolrDispatchFilter.java:323)
        at org.eclipse.jetty.servlet.ServletHandler$CachedChain.doFilter(ServletHandler.java:1642)
        at org.apache.solr.client.solrj.embedded.JettySolrRunner$DebugFilter.doFilter(JettySolrRunner.java:139)
        at org.eclipse.jetty.servlet.ServletHandler$CachedChain.doFilter(ServletHandler.java:1642)
        at org.eclipse.jetty.servlet.ServletHandler.doHandle(ServletHandler.java:533)
        at org.eclipse.jetty.server.handler.ScopedHandler.nextHandle(ScopedHandler.java:255)
        at org.eclipse.jetty.server.session.SessionHandler.doHandle(SessionHandler.java:1595)
        at org.eclipse.jetty.server.handler.ScopedHandler.nextHandle(ScopedHandler.java:255)
        at org.eclipse.jetty.server.handler.ContextHandler.doHandle(ContextHandler.java:1317)
        at org.eclipse.jetty.server.handler.ScopedHandler.nextScope(ScopedHandler.java:203)
        at org.eclipse.jetty.servlet.ServletHandler.doScope(ServletHandler.java:473)
        at org.eclipse.jetty.server.session.SessionHandler.doScope(SessionHandler.java:1564)
        at org.eclipse.jetty.server.handler.ScopedHandler.nextScope(ScopedHandler.java:201)
        at org.eclipse.jetty.server.handler.ContextHandler.doScope(ContextHandler.java:1219)
        at org.eclipse.jetty.server.handler.ScopedHandler.handle(ScopedHandler.java:144)
        at org.eclipse.jetty.server.handler.gzip.GzipHandler.handle(GzipHandler.java:674)
        at org.eclipse.jetty.server.handler.HandlerWrapper.handle(HandlerWrapper.java:132)
        at org.eclipse.jetty.server.Server.handle(Server.java:531)
        at org.eclipse.jetty.server.HttpChannel.handle(HttpChannel.java:352)
        at org.eclipse.jetty.server.HttpConnection.onFillable(HttpConnection.java:260)
        at org.eclipse.jetty.io.AbstractConnection$ReadCallback.succeeded(AbstractConnection.java:281)
        at org.eclipse.jetty.io.FillInterest.fillable(FillInterest.java:102)
        at org.eclipse.jetty.io.ChannelEndPoint$2.run(ChannelEndPoint.java:118)
        at org.eclipse.jetty.util.thread.QueuedThreadPool.runJob(QueuedThreadPool.java:762)
        at org.eclipse.jetty.util.thread.QueuedThreadPool$2.run(QueuedThreadPool.java:680)
        at java.lang.Thread.run(Thread.java:748)


        at __randomizedtesting.SeedInfo.seed([A09269C3DD49E210]:0)
        at org.junit.Assert.fail(Assert.java:93)
        at org.junit.Assert.assertTrue(Assert.java:43)
        at org.junit.Assert.assertNull(Assert.java:551)
        at org.apache.solr.SolrTestCaseJ4.teardownTestCases(SolrTestCaseJ4.java:304)
        at sun.reflect.GeneratedMethodAccessor65.invoke(Unknown Source)
        at sun.reflect.DelegatingMethodAccessorImpl.invoke(DelegatingMethodAccessorImpl.java:43)
        at java.lang.reflect.Method.invoke(Method.java:498)
        at com.carrotsearch.randomizedtesting.RandomizedRunner.invoke(RandomizedRunner.java:1737)
        at com.carrotsearch.randomizedtesting.RandomizedRunner$7.evaluate(RandomizedRunner.java:897)
        at com.carrotsearch.randomizedtesting.rules.StatementAdapter.evaluate(StatementAdapter.java:36)
        at com.carrotsearch.randomizedtesting.rules.SystemPropertiesRestoreRule$1.evaluate(SystemPropertiesRestoreRule.java:57)
        at org.apache.lucene.util.AbstractBeforeAfterRule$1.evaluate(AbstractBeforeAfterRule.java:45)
        at com.carrotsearch.randomizedtesting.rules.StatementAdapter.evaluate(StatementAdapter.java:36)
        at org.apache.lucene.util.TestRuleStoreClassName$1.evaluate(TestRuleStoreClassName.java:41)
        at com.carrotsearch.randomizedtesting.rules.NoShadowingOrOverridesOnMethodsRule$1.evaluate(NoShadowingOrOverridesOnMethodsRule.java:40)
        at com.carrotsearch.randomizedtesting.rules.NoShadowingOrOverridesOnMethodsRule$1.evaluate(NoShadowingOrOverridesOnMethodsRule.java:40)
        at com.carrotsearch.randomizedtesting.rules.StatementAdapter.evaluate(StatementAdapter.java:36)
        at com.carrotsearch.randomizedtesting.rules.StatementAdapter.evaluate(StatementAdapter.java:36)
        at com.carrotsearch.randomizedtesting.rules.StatementAdapter.evaluate(StatementAdapter.java:36)
        at org.apache.lucene.util.TestRuleAssertionsRequired$1.evaluate(TestRuleAssertionsRequired.java:53)
        at org.apache.lucene.util.TestRuleMarkFailure$1.evaluate(TestRuleMarkFailure.java:47)
        at org.apache.lucene.util.TestRuleIgnoreAfterMaxFailures$1.evaluate(TestRuleIgnoreAfterMaxFailures.java:64)
        at org.apache.lucene.util.TestRuleIgnoreTestSuites$1.evaluate(TestRuleIgnoreTestSuites.java:54)
        at com.carrotsearch.randomizedtesting.rules.StatementAdapter.evaluate(StatementAdapter.java:36)
        at com.carrotsearch.randomizedtesting.ThreadLeakControl$StatementRunner.run(ThreadLeakControl.java:368)
        at java.lang.Thread.run(Thread.java:748)




Build Log:
[...truncated 14352 lines...]
   [junit4] Suite: org.apache.solr.cloud.LeaderTragicEventTest
   [junit4]   2> 1847339 INFO  (SUITE-LeaderTragicEventTest-seed#[A09269C3DD49E210]-worker) [    ] o.a.s.SolrTestCaseJ4 SecureRandom sanity checks: test.solr.allowed.securerandom=null & java.security.egd=file:/dev/./urandom
   [junit4]   2> Creating dataDir: /x1/jenkins/jenkins-slave/workspace/Lucene-Solr-NightlyTests-master/checkout/solr/build/solr-core/test/J1/temp/solr.cloud.LeaderTragicEventTest_A09269C3DD49E210-001/init-core-data-001
   [junit4]   2> 1847339 WARN  (SUITE-LeaderTragicEventTest-seed#[A09269C3DD49E210]-worker) [    ] o.a.s.SolrTestCaseJ4 startTrackingSearchers: numOpens=335 numCloses=335
   [junit4]   2> 1847339 INFO  (SUITE-LeaderTragicEventTest-seed#[A09269C3DD49E210]-worker) [    ] o.a.s.SolrTestCaseJ4 Using TrieFields (NUMERIC_POINTS_SYSPROP=false) w/NUMERIC_DOCVALUES_SYSPROP=false
   [junit4]   2> 1847341 INFO  (SUITE-LeaderTragicEventTest-seed#[A09269C3DD49E210]-worker) [    ] o.a.s.SolrTestCaseJ4 Randomized ssl (false) and clientAuth (false) via: @org.apache.solr.util.RandomizeSSL(reason=, ssl=NaN, value=NaN, clientAuth=NaN)
   [junit4]   2> 1847342 INFO  (SUITE-LeaderTragicEventTest-seed#[A09269C3DD49E210]-worker) [    ] o.a.s.c.MiniSolrCloudCluster Starting cluster of 2 servers in /x1/jenkins/jenkins-slave/workspace/Lucene-Solr-NightlyTests-master/checkout/solr/build/solr-core/test/J1/temp/solr.cloud.LeaderTragicEventTest_A09269C3DD49E210-001/tempDir-001
   [junit4]   2> 1847342 INFO  (SUITE-LeaderTragicEventTest-seed#[A09269C3DD49E210]-worker) [    ] o.a.s.c.ZkTestServer STARTING ZK TEST SERVER
   [junit4]   2> 1847342 INFO  (Thread-12153) [    ] o.a.s.c.ZkTestServer client port:0.0.0.0/0.0.0.0:0
   [junit4]   2> 1847342 INFO  (Thread-12153) [    ] o.a.s.c.ZkTestServer Starting server
   [junit4]   2> 1847344 ERROR (Thread-12153) [    ] o.a.z.s.ZooKeeperServer ZKShutdownHandler is not registered, so ZooKeeper server won't take any action on ERROR or SHUTDOWN server state changes
   [junit4]   2> 1847442 INFO  (SUITE-LeaderTragicEventTest-seed#[A09269C3DD49E210]-worker) [    ] o.a.s.c.ZkTestServer start zk server on port:39053
   [junit4]   2> 1847445 INFO  (zkConnectionManagerCallback-5469-thread-1) [    ] o.a.s.c.c.ConnectionManager zkClient has connected
   [junit4]   2> 1847449 INFO  (jetty-launcher-5466-thread-2) [    ] o.e.j.s.Server jetty-9.4.11.v20180605; built: 2018-06-05T18:24:03.829Z; git: d5fc0523cfa96bfebfbda19606cad384d772f04c; jvm 1.8.0_172-b11
   [junit4]   2> 1847449 INFO  (jetty-launcher-5466-thread-1) [    ] o.e.j.s.Server jetty-9.4.11.v20180605; built: 2018-06-05T18:24:03.829Z; git: d5fc0523cfa96bfebfbda19606cad384d772f04c; jvm 1.8.0_172-b11
   [junit4]   2> 1847450 INFO  (jetty-launcher-5466-thread-1) [    ] o.e.j.s.session DefaultSessionIdManager workerName=node0
   [junit4]   2> 1847451 INFO  (jetty-launcher-5466-thread-1) [    ] o.e.j.s.session No SessionScavenger set, using defaults
   [junit4]   2> 1847451 INFO  (jetty-launcher-5466-thread-1) [    ] o.e.j.s.session node0 Scavenging every 600000ms
   [junit4]   2> 1847451 INFO  (jetty-launcher-5466-thread-1) [    ] o.e.j.s.h.ContextHandler Started o.e.j.s.ServletContextHandler@558585ac{/solr,null,AVAILABLE}
   [junit4]   2> 1847451 INFO  (jetty-launcher-5466-thread-1) [    ] o.e.j.s.AbstractConnector Started ServerConnector@7a3d1cad{HTTP/1.1,[http/1.1]}{127.0.0.1:43044}
   [junit4]   2> 1847451 INFO  (jetty-launcher-5466-thread-1) [    ] o.e.j.s.Server Started @1847492ms
   [junit4]   2> 1847451 INFO  (jetty-launcher-5466-thread-1) [    ] o.a.s.c.s.e.JettySolrRunner Jetty properties: {hostContext=/solr, hostPort=43044}
   [junit4]   2> 1847452 ERROR (jetty-launcher-5466-thread-1) [    ] o.a.s.u.StartupLoggingUtils Missing Java Option solr.log.dir. Logging may be missing or incomplete.
   [junit4]   2> 1847452 INFO  (jetty-launcher-5466-thread-1) [    ] o.a.s.s.SolrDispatchFilter Using logger factory org.apache.logging.slf4j.Log4jLoggerFactory
   [junit4]   2> 1847452 INFO  (jetty-launcher-5466-thread-1) [    ] o.a.s.s.SolrDispatchFilter  ___      _       Welcome to Apache Solr™ version 8.0.0
   [junit4]   2> 1847452 INFO  (jetty-launcher-5466-thread-1) [    ] o.a.s.s.SolrDispatchFilter / __| ___| |_ _   Starting in cloud mode on port null
   [junit4]   2> 1847452 INFO  (jetty-launcher-5466-thread-1) [    ] o.a.s.s.SolrDispatchFilter \__ \/ _ \ | '_|  Install dir: null
   [junit4]   2> 1847452 INFO  (jetty-launcher-5466-thread-1) [    ] o.a.s.s.SolrDispatchFilter |___/\___/_|_|    Start time: 2018-08-08T09:29:39.622Z
   [junit4]   2> 1847452 INFO  (jetty-launcher-5466-thread-2) [    ] o.e.j.s.session DefaultSessionIdManager workerName=node0
   [junit4]   2> 1847452 INFO  (jetty-launcher-5466-thread-2) [    ] o.e.j.s.session No SessionScavenger set, using defaults
   [junit4]   2> 1847452 INFO  (jetty-launcher-5466-thread-2) [    ] o.e.j.s.session node0 Scavenging every 660000ms
   [junit4]   2> 1847453 INFO  (jetty-launcher-5466-thread-2) [    ] o.e.j.s.h.ContextHandler Started o.e.j.s.ServletContextHandler@48d2011a{/solr,null,AVAILABLE}
   [junit4]   2> 1847453 INFO  (jetty-launcher-5466-thread-2) [    ] o.e.j.s.AbstractConnector Started ServerConnector@16145285{HTTP/1.1,[http/1.1]}{127.0.0.1:33785}
   [junit4]   2> 1847453 INFO  (jetty-launcher-5466-thread-2) [    ] o.e.j.s.Server Started @1847494ms
   [junit4]   2> 1847453 INFO  (jetty-launcher-5466-thread-2) [    ] o.a.s.c.s.e.JettySolrRunner Jetty properties: {hostContext=/solr, hostPort=33785}
   [junit4]   2> 1847453 ERROR (jetty-launcher-5466-thread-2) [    ] o.a.s.u.StartupLoggingUtils Missing Java Option solr.log.dir. Logging may be missing or incomplete.
   [junit4]   2> 1847453 INFO  (jetty-launcher-5466-thread-2) [    ] o.a.s.s.SolrDispatchFilter Using logger factory org.apache.logging.slf4j.Log4jLoggerFactory
   [junit4]   2> 1847453 INFO  (jetty-launcher-5466-thread-2) [    ] o.a.s.s.SolrDispatchFilter  ___      _       Welcome to Apache Solr™ version 8.0.0
   [junit4]   2> 1847454 INFO  (jetty-launcher-5466-thread-2) [    ] o.a.s.s.SolrDispatchFilter / __| ___| |_ _   Starting in cloud mode on port null
   [junit4]   2> 1847454 INFO  (jetty-launcher-5466-thread-2) [    ] o.a.s.s.SolrDispatchFilter \__ \/ _ \ | '_|  Install dir: null
   [junit4]   2> 1847454 INFO  (jetty-launcher-5466-thread-2) [    ] o.a.s.s.SolrDispatchFilter |___/\___/_|_|    Start time: 2018-08-08T09:29:39.624Z
   [junit4]   2> 1847454 INFO  (zkConnectionManagerCallback-5471-thread-1) [    ] o.a.s.c.c.ConnectionManager zkClient has connected
   [junit4]   2> 1847455 INFO  (zkConnectionManagerCallback-5473-thread-1) [    ] o.a.s.c.c.ConnectionManager zkClient has connected
   [junit4]   2> 1847455 INFO  (jetty-launcher-5466-thread-1) [    ] o.a.s.s.SolrDispatchFilter solr.xml found in ZooKeeper. Loading...
   [junit4]   2> 1847460 INFO  (jetty-launcher-5466-thread-2) [    ] o.a.s.s.SolrDispatchFilter solr.xml found in ZooKeeper. Loading...
   [junit4]   2> 1847642 INFO  (jetty-launcher-5466-thread-2) [    ] o.a.s.c.ZkContainer Zookeeper client=127.0.0.1:39053/solr
   [junit4]   2> 1847644 INFO  (zkConnectionManagerCallback-5477-thread-1) [    ] o.a.s.c.c.ConnectionManager zkClient has connected
   [junit4]   2> 1847647 INFO  (zkConnectionManagerCallback-5479-thread-1) [    ] o.a.s.c.c.ConnectionManager zkClient has connected
   [junit4]   2> 1847699 INFO  (jetty-launcher-5466-thread-1) [    ] o.a.s.c.ZkContainer Zookeeper client=127.0.0.1:39053/solr
   [junit4]   2> 1847702 INFO  (zkConnectionManagerCallback-5485-thread-1) [    ] o.a.s.c.c.ConnectionManager zkClient has connected
   [junit4]   2> 1847704 INFO  (zkConnectionManagerCallback-5487-thread-1) [    ] o.a.s.c.c.ConnectionManager zkClient has connected
   [junit4]   2> 1847709 INFO  (jetty-launcher-5466-thread-2) [n:127.0.0.1:33785_solr    ] o.a.s.c.OverseerElectionContext I am going to be the leader 127.0.0.1:33785_solr
   [junit4]   2> 1847710 INFO  (jetty-launcher-5466-thread-2) [n:127.0.0.1:33785_solr    ] o.a.s.c.Overseer Overseer (id=72123742487511044-127.0.0.1:33785_solr-n_0000000000) starting
   [junit4]   2> 1847714 INFO  (jetty-launcher-5466-thread-1) [n:127.0.0.1:43044_solr    ] o.a.s.c.ZkController Register node as live in ZooKeeper:/live_nodes/127.0.0.1:43044_solr
   [junit4]   2> 1847716 INFO  (zkCallback-5478-thread-1) [    ] o.a.s.c.c.ZkStateReader Updated live nodes from ZooKeeper... (0) -> (1)
   [junit4]   2> 1847724 INFO  (zkCallback-5486-thread-1) [    ] o.a.s.c.c.ZkStateReader Updated live nodes from ZooKeeper... (0) -> (1)
   [junit4]   2> 1847728 INFO  (zkConnectionManagerCallback-5494-thread-1) [    ] o.a.s.c.c.ConnectionManager zkClient has connected
   [junit4]   2> 1847729 INFO  (jetty-launcher-5466-thread-2) [n:127.0.0.1:33785_solr    ] o.a.s.c.c.ZkStateReader Updated live nodes from ZooKeeper... (0) -> (1)
   [junit4]   2> 1847730 INFO  (jetty-launcher-5466-thread-2) [n:127.0.0.1:33785_solr    ] o.a.s.c.s.i.ZkClientClusterStateProvider Cluster at 127.0.0.1:39053/solr ready
   [junit4]   2> 1847731 INFO  (OverseerStateUpdate-72123742487511044-127.0.0.1:33785_solr-n_0000000000) [    ] o.a.s.c.Overseer Starting to work on the main queue : 127.0.0.1:33785_solr
   [junit4]   2> 1847737 INFO  (jetty-launcher-5466-thread-2) [n:127.0.0.1:33785_solr    ] o.a.s.c.TransientSolrCoreCacheDefault Allocating transient cache for 2147483647 transient cores
   [junit4]   2> 1847737 INFO  (jetty-launcher-5466-thread-2) [n:127.0.0.1:33785_solr    ] o.a.s.c.ZkController Register node as live in ZooKeeper:/live_nodes/127.0.0.1:33785_solr
   [junit4]   2> 1847737 INFO  (zkConnectionManagerCallback-5499-thread-1) [    ] o.a.s.c.c.ConnectionManager zkClient has connected
   [junit4]   2> 1847744 INFO  (zkCallback-5486-thread-1) [    ] o.a.s.c.c.ZkStateReader Updated live nodes from ZooKeeper... (1) -> (2)
   [junit4]   2> 1847744 INFO  (zkCallback-5478-thread-1) [    ] o.a.s.c.c.ZkStateReader Updated live nodes from ZooKeeper... (1) -> (2)
   [junit4]   2> 1847745 INFO  (jetty-launcher-5466-thread-1) [n:127.0.0.1:43044_solr    ] o.a.s.c.c.ZkStateReader Updated live nodes from ZooKeeper... (0) -> (2)
   [junit4]   2> 1847746 INFO  (jetty-launcher-5466-thread-1) [n:127.0.0.1:43044_solr    ] o.a.s.c.s.i.ZkClientClusterStateProvider Cluster at 127.0.0.1:39053/solr ready
   [junit4]   2> 1847747 INFO  (zkCallback-5493-thread-1) [    ] o.a.s.c.c.ZkStateReader Updated live nodes from ZooKeeper... (1) -> (2)
   [junit4]   2> 1847747 INFO  (jetty-launcher-5466-thread-1) [n:127.0.0.1:43044_solr    ] o.a.s.h.a.MetricsHistoryHandler No .system collection, keeping metrics history in memory.
   [junit4]   2> 1847760 INFO  (jetty-launcher-5466-thread-2) [n:127.0.0.1:33785_solr    ] o.a.s.h.a.MetricsHistoryHandler No .system collection, keeping metrics history in memory.
   [junit4]   2> 1847777 INFO  (jetty-launcher-5466-thread-1) [n:127.0.0.1:43044_solr    ] o.a.s.m.r.SolrJmxReporter JMX monitoring for 'solr_43044.solr.node' (registry 'solr.node') enabled at server: com.sun.jmx.mbeanserver.JmxMBeanServer@7e13677a
   [junit4]   2> 1847785 INFO  (jetty-launcher-5466-thread-1) [n:127.0.0.1:43044_solr    ] o.a.s.m.r.SolrJmxReporter JMX monitoring for 'solr_43044.solr.jvm' (registry 'solr.jvm') enabled at server: com.sun.jmx.mbeanserver.JmxMBeanServer@7e13677a
   [junit4]   2> 1847785 INFO  (jetty-launcher-5466-thread-1) [n:127.0.0.1:43044_solr    ] o.a.s.m.r.SolrJmxReporter JMX monitoring for 'solr_43044.solr.jetty' (registry 'solr.jetty') enabled at server: com.sun.jmx.mbeanserver.JmxMBeanServer@7e13677a
   [junit4]   2> 1847786 INFO  (jetty-launcher-5466-thread-1) [n:127.0.0.1:43044_solr    ] o.a.s.c.CorePropertiesLocator Found 0 core definitions underneath /x1/jenkins/jenkins-slave/workspace/Lucene-Solr-NightlyTests-master/checkout/solr/build/solr-core/test/J1/temp/solr.cloud.LeaderTragicEventTest_A09269C3DD49E210-001/tempDir-001/node1/.
   [junit4]   2> 1847787 INFO  (jetty-launcher-5466-thread-2) [n:127.0.0.1:33785_solr    ] o.a.s.m.r.SolrJmxReporter JMX monitoring for 'solr_33785.solr.node' (registry 'solr.node') enabled at server: com.sun.jmx.mbeanserver.JmxMBeanServer@7e13677a
   [junit4]   2> 1847793 INFO  (jetty-launcher-5466-thread-2) [n:127.0.0.1:33785_solr    ] o.a.s.m.r.SolrJmxReporter JMX monitoring for 'solr_33785.solr.jvm' (registry 'solr.jvm') enabled at server: com.sun.jmx.mbeanserver.JmxMBeanServer@7e13677a
   [junit4]   2> 1847793 INFO  (jetty-launcher-5466-thread-2) [n:127.0.0.1:33785_solr    ] o.a.s.m.r.SolrJmxReporter JMX monitoring for 'solr_33785.solr.jetty' (registry 'solr.jetty') enabled at server: com.sun.jmx.mbeanserver.JmxMBeanServer@7e13677a
   [junit4]   2> 1847794 INFO  (jetty-launcher-5466-thread-2) [n:127.0.0.1:33785_solr    ] o.a.s.c.CorePropertiesLocator Found 0 core definitions underneath /x1/jenkins/jenkins-slave/workspace/Lucene-Solr-NightlyTests-master/checkout/solr/build/solr-core/test/J1/temp/solr.cloud.LeaderTragicEventTest_A09269C3DD49E210-001/tempDir-001/node2/.
   [junit4]   2> 1847825 INFO  (zkConnectionManagerCallback-5503-thread-1) [    ] o.a.s.c.c.ConnectionManager zkClient has connected
   [junit4]   2> 1847828 INFO  (zkConnectionManagerCallback-5508-thread-1) [    ] o.a.s.c.c.ConnectionManager zkClient has connected
   [junit4]   2> 1847829 INFO  (SUITE-LeaderTragicEventTest-seed#[A09269C3DD49E210]-worker) [    ] o.a.s.c.c.ZkStateReader Updated live nodes from ZooKeeper... (0) -> (2)
   [junit4]   2> 1847829 INFO  (SUITE-LeaderTragicEventTest-seed#[A09269C3DD49E210]-worker) [    ] o.a.s.c.s.i.ZkClientClusterStateProvider Cluster at 127.0.0.1:39053/solr ready
   [junit4]   2> 1847860 INFO  (TEST-LeaderTragicEventTest.testOtherReplicasAreNotActive-seed#[A09269C3DD49E210]) [    ] o.a.s.SolrTestCaseJ4 ###Starting testOtherReplicasAreNotActive
   [junit4]   2> 1847862 INFO  (qtp1563372743-27075) [n:127.0.0.1:33785_solr    ] o.a.s.h.a.CollectionsHandler Invoked Collection Action :create with params collection.configName=config&name=collection2&nrtReplicas=1&action=CREATE&numShards=1&wt=javabin&version=2 and sendToOCPQueue=true
   [junit4]   2> 1847864 INFO  (OverseerThreadFactory-7987-thread-1) [    ] o.a.s.c.a.c.CreateCollectionCmd Create collection collection2
   [junit4]   2> 1847973 INFO  (OverseerStateUpdate-72123742487511044-127.0.0.1:33785_solr-n_0000000000) [    ] o.a.s.c.o.SliceMutator createReplica() {
   [junit4]   2>   "operation":"ADDREPLICA",
   [junit4]   2>   "collection":"collection2",
   [junit4]   2>   "shard":"shard1",
   [junit4]   2>   "core":"collection2_shard1_replica_n1",
   [junit4]   2>   "state":"down",
   [junit4]   2>   "base_url":"http://127.0.0.1:33785/solr",
   [junit4]   2>   "type":"NRT",
   [junit4]   2>   "waitForFinalState":"false"}
   [junit4]   2> 1848176 INFO  (qtp1563372743-27067) [n:127.0.0.1:33785_solr    x:collection2_shard1_replica_n1] o.a.s.h.a.CoreAdminOperation core create command qt=/admin/cores&coreNodeName=core_node2&collection.configName=config&newCollection=true&name=collection2_shard1_replica_n1&action=CREATE&numShards=1&collection=collection2&shard=shard1&wt=javabin&version=2&replicaType=NRT
   [junit4]   2> 1849190 INFO  (qtp1563372743-27067) [n:127.0.0.1:33785_solr c:collection2 s:shard1 r:core_node2 x:collection2_shard1_replica_n1] o.a.s.c.SolrConfig Using Lucene MatchVersion: 8.0.0
   [junit4]   2> 1849209 INFO  (qtp1563372743-27067) [n:127.0.0.1:33785_solr c:collection2 s:shard1 r:core_node2 x:collection2_shard1_replica_n1] o.a.s.s.IndexSchema [collection2_shard1_replica_n1] Schema name=minimal
   [junit4]   2> 1849212 INFO  (qtp1563372743-27067) [n:127.0.0.1:33785_solr c:collection2 s:shard1 r:core_node2 x:collection2_shard1_replica_n1] o.a.s.s.IndexSchema Loaded schema minimal/1.1 with uniqueid field id
   [junit4]   2> 1849212 INFO  (qtp1563372743-27067) [n:127.0.0.1:33785_solr c:collection2 s:shard1 r:core_node2 x:collection2_shard1_replica_n1] o.a.s.c.CoreContainer Creating SolrCore 'collection2_shard1_replica_n1' using configuration from collection collection2, trusted=true
   [junit4]   2> 1849212 INFO  (qtp1563372743-27067) [n:127.0.0.1:33785_solr c:collection2 s:shard1 r:core_node2 x:collection2_shard1_replica_n1] o.a.s.m.r.SolrJmxReporter JMX monitoring for 'solr_33785.solr.core.collection2.shard1.replica_n1' (registry 'solr.core.collection2.shard1.replica_n1') enabled at server: com.sun.jmx.mbeanserver.JmxMBeanServer@7e13677a
   [junit4]   2> 1849213 INFO  (qtp1563372743-27067) [n:127.0.0.1:33785_solr c:collection2 s:shard1 r:core_node2 x:collection2_shard1_replica_n1] o.a.s.c.SolrCore solr.RecoveryStrategy.Builder
   [junit4]   2> 1849213 INFO  (qtp1563372743-27067) [n:127.0.0.1:33785_solr c:collection2 s:shard1 r:core_node2 x:collection2_shard1_replica_n1] o.a.s.c.SolrCore [[collection2_shard1_replica_n1] ] Opening new SolrCore at [/x1/jenkins/jenkins-slave/workspace/Lucene-Solr-NightlyTests-master/checkout/solr/build/solr-core/test/J1/temp/solr.cloud.LeaderTragicEventTest_A09269C3DD49E210-001/tempDir-001/node2/collection2_shard1_replica_n1], dataDir=[/x1/jenkins/jenkins-slave/workspace/Lucene-Solr-NightlyTests-master/checkout/solr/build/solr-core/test/J1/temp/solr.cloud.LeaderTragicEventTest_A09269C3DD49E210-001/tempDir-001/node2/./collection2_shard1_replica_n1/data/]
   [junit4]   2> 1849275 INFO  (qtp1563372743-27067) [n:127.0.0.1:33785_solr c:collection2 s:shard1 r:core_node2 x:collection2_shard1_replica_n1] o.a.s.u.UpdateHandler Using UpdateLog implementation: org.apache.solr.update.UpdateLog
   [junit4]   2> 1849275 INFO  (qtp1563372743-27067) [n:127.0.0.1:33785_solr c:collection2 s:shard1 r:core_node2 x:collection2_shard1_replica_n1] o.a.s.u.UpdateLog Initializing UpdateLog: dataDir=null defaultSyncLevel=FLUSH numRecordsToKeep=100 maxNumLogsToKeep=10 numVersionBuckets=65536
   [junit4]   2> 1849277 INFO  (qtp1563372743-27067) [n:127.0.0.1:33785_solr c:collection2 s:shard1 r:core_node2 x:collection2_shard1_replica_n1] o.a.s.u.CommitTracker Hard AutoCommit: disabled
   [junit4]   2> 1849277 INFO  (qtp1563372743-27067) [n:127.0.0.1:33785_solr c:collection2 s:shard1 r:core_node2 x:collection2_shard1_replica_n1] o.a.s.u.CommitTracker Soft AutoCommit: disabled
   [junit4]   2> 1849279 INFO  (qtp1563372743-27067) [n:127.0.0.1:33785_solr c:collection2 s:shard1 r:core_node2 x:collection2_shard1_replica_n1] o.a.s.s.SolrIndexSearcher Opening [Searcher@dfabcec[collection2_shard1_replica_n1] main]
   [junit4]   2> 1849280 INFO  (qtp1563372743-27067) [n:127.0.0.1:33785_solr c:collection2 s:shard1 r:core_node2 x:collection2_shard1_replica_n1] o.a.s.r.ManagedResourceStorage Configured ZooKeeperStorageIO with znodeBase: /configs/config
   [junit4]   2> 1849280 INFO  (qtp1563372743-27067) [n:127.0.0.1:33785_solr c:collection2 s:shard1 r:core_node2 x:collection2_shard1_replica_n1] o.a.s.r.ManagedResourceStorage Loaded null at path _rest_managed.json using ZooKeeperStorageIO:path=/configs/config
   [junit4]   2> 1849281 INFO  (qtp1563372743-27067) [n:127.0.0.1:33785_solr c:collection2 s:shard1 r:core_node2 x:collection2_shard1_replica_n1] o.a.s.h.ReplicationHandler Commits will be reserved for 10000ms.
   [junit4]   2> 1849281 INFO  (qtp1563372743-27067) [n:127.0.0.1:33785_solr c:collection2 s:shard1 r:core_node2 x:collection2_shard1_replica_n1] o.a.s.u.UpdateLog Could not find max version in index or recent updates, using new clock 1608222592415563776
   [junit4]   2> 1849282 INFO  (searcherExecutor-7995-thread-1-processing-n:127.0.0.1:33785_solr x:collection2_shard1_replica_n1 c:collection2 s:shard1 r:core_node2) [n:127.0.0.1:33785_solr c:collection2 s:shard1 r:core_node2 x:collection2_shard1_replica_n1] o.a.s.c.SolrCore [collection2_shard1_replica_n1] Registered new searcher Searcher@dfabcec[collection2_shard1_replica_n1] main{ExitableDirectoryReader(UninvertingDirectoryReader())}
   [junit4]   2> 1849287 INFO  (qtp1563372743-27067) [n:127.0.0.1:33785_solr c:collection2 s:shard1 r:core_node2 x:collection2_shard1_replica_n1] o.a.s.c.ZkShardTerms Successful update of terms at /collections/collection2/terms/shard1 to Terms{values={core_node2=0}, version=0}
   [junit4]   2> 1849290 INFO  (qtp1563372743-27067) [n:127.0.0.1:33785_solr c:collection2 s:shard1 r:core_node2 x:collection2_shard1_replica_n1] o.a.s.c.ShardLeaderElectionContext Enough replicas found to continue.
   [junit4]   2> 1849290 INFO  (qtp1563372743-27067) [n:127.0.0.1:33785_solr c:collection2 s:shard1 r:core_node2 x:collection2_shard1_replica_n1] o.a.s.c.ShardLeaderElectionContext I may be the new leader - try and sync
   [junit4]   2> 1849290 INFO  (qtp1563372743-27067) [n:127.0.0.1:33785_solr c:collection2 s:shard1 r:core_node2 x:collection2_shard1_replica_n1] o.a.s.c.SyncStrategy Sync replicas to http://127.0.0.1:33785/solr/collection2_shard1_replica_n1/
   [junit4]   2> 1849291 INFO  (qtp1563372743-27067) [n:127.0.0.1:33785_solr c:collection2 s:shard1 r:core_node2 x:collection2_shard1_replica_n1] o.a.s.c.SyncStrategy Sync Success - now sync replicas to me
   [junit4]   2> 1849291 INFO  (qtp1563372743-27067) [n:127.0.0.1:33785_solr c:collection2 s:shard1 r:core_node2 x:collection2_shard1_replica_n1] o.a.s.c.SyncStrategy http://127.0.0.1:33785/solr/collection2_shard1_replica_n1/ has no replicas
   [junit4]   2> 1849291 INFO  (qtp1563372743-27067) [n:127.0.0.1:33785_solr c:collection2 s:shard1 r:core_node2 x:collection2_shard1_replica_n1] o.a.s.c.ShardLeaderElectionContext Found all replicas participating in election, clear LIR
   [junit4]   2> 1849295 INFO  (qtp1563372743-27067) [n:127.0.0.1:33785_solr c:collection2 s:shard1 r:core_node2 x:collection2_shard1_replica_n1] o.a.s.c.ShardLeaderElectionContext I am the new leader: http://127.0.0.1:33785/solr/collection2_shard1_replica_n1/ shard1
   [junit4]   2> 1849397 INFO  (qtp1563372743-27067) [n:127.0.0.1:33785_solr c:collection2 s:shard1 r:core_node2 x:collection2_shard1_replica_n1] o.a.s.c.ZkController I am the leader, no recovery necessary
   [junit4]   2> 1849399 INFO  (qtp1563372743-27067) [n:127.0.0.1:33785_solr c:collection2 s:shard1 r:core_node2 x:collection2_shard1_replica_n1] o.a.s.s.HttpSolrCall [admin] webapp=null path=/admin/cores params={qt=/admin/cores&coreNodeName=core_node2&collection.configName=config&newCollection=true&name=collection2_shard1_replica_n1&action=CREATE&numShards=1&collection=collection2&shard=shard1&wt=javabin&version=2&replicaType=NRT} status=0 QTime=1224
   [junit4]   2> 1849402 INFO  (qtp1563372743-27075) [n:127.0.0.1:33785_solr    ] o.a.s.h.a.CollectionsHandler Wait for new collection to be active for at most 30 seconds. Check all shard replicas
   [junit4]   2> 1849500 INFO  (zkCallback-5478-thread-1) [    ] o.a.s.c.c.ZkStateReader A cluster state change: [WatchedEvent state:SyncConnected type:NodeDataChanged path:/collections/collection2/state.json] for collection [collection2] has occurred - updating... (live nodes size: [2])
   [junit4]   2> 1849865 INFO  (OverseerCollectionConfigSetProcessor-72123742487511044-127.0.0.1:33785_solr-n_0000000000) [    ] o.a.s.c.OverseerTaskQueue Response ZK path: /overseer/collection-queue-work/qnr-0000000000 doesn't exist.  Requestor may have disconnected from ZooKeeper
   [junit4]   2> 1850402 INFO  (qtp1563372743-27075) [n:127.0.0.1:33785_solr    ] o.a.s.s.HttpSolrCall [admin] webapp=null path=/admin/collections params={collection.configName=config&name=collection2&nrtReplicas=1&action=CREATE&numShards=1&wt=javabin&version=2} status=0 QTime=2540
   [junit4]   2> 1850403 INFO  (TEST-LeaderTragicEventTest.testOtherReplicasAreNotActive-seed#[A09269C3DD49E210]) [    ] o.a.s.c.LeaderTragicEventTest Corrupt leader : core_node2:{"core":"collection2_shard1_replica_n1","base_url":"http://127.0.0.1:33785/solr","node_name":"127.0.0.1:33785_solr","state":"active","type":"NRT","force_set_state":"false","leader":"true"}
   [junit4]   2> 1850411 INFO  (qtp1563372743-27068) [n:127.0.0.1:33785_solr c:collection2 s:shard1 r:core_node2 x:collection2_shard1_replica_n1] o.a.s.c.ZkShardTerms Successful update of terms at /collections/collection2/terms/shard1 to Terms{values={core_node2=1}, version=1}
   [junit4]   2> 1850411 INFO  (qtp1563372743-27068) [n:127.0.0.1:33785_solr c:collection2 s:shard1 r:core_node2 x:collection2_shard1_replica_n1] o.a.s.u.p.LogUpdateProcessorFactory [collection2_shard1_replica_n1]  webapp=/solr path=/update params={wt=javabin&version=2}{add=[0 (1608222593595211776)]} 0 4
   [junit4]   2> 1850411 INFO  (qtp1563372743-27068) [n:127.0.0.1:33785_solr c:collection2 s:shard1 r:core_node2 x:collection2_shard1_replica_n1] o.a.s.u.DirectUpdateHandler2 start commit{_version_=1608222593600454656,optimize=false,openSearcher=true,waitSearcher=true,expungeDeletes=false,softCommit=false,prepareCommit=false}
   [junit4]   2> 1850411 INFO  (qtp1563372743-27068) [n:127.0.0.1:33785_solr c:collection2 s:shard1 r:core_node2 x:collection2_shard1_replica_n1] o.a.s.u.SolrIndexWriter Calling setCommitData with IW:org.apache.solr.update.SolrIndexWriter@4db97262 commitCommandVersion:1608222593600454656
   [junit4]   2> 1850435 INFO  (qtp1563372743-27068) [n:127.0.0.1:33785_solr c:collection2 s:shard1 r:core_node2 x:collection2_shard1_replica_n1] o.a.s.s.SolrIndexSearcher Opening [Searcher@3ff12dad[collection2_shard1_replica_n1] main]
   [junit4]   2> 1850435 INFO  (qtp1563372743-27068) [n:127.0.0.1:33785_solr c:collection2 s:shard1 r:core_node2 x:collection2_shard1_replica_n1] o.a.s.u.DirectUpdateHandler2 end_commit_flush
   [junit4]   2> 1850436 INFO  (searcherExecutor-7995-thread-1-processing-n:127.0.0.1:33785_solr x:collection2_shard1_replica_n1 c:collection2 s:shard1 r:core_node2) [n:127.0.0.1:33785_solr c:collection2 s:shard1 r:core_node2 x:collection2_shard1_replica_n1] o.a.s.c.SolrCore [collection2_shard1_replica_n1] Registered new searcher Searcher@3ff12dad[collection2_shard1_replica_n1] main{ExitableDirectoryReader(UninvertingDirectoryReader(Uninverting(_0(8.0.0):C1)))}
   [junit4]   2> 1850436 INFO  (qtp1563372743-27068) [n:127.0.0.1:33785_solr c:collection2 s:shard1 r:core_node2 x:collection2_shard1_replica_n1] o.a.s.u.p.LogUpdateProcessorFactory [collection2_shard1_replica_n1]  webapp=/solr path=/update params={waitSearcher=true&commit=true&softCommit=false&wt=javabin&version=2}{commit=} 0 25
   [junit4]   2> 1850440 INFO  (qtp1563372743-27083) [n:127.0.0.1:33785_solr c:collection2 s:shard1 r:core_node2 x:collection2_shard1_replica_n1] o.a.s.u.p.LogUpdateProcessorFactory [collection2_shard1_replica_n1]  webapp=/solr path=/update params={wt=javabin&version=2}{add=[1 (1608222593628766208)]} 0 2
   [junit4]   2> 1850440 INFO  (qtp1563372743-27082) [n:127.0.0.1:33785_solr c:collection2 s:shard1 r:core_node2 x:collection2_shard1_replica_n1] o.a.s.u.DirectUpdateHandler2 start commit{_version_=1608222593630863360,optimize=false,openSearcher=true,waitSearcher=true,expungeDeletes=false,softCommit=false,prepareCommit=false}
   [junit4]   2> 1850440 INFO  (qtp1563372743-27082) [n:127.0.0.1:33785_solr c:collection2 s:shard1 r:core_node2 x:collection2_shard1_replica_n1] o.a.s.u.SolrIndexWriter Calling setCommitData with IW:org.apache.solr.update.SolrIndexWriter@4db97262 commitCommandVersion:1608222593630863360
   [junit4]   2> 1850450 INFO  (qtp1563372743-27082) [n:127.0.0.1:33785_solr c:collection2 s:shard1 r:core_node2 x:collection2_shard1_replica_n1] o.a.s.s.SolrIndexSearcher Opening [Searcher@2523ff3c[collection2_shard1_replica_n1] main]
   [junit4]   2> 1850451 INFO  (qtp1563372743-27082) [n:127.0.0.1:33785_solr c:collection2 s:shard1 r:core_node2 x:collection2_shard1_replica_n1] o.a.s.u.DirectUpdateHandler2 end_commit_flush
   [junit4]   2> 1850452 INFO  (searcherExecutor-7995-thread-1-processing-n:127.0.0.1:33785_solr x:collection2_shard1_replica_n1 c:collection2 s:shard1 r:core_node2) [n:127.0.0.1:33785_solr c:collection2 s:shard1 r:core_node2 x:collection2_shard1_replica_n1] o.a.s.c.SolrCore [collection2_shard1_replica_n1] Registered new searcher Searcher@2523ff3c[collection2_shard1_replica_n1] main{ExitableDirectoryReader(UninvertingDirectoryReader(Uninverting(_0(8.0.0):C1) Uninverting(_1(8.0.0):C1)))}
   [junit4]   2> 1850452 INFO  (qtp1563372743-27082) [n:127.0.0.1:33785_solr c:collection2 s:shard1 r:core_node2 x:collection2_shard1_replica_n1] o.a.s.u.p.LogUpdateProcessorFactory [collection2_shard1_replica_n1]  webapp=/solr path=/update params={waitSearcher=true&commit=true&softCommit=false&wt=javabin&version=2}{commit=} 0 11
   [junit4]   2> 1850456 INFO  (qtp1563372743-27083) [n:127.0.0.1:33785_solr c:collection2 s:shard1 r:core_node2 x:collection2_shard1_replica_n1] o.a.s.u.p.LogUpdateProcessorFactory [collection2_shard1_replica_n1]  webapp=/solr path=/update params={wt=javabin&version=2}{add=[2 (1608222593645543424)]} 0 1
   [junit4]   2> 1850456 INFO  (qtp1563372743-27082) [n:127.0.0.1:33785_solr c:collection2 s:shard1 r:core_node2 x:collection2_shard1_replica_n1] o.a.s.u.DirectUpdateHandler2 start commit{_version_=1608222593647640576,optimize=false,openSearcher=true,waitSearcher=true,expungeDeletes=false,softCommit=false,prepareCommit=false}
   [junit4]   2> 1850456 INFO  (qtp1563372743-27082) [n:127.0.0.1:33785_solr c:collection2 s:shard1 r:core_node2 x:collection2_shard1_replica_n1] o.a.s.u.SolrIndexWriter Calling setCommitData with IW:org.apache.solr.update.SolrIndexWriter@4db97262 commitCommandVersion:1608222593647640576
   [junit4]   2> 1850460 INFO  (qtp1563372743-27082) [n:127.0.0.1:33785_solr c:collection2 s:shard1 r:core_node2 x:collection2_shard1_replica_n1] o.a.s.u.p.LogUpdateProcessorFactory [collection2_shard1_replica_n1]  webapp=/solr path=/update params={waitSearcher=true&commit=true&softCommit=false&wt=javabin&version=2}{} 0 3
   [junit4]   2> 1850460 ERROR (qtp1563372743-27082) [n:127.0.0.1:33785_solr c:collection2 s:shard1 r:core_node2 x:collection2_shard1_replica_n1] o.a.s.h.RequestHandlerBase java.nio.file.NoSuchFileException: /x1/jenkins/jenkins-slave/workspace/Lucene-Solr-NightlyTests-master/checkout/solr/build/solr-core/test/J1/temp/solr.cloud.LeaderTragicEventTest_A09269C3DD49E210-001/index-MMapDirectory-001/_1.pst
   [junit4]   2> at sun.nio.fs.UnixException.translateToIOException(UnixException.java:86)
   [junit4]   2> at sun.nio.fs.UnixException.rethrowAsIOException(UnixException.java:102)
   [junit4]   2> at sun.nio.fs.UnixException.rethrowAsIOException(UnixException.java:107)
   [junit4]   2> at sun.nio.fs.UnixFileSystemProvider.newFileChannel(UnixFileSystemProvider.java:177)
   [junit4]   2> at org.apache.lucene.mockfile.FilterFileSystemProvider.newFileChannel(FilterFileSystemProvider.java:202)
   [junit4]   2> at org.apache.lucene.mockfile.DisableFsyncFS.newFileChannel(DisableFsyncFS.java:45)
   [junit4]   2> at org.apache.lucene.mockfile.FilterFileSystemProvider.newFileChannel(FilterFileSystemProvider.java:202)
   [junit4]   2> at org.apache.lucene.mockfile.HandleTrackingFS.newFileChannel(HandleTrackingFS.java:166)
   [junit4]   2> at org.apache.lucene.mockfile.HandleTrackingFS.newFileChannel(HandleTrackingFS.java:166)
   [junit4]   2> at org.apache.lucene.mockfile.HandleTrackingFS.newFileChannel(HandleTrackingFS.java:166)
   [junit4]   2> at java.nio.channels.FileChannel.open(FileChannel.java:287)
   [junit4]   2> at java.nio.channels.FileChannel.open(FileChannel.java:335)
   [junit4]   2> at org.apache.lucene.util.IOUtils.fsync(IOUtils.java:460)
   [junit4]   2> at org.apache.lucene.store.FSDirectory.fsync(FSDirectory.java:332)
   [junit4]   2> at org.apache.lucene.store.FSDirectory.sync(FSDirectory.java:287)
   [junit4]   2> at org.apache.lucene.store.NRTCachingDirectory.sync(NRTCachingDirectory.java:159)
   [junit4]   2> at org.apache.lucene.store.MockDirectoryWrapper.sync(MockDirectoryWrapper.java:207)
   [junit4]   2> at org.apache.lucene.store.LockValidatingDirectoryWrapper.sync(LockValidatingDirectoryWrapper.java:68)
   [junit4]   2> at org.apache.lucene.index.IndexWriter.startCommit(IndexWriter.java:4778)
   [junit4]   2> at org.apache.lucene.index.IndexWriter.prepareCommitInternal(IndexWriter.java:3278)
   [junit4]   2> at org.apache.lucene.index.IndexWriter.commitInternal(IndexWriter.java:3446)
   [junit4]   2> at org.apache.lucene.index.IndexWriter.commit(IndexWriter.java:3411)
   [junit4]   2> at org.apache.solr.update.DirectUpdateHandler2.commit(DirectUpdateHandler2.java:676)
   [junit4]   2> at org.apache.solr.update.processor.RunUpdateProcessor.processCommit(RunUpdateProcessorFactory.java:93)
   [junit4]   2> at org.apache.solr.update.processor.UpdateRequestProcessor.processCommit(UpdateRequestProcessor.java:68)
   [junit4]   2> at org.apache.solr.update.processor.DistributedUpdateProcessor.doLocalCommit(DistributedUpdateProcessor.java:1959)
   [junit4]   2> at org.apache.solr.update.processor.DistributedUpdateProcessor.processCommit(DistributedUpdateProcessor.java:1935)
   [junit4]   2> at org.apache.solr.update.processor.LogUpdateProcessorFactory$LogUpdateProcessor.processCommit(LogUpdateProcessorFactory.java:160)
   [junit4]   2> at org.apache.solr.handler.RequestHandlerUtils.handleCommit(RequestHandlerUtils.java:69)
   [junit4]   2> at org.apache.solr.handler.ContentStreamHandlerBase.handleRequestBody(ContentStreamHandlerBase.java:62)
   [junit4]   2> at org.apache.solr.handler.RequestHandlerBase.handleRequest(RequestHandlerBase.java:199)
   [junit4]   2> at org.apache.solr.core.SolrCore.execute(SolrCore.java:2541)
   [junit4]   2> at org.apache.solr.servlet.HttpSolrCall.execute(HttpSolrCall.java:709)
   [junit4]   2> at org.apache.solr.servlet.HttpSolrCall.call(HttpSolrCall.java:515)
   [junit4]   2> at org.apache.solr.servlet.SolrDispatchFilter.doFilter(SolrDispatchFilter.java:377)
   [junit4]   2> at org.apache.solr.servlet.SolrDispatchFilter.doFilter(SolrDispatchFilter.java:323)
   [junit4]   2> at org.eclipse.jetty.servlet.ServletHandler$CachedChain.doFilter(ServletHandler.java:1642)
   [junit4]   2> at org.apache.solr.client.solrj.embedded.JettySolrRunner$DebugFilter.doFilter(JettySolrRunner.java:139)
   [junit4]   2> at org.eclipse.jetty.servlet.ServletHandler$CachedChain.doFilter(ServletHandler.java:1642)
   [junit4]   2> at org.eclipse.jetty.servlet.ServletHandler.doHandle(ServletHandler.java:533)
   [junit4]   2> at org.eclipse.jetty.server.handler.ScopedHandler.nextHandle(ScopedHandler.java:255)
   [junit4]   2> at org.eclipse.jetty.server.session.SessionHandler.doHandle(SessionHandler.java:1595)
   [junit4]   2> at org.eclipse.jetty.server.handler.ScopedHandler.nextHandle(ScopedHandler.java:255)
   [junit4]   2> at org.eclipse.jetty.server.handler.ContextHandler.doHandle(ContextHandler.java:1317)
   [junit4]   2> at org.eclipse.jetty.server.handler.ScopedHandler.nextScope(ScopedHandler.java:203)
   [junit4]   2> at org.eclipse.jetty.servlet.ServletHandler.doScope(ServletHandler.java:473)
   [junit4]   2> at org.eclipse.jetty.server.session.SessionHandler.doScope(SessionHandler.java:1564)
   [junit4]   2> at org.eclipse.jetty.server.handler.ScopedHandler.nextScope(ScopedHandler.java:201)
   [junit4]   2> at org.eclipse.jetty.server.handler.ContextHandler.doScope(ContextHandler.java:1219)
   [junit4]   2> at org.eclipse.jetty.server.handler.ScopedHandler.handle(ScopedHandler.java:144)
   [junit4]   2> at org.eclipse.jetty.server.handler.gzip.GzipHandler.handle(GzipHandler.java:674)
   [junit4]   2> at org.eclipse.jetty.server.handler.HandlerWrapper.handle(HandlerWrapper.java:132)
   [junit4]   2> at org.eclipse.jetty.server.Server.handle(Server.java:531)
   [junit4]   2> at org.eclipse.jetty.server.HttpChannel.handle(HttpChannel.java:352)
   [junit4]   2> at org.eclipse.jetty.server.HttpConnection.onFillable(HttpConnection.java:260)
   [junit4]   2> at org.eclipse.jetty.io.AbstractConnection$ReadCallback.succeeded(AbstractConnection.java:281)
   [junit4]   2> at org.eclipse.jetty.io.FillInterest.fillable(FillInterest.java:102)
   [junit4]   2> at org.eclipse.jetty.io.ChannelEndPoint$2.run(ChannelEndPoint.java:118)
   [junit4]   2> at org.eclipse.jetty.util.thread.strategy.EatWhatYouKill.runTask(EatWhatYouKill.java:333)
   [junit4]   2> at org.eclipse.jetty.util.thread.strategy.EatWhatYouKill.doProduce(EatWhatYouKill.java:310)
   [junit4]   2> at org.eclipse.jetty.util.thread.strategy.EatWhatYouKill.tryProduce(EatWhatYouKill.java:168)
   [junit4]   2> at org.eclipse.jetty.util.thread.strategy.EatWhatYouKill.run(EatWhatYouKill.java:126)
   [junit4]   2> at org.eclipse.jetty.util.thread.ReservedThreadExecutor$ReservedThread.run(ReservedThreadExecutor.java:366)
   [junit4]   2> at org.eclipse.jetty.util.thread.QueuedThreadPool.runJob(QueuedThreadPool.java:762)
   [junit4]   2> at org.eclipse.jetty.util.thread.QueuedThreadPool$2.run(QueuedThreadPool.java:680)
   [junit4]   2> at java.lang.Thread.run(Thread.java:748)
   [junit4]   2>
   [junit4]   2> 1850461 ERROR (qtp1563372743-27082) [n:127.0.0.1:33785_solr c:collection2 s:shard1 r:core_node2 x:collection2_shard1_replica_n1] o.a.s.s.HttpSolrCall null:java.nio.file.NoSuchFileException: /x1/jenkins/jenkins-slave/workspace/Lucene-Solr-NightlyTests-master/checkout/solr/build/solr-core/test/J1/temp/solr.cloud.LeaderTragicEventTest_A09269C3DD49E210-001/index-MMapDirectory-001/_1.pst
   [junit4]   2> at sun.nio.fs.UnixException.translateToIOException(UnixException.java:86)
   [junit4]   2> at sun.nio.fs.UnixException.rethrowAsIOException(UnixException.java:102)
   [junit4]   2> at sun.nio.fs.UnixException.rethrowAsIOException(UnixException.java:107)
   [junit4]   2> at sun.nio.fs.UnixFileSystemProvider.newFileChannel(UnixFileSystemProvider.java:177)
   [junit4]   2> at org.apache.lucene.mockfile.FilterFileSystemProvider.newFileChannel(FilterFileSystemProvider.java:202)
   [junit4]   2> at org.apache.lucene.mockfile.DisableFsyncFS.newFileChannel(DisableFsyncFS.java:45)
   [junit4]   2> at org.apache.lucene.mockfile.FilterFileSystemProvider.newFileChannel(FilterFileSystemProvider.java:202)
   [junit4]   2> at org.apache.lucene.mockfile.HandleTrackingFS.newFileChannel(HandleTrackingFS.java:166)
   [junit4]   2> at org.apache.lucene.mockfile.HandleTrackingFS.newFileChannel(HandleTrackingFS.java:166)
   [junit4]   2> at org.apache.lucene.mockfile.HandleTrackingFS.newFileChannel(HandleTrackingFS.java:166)
   [junit4]   2> at java.nio.channels.FileChannel.open(FileChannel.java:287)
   [junit4]   2> at java.nio.channels.FileChannel.open(FileChannel.java:335)
   [junit4]   2> at org.apache.lucene.util.IOUtils.fsync(IOUtils.java:460)
   [junit4]   2> at org.apache.lucene.store.FSDirectory.fsync(FSDirectory.java:332)
   [junit4]   2> at org.apache.lucene.store.FSDirectory.sync(FSDirectory.java:287)
   [junit4]   2> at org.apache.lucene.store.NRTCachingDirectory.sync(NRTCachingDirectory.java:159)
   [junit4]   2> at org.apache.lucene.store.MockDirectoryWrapper.sync(MockDirectoryWrapper.java:207)
   [junit4]   2> at org.apache.lucene.store.LockValidatingDirectoryWrapper.sync(LockValidatingDirectoryWrapper.java:68)
   [junit4]   2> at org.apache.lucene.index.IndexWriter.startCommit(IndexWriter.java:4778)
   [junit4]   2> at org.apache.lucene.index.IndexWriter.prepareCommitInternal(IndexWriter.java:3278)
   [junit4]   2> at org.apache.lucene.index.IndexWriter.commitInternal(IndexWriter.java:3446)
   [junit4]   2> at org.apache.lucene.index.IndexWriter.commit(IndexWriter.java:3411)
   [junit4]   2> at org.apache.solr.update.DirectUpdateHandler2.commit(DirectUpdateHandler2.java:676)
   [junit4]   2> at org.apache.solr.update.processor.RunUpdateProcessor.processCommit(RunUpdateProcessorFactory.java:93)
   [junit4]   2> at org.apache.solr.update.processor.UpdateRequestProcessor.processCommit(UpdateRequestProcessor.java:68)
   [junit4]   2> at org.apache.solr.update.processor.DistributedUpdateProcessor.doLocalCommit(DistributedUpdateProcessor.java:1959)
   [junit4]   2> at org.apache.solr.update.processor.DistributedUpdateProcessor.processCommit(DistributedUpdateProcessor.java:1935)
   [junit4]   2> at org.apache.solr.update.processor.LogUpdateProcessorFactory$LogUpdateProcessor.processCommit(LogUpdateProcessorFactory.java:160)
   [junit4]   2> at org.apache.solr.handler.RequestHandlerUtils.handleCommit(RequestHandlerUtils.java:69)
   [junit4]   2> at org.apache.solr.handler.ContentStreamHandlerBase.handleRequestBody(ContentStreamHandlerBase.java:62)
   [junit4]   2> at org.apache.solr.handler.RequestHandlerBase.handleRequest(RequestHandlerBase.java:199)
   [junit4]   2> at org.apache.solr.core.SolrCore.execute(SolrCore.java:2541)
   [junit4]   2> at org.apache.solr.servlet.HttpSolrCall.execute(HttpSolrCall.java:709)
   [junit4]   2> at org.apache.solr.servlet.HttpSolrCall.call(HttpSolrCall.java:515)
   [junit4]   2> at org.apache.solr.servlet.SolrDispatchFilter.doFilter(SolrDispatchFilter.java:377)
   [junit4]   2> at org.apache.solr.servlet.SolrDispatchFilter.doFilter(SolrDispatchFilter.java:323)
   [junit4]   2> at org.eclipse.jetty.servlet.ServletHandler$CachedChain.doFilter(ServletHandler.java:1642)
   [junit4]   2> at org.apache.solr.client.solrj.embedded.JettySolrRunner$DebugFilter.doFilter(JettySolrRunner.java:139)
   [junit4]   2> at org.eclipse.jetty.servlet.ServletHandler$CachedChain.doFilter(ServletHandler.java:1642)
   [junit4]   2> at org.eclipse.jetty.servlet.ServletHandler.doHandle(ServletHandler.java:533)
   [junit4]   2> at org.eclipse.jetty.server.handler.ScopedHandler.nextHandle(ScopedHandler.java:255)
   [junit4]   2> at org.eclipse.jetty.server.session.SessionHandler.doHandle(SessionHandler.java:1595)
   [junit4]   2> at org.eclipse.jetty.server.handler.ScopedHandler.nextHandle(ScopedHandler.java:255)
   [junit4]   2> at org.eclipse.jetty.server.handler.ContextHandler.doHandle(ContextHandler.java:1317)
   [junit4]   2> at org.eclipse.jetty.server.handler.ScopedHandler.nextScope(ScopedHandler.java:203)
   [junit4]   2> at org.eclipse.jetty.servlet.ServletHandler.doScope(ServletHandler.java:473)
   [junit4]   2> at org.eclipse.jetty.server.session.SessionHandler.doScope(SessionHandler.java:1564)
   [junit4]   2> at org.eclipse.jetty.server.handler.ScopedHandler.nextScope(ScopedHandler.java:201)
   [junit4]   2> at org.eclipse.jetty.server.handler.ContextHandler.doScope(ContextHandler.java:1219)
   [junit4]   2> at org.eclipse.jetty.server.handler.ScopedHandler.handle(ScopedHandler.java:144)
   [junit4]   2> at org.eclipse.jetty.server.handler.gzip.GzipHandler.handle(GzipHandler.java:674)
   [junit4]   2> at org.eclipse.jetty.server.handler.HandlerWrapper.handle(HandlerWrapper.java:132)
   [junit4]   2> at org.eclipse.jetty.server.Server.handle(Server.java:531)
   [junit4]   2> at org.eclipse.jetty.server.HttpChannel.handle(HttpChannel.java:352)
   [junit4]   2> at org.eclipse.jetty.server.HttpConnection.onFillable(HttpConnection.java:260)
   [junit4]   2> at org.eclipse.jetty.io.AbstractConnection$ReadCallback.succeeded(AbstractConnection.java:281)
   [junit4]   2> at org.eclipse.jetty.io.FillInterest.fillable(FillInterest.java:102)
   [junit4]   2> at org.eclipse.jetty.io.ChannelEndPoint$2.run(ChannelEndPoint.java:118)
   [junit4]   2> at org.eclipse.jetty.util.thread.strategy.EatWhatYouKill.runTask(EatWhatYouKill.java:333)
   [junit4]   2> at org.eclipse.jetty.util.thread.strategy.EatWhatYouKill.doProduce(EatWhatYouKill.java:310)
   [junit4]   2> at org.eclipse.jetty.util.thread.strategy.EatWhatYouKill.tryProduce(EatWhatYouKill.java:168)
   [junit4]   2> at org.eclipse.jetty.util.thread.strategy.EatWhatYouKill.run(EatWhatYouKill.java:126)
   [junit4]   2> at org.eclipse.jetty.util.thread.ReservedThreadExecutor$ReservedThread.run(ReservedThreadExecutor.java:366)
   [junit4]   2> at org.eclipse.jetty.util.thread.QueuedThreadPool.runJob(QueuedThreadPool.java:762)
   [junit4]   2> at org.eclipse.jetty.util.thread.QueuedThreadPool$2.run(QueuedThreadPool.java:680)
   [junit4]   2> at java.lang.Thread.run(Thread.java:748)
   [junit4]   2>
   [junit4]   2> 1850462 INFO  (TEST-LeaderTragicEventTest.testOtherReplicasAreNotActive-seed#[A09269C3DD49E210]) [    ] o.a.s.c.LeaderTragicEventTest Corrupt leader ex:
   [junit4]   2> org.apache.solr.client.solrj.impl.HttpSolrClient$RemoteSolrException: Error from server at http://127.0.0.1:33785/solr/collection2_shard1_replica_n1: /x1/jenkins/jenkins-slave/workspace/Lucene-Solr-NightlyTests-master/checkout/solr/build/solr-core/test/J1/temp/solr.cloud.LeaderTragicEventTest_A09269C3DD49E210-001/index-MMapDirectory-001/_1.pst
   [junit4]   2> at org.apache.solr.client.solrj.impl.HttpSolrClient.executeMethod(HttpSolrClient.java:643) ~[java/:?]
   [junit4]   2> at org.apache.solr.client.solrj.impl.HttpSolrClient.request(HttpSolrClient.java:255) ~[java/:?]
   [junit4]   2> at org.apache.solr.client.solrj.impl.HttpSolrClient.request(HttpSolrClient.java:244) ~[java/:?]
   [junit4]   2> at org.apache.solr.client.solrj.SolrRequest.process(SolrRequest.java:194) ~[java/:?]
   [junit4]   2> at org.apache.solr.client.solrj.SolrClient.commit(SolrClient.java:484) ~[java/:?]
   [junit4]   2> at org.apache.solr.client.solrj.SolrClient.commit(SolrClient.java:463) ~[java/:?]
   [junit4]   2> at org.apache.solr.cloud.LeaderTragicEventTest.corruptLeader(LeaderTragicEventTest.java:124) [test/:?]
   [junit4]   2> at org.apache.solr.cloud.LeaderTragicEventTest.testOtherReplicasAreNotActive(LeaderTragicEventTest.java:182) [test/:?]
   [junit4]   2> at sun.reflect.NativeMethodAccessorImpl.invoke0(Native Method) ~[?:1.8.0_172]
   [junit4]   2> at sun.reflect.NativeMethodAccessorImpl.invoke(NativeMethodAccessorImpl.java:62) ~[?:1.8.0_172]
   [junit4]   2> at sun.reflect.DelegatingMethodAccessorImpl.invoke(DelegatingMethodAccessorImpl.java:43) ~[?:1.8.0_172]
   [junit4]   2> at java.lang.reflect.Method.invoke(Method.java:498) ~[?:1.8.0_172]
   [junit4]   2> at com.carrotsearch.randomizedtesting.RandomizedRunner.invoke(RandomizedRunner.java:1737) [randomizedtesting-runner-2.6.0.jar:?]
   [junit4]   2> at com.carrotsearch.randomizedtesting.RandomizedRunner$8.evaluate(RandomizedRunner.java:934) [randomizedtesting-runner-2.6.0.jar:?]
   [junit4]   2> at com.carrotsearch.randomizedtesting.RandomizedRunner$9.evaluate(RandomizedRunner.java:970) [randomizedtesting-runner-2.6.0.jar:?]
   [junit4]   2> at com.carrotsearch.randomizedtesting.RandomizedRunner$10.evaluate(RandomizedRunner.java:984) [randomizedtesting-runner-2.6.0.jar:?]
   [junit4]   2> at com.carrotsearch.randomizedtesting.rules.SystemPropertiesRestoreRule$1.evaluate(SystemPropertiesRestoreRule.java:57) [randomizedtesting-runner-2.6.0.jar:?]
   [junit4]   2> at org.apache.lucene.util.TestRuleSetupTeardownChained$1.evaluate(TestRuleSetupTeardownChained.java:49) [java/:?]
   [junit4]   2> at org.apache.lucene.util.AbstractBeforeAfterRule$1.evaluate(AbstractBeforeAfterRule.java:45) [java/:?]
   [junit4]   2> at org.apache.lucene.util.TestRuleThreadAndTestName$1.evaluate(TestRuleThreadAndTestName.java:48) [java/:?]
   [junit4]   2> at org.apache.lucene.util.TestRuleIgnoreAfterMaxFailures$1.evaluate(TestRuleIgnoreAfterMaxFailures.java:64) [java/:?]
   [junit4]   2> at org.apache.lucene.util.TestRuleMarkFailure$1.evaluate(TestRuleMarkFailure.java:47) [java/:?]
   [junit4]   2> at com.carrotsearch.randomizedtesting.rules.StatementAdapter.evaluate(StatementAdapter.java:36) [randomizedtesting-runner-2.6.0.jar:?]
   [junit4]   2> at com.carrotsearch.randomizedtesting.ThreadLeakControl$StatementRunner.run(ThreadLeakControl.java:368) [randomizedtesting-runner-2.6.0.jar:?]
   [junit4]   2> at com.carrotsearch.randomizedtesting.ThreadLeakControl.forkTimeoutingTask(ThreadLeakControl.java:817) [randomizedtesting-runner-2.6.0.jar:?]
   [junit4]   2> at com.carrotsearch.randomizedtesting.ThreadLeakControl$3.evaluate(ThreadLeakControl.java:468) [randomizedtesting-runner-2.6.0.jar:?]
   [junit4]   2> at com.carrotsearch.randomizedtesting.RandomizedRunner.runSingleTest(RandomizedRunner.java:943) [randomizedtesting-runner-2.6.0.jar:?]
   [junit4]   2> at com.carrotsearch.randomizedtesting.RandomizedRunner$5.evaluate(RandomizedRunner.java:829) [randomizedtesting-runner-2.6.0.jar:?]
   [junit4]   2> at com.carrotsearch.randomizedtesting.RandomizedRunner$6.evaluate(RandomizedRunner.java:879) [randomizedtesting-runner-2.6.0.jar:?]
   [junit4]   2> at com.carrotsearch.randomizedtesting.RandomizedRunner$7.evaluate(RandomizedRunner.java:890) [randomizedtesting-runner-2.6.0.jar:?]
   [junit4]   2> at com.carrotsearch.randomizedtesting.rules.StatementAdapter.evaluate(StatementAdapter.java:36) [randomizedtesting-runner-2.6.0.jar:?]
   [junit4]   2> at com.carrotsearch.randomizedtesting.rules.SystemPropertiesRestoreRule$1.evaluate(SystemPropertiesRestoreRule.java:57) [randomizedtesting-runner-2.6.0.jar:?]
   [junit4]   2> at org.apache.lucene.util.AbstractBeforeAfterRule$1.evaluate(AbstractBeforeAfterRule.java:45) [java/:?]
   [junit4]   2> at com.carrotsearch.randomizedtesting.rules.StatementAdapter.evaluate(StatementAdapter.java:36) [randomizedtesting-runner-2.6.0.jar:?]
   [junit4]   2> at org.apache.lucene.util.TestRuleStoreClassName$1.evaluate(TestRuleStoreClassName.java:41) [java/:?]
   [junit4]   2> at com.carrotsearch.randomizedtesting.rules.NoShadowingOrOverridesOnMethodsRule$1.evaluate(NoShadowingOrOverridesOnMethodsRule.java:40) [randomizedtesting-runner-2.6.0.jar:?]
   [junit4]   2> at com.carrotsearch.randomizedtesting.rules.NoShadowingOrOverridesOnMethodsRule$1.evaluate(NoShadowingOrOverridesOnMethodsRule.java:40) [randomizedtesting-runner-2.6.0.jar:?]
   [junit4]   2> at com.carrotsearch.randomizedtesting.rules.StatementAdapter.evaluate(StatementAdapter.java:36) [randomizedtesting-runner-2.6.0.jar:?]
   [junit4]   2> at com.carrotsearch.randomizedtesting.rules.StatementAdapter.evaluate(StatementAdapter.java:36) [randomizedtesting-runner-2.6.0.jar:?]
   [junit4]   2> at com.carrotsearch.randomizedtesting.rules.StatementAdapter.evaluate(StatementAdapter.java:36) [randomizedtesting-runner-2.6.0.jar:?]
   [junit4]   2> at org.apache.lucene.util.TestRuleAssertionsRequired$1.evaluate(TestRuleAssertionsRequired.java:53) [java/:?]
   [junit4]   2> at org.apache.lucene.util.TestRuleMarkFailure$1.evaluate(TestRuleMarkFailure.java:47) [java/:?]
   [junit4]   2> at org.apache.lucene.util.TestRuleIgnoreAfterMaxFailures$1.evaluate(TestRuleIgnoreAfterMaxFailures.java:64) [java/:?]
   [junit4]   2> at org.apache.lucene.util.TestRuleIgnoreTestSuites$1.evaluate(TestRuleIgnoreTestSuites.java:54) [java/:?]
   [junit4]   2> at com.carrotsearch.randomizedtesting.rules.StatementAdapter.evaluate(StatementAdapter.java:36) [randomizedtesting-runner-2.6.0.jar:?]
   [junit4]   2> at com.carrotsearch.randomizedtesting.ThreadLeakControl$StatementRunner.run(ThreadLeakControl.java:368) [randomizedtesting-runner-2.6.0.jar:?]
   [junit4]   2> at java.lang.Thread.run(Thread.java:748) [?:1.8.0_172]
   [junit4]   2> 1852465 INFO  (qtp1563372743-27083) [n:127.0.0.1:33785_solr    ] o.a.s.h.a.CollectionsHandler Invoked Collection Action :delete with params name=collection2&action=DELETE&wt=javabin&version=2 and sendToOCPQueue=true
   [junit4]   2> 1852467 INFO  (OverseerThreadFactory-7987-thread-2) [    ] o.a.s.c.a.c.OverseerCollectionMessageHandler Executing Collection Cmd=action=UNLOAD&deleteInstanceDir=true&deleteDataDir=true&deleteMetricsHistory=true, asyncId=null
   [junit4]   2> 1852469 INFO  (qtp1563372743-27073) [n:127.0.0.1:33785_solr    x:collection2_shard1_replica_n1] o.a.s.m.SolrMetricManager Closing metric reporters for registry=solr.core.collection2.shard1.replica_n1, tag=null
   [junit4]   2> 1852469 INFO  (qtp1563372743-27073) [n:127.0.0.1:33785_solr    x:collection2_shard1_replica_n1] o.a.s.m.r.SolrJmxReporter Closing reporter [org.apache.solr.metrics.reporters.SolrJmxReporter@78c9c2f8: rootName = solr_33785, domain = solr.core.collection2.shard1.replica_n1, service url = null, agent id = null] for registry solr.core.collection2.shard1.replica_n1 / com.codahale.metrics.MetricRegistry@65492c0a
   [junit4]   2> 1852482 INFO  (qtp1563372743-27073) [n:127.0.0.1:33785_solr    x:collection2_shard1_replica_n1] o.a.s.c.SolrCore [collection2_shard1_replica_n1]  CLOSING SolrCore org.apache.solr.core.SolrCore@2953919f
   [junit4]   2> 1852482 INFO  (qtp1563372743-27073) [n:127.0.0.1:33785_solr    x:collection2_shard1_replica_n1] o.a.s.m.SolrMetricManager Closing metric reporters for registry=solr.core.collection2.shard1.replica_n1, tag=2953919f
   [junit4]   2> 1852482 INFO  (qtp1563372743-27073) [n:127.0.0.1:33785_solr    x:collection2_shard1_replica_n1] o.a.s.m.SolrMetricManager Closing metric reporters for registry=solr.collection.collection2.shard1.leader, tag=2953919f
   [junit4]   2> 1852485 ERROR (qtp1563372743-27073) [n:127.0.0.1:33785_solr    x:collection2_shard1_replica_n1] o.a.s.u.SolrIndexWriter Error closing IndexWriter
   [junit4]   2> java.nio.file.NoSuchFileException: /x1/jenkins/jenkins-slave/workspace/Lucene-Solr-NightlyTests-master/checkout/solr/build/solr-core/test/J1/temp/solr.cloud.LeaderTragicEventTest_A09269C3DD49E210-001/index-MMapDirectory-001/_1.pst
   [junit4]   2> at sun.nio.fs.UnixException.translateToIOException(UnixException.java:86) ~[?:1.8.0_172]
   [junit4]   2> at sun.nio.fs.UnixException.rethrowAsIOException(UnixException.java:102) ~[?:1.8.0_172]
   [junit4]   2> at sun.nio.fs.UnixException.rethrowAsIOException(UnixException.java:107) ~[?:1.8.0_172]
   [junit4]   2> at sun.nio.fs.UnixFileSystemProvider.newFileChannel(UnixFileSystemProvider.java:177) ~[?:1.8.0_172]
   [junit4]   2> at org.apache.lucene.mockfile.FilterFileSystemProvider.newFileChannel(FilterFileSystemProvider.java:202) ~[java/:?]
   [junit4]   2> at org.apache.lucene.mockfile.DisableFsyncFS.newFileChannel(DisableFsyncFS.java:45) ~[java/:?]
   [junit4]   2> at org.apache.lucene.mockfile.FilterFileSystemProvider.newFileChannel(FilterFileSystemProvider.java:202) ~[java/:?]
   [junit4]   2> at org.apache.lucene.mockfile.HandleTrackingFS.newFileChannel(HandleTrackingFS.java:166) ~[java/:?]
   [junit4]   2> at org.apache.lucene.mockfile.HandleTrackingFS.newFileChannel(HandleTrackingFS.java:166) ~[java/:?]
   [junit4]   2> at org.apache.lucene.mockfile.HandleTrackingFS.newFileChannel(HandleTrackingFS.java:166) ~[java/:?]
   [junit4]   2> at java.nio.channels.FileChannel.open(FileChannel.java:287) ~[?:1.8.0_172]
   [junit4]   2> at java.nio.channels.FileChannel.open(FileChannel.java:335) ~[?:1.8.0_172]
   [junit4]   2> at org.apache.lucene.util.IOUtils.fsync(IOUtils.java:460) ~[java/:?]
   [junit4]   2> at org.apache.lucene.store.FSDirectory.fsync(FSDirectory.java:332) ~[java/:?]
   [junit4]   2> at org.apache.lucene.store.FSDirectory.sync(FSDirectory.java:287) ~[java/:?]
   [junit4]   2> at org.apache.lucene.store.NRTCachingDirectory.sync(NRTCachingDirectory.java:159) ~[java/:?]
   [junit4]   2> at org.apache.lucene.store.MockDirectoryWrapper.sync(MockDirectoryWrapper.java:207) ~[java/:?]
   [junit4]   2> at org.apache.lucene.store.LockValidatingDirectoryWrapper.sync(LockValidatingDirectoryWrapper.java:68) ~[java/:?]
   [junit4]   2> at org.apache.lucene.index.IndexWriter.startCommit(IndexWriter.java:4778) ~[java/:?]
   [junit4]   2> at org.apache.lucene.index.IndexWriter.prepareCommitInternal(IndexWriter.java:3278) ~[java/:?]
   [junit4]   2> at org.apache.lucene.index.IndexWriter.commitInternal(IndexWriter.java:3446) ~[java/:?]
   [junit4]   2> at org.apache.lucene.index.IndexWriter.shutdown(IndexWriter.java:1027) ~[java/:?]
   [junit4]   2> at org.apache.lucene.index.IndexWriter.close(IndexWriter.java:1068) ~[java/:?]
   [junit4]   2> at org.apache.solr.update.SolrIndexWriter.close(SolrIndexWriter.java:286) ~[java/:?]
   [junit4]   2> at org.apache.solr.update.DirectUpdateHandler2.closeWriter(DirectUpdateHandler2.java:892) ~[java/:?]
   [junit4]   2> at org.apache.solr.update.DefaultSolrCoreState.closeIndexWriter(DefaultSolrCoreState.java:105) ~[java/:?]
   [junit4]   2> at org.apache.solr.update.DefaultSolrCoreState.close(DefaultSolrCoreState.java:399) ~[java/:?]
   [junit4]   2> at org.apache.solr.update.SolrCoreState.decrefSolrCoreState(SolrCoreState.java:83) ~[java/:?]
   [junit4]   2> at org.apache.solr.core.SolrCore.close(SolrCore.java:1574) ~[java/:?]
   [junit4]   2> at org.apache.solr.core.SolrCore.closeAndWait(SolrCore.java:1354) ~[java/:?]
   [junit4]   2> at org.apache.solr.core.CoreContainer.unload(CoreContainer.java:1517) ~[java/:?]
   [junit4]   2> at org.apache.solr.handler.admin.CoreAdminOperation.lambda$static$1(CoreAdminOperation.java:105) ~[java/:?]
   [junit4]   2> at org.apache.solr.handler.admin.CoreAdminOperation.execute(CoreAdminOperation.java:360) [java/:?]
   [junit4]   2> at org.apache.solr.handler.admin.CoreAdminHandler$CallInfo.call(CoreAdminHandler.java:395) [java/:?]
   [junit4]   2> at org.apache.solr.handler.admin.CoreAdminHandler.handleRequestBody(CoreAdminHandler.java:180) [java/:?]
   [junit4]   2> at org.apache.solr.handler.RequestHandlerBase.handleRequest(RequestHandlerBase.java:199) [java/:?]
   [junit4]   2> at org.apache.solr.servlet.HttpSolrCall.handleAdmin(HttpSolrCall.java:734) [java/:?]
   [junit4]   2> at org.apache.solr.servlet.HttpSolrCall.handleAdminRequest(HttpSolrCall.java:715) [java/:?]
   [junit4]   2> at org.apache.solr.servlet.HttpSolrCall.call(HttpSolrCall.java:496) [java/:?]
   [junit4]   2> at org.apache.solr.servlet.SolrDispatchFilter.doFilter(SolrDispatchFilter.java:377) [java/:?]
   [junit4]   2> at org.apache.solr.servlet.SolrDispatchFilter.doFilter(SolrDispatchFilter.java:323) [java/:?]
   [junit4]   2> at org.eclipse.jetty.servlet.ServletHandler$CachedChain.doFilter(ServletHandler.java:1642) [jetty-servlet-9.4.11.v20180605.jar:9.4.11.v20180605]
   [junit4]   2> at org.apache.solr.client.solrj.embedded.JettySolrRunner$DebugFilter.doFilter(JettySolrRunner.java:139) [java/:?]
   [junit4]   2> at org.eclipse.jetty.servlet.ServletHandler$CachedChain.doFilter(ServletHandler.java:1642) [jetty-servlet-9.4.11.v20180605.jar:9.4.11.v20180605]
   [junit4]   2> at org.eclipse.jetty.servlet.ServletHandler.doHandle(ServletHandler.java:533) [jetty-servlet-9.4.11.v20180605.jar:9.4.11.v20180605]
   [junit4]   2> at org.eclipse.jetty.server.handler.ScopedHandler.nextHandle(ScopedHandler.java:255) [jetty-server-9.4.11.v20180605.jar:9.4.11.v20180605]
   [junit4]   2> at org.eclipse.jetty.server.session.SessionHandler.doHandle(SessionHandler.java:1595) [jetty-server-9.4.11.v20180605.jar:9.4.11.v20180605]
   [junit4]   2> at org.eclipse.jetty.server.handler.ScopedHandler.nextHandle(ScopedHandler.java:255) [jetty-server-9.4.11.v20180605.jar:9.4.11.v20180605]
   [junit4]   2> at org.eclipse.jetty.server.handler.ContextHandler.doHandle(ContextHandler.java:1317) [jetty-server-9.4.11.v20180605.jar:9.4.11.v20180605]
   [junit4]   2> at org.eclipse.jetty.server.handler.ScopedHandler.nextScope(ScopedHandler.java:203) [jetty-server-9.4.11.v20180605.jar:9.4.11.v20180605]
   [junit4]   2> at org.eclipse.jetty.servlet.ServletHandler.doScope(ServletHandler.java:473) [jetty-servlet-9.4.11.v20180605.jar:9.4.11.v20180605]
   [junit4]   2> at org.eclipse.jetty.server.session.SessionHandler.doScope(SessionHandler.java:1564) [jetty-server-9.4.11.v20180605.jar:9.4.11.v20180605]
   [junit4]   2> at org.eclipse.jetty.server.handler.ScopedHandler.nextScope(ScopedHandler.java:201) [jetty-server-9.4.11.v20180605.jar:9.4.11.v20180605]
   [junit4]   2> at org.eclipse.jetty.server.handler.ContextHandler.doScope(ContextHandler.java:1219) [jetty-server-9.4.11.v20180605.jar:9.4.11.v20180605]
   [junit4]   2> at org.eclipse.jetty.server.handler.ScopedHandler.handle(ScopedHandler.java:144) [jetty-server-9.4.11.v20180605.jar:9.4.11.v20180605]
   [junit4]   2> at org.eclipse.jetty.server.handler.gzip.GzipHandler.handle(GzipHandler.java:674) [jetty-server-9.4.11.v20180605.jar:9.4.11.v20180605]
   [junit4]   2> at org.eclipse.jetty.server.handler.HandlerWrapper.handle(HandlerWrapper.java:132) [jetty-server-9.4.11.v20180605.jar:9.4.11.v20180605]
   [junit4]   2> at org.eclipse.jetty.server.Server.handle(Server.java:531) [jetty-server-9.4.11.v20180605.jar:9.4.11.v20180605]
   [junit4]   2> at org.eclipse.jetty.server.HttpChannel.handle(HttpChannel.java:352) [jetty-server-9.4.11.v20180605.jar:9.4.11.v20180605]
   [junit4]   2> at org.eclipse.jetty.server.HttpConnection.onFillable(HttpConnection.java:260) [jetty-server-9.4.11.v20180605.jar:9.4.11.v20180605]
   [junit4]   2> at org.eclipse.jetty.io.AbstractConnection$ReadCallback.succeeded(AbstractConnection.java:281) [jetty-io-9.4.11.v20180605.jar:9.4.11.v20180605]
   [junit4]   2> at org.eclipse.jetty.io.FillInterest.fillable(FillInterest.java:102) [jetty-io-9.4.11.v20180605.jar:9.4.11.v20180605]
   [junit4]   2> at org.eclipse.jetty.io.ChannelEndPoint$2.run(ChannelEndPoint.java:118) [jetty-io-9.4.11.v20180605.jar:9.4.11.v20180605]
   [junit4]   2> at org.eclipse.jetty.util.thread.strategy.EatWhatYouKill.runTask(EatWhatYouKill.java:333) [jetty-util-9.4.11.v20180605.jar:9.4.11.v20180605]
   [junit4]   2> at org.eclipse.jetty.util.thread.strategy.EatWhatYouKill.doProduce(EatWhatYouKill.java:310) [jetty-util-9.4.11.v20180605.jar:9.4.11.v20180605]
   [junit4]   2> at org.eclipse.jetty.util.thread.strategy.EatWhatYouKill.tryProduce(EatWhatYouKill.java:168) [jetty-util-9.4.11.v20180605.jar:9.4.11.v20180605]
   [junit4]   2> at org.eclipse.jetty.util.thread.strategy.EatWhatYouKill.run(EatWhatYouKill.java:126) [jetty-util-9.4.11.v20180605.jar:9.4.11.v20180605]
   [junit4]   2> at org.eclipse.jetty.util.thread.ReservedThreadExecutor$ReservedThread.run(ReservedThreadExecutor.java:366) [jetty-util-9.4.11.v20180605.jar:9.4.11.v20180605]
   [junit4]   2> at org.eclipse.jetty.util.thread.QueuedThreadPool.runJob(QueuedThreadPool.java:762) [jetty-util-9.4.11.v20180605.jar:9.4.11.v20180605]
   [junit4]   2> at org.eclipse.jetty.util.thread.QueuedThreadPool$2.run(QueuedThreadPool.java:680) [jetty-util-9.4.11.v20180605.jar:9.4.11.v20180605]
   [junit4]   2> at java.lang.Thread.run(Thread.java:748) [?:1.8.0_172]
   [junit4]   2> 1852490 INFO  (qtp1563372743-27073) [n:127.0.0.1:33785_solr    x:collection2_shard1_replica_n1] o.a.s.c.ZkShardTerms Successful update of terms at /collections/collection2/terms/shard1 to Terms{values={}, version=2}
   [junit4]   2> 1852492 INFO  (zkCallback-5478-thread-1) [    ] o.a.s.c.c.ZkStateReader A cluster state change: [WatchedEvent state:SyncConnected type:NodeDataChanged path:/collections/collection2/state.json] for collection [collection2] has occurred - updating... (live nodes size: [2])
   [junit4]   2> 1852492 INFO  (qtp1563372743-27073) [n:127.0.0.1:33785_solr    x:collection2_shard1_replica_n1] o.a.s.s.HttpSolrCall [admin] webapp=null path=/admin/cores params={deleteInstanceDir=true&deleteMetricsHistory=true&core=collection2_shard1_replica_n1&qt=/admin/cores&deleteDataDir=true&action=UNLOAD&wt=javabin&version=2} status=0 QTime=23
   [junit4]   2> 1853202 INFO  (qtp1563372743-27083) [n:127.0.0.1:33785_solr    ] o.a.s.s.HttpSolrCall [admin] webapp=null path=/admin/collections params={name=collection2&action=DELETE&wt=javabin&version=2} status=0 QTime=736
   [junit4]   2> 1853202 INFO  (TEST-LeaderTragicEventTest.testOtherReplicasAreNotActive-seed#[A09269C3DD49E210]) [    ] o.a.s.SolrTestCaseJ4 ###Ending testOtherReplicasAreNotActive
   [junit4]   2> 1853232 INFO  (TEST-LeaderTragicEventTest.test-seed#[A09269C3DD49E210]) [    ] o.a.s.SolrTestCaseJ4 ###Starting test
   [junit4]   2> 1853232 INFO  (qtp1563372743-27082) [n:127.0.0.1:33785_solr    ] o.a.s.h.a.CollectionsHandler Invoked Collection Action :create with params collection.configName=config&name=collection1&nrtReplicas=2&action=CREATE&numShards=1&wt=javabin&version=2 and sendToOCPQueue=true
   [junit4]   2> 1853235 INFO  (OverseerThreadFactory-7987-thread-3) [    ] o.a.s.c.a.c.CreateCollectionCmd Create collection collection1
   [junit4]   2> 1853235 INFO  (OverseerCollectionConfigSetProcessor-72123742487511044-127.0.0.1:33785_solr-n_0000000000) [    ] o.a.s.c.OverseerTaskQueue Response ZK path: /overseer/collection-queue-work/qnr-0000000002 doesn't exist.  Requestor may have disconnected from ZooKeeper
   [junit4]   2> 1853442 INFO  (OverseerStateUpdate-72123742487511044-127.0.0.1:33785_solr-n_0000000000) [    ] o.a.s.c.o.SliceMutator createReplica() {
   [junit4]   2>   "operation":"ADDREPLICA",
   [junit4]   2>   "collection":"collection1",
   [junit4]   2>   "shard":"shard1",
   [junit4]   2>   "core":"collection1_shard1_replica_n1",
   [junit4]   2>   "state":"down",
   [junit4]   2>   "base_url":"http://127.0.0.1:33785/solr",
   [junit4]   2>   "type":"NRT",
   [junit4]   2>   "waitForFinalState":"false"}
   [junit4]   2> 1853444 INFO  (OverseerStateUpdate-72123742487511044-127.0.0.1:33785_solr-n_0000000000) [    ] o.a.s.c.o.SliceMutator createReplica() {
   [junit4]   2>   "operation":"ADDREPLICA",
   [junit4]   2>   "collection":"collection1",
   [junit4]   2>   "shard":"shard1",
   [junit4]   2>   "core":"collection1_shard1_replica_n2",
   [junit4]   2>   "state":"down",
   [junit4]   2>   "base_url":"http://127.0.0.1:43044/solr",
   [junit4]   2>   "type":"NRT",
   [junit4]   2>   "waitForFinalState":"false"}
   [junit4]   2> 1853647 INFO  (qtp1563372743-27067) [n:127.0.0.1:33785_solr    x:collection1_shard1_replica_n1] o.a.s.h.a.CoreAdminOperation core create command qt=/admin/cores&coreNodeName=core_node3&collection.configName=config&newCollection=true&name=collection1_shard1_replica_n1&action=CREATE&numShards=1&collection=collection1&shard=shard1&wt=javabin&version=2&replicaType=NRT
   [junit4]   2> 1853648 INFO  (qtp568090666-27078) [n:127.0.0.1:43044_solr    x:collection1_shard1_replica_n2] o.a.s.h.a.CoreAdminOperation core create command qt=/admin/cores&coreNodeName=core_node4&collection.configName=config&newCollection=true&name=collection1_shard1_replica_n2&action=CREATE&numShards=1&collection=collection1&shard=shard1&wt=javabin&version=2&replicaType=NRT
   [junit4]   2> 1853648 INFO  (qtp568090666-27078) [n:127.0.0.1:43044_solr    x:collection1_shard1_replica_n2] o.a.s.c.TransientSolrCoreCacheDefault Allocating transient cache for 2147483647 transient cores
   [junit4]   2> 1854658 INFO  (qtp1563372743-27067) [n:127.0.0.1:33785_solr c:collection1 s:shard1 r:core_node3 x:collection1_shard1_replica_n1] o.a.s.c.SolrConfig Using Lucene MatchVersion: 8.0.0
   [junit4]   2> 1854658 INFO  (qtp568090666-27078) [n:127.0.0.1:43044_solr c:collection1 s:shard1 r:core_node4 x:collection1_shard1_replica_n2] o.a.s.c.SolrConfig Using Lucene MatchVersion: 8.0.0
   [junit4]   2> 1854665 INFO  (qtp568090666-27078) [n:127.0.0.1:43044_solr c:collection1 s:shard1 r:core_node4 x:collection1_shard1_replica_n2] o.a.s.s.IndexSchema [collection1_shard1_replica_n2] Schema name=minimal
   [junit4]   2> 1854665 INFO  (qtp1563372743-27067) [n:127.0.0.1:33785_solr c:collection1 s:shard1 r:core_node3 x:collection1_shard1_replica_n1] o.a.s.s.IndexSchema [collection1_shard1_replica_n1] Schema name=minimal
   [junit4]   2> 1854667 INFO  (qtp1563372743-27067) [n:127.0.0.1:33785_solr c:collection1 s:shard1 r:core_node3 x:collection1_shard1_replica_n1] o.a.s.s.IndexSchema Loaded schema minimal/1.1 with uniqueid field id
   [junit4]   2> 1854667 INFO  (qtp568090666-27078) [n:127.0.0.1:43044_solr c:collection1 s:shard1 r:core_node4 x:collection1_shard1_replica_n2] o.a.s.s.IndexSchema Loaded schema minimal/1.1 with uniqueid field id
   [junit4]   2> 1854667 INFO  (qtp1563372743-27067) [n:127.0.0.1:33785_solr c:collection1 s:shard1 r:core_node3 x:collection1_shard1_replica_n1] o.a.s.c.CoreContainer Creating SolrCore 'collection1_shard1_replica_n1' using configuration from collection collection1, trusted=true
   [junit4]   2> 1854667 INFO  (qtp568090666-27078) [n:127.0.0.1:43044_solr c:collection1 s:shard1 r:core_node4 x:collection1_shard1_replica_n2] o.a.s.c.CoreContainer Creating SolrCore 'collection1_shard1_replica_n2' using configuration from collection collection1, trusted=true
   [junit4]   2> 1854668 INFO  (qtp1563372743-27067) [n:127.0.0.1:33785_solr c:collection1 s:shard1 r:core_node3 x:collection1_shard1_replica_n1] o.a.s.m.r.SolrJmxReporter JMX monitoring for 'solr_33785.solr.core.collection1.shard1.replica_n1' (registry 'solr.core.collection1.shard1.replica_n1') enabled at server: com.sun.jmx.mbeanserver.JmxMBeanServer@7e13677a
   [junit4]   2> 1854668 INFO  (qtp568090666-27078) [n:127.0.0.1:43044_solr c:collection1 s:shard1 r:core_node4 x:collection1_shard1_replica_n2] o.a.s.m.r.SolrJmxReporter JMX monitoring for 'solr_43044.solr.core.collection1.shard1.replica_n2' (registry 'solr.core.collection1.shard1.replica_n2') enabled at server: com.sun.jmx.mbeanserver.JmxMBeanServer@7e13677a
   [junit4]   2> 1854668 INFO  (qtp1563372743-27067) [n:127.0.0.1:33785_solr c:collection1 s:shard1 r:core_node3 x:collection1_shard1_replica_n1] o.a.s.c.SolrCore solr.RecoveryStrategy.Builder
   [junit4]   2> 1854668 INFO  (qtp568090666-27078) [n:127.0.0.1:43044_solr c:collection1 s:shard1 r:core_node4 x:collection1_shard1_replica_n2] o.a.s.c.SolrCore solr.RecoveryStrategy.Builder
   [junit4]   2> 1854668 INFO  (qtp1563372743-27067) [n:127.0.0.1:33785_solr c:collection1 s:shard1 r:core_node3 x:collection1_shard1_replica_n1] o.a.s.c.SolrCore [[collection1_shard1_replica_n1] ] Opening new SolrCore at [/x1/jenkins/jenkins-slave/workspace/Lucene-Solr-NightlyTests-master/checkout/solr/build/solr-core/test/J1/temp/solr.cloud.LeaderTragicEventTest_A09269C3DD49E210-001/tempDir-001/node2/collection1_shard1_replica_n1], dataDir=[/x1/jenkins/jenkins-slave/workspace/Lucene-Solr-NightlyTests-master/checkout/solr/build/solr-core/test/J1/temp/solr.cloud.LeaderTragicEventTest_A09269C3DD49E210-001/tempDir-001/node2/./collection1_shard1_replica_n1/data/]
   [junit4]   2> 1854668 INFO  (qtp568090666-27078) [n:127.0.0.1:43044_solr c:collection1 s:shard1 r:core_node4 x:collection1_shard1_replica_n2] o.a.s.c.SolrCore [[collection1_shard1_replica_n2] ] Opening new SolrCore at [/x1/jenkins/jenkins-slave/workspace/Lucene-Solr-NightlyTests-master/checkout/solr/build/solr-core/test/J1/temp/solr.cloud.LeaderTragicEventTest_A09269C3DD49E210-001/tempDir-001/node1/collection1_shard1_replica_n2], dataDir=[/x1/jenkins/jenkins-slave/workspace/Lucene-Solr-NightlyTests-master/checkout/solr/build/solr-core/test/J1/temp/solr.cloud.LeaderTragicEventTest_A09269C3DD49E210-001/tempDir-001/node1/./collection1_shard1_replica_n2/data/]
   [junit4]   2> 1854715 INFO  (qtp1563372743-27067) [n:127.0.0.1:33785_solr c:collection1 s:shard1 r:core_node3 x:collection1_shard1_replica_n1] o.a.s.u.UpdateHandler Using UpdateLog implementation: org.apache.solr.update.UpdateLog
   [junit4]   2> 1854715 INFO  (qtp1563372743-27067) [n:127.0.0.1:33785_solr c:collection1 s:shard1 r:core_node3 x:collection1_shard1_replica_n1] o.a.s.u.UpdateLog Initializing UpdateLog: dataDir=null defaultSyncLevel=FLUSH numRecordsToKeep=100 maxNumLogsToKeep=10 numVersionBuckets=65536
   [junit4]   2> 1854716 INFO  (qtp1563372743-27067) [n:127.0.0.1:33785_solr c:collection1 s:shard1 r:core_node3 x:collection1_shard1_replica_n1] o.a.s.u.CommitTracker Hard AutoCommit: disabled
   [junit4]   2> 1854716 INFO  (qtp568090666-27078) [n:127.0.0.1:43044_solr c:collection1 s:shard1 r:core_node4 x:collection1_shard1_replica_n2] o.a.s.u.UpdateHandler Using UpdateLog implementation: org.apache.solr.update.UpdateLog
   [junit4]   2> 1854716 INFO  (qtp1563372743-27067) [n:127.0.0.1:33785_solr c:collection1 s:shard1 r:core_node3 x:collection1_shard1_replica_n1] o.a.s.u.CommitTracker Soft AutoCommit: disabled
   [junit4]   2> 1854716 INFO  (qtp568090666-27078) [n:127.0.0.1:43044_solr c:collection1 s:shard1 r:core_node4 x:collection1_shard1_replica_n2] o.a.s.u.UpdateLog Initializing UpdateLog: dataDir=null defaultSyncLevel=FLUSH numRecordsToKeep=100 maxNumLogsToKeep=10 numVersionBuckets=65536
   [junit4]   2> 1854742 INFO  (qtp568090666-27078) [n:127.0.0.1:43044_solr c:collection1 s:shard1 r:core_node4 x:collection1_shard1_replica_n2] o.a.s.u.CommitTracker Hard AutoCommit: disabled
   [junit4]   2> 1854742 INFO  (qtp568090666-27078) [n:127.0.0.1:43044_solr c:collection1 s:shard1 r:core_node4 x:collection1_shard1_replica_n2] o.a.s.u.CommitTracker Soft AutoCommit: disabled
   [junit4]   2> 1854742 INFO  (qtp1563372743-27067) [n:127.0.0.1:33785_solr c:collection1 s:shard1 r:core_node3 x:collection1_shard1_replica_n1] o.a.s.s.SolrIndexSearcher Opening [Searcher@47669a79[collection1_shard1_replica_n1] main]
   [junit4]   2> 1854743 INFO  (qtp1563372743-27067) [n:127.0.0.1:33785_solr c:collection1 s:shard1 r:core_node3 x:collection1_shard1_replica_n1] o.a.s.r.ManagedResourceStorage Configured ZooKeeperStorageIO with znodeBase: /configs/config
   [junit4]   2> 1854744 INFO  (qtp1563372743-27067) [n:127.0.0.1:33785_solr c:collection1 s:shard1 r:core_node3 x:collection1_shard1_replica_n1] o.a.s.r.ManagedResourceStorage Loaded null at path _rest_managed.json using ZooKeeperStorageIO:path=/configs/config
   [junit4]   2> 1854745 INFO  (qtp1563372743-27067) [n:127.0.0.1:33785_solr c:collection1 s:shard1 r:core_node3 x:collection1_shard1_replica_n1] o.a.s.h.ReplicationHandler Commits will be reserved for 10000ms.
   [junit4]   2> 1854745 INFO  (qtp568090666-27078) [n:127.0.0.1:43044_solr c:collection1 s:shard1 r:core_node4 x:collection1_shard1_replica_n2] o.a.s.s.SolrIndexSearcher Opening [Searcher@60f6b0d1[collection1_shard1_replica_n2] main]
   [junit4]   2> 1854745 INFO  (searcherExecutor-8000-thread-1-processing-n:127.0.0.1:33785_solr x:collection1_shard1_replica_n1 c:collection1 s:shard1 r:core_node3) [n:127.0.0.1:33785_solr c:collection1 s:shard1 r:core_node3 x:collection1_shard1_replica_n1] o.a.s.c.SolrCore [collection1_shard1_replica_n1] Registered new searcher Searcher@47669a79[collection1_shard1_replica_n1] main{ExitableDirectoryReader(UninvertingDirectoryReader())}
   [junit4]   2> 1854745 INFO  (qtp1563372743-27067) [n:127.0.0.1:33785_solr c:collection1 s:shard1 r:core_node3 x:collection1_shard1_replica_n1] o.a.s.u.UpdateLog Could not find max version in index or recent updates, using new clock 1608222598144983040
   [junit4]   2> 1854746 INFO  (qtp568090666-27078) [n:127.0.0.1:43044_solr c:collection1 s:shard1 r:core_node4 x:collection1_shard1_replica_n2] o.a.s.r.ManagedResourceStorage Configured ZooKeeperStorageIO with znodeBase: /configs/config
   [junit4]   2> 1854746 INFO  (qtp568090666-27078) [n:127.0.0.1:43044_solr c:collection1 s:shard1 r:core_node4 x:collection1_shard1_replica_n2] o.a.s.r.ManagedResourceStorage Loaded null at path _rest_managed.json using ZooKeeperStorageIO:path=/configs/config
   [junit4]   2> 1854747 INFO  (qtp568090666-27078) [n:127.0.0.1:43044_solr c:collection1 s:shard1 r:core_node4 x:collection1_shard1_replica_n2] o.a.s.h.ReplicationHandler Commits will be reserved for 10000ms.
   [junit4]   2> 1854747 INFO  (qtp568090666-27078) [n:127.0.0.1:43044_solr c:collection1 s:shard1 r:core_node4 x:collection1_shard1_replica_n2] o.a.s.u.UpdateLog Could not find max version in index or recent updates, using new clock 1608222598147080192
   [junit4]   2> 1854748 INFO  (searcherExecutor-8001-thread-1-processing-n:127.0.0.1:43044_solr x:collection1_shard1_replica_n2 c:collection1 s:shard1 r:core_node4) [n:127.0.0.1:43044_solr c:collection1 s:shard1 r:core_node4 x:collection1_shard1_replica_n2] o.a.s.c.SolrCore [collection1_shard1_replica_n2] Registered new searcher Searcher@60f6b0d1[collection1_shard1_replica_n2] main{ExitableDirectoryReader(UninvertingDirectoryReader())}
   [junit4]   2> 1854751 INFO  (qtp568090666-27078) [n:127.0.0.1:43044_solr c:collection1 s:shard1 r:core_node4 x:collection1_shard1_replica_n2] o.a.s.c.ZkShardTerms Failed to save terms, version is not a match, retrying
   [junit4]   2> 1854751 INFO  (qtp1563372743-27067) [n:127.0.0.1:33785_solr c:collection1 s:shard1 r:core_node3 x:collection1_shard1_replica_n1] o.a.s.c.ZkShardTerms Successful update of terms at /collections/collection1/terms/shard1 to Terms{values={core_node3=0}, version=0}
   [junit4]   2> 1854752 INFO  (qtp568090666-27078) [n:127.0.0.1:43044_solr c:collection1 s:shard1 r:core_node4 x:collection1_shard1_replica_n2] o.a.s.c.ZkShardTerms Successful update of terms at /collections/collection1/terms/shard1 to Terms{values={core_node3=0, core_node4=0}, version=1}
   [junit4]   2> 1854756 INFO  (qtp568090666-27078) [n:127.0.0.1:43044_solr c:collection1 s:shard1 r:core_node4 x:collection1_shard1_replica_n2] o.a.s.c.ShardLeaderElectionContext Enough replicas found to continue.
   [junit4]   2> 1854756 INFO  (qtp568090666-27078) [n:127.0.0.1:43044_solr c:collection1 s:shard1 r:core_node4 x:collection1_shard1_replica_n2] o.a.s.c.ShardLeaderElectionContext I may be the new leader - try and sync
   [junit4]   2> 1854756 INFO  (qtp568090666-27078) [n:127.0.0.1:43044_solr c:collection1 s:shard1 r:core_node4 x:collection1_shard1_replica_n2] o.a.s.c.SyncStrategy Sync replicas to http://127.0.0.1:43044/solr/collection1_shard1_replica_n2/
   [junit4]   2> 1854756 INFO  (qtp568090666-27078) [n:127.0.0.1:43044_solr c:collection1 s:shard1 r:core_node4 x:collection1_shard1_replica_n2] o.a.s.u.PeerSync PeerSync: core=collection1_shard1_replica_n2 url=http://127.0.0.1:43044/solr START replicas=[http://127.0.0.1:33785/solr/collection1_shard1_replica_n1/] nUpdates=100
   [junit4]   2> 1854756 INFO  (qtp568090666-27078) [n:127.0.0.1:43044_solr c:collection1 s:shard1 r:core_node4 x:collection1_shard1_replica_n2] o.a.s.u.PeerSync PeerSync: core=collection1_shard1_replica_n2 url=http://127.0.0.1:43044/solr DONE.  We have no versions.  sync failed.
   [junit4]   2> 1854758 INFO  (qtp1563372743-27073) [n:127.0.0.1:33785_solr c:collection1 s:shard1 r:core_node3 x:collection1_shard1_replica_n1] o.a.s.c.S.Request [collection1_shard1_replica_n1]  webapp=/solr path=/get params={distrib=false&qt=/get&fingerprint=false&getVersions=100&wt=javabin&version=2} status=0 QTime=1
   [junit4]   2> 1854759 INFO  (qtp568090666-27078) [n:127.0.0.1:43044_solr c:collection1 s:shard1 r:core_node4 x:collection1_shard1_replica_n2] o.a.s.c.SyncStrategy Leader's attempt to sync with shard failed, moving to the next candidate
   [junit4]   2> 1854759 INFO  (qtp568090666-27078) [n:127.0.0.1:43044_solr c:collection1 s:shard1 r:core_node4 x:collection1_shard1_replica_n2] o.a.s.c.ShardLeaderElectionContext We failed sync, but we have no versions - we can't sync in that case - we were active before, so become leader anyway
   [junit4]   2> 1854759 INFO  (qtp568090666-27078) [n:127.0.0.1:43044_solr c:collection1 s:shard1 r:core_node4 x:collection1_shard1_replica_n2] o.a.s.c.ShardLeaderElectionContext Found all replicas participating in election, clear LIR
   [junit4]   2> 1854763 INFO  (qtp568090666-27078) [n:127.0.0.1:43044_solr c:collection1 s:shard1 r:core_node4 x:collection1_shard1_replica_n2] o.a.s.c.ShardLeaderElectionContext I am the new leader: http://127.0.0.1:43044/solr/collection1_shard1_replica_n2/ shard1
   [junit4]   2> 1854916 INFO  (qtp568090666-27078) [n:127.0.0.1:43044_solr c:collection1 s:shard1 r:core_node4 x:collection1_shard1_replica_n2] o.a.s.c.ZkController I am the leader, no recovery necessary
   [junit4]   2> 1854919 INFO  (qtp568090666-27078) [n:127.0.0.1:43044_solr c:collection1 s:shard1 r:core_node4 x:collection1_shard1_replica_n2] o.a.s.s.HttpSolrCall [admin] webapp=null path=/admin/cores params={qt=/admin/cores&coreNodeName=core_node4&collection.configName=config&newCollection=true&name=collection1_shard1_replica_n2&action=CREATE&numShards=1&collection=collection1&shard=shard1&wt=javabin&version=2&replicaType=NRT} status=0 QTime=1270
   [junit4]   2> 1855019 INFO  (zkCallback-5486-thread-1) [    ] o.a.s.c.c.ZkStateReader A cluster state change: [WatchedEvent state:SyncConnected type:NodeDataChanged path:/collections/collection1/state.

[...truncated too long message...]



ivy-availability-check:
[loadresource] Do not set property disallowed.ivy.jars.list as its length is 0.

-ivy-fail-disallowed-ivy-version:

ivy-fail:

ivy-configure:
[ivy:configure] :: loading settings :: file = /x1/jenkins/jenkins-slave/workspace/Lucene-Solr-NightlyTests-master/checkout/lucene/top-level-ivy-settings.xml

resolve:

ivy-availability-check:
[loadresource] Do not set property disallowed.ivy.jars.list as its length is 0.

-ivy-fail-disallowed-ivy-version:

ivy-fail:

ivy-fail:

ivy-configure:
[ivy:configure] :: loading settings :: file = /x1/jenkins/jenkins-slave/workspace/Lucene-Solr-NightlyTests-master/checkout/lucene/top-level-ivy-settings.xml

resolve:

ivy-availability-check:
[loadresource] Do not set property disallowed.ivy.jars.list as its length is 0.

-ivy-fail-disallowed-ivy-version:

ivy-fail:

ivy-configure:
[ivy:configure] :: loading settings :: file = /x1/jenkins/jenkins-slave/workspace/Lucene-Solr-NightlyTests-master/checkout/lucene/top-level-ivy-settings.xml

resolve:

ivy-availability-check:
[loadresource] Do not set property disallowed.ivy.jars.list as its length is 0.

-ivy-fail-disallowed-ivy-version:

ivy-fail:

ivy-fail:

ivy-configure:
[ivy:configure] :: loading settings :: file = /x1/jenkins/jenkins-slave/workspace/Lucene-Solr-NightlyTests-master/checkout/lucene/top-level-ivy-settings.xml

resolve:

ivy-availability-check:
[loadresource] Do not set property disallowed.ivy.jars.list as its length is 0.

-ivy-fail-disallowed-ivy-version:

ivy-fail:

ivy-fail:

ivy-configure:
[ivy:configure] :: loading settings :: file = /x1/jenkins/jenkins-slave/workspace/Lucene-Solr-NightlyTests-master/checkout/lucene/top-level-ivy-settings.xml

resolve:

ivy-availability-check:
[loadresource] Do not set property disallowed.ivy.jars.list as its length is 0.

-ivy-fail-disallowed-ivy-version:

ivy-fail:

ivy-fail:

ivy-configure:
[ivy:configure] :: loading settings :: file = /x1/jenkins/jenkins-slave/workspace/Lucene-Solr-NightlyTests-master/checkout/lucene/top-level-ivy-settings.xml

resolve:

ivy-availability-check:
[loadresource] Do not set property disallowed.ivy.jars.list as its length is 0.

-ivy-fail-disallowed-ivy-version:

ivy-fail:

ivy-fail:

ivy-configure:
[ivy:configure] :: loading settings :: file = /x1/jenkins/jenkins-slave/workspace/Lucene-Solr-NightlyTests-master/checkout/lucene/top-level-ivy-settings.xml

resolve:

ivy-availability-check:
[loadresource] Do not set property disallowed.ivy.jars.list as its length is 0.

-ivy-fail-disallowed-ivy-version:

ivy-fail:

ivy-fail:

ivy-configure:
[ivy:configure] :: loading settings :: file = /x1/jenkins/jenkins-slave/workspace/Lucene-Solr-NightlyTests-master/checkout/lucene/top-level-ivy-settings.xml

resolve:

ivy-availability-check:
[loadresource] Do not set property disallowed.ivy.jars.list as its length is 0.

-ivy-fail-disallowed-ivy-version:

ivy-fail:

ivy-fail:

ivy-configure:
[ivy:configure] :: loading settings :: file = /x1/jenkins/jenkins-slave/workspace/Lucene-Solr-NightlyTests-master/checkout/lucene/top-level-ivy-settings.xml

resolve:

ivy-availability-check:
[loadresource] Do not set property disallowed.ivy.jars.list as its length is 0.

-ivy-fail-disallowed-ivy-version:

ivy-fail:

ivy-fail:

ivy-configure:
[ivy:configure] :: loading settings :: file = /x1/jenkins/jenkins-slave/workspace/Lucene-Solr-NightlyTests-master/checkout/lucene/top-level-ivy-settings.xml

resolve:

ivy-availability-check:
[loadresource] Do not set property disallowed.ivy.jars.list as its length is 0.

-ivy-fail-disallowed-ivy-version:

ivy-fail:

ivy-fail:

ivy-configure:
[ivy:configure] :: loading settings :: file = /x1/jenkins/jenkins-slave/workspace/Lucene-Solr-NightlyTests-master/checkout/lucene/top-level-ivy-settings.xml

resolve:

ivy-availability-check:
[loadresource] Do not set property disallowed.ivy.jars.list as its length is 0.

-ivy-fail-disallowed-ivy-version:

ivy-fail:

ivy-fail:

ivy-configure:
[ivy:configure] :: loading settings :: file = /x1/jenkins/jenkins-slave/workspace/Lucene-Solr-NightlyTests-master/checkout/lucene/top-level-ivy-settings.xml

resolve:

ivy-availability-check:
[loadresource] Do not set property disallowed.ivy.jars.list as its length is 0.

-ivy-fail-disallowed-ivy-version:

ivy-fail:

ivy-fail:

ivy-configure:
[ivy:configure] :: loading settings :: file = /x1/jenkins/jenkins-slave/workspace/Lucene-Solr-NightlyTests-master/checkout/lucene/top-level-ivy-settings.xml

resolve:

jar-checksums:
    [mkdir] Created dir: /x1/jenkins/jenkins-slave/workspace/Lucene-Solr-NightlyTests-master/checkout/solr/null2041058330
     [copy] Copying 238 files to /x1/jenkins/jenkins-slave/workspace/Lucene-Solr-NightlyTests-master/checkout/solr/null2041058330
   [delete] Deleting directory /x1/jenkins/jenkins-slave/workspace/Lucene-Solr-NightlyTests-master/checkout/solr/null2041058330

check-working-copy:
[ivy:cachepath] :: resolving dependencies :: org.eclipse.jgit#org.eclipse.jgit-caller;working
[ivy:cachepath] confs: [default]
[ivy:cachepath] found org.eclipse.jgit#org.eclipse.jgit;4.6.0.201612231935-r in public
[ivy:cachepath] found com.jcraft#jsch;0.1.53 in public
[ivy:cachepath] found com.googlecode.javaewah#JavaEWAH;1.1.6 in public
[ivy:cachepath] found org.apache.httpcomponents#httpclient;4.3.6 in public
[ivy:cachepath] found org.apache.httpcomponents#httpcore;4.3.3 in public
[ivy:cachepath] found commons-logging#commons-logging;1.1.3 in public
[ivy:cachepath] found commons-codec#commons-codec;1.6 in public
[ivy:cachepath] found org.slf4j#slf4j-api;1.7.2 in public
[ivy:cachepath] :: resolution report :: resolve 39ms :: artifacts dl 1ms
        ---------------------------------------------------------------------
        |                  |            modules            ||   artifacts   |
        |       conf       | number| search|dwnlded|evicted|| number|dwnlded|
        ---------------------------------------------------------------------
        |      default     |   8   |   0   |   0   |   0   ||   8   |   0   |
        ---------------------------------------------------------------------
[wc-checker] Initializing working copy...
[wc-checker] SLF4J: Failed to load class "org.slf4j.impl.StaticLoggerBinder".
[wc-checker] SLF4J: Defaulting to no-operation (NOP) logger implementation
[wc-checker] SLF4J: See http://www.slf4j.org/codes.html#StaticLoggerBinder for further details.
[wc-checker] Checking working copy status...

-jenkins-base:

BUILD SUCCESSFUL
Total time: 272 minutes 19 seconds
Archiving artifacts
java.lang.InterruptedException: no matches found within 10000
        at hudson.FilePath$34.hasMatch(FilePath.java:2678)
        at hudson.FilePath$34.invoke(FilePath.java:2557)
        at hudson.FilePath$34.invoke(FilePath.java:2547)
        at hudson.FilePath$FileCallableWrapper.call(FilePath.java:2918)
Also:   hudson.remoting.Channel$CallSiteStackTrace: Remote call to lucene
                at hudson.remoting.Channel.attachCallSiteStackTrace(Channel.java:1741)
                at hudson.remoting.UserRequest$ExceptionResponse.retrieve(UserRequest.java:357)
                at hudson.remoting.Channel.call(Channel.java:955)
                at hudson.FilePath.act(FilePath.java:1036)
                at hudson.FilePath.act(FilePath.java:1025)
                at hudson.FilePath.validateAntFileMask(FilePath.java:2547)
                at hudson.tasks.ArtifactArchiver.perform(ArtifactArchiver.java:243)
                at hudson.tasks.BuildStepCompatibilityLayer.perform(BuildStepCompatibilityLayer.java:81)
                at hudson.tasks.BuildStepMonitor$1.perform(BuildStepMonitor.java:20)
                at hudson.model.AbstractBuild$AbstractBuildExecution.perform(AbstractBuild.java:744)
                at hudson.model.AbstractBuild$AbstractBuildExecution.performAllBuildSteps(AbstractBuild.java:690)
                at hudson.model.Build$BuildExecution.post2(Build.java:186)
                at hudson.model.AbstractBuild$AbstractBuildExecution.post(AbstractBuild.java:635)
                at hudson.model.Run.execute(Run.java:1819)
                at hudson.model.FreeStyleBuild.run(FreeStyleBuild.java:43)
                at hudson.model.ResourceController.execute(ResourceController.java:97)
                at hudson.model.Executor.run(Executor.java:429)
Caused: hudson.FilePath$TunneledInterruptedException
        at hudson.FilePath$FileCallableWrapper.call(FilePath.java:2920)
        at hudson.remoting.UserRequest.perform(UserRequest.java:212)
        at hudson.remoting.UserRequest.perform(UserRequest.java:54)
        at hudson.remoting.Request$2.run(Request.java:369)
        at hudson.remoting.InterceptingExecutorService$1.call(InterceptingExecutorService.java:72)
        at java.util.concurrent.FutureTask.run(FutureTask.java:266)
        at java.util.concurrent.ThreadPoolExecutor.runWorker(ThreadPoolExecutor.java:1142)
        at java.util.concurrent.ThreadPoolExecutor$Worker.run(ThreadPoolExecutor.java:617)
        at java.lang.Thread.run(Thread.java:748)
Caused: java.lang.InterruptedException: java.lang.InterruptedException: no matches found within 10000
        at hudson.FilePath.act(FilePath.java:1038)
        at hudson.FilePath.act(FilePath.java:1025)
        at hudson.FilePath.validateAntFileMask(FilePath.java:2547)
        at hudson.tasks.ArtifactArchiver.perform(ArtifactArchiver.java:243)
        at hudson.tasks.BuildStepCompatibilityLayer.perform(BuildStepCompatibilityLayer.java:81)
        at hudson.tasks.BuildStepMonitor$1.perform(BuildStepMonitor.java:20)
        at hudson.model.AbstractBuild$AbstractBuildExecution.perform(AbstractBuild.java:744)
        at hudson.model.AbstractBuild$AbstractBuildExecution.performAllBuildSteps(AbstractBuild.java:690)
        at hudson.model.Build$BuildExecution.post2(Build.java:186)
        at hudson.model.AbstractBuild$AbstractBuildExecution.post(AbstractBuild.java:635)
        at hudson.model.Run.execute(Run.java:1819)
        at hudson.model.FreeStyleBuild.run(FreeStyleBuild.java:43)
        at hudson.model.ResourceController.execute(ResourceController.java:97)
        at hudson.model.Executor.run(Executor.java:429)
No artifacts found that match the file pattern "**/*.events,heapdumps/**,**/hs_err_pid*". Configuration error?
Recording test results
Build step 'Publish JUnit test result report' changed build result to UNSTABLE
Email was triggered for: Unstable (Test Failures)
Sending email for trigger: Unstable (Test Failures)


---------------------------------------------------------------------
To unsubscribe, e-mail: [hidden email]
For additional commands, e-mail: [hidden email]
Reply | Threaded
Open this post in threaded view
|

[JENKINS] Lucene-Solr-NightlyTests-master - Build # 1608 - Failure

Apache Jenkins Server-2
Build: https://builds.apache.org/job/Lucene-Solr-NightlyTests-master/1608/

All tests passed

Build Log:
[...truncated 25003 lines...]
BUILD FAILED
/home/jenkins/jenkins-slave/workspace/Lucene-Solr-NightlyTests-master/checkout/build.xml:651: The following error occurred while executing this line:
/home/jenkins/jenkins-slave/workspace/Lucene-Solr-NightlyTests-master/checkout/build.xml:128: Found 1 violations in source files (Unescaped symbol "<-" on line #249).

Total time: 526 minutes 14 seconds
Build step 'Invoke Ant' marked build as failure
Archiving artifacts
Recording test results
Email was triggered for: Failure - Any
Sending email for trigger: Failure - Any


---------------------------------------------------------------------
To unsubscribe, e-mail: [hidden email]
For additional commands, e-mail: [hidden email]
Reply | Threaded
Open this post in threaded view
|

[JENKINS] Lucene-Solr-NightlyTests-master - Build # 1609 - Still unstable

Apache Jenkins Server-2
Build: https://builds.apache.org/job/Lucene-Solr-NightlyTests-master/1609/

3 tests failed.
FAILED:  org.apache.solr.cloud.DeleteReplicaTest.raceConditionOnDeleteAndRegisterReplica

Error Message:
Expected 1x2 collections null Live Nodes: [127.0.0.1:33557_solr, 127.0.0.1:38345_solr, 127.0.0.1:44991_solr, 127.0.0.1:46043_solr] Last available state: null

Stack Trace:
java.lang.AssertionError: Expected 1x2 collections
null
Live Nodes: [127.0.0.1:33557_solr, 127.0.0.1:38345_solr, 127.0.0.1:44991_solr, 127.0.0.1:46043_solr]
Last available state: null
        at __randomizedtesting.SeedInfo.seed([2E8973372122B4FA:449F12E749D0FE30]:0)
        at org.junit.Assert.fail(Assert.java:93)
        at org.apache.solr.cloud.SolrCloudTestCase.waitForState(SolrCloudTestCase.java:280)
        at org.apache.solr.cloud.DeleteReplicaTest.raceConditionOnDeleteAndRegisterReplica(DeleteReplicaTest.java:233)
        at org.apache.solr.cloud.DeleteReplicaTest.raceConditionOnDeleteAndRegisterReplica(DeleteReplicaTest.java:224)
        at sun.reflect.NativeMethodAccessorImpl.invoke0(Native Method)
        at sun.reflect.NativeMethodAccessorImpl.invoke(NativeMethodAccessorImpl.java:62)
        at sun.reflect.DelegatingMethodAccessorImpl.invoke(DelegatingMethodAccessorImpl.java:43)
        at java.lang.reflect.Method.invoke(Method.java:498)
        at com.carrotsearch.randomizedtesting.RandomizedRunner.invoke(RandomizedRunner.java:1737)
        at com.carrotsearch.randomizedtesting.RandomizedRunner$8.evaluate(RandomizedRunner.java:934)
        at com.carrotsearch.randomizedtesting.RandomizedRunner$9.evaluate(RandomizedRunner.java:970)
        at com.carrotsearch.randomizedtesting.RandomizedRunner$10.evaluate(RandomizedRunner.java:984)
        at com.carrotsearch.randomizedtesting.rules.SystemPropertiesRestoreRule$1.evaluate(SystemPropertiesRestoreRule.java:57)
        at org.apache.lucene.util.TestRuleSetupTeardownChained$1.evaluate(TestRuleSetupTeardownChained.java:49)
        at org.apache.lucene.util.AbstractBeforeAfterRule$1.evaluate(AbstractBeforeAfterRule.java:45)
        at org.apache.lucene.util.TestRuleThreadAndTestName$1.evaluate(TestRuleThreadAndTestName.java:48)
        at org.apache.lucene.util.TestRuleIgnoreAfterMaxFailures$1.evaluate(TestRuleIgnoreAfterMaxFailures.java:64)
        at org.apache.lucene.util.TestRuleMarkFailure$1.evaluate(TestRuleMarkFailure.java:47)
        at com.carrotsearch.randomizedtesting.rules.StatementAdapter.evaluate(StatementAdapter.java:36)
        at com.carrotsearch.randomizedtesting.ThreadLeakControl$StatementRunner.run(ThreadLeakControl.java:368)
        at com.carrotsearch.randomizedtesting.ThreadLeakControl.forkTimeoutingTask(ThreadLeakControl.java:817)
        at com.carrotsearch.randomizedtesting.ThreadLeakControl$3.evaluate(ThreadLeakControl.java:468)
        at com.carrotsearch.randomizedtesting.RandomizedRunner.runSingleTest(RandomizedRunner.java:943)
        at com.carrotsearch.randomizedtesting.RandomizedRunner$5.evaluate(RandomizedRunner.java:829)
        at com.carrotsearch.randomizedtesting.RandomizedRunner$6.evaluate(RandomizedRunner.java:879)
        at com.carrotsearch.randomizedtesting.RandomizedRunner$7.evaluate(RandomizedRunner.java:890)
        at com.carrotsearch.randomizedtesting.rules.StatementAdapter.evaluate(StatementAdapter.java:36)
        at com.carrotsearch.randomizedtesting.rules.SystemPropertiesRestoreRule$1.evaluate(SystemPropertiesRestoreRule.java:57)
        at org.apache.lucene.util.AbstractBeforeAfterRule$1.evaluate(AbstractBeforeAfterRule.java:45)
        at com.carrotsearch.randomizedtesting.rules.StatementAdapter.evaluate(StatementAdapter.java:36)
        at org.apache.lucene.util.TestRuleStoreClassName$1.evaluate(TestRuleStoreClassName.java:41)
        at com.carrotsearch.randomizedtesting.rules.NoShadowingOrOverridesOnMethodsRule$1.evaluate(NoShadowingOrOverridesOnMethodsRule.java:40)
        at com.carrotsearch.randomizedtesting.rules.NoShadowingOrOverridesOnMethodsRule$1.evaluate(NoShadowingOrOverridesOnMethodsRule.java:40)
        at com.carrotsearch.randomizedtesting.rules.StatementAdapter.evaluate(StatementAdapter.java:36)
        at com.carrotsearch.randomizedtesting.rules.StatementAdapter.evaluate(StatementAdapter.java:36)
        at com.carrotsearch.randomizedtesting.rules.StatementAdapter.evaluate(StatementAdapter.java:36)
        at org.apache.lucene.util.TestRuleAssertionsRequired$1.evaluate(TestRuleAssertionsRequired.java:53)
        at org.apache.lucene.util.TestRuleMarkFailure$1.evaluate(TestRuleMarkFailure.java:47)
        at org.apache.lucene.util.TestRuleIgnoreAfterMaxFailures$1.evaluate(TestRuleIgnoreAfterMaxFailures.java:64)
        at org.apache.lucene.util.TestRuleIgnoreTestSuites$1.evaluate(TestRuleIgnoreTestSuites.java:54)
        at com.carrotsearch.randomizedtesting.rules.StatementAdapter.evaluate(StatementAdapter.java:36)
        at com.carrotsearch.randomizedtesting.ThreadLeakControl$StatementRunner.run(ThreadLeakControl.java:368)
        at java.lang.Thread.run(Thread.java:748)


FAILED:  org.apache.solr.cloud.LeaderVoteWaitTimeoutTest.testMostInSyncReplicasCanWinElection

Error Message:
Timeout waiting for new leader null Live Nodes: [127.0.0.1:35752_solr, 127.0.0.1:41666_solr, 127.0.0.1:46045_solr] Last available state: DocCollection(collection1//collections/collection1/state.json/14)={   "pullReplicas":"0",   "replicationFactor":"3",   "shards":{"shard1":{       "range":"80000000-7fffffff",       "state":"active",       "replicas":{         "core_node62":{           "core":"collection1_shard1_replica_n61",           "base_url":"https://127.0.0.1:41377/solr",           "node_name":"127.0.0.1:41377_solr",           "state":"down",           "type":"NRT",           "force_set_state":"false"},         "core_node64":{           "core":"collection1_shard1_replica_n63",           "base_url":"https://127.0.0.1:41666/solr",           "node_name":"127.0.0.1:41666_solr",           "state":"active",           "type":"NRT",           "force_set_state":"false"},         "core_node66":{           "core":"collection1_shard1_replica_n65",           "base_url":"https://127.0.0.1:46045/solr",           "node_name":"127.0.0.1:46045_solr",           "state":"active",           "type":"NRT",           "force_set_state":"false"}}}},   "router":{"name":"compositeId"},   "maxShardsPerNode":"1",   "autoAddReplicas":"false",   "nrtReplicas":"3",   "tlogReplicas":"0"}

Stack Trace:
java.lang.AssertionError: Timeout waiting for new leader
null
Live Nodes: [127.0.0.1:35752_solr, 127.0.0.1:41666_solr, 127.0.0.1:46045_solr]
Last available state: DocCollection(collection1//collections/collection1/state.json/14)={
  "pullReplicas":"0",
  "replicationFactor":"3",
  "shards":{"shard1":{
      "range":"80000000-7fffffff",
      "state":"active",
      "replicas":{
        "core_node62":{
          "core":"collection1_shard1_replica_n61",
          "base_url":"https://127.0.0.1:41377/solr",
          "node_name":"127.0.0.1:41377_solr",
          "state":"down",
          "type":"NRT",
          "force_set_state":"false"},
        "core_node64":{
          "core":"collection1_shard1_replica_n63",
          "base_url":"https://127.0.0.1:41666/solr",
          "node_name":"127.0.0.1:41666_solr",
          "state":"active",
          "type":"NRT",
          "force_set_state":"false"},
        "core_node66":{
          "core":"collection1_shard1_replica_n65",
          "base_url":"https://127.0.0.1:46045/solr",
          "node_name":"127.0.0.1:46045_solr",
          "state":"active",
          "type":"NRT",
          "force_set_state":"false"}}}},
  "router":{"name":"compositeId"},
  "maxShardsPerNode":"1",
  "autoAddReplicas":"false",
  "nrtReplicas":"3",
  "tlogReplicas":"0"}
        at __randomizedtesting.SeedInfo.seed([2E8973372122B4FA:86956F8DE36280D0]:0)
        at org.junit.Assert.fail(Assert.java:93)
        at org.apache.solr.cloud.SolrCloudTestCase.waitForState(SolrCloudTestCase.java:280)
        at org.apache.solr.cloud.LeaderVoteWaitTimeoutTest.testMostInSyncReplicasCanWinElection(LeaderVoteWaitTimeoutTest.java:189)
        at sun.reflect.NativeMethodAccessorImpl.invoke0(Native Method)
        at sun.reflect.NativeMethodAccessorImpl.invoke(NativeMethodAccessorImpl.java:62)
        at sun.reflect.DelegatingMethodAccessorImpl.invoke(DelegatingMethodAccessorImpl.java:43)
        at java.lang.reflect.Method.invoke(Method.java:498)
        at com.carrotsearch.randomizedtesting.RandomizedRunner.invoke(RandomizedRunner.java:1737)
        at com.carrotsearch.randomizedtesting.RandomizedRunner$8.evaluate(RandomizedRunner.java:934)
        at com.carrotsearch.randomizedtesting.RandomizedRunner$9.evaluate(RandomizedRunner.java:970)
        at com.carrotsearch.randomizedtesting.RandomizedRunner$10.evaluate(RandomizedRunner.java:984)
        at com.carrotsearch.randomizedtesting.rules.SystemPropertiesRestoreRule$1.evaluate(SystemPropertiesRestoreRule.java:57)
        at org.apache.lucene.util.TestRuleSetupTeardownChained$1.evaluate(TestRuleSetupTeardownChained.java:49)
        at org.apache.lucene.util.AbstractBeforeAfterRule$1.evaluate(AbstractBeforeAfterRule.java:45)
        at org.apache.lucene.util.TestRuleThreadAndTestName$1.evaluate(TestRuleThreadAndTestName.java:48)
        at org.apache.lucene.util.TestRuleIgnoreAfterMaxFailures$1.evaluate(TestRuleIgnoreAfterMaxFailures.java:64)
        at org.apache.lucene.util.TestRuleMarkFailure$1.evaluate(TestRuleMarkFailure.java:47)
        at com.carrotsearch.randomizedtesting.rules.StatementAdapter.evaluate(StatementAdapter.java:36)
        at com.carrotsearch.randomizedtesting.ThreadLeakControl$StatementRunner.run(ThreadLeakControl.java:368)
        at com.carrotsearch.randomizedtesting.ThreadLeakControl.forkTimeoutingTask(ThreadLeakControl.java:817)
        at com.carrotsearch.randomizedtesting.ThreadLeakControl$3.evaluate(ThreadLeakControl.java:468)
        at com.carrotsearch.randomizedtesting.RandomizedRunner.runSingleTest(RandomizedRunner.java:943)
        at com.carrotsearch.randomizedtesting.RandomizedRunner$5.evaluate(RandomizedRunner.java:829)
        at com.carrotsearch.randomizedtesting.RandomizedRunner$6.evaluate(RandomizedRunner.java:879)
        at com.carrotsearch.randomizedtesting.RandomizedRunner$7.evaluate(RandomizedRunner.java:890)
        at com.carrotsearch.randomizedtesting.rules.StatementAdapter.evaluate(StatementAdapter.java:36)
        at com.carrotsearch.randomizedtesting.rules.SystemPropertiesRestoreRule$1.evaluate(SystemPropertiesRestoreRule.java:57)
        at org.apache.lucene.util.AbstractBeforeAfterRule$1.evaluate(AbstractBeforeAfterRule.java:45)
        at com.carrotsearch.randomizedtesting.rules.StatementAdapter.evaluate(StatementAdapter.java:36)
        at org.apache.lucene.util.TestRuleStoreClassName$1.evaluate(TestRuleStoreClassName.java:41)
        at com.carrotsearch.randomizedtesting.rules.NoShadowingOrOverridesOnMethodsRule$1.evaluate(NoShadowingOrOverridesOnMethodsRule.java:40)
        at com.carrotsearch.randomizedtesting.rules.NoShadowingOrOverridesOnMethodsRule$1.evaluate(NoShadowingOrOverridesOnMethodsRule.java:40)
        at com.carrotsearch.randomizedtesting.rules.StatementAdapter.evaluate(StatementAdapter.java:36)
        at com.carrotsearch.randomizedtesting.rules.StatementAdapter.evaluate(StatementAdapter.java:36)
        at com.carrotsearch.randomizedtesting.rules.StatementAdapter.evaluate(StatementAdapter.java:36)
        at org.apache.lucene.util.TestRuleAssertionsRequired$1.evaluate(TestRuleAssertionsRequired.java:53)
        at org.apache.lucene.util.TestRuleMarkFailure$1.evaluate(TestRuleMarkFailure.java:47)
        at org.apache.lucene.util.TestRuleIgnoreAfterMaxFailures$1.evaluate(TestRuleIgnoreAfterMaxFailures.java:64)
        at org.apache.lucene.util.TestRuleIgnoreTestSuites$1.evaluate(TestRuleIgnoreTestSuites.java:54)
        at com.carrotsearch.randomizedtesting.rules.StatementAdapter.evaluate(StatementAdapter.java:36)
        at com.carrotsearch.randomizedtesting.ThreadLeakControl$StatementRunner.run(ThreadLeakControl.java:368)
        at java.lang.Thread.run(Thread.java:748)


FAILED:  org.apache.solr.cloud.LeaderVoteWaitTimeoutTest.basicTest

Error Message:


Stack Trace:
java.lang.NullPointerException
        at __randomizedtesting.SeedInfo.seed([2E8973372122B4FA:DC7D64556587B9C9]:0)
        at org.apache.solr.client.solrj.embedded.JettySolrRunner.getNodeName(JettySolrRunner.java:347)
        at org.apache.solr.cloud.LeaderVoteWaitTimeoutTest.basicTest(LeaderVoteWaitTimeoutTest.java:94)
        at sun.reflect.NativeMethodAccessorImpl.invoke0(Native Method)
        at sun.reflect.NativeMethodAccessorImpl.invoke(NativeMethodAccessorImpl.java:62)
        at sun.reflect.DelegatingMethodAccessorImpl.invoke(DelegatingMethodAccessorImpl.java:43)
        at java.lang.reflect.Method.invoke(Method.java:498)
        at com.carrotsearch.randomizedtesting.RandomizedRunner.invoke(RandomizedRunner.java:1737)
        at com.carrotsearch.randomizedtesting.RandomizedRunner$8.evaluate(RandomizedRunner.java:934)
        at com.carrotsearch.randomizedtesting.RandomizedRunner$9.evaluate(RandomizedRunner.java:970)
        at com.carrotsearch.randomizedtesting.RandomizedRunner$10.evaluate(RandomizedRunner.java:984)
        at com.carrotsearch.randomizedtesting.rules.SystemPropertiesRestoreRule$1.evaluate(SystemPropertiesRestoreRule.java:57)
        at org.apache.lucene.util.TestRuleSetupTeardownChained$1.evaluate(TestRuleSetupTeardownChained.java:49)
        at org.apache.lucene.util.AbstractBeforeAfterRule$1.evaluate(AbstractBeforeAfterRule.java:45)
        at org.apache.lucene.util.TestRuleThreadAndTestName$1.evaluate(TestRuleThreadAndTestName.java:48)
        at org.apache.lucene.util.TestRuleIgnoreAfterMaxFailures$1.evaluate(TestRuleIgnoreAfterMaxFailures.java:64)
        at org.apache.lucene.util.TestRuleMarkFailure$1.evaluate(TestRuleMarkFailure.java:47)
        at com.carrotsearch.randomizedtesting.rules.StatementAdapter.evaluate(StatementAdapter.java:36)
        at com.carrotsearch.randomizedtesting.ThreadLeakControl$StatementRunner.run(ThreadLeakControl.java:368)
        at com.carrotsearch.randomizedtesting.ThreadLeakControl.forkTimeoutingTask(ThreadLeakControl.java:817)
        at com.carrotsearch.randomizedtesting.ThreadLeakControl$3.evaluate(ThreadLeakControl.java:468)
        at com.carrotsearch.randomizedtesting.RandomizedRunner.runSingleTest(RandomizedRunner.java:943)
        at com.carrotsearch.randomizedtesting.RandomizedRunner$5.evaluate(RandomizedRunner.java:829)
        at com.carrotsearch.randomizedtesting.RandomizedRunner$6.evaluate(RandomizedRunner.java:879)
        at com.carrotsearch.randomizedtesting.RandomizedRunner$7.evaluate(RandomizedRunner.java:890)
        at com.carrotsearch.randomizedtesting.rules.StatementAdapter.evaluate(StatementAdapter.java:36)
        at com.carrotsearch.randomizedtesting.rules.SystemPropertiesRestoreRule$1.evaluate(SystemPropertiesRestoreRule.java:57)
        at org.apache.lucene.util.AbstractBeforeAfterRule$1.evaluate(AbstractBeforeAfterRule.java:45)
        at com.carrotsearch.randomizedtesting.rules.StatementAdapter.evaluate(StatementAdapter.java:36)
        at org.apache.lucene.util.TestRuleStoreClassName$1.evaluate(TestRuleStoreClassName.java:41)
        at com.carrotsearch.randomizedtesting.rules.NoShadowingOrOverridesOnMethodsRule$1.evaluate(NoShadowingOrOverridesOnMethodsRule.java:40)
        at com.carrotsearch.randomizedtesting.rules.NoShadowingOrOverridesOnMethodsRule$1.evaluate(NoShadowingOrOverridesOnMethodsRule.java:40)
        at com.carrotsearch.randomizedtesting.rules.StatementAdapter.evaluate(StatementAdapter.java:36)
        at com.carrotsearch.randomizedtesting.rules.StatementAdapter.evaluate(StatementAdapter.java:36)
        at com.carrotsearch.randomizedtesting.rules.StatementAdapter.evaluate(StatementAdapter.java:36)
        at org.apache.lucene.util.TestRuleAssertionsRequired$1.evaluate(TestRuleAssertionsRequired.java:53)
        at org.apache.lucene.util.TestRuleMarkFailure$1.evaluate(TestRuleMarkFailure.java:47)
        at org.apache.lucene.util.TestRuleIgnoreAfterMaxFailures$1.evaluate(TestRuleIgnoreAfterMaxFailures.java:64)
        at org.apache.lucene.util.TestRuleIgnoreTestSuites$1.evaluate(TestRuleIgnoreTestSuites.java:54)
        at com.carrotsearch.randomizedtesting.rules.StatementAdapter.evaluate(StatementAdapter.java:36)
        at com.carrotsearch.randomizedtesting.ThreadLeakControl$StatementRunner.run(ThreadLeakControl.java:368)
        at java.lang.Thread.run(Thread.java:748)




Build Log:
[...truncated 13743 lines...]
   [junit4] Suite: org.apache.solr.cloud.DeleteReplicaTest
   [junit4]   2> 1125534 INFO  (SUITE-DeleteReplicaTest-seed#[2E8973372122B4FA]-worker) [    ] o.a.s.SolrTestCaseJ4 SecureRandom sanity checks: test.solr.allowed.securerandom=null & java.security.egd=file:/dev/./urandom
   [junit4]   2> Creating dataDir: /home/jenkins/jenkins-slave/workspace/Lucene-Solr-NightlyTests-master/checkout/solr/build/solr-core/test/J2/temp/solr.cloud.DeleteReplicaTest_2E8973372122B4FA-001/init-core-data-001
   [junit4]   2> 1125584 WARN  (SUITE-DeleteReplicaTest-seed#[2E8973372122B4FA]-worker) [    ] o.a.s.SolrTestCaseJ4 startTrackingSearchers: numOpens=1 numCloses=1
   [junit4]   2> 1125588 INFO  (SUITE-DeleteReplicaTest-seed#[2E8973372122B4FA]-worker) [    ] o.a.s.SolrTestCaseJ4 Using PointFields (NUMERIC_POINTS_SYSPROP=true) w/NUMERIC_DOCVALUES_SYSPROP=true
   [junit4]   2> 1125590 INFO  (SUITE-DeleteReplicaTest-seed#[2E8973372122B4FA]-worker) [    ] o.a.s.SolrTestCaseJ4 Randomized ssl (false) and clientAuth (false) via: @org.apache.solr.util.RandomizeSSL(reason=, ssl=NaN, value=NaN, clientAuth=NaN)
   [junit4]   2> 1125590 INFO  (SUITE-DeleteReplicaTest-seed#[2E8973372122B4FA]-worker) [    ] o.a.s.c.MiniSolrCloudCluster Starting cluster of 4 servers in /home/jenkins/jenkins-slave/workspace/Lucene-Solr-NightlyTests-master/checkout/solr/build/solr-core/test/J2/temp/solr.cloud.DeleteReplicaTest_2E8973372122B4FA-001/tempDir-001
   [junit4]   2> 1125591 INFO  (SUITE-DeleteReplicaTest-seed#[2E8973372122B4FA]-worker) [    ] o.a.s.c.ZkTestServer STARTING ZK TEST SERVER
   [junit4]   2> 1125608 INFO  (Thread-1553) [    ] o.a.s.c.ZkTestServer client port:0.0.0.0/0.0.0.0:0
   [junit4]   2> 1125608 INFO  (Thread-1553) [    ] o.a.s.c.ZkTestServer Starting server
   [junit4]   2> 1125632 ERROR (Thread-1553) [    ] o.a.z.s.ZooKeeperServer ZKShutdownHandler is not registered, so ZooKeeper server won't take any action on ERROR or SHUTDOWN server state changes
   [junit4]   2> 1125718 INFO  (SUITE-DeleteReplicaTest-seed#[2E8973372122B4FA]-worker) [    ] o.a.s.c.ZkTestServer start zk server on port:39011
   [junit4]   2> 1125755 INFO  (zkConnectionManagerCallback-2221-thread-1) [    ] o.a.s.c.c.ConnectionManager zkClient has connected
   [junit4]   2> 1125881 INFO  (jetty-launcher-2218-thread-2) [    ] o.e.j.s.Server jetty-9.4.11.v20180605; built: 2018-06-05T18:24:03.829Z; git: d5fc0523cfa96bfebfbda19606cad384d772f04c; jvm 1.8.0_172-b11
   [junit4]   2> 1125882 INFO  (jetty-launcher-2218-thread-3) [    ] o.e.j.s.Server jetty-9.4.11.v20180605; built: 2018-06-05T18:24:03.829Z; git: d5fc0523cfa96bfebfbda19606cad384d772f04c; jvm 1.8.0_172-b11
   [junit4]   2> 1125883 INFO  (jetty-launcher-2218-thread-4) [    ] o.e.j.s.Server jetty-9.4.11.v20180605; built: 2018-06-05T18:24:03.829Z; git: d5fc0523cfa96bfebfbda19606cad384d772f04c; jvm 1.8.0_172-b11
   [junit4]   2> 1125884 INFO  (jetty-launcher-2218-thread-2) [    ] o.e.j.s.session DefaultSessionIdManager workerName=node0
   [junit4]   2> 1125884 INFO  (jetty-launcher-2218-thread-2) [    ] o.e.j.s.session No SessionScavenger set, using defaults
   [junit4]   2> 1125884 INFO  (jetty-launcher-2218-thread-2) [    ] o.e.j.s.session node0 Scavenging every 600000ms
   [junit4]   2> 1125884 INFO  (jetty-launcher-2218-thread-2) [    ] o.e.j.s.h.ContextHandler Started o.e.j.s.ServletContextHandler@446bc4ca{/solr,null,AVAILABLE}
   [junit4]   2> 1126011 INFO  (jetty-launcher-2218-thread-1) [    ] o.e.j.s.Server jetty-9.4.11.v20180605; built: 2018-06-05T18:24:03.829Z; git: d5fc0523cfa96bfebfbda19606cad384d772f04c; jvm 1.8.0_172-b11
   [junit4]   2> 1126027 INFO  (jetty-launcher-2218-thread-2) [    ] o.e.j.s.AbstractConnector Started ServerConnector@3b0169f7{HTTP/1.1,[http/1.1]}{127.0.0.1:46043}
   [junit4]   2> 1126027 INFO  (jetty-launcher-2218-thread-2) [    ] o.e.j.s.Server Started @1126382ms
   [junit4]   2> 1126027 INFO  (jetty-launcher-2218-thread-2) [    ] o.a.s.c.s.e.JettySolrRunner Jetty properties: {hostContext=/solr, hostPort=46043}
   [junit4]   2> 1126028 ERROR (jetty-launcher-2218-thread-2) [    ] o.a.s.u.StartupLoggingUtils Missing Java Option solr.log.dir. Logging may be missing or incomplete.
   [junit4]   2> 1126028 INFO  (jetty-launcher-2218-thread-2) [    ] o.a.s.s.SolrDispatchFilter Using logger factory org.apache.logging.slf4j.Log4jLoggerFactory
   [junit4]   2> 1126028 INFO  (jetty-launcher-2218-thread-2) [    ] o.a.s.s.SolrDispatchFilter  ___      _       Welcome to Apache Solr™ version 8.0.0
   [junit4]   2> 1126028 INFO  (jetty-launcher-2218-thread-2) [    ] o.a.s.s.SolrDispatchFilter / __| ___| |_ _   Starting in cloud mode on port null
   [junit4]   2> 1126028 INFO  (jetty-launcher-2218-thread-2) [    ] o.a.s.s.SolrDispatchFilter \__ \/ _ \ | '_|  Install dir: null
   [junit4]   2> 1126028 INFO  (jetty-launcher-2218-thread-2) [    ] o.a.s.s.SolrDispatchFilter |___/\___/_|_|    Start time: 2018-08-10T11:38:43.357Z
   [junit4]   2> 1126048 INFO  (jetty-launcher-2218-thread-4) [    ] o.e.j.s.session DefaultSessionIdManager workerName=node0
   [junit4]   2> 1126048 INFO  (jetty-launcher-2218-thread-4) [    ] o.e.j.s.session No SessionScavenger set, using defaults
   [junit4]   2> 1126048 INFO  (jetty-launcher-2218-thread-4) [    ] o.e.j.s.session node0 Scavenging every 600000ms
   [junit4]   2> 1126048 INFO  (jetty-launcher-2218-thread-4) [    ] o.e.j.s.h.ContextHandler Started o.e.j.s.ServletContextHandler@111561c6{/solr,null,AVAILABLE}
   [junit4]   2> 1126153 INFO  (jetty-launcher-2218-thread-3) [    ] o.e.j.s.session DefaultSessionIdManager workerName=node0
   [junit4]   2> 1126153 INFO  (jetty-launcher-2218-thread-3) [    ] o.e.j.s.session No SessionScavenger set, using defaults
   [junit4]   2> 1126154 INFO  (jetty-launcher-2218-thread-3) [    ] o.e.j.s.session node0 Scavenging every 660000ms
   [junit4]   2> 1126154 INFO  (jetty-launcher-2218-thread-3) [    ] o.e.j.s.h.ContextHandler Started o.e.j.s.ServletContextHandler@36654ff{/solr,null,AVAILABLE}
   [junit4]   2> 1126049 INFO  (jetty-launcher-2218-thread-4) [    ] o.e.j.s.AbstractConnector Started ServerConnector@123dfcd3{HTTP/1.1,[http/1.1]}{127.0.0.1:38345}
   [junit4]   2> 1126155 INFO  (jetty-launcher-2218-thread-4) [    ] o.e.j.s.Server Started @1126509ms
   [junit4]   2> 1126155 INFO  (jetty-launcher-2218-thread-4) [    ] o.a.s.c.s.e.JettySolrRunner Jetty properties: {hostContext=/solr, hostPort=38345}
   [junit4]   2> 1126155 ERROR (jetty-launcher-2218-thread-4) [    ] o.a.s.u.StartupLoggingUtils Missing Java Option solr.log.dir. Logging may be missing or incomplete.
   [junit4]   2> 1126155 INFO  (jetty-launcher-2218-thread-4) [    ] o.a.s.s.SolrDispatchFilter Using logger factory org.apache.logging.slf4j.Log4jLoggerFactory
   [junit4]   2> 1126155 INFO  (jetty-launcher-2218-thread-4) [    ] o.a.s.s.SolrDispatchFilter  ___      _       Welcome to Apache Solr™ version 8.0.0
   [junit4]   2> 1126155 INFO  (jetty-launcher-2218-thread-4) [    ] o.a.s.s.SolrDispatchFilter / __| ___| |_ _   Starting in cloud mode on port null
   [junit4]   2> 1126155 INFO  (jetty-launcher-2218-thread-4) [    ] o.a.s.s.SolrDispatchFilter \__ \/ _ \ | '_|  Install dir: null
   [junit4]   2> 1126155 INFO  (jetty-launcher-2218-thread-4) [    ] o.a.s.s.SolrDispatchFilter |___/\___/_|_|    Start time: 2018-08-10T11:38:43.484Z
   [junit4]   2> 1126157 INFO  (zkConnectionManagerCallback-2225-thread-1) [    ] o.a.s.c.c.ConnectionManager zkClient has connected
   [junit4]   2> 1126174 INFO  (jetty-launcher-2218-thread-4) [    ] o.a.s.s.SolrDispatchFilter solr.xml found in ZooKeeper. Loading...
   [junit4]   2> 1126210 INFO  (jetty-launcher-2218-thread-1) [    ] o.e.j.s.session DefaultSessionIdManager workerName=node0
   [junit4]   2> 1126211 INFO  (jetty-launcher-2218-thread-1) [    ] o.e.j.s.session No SessionScavenger set, using defaults
   [junit4]   2> 1126211 INFO  (jetty-launcher-2218-thread-1) [    ] o.e.j.s.session node0 Scavenging every 660000ms
   [junit4]   2> 1126213 INFO  (jetty-launcher-2218-thread-1) [    ] o.e.j.s.h.ContextHandler Started o.e.j.s.ServletContextHandler@180fc8a9{/solr,null,AVAILABLE}
   [junit4]   2> 1126213 INFO  (jetty-launcher-2218-thread-1) [    ] o.e.j.s.AbstractConnector Started ServerConnector@235c2233{HTTP/1.1,[http/1.1]}{127.0.0.1:44991}
   [junit4]   2> 1126213 INFO  (jetty-launcher-2218-thread-1) [    ] o.e.j.s.Server Started @1126568ms
   [junit4]   2> 1126213 INFO  (jetty-launcher-2218-thread-1) [    ] o.a.s.c.s.e.JettySolrRunner Jetty properties: {hostContext=/solr, hostPort=44991}
   [junit4]   2> 1126226 ERROR (jetty-launcher-2218-thread-1) [    ] o.a.s.u.StartupLoggingUtils Missing Java Option solr.log.dir. Logging may be missing or incomplete.
   [junit4]   2> 1126226 INFO  (jetty-launcher-2218-thread-1) [    ] o.a.s.s.SolrDispatchFilter Using logger factory org.apache.logging.slf4j.Log4jLoggerFactory
   [junit4]   2> 1126226 INFO  (jetty-launcher-2218-thread-1) [    ] o.a.s.s.SolrDispatchFilter  ___      _       Welcome to Apache Solr™ version 8.0.0
   [junit4]   2> 1126226 INFO  (jetty-launcher-2218-thread-1) [    ] o.a.s.s.SolrDispatchFilter / __| ___| |_ _   Starting in cloud mode on port null
   [junit4]   2> 1126226 INFO  (jetty-launcher-2218-thread-1) [    ] o.a.s.s.SolrDispatchFilter \__ \/ _ \ | '_|  Install dir: null
   [junit4]   2> 1126226 INFO  (jetty-launcher-2218-thread-1) [    ] o.a.s.s.SolrDispatchFilter |___/\___/_|_|    Start time: 2018-08-10T11:38:43.555Z
   [junit4]   2> 1126231 INFO  (jetty-launcher-2218-thread-3) [    ] o.e.j.s.AbstractConnector Started ServerConnector@15ca633e{HTTP/1.1,[http/1.1]}{127.0.0.1:33557}
   [junit4]   2> 1126231 INFO  (jetty-launcher-2218-thread-3) [    ] o.e.j.s.Server Started @1126585ms
   [junit4]   2> 1126231 INFO  (jetty-launcher-2218-thread-3) [    ] o.a.s.c.s.e.JettySolrRunner Jetty properties: {hostContext=/solr, hostPort=33557}
   [junit4]   2> 1126231 ERROR (jetty-launcher-2218-thread-3) [    ] o.a.s.u.StartupLoggingUtils Missing Java Option solr.log.dir. Logging may be missing or incomplete.
   [junit4]   2> 1126231 INFO  (jetty-launcher-2218-thread-3) [    ] o.a.s.s.SolrDispatchFilter Using logger factory org.apache.logging.slf4j.Log4jLoggerFactory
   [junit4]   2> 1126231 INFO  (jetty-launcher-2218-thread-3) [    ] o.a.s.s.SolrDispatchFilter  ___      _       Welcome to Apache Solr™ version 8.0.0
   [junit4]   2> 1126231 INFO  (jetty-launcher-2218-thread-3) [    ] o.a.s.s.SolrDispatchFilter / __| ___| |_ _   Starting in cloud mode on port null
   [junit4]   2> 1126231 INFO  (jetty-launcher-2218-thread-3) [    ] o.a.s.s.SolrDispatchFilter \__ \/ _ \ | '_|  Install dir: null
   [junit4]   2> 1126231 INFO  (jetty-launcher-2218-thread-3) [    ] o.a.s.s.SolrDispatchFilter |___/\___/_|_|    Start time: 2018-08-10T11:38:43.560Z
   [junit4]   2> 1126232 INFO  (zkConnectionManagerCallback-2223-thread-1) [    ] o.a.s.c.c.ConnectionManager zkClient has connected
   [junit4]   2> 1126356 INFO  (jetty-launcher-2218-thread-2) [    ] o.a.s.s.SolrDispatchFilter solr.xml found in ZooKeeper. Loading...
   [junit4]   2> 1126465 INFO  (zkConnectionManagerCallback-2227-thread-1) [    ] o.a.s.c.c.ConnectionManager zkClient has connected
   [junit4]   2> 1126482 INFO  (zkConnectionManagerCallback-2229-thread-1) [    ] o.a.s.c.c.ConnectionManager zkClient has connected
   [junit4]   2> 1126502 INFO  (jetty-launcher-2218-thread-1) [    ] o.a.s.s.SolrDispatchFilter solr.xml found in ZooKeeper. Loading...
   [junit4]   2> 1126502 INFO  (jetty-launcher-2218-thread-3) [    ] o.a.s.s.SolrDispatchFilter solr.xml found in ZooKeeper. Loading...
   [junit4]   2> 1126937 INFO  (jetty-launcher-2218-thread-4) [    ] o.a.s.c.ZkContainer Zookeeper client=127.0.0.1:39011/solr
   [junit4]   2> 1126992 INFO  (zkConnectionManagerCallback-2233-thread-1) [    ] o.a.s.c.c.ConnectionManager zkClient has connected
   [junit4]   2> 1127061 INFO  (zkConnectionManagerCallback-2235-thread-1) [    ] o.a.s.c.c.ConnectionManager zkClient has connected
   [junit4]   2> 1127631 INFO  (jetty-launcher-2218-thread-3) [    ] o.a.s.c.ZkContainer Zookeeper client=127.0.0.1:39011/solr
   [junit4]   2> 1127667 INFO  (zkConnectionManagerCallback-2241-thread-1) [    ] o.a.s.c.c.ConnectionManager zkClient has connected
   [junit4]   2> 1127740 INFO  (zkConnectionManagerCallback-2243-thread-1) [    ] o.a.s.c.c.ConnectionManager zkClient has connected
   [junit4]   2> 1127935 INFO  (jetty-launcher-2218-thread-3) [n:127.0.0.1:33557_solr    ] o.a.s.c.OverseerElectionContext I am going to be the leader 127.0.0.1:33557_solr
   [junit4]   2> 1127956 INFO  (jetty-launcher-2218-thread-3) [n:127.0.0.1:33557_solr    ] o.a.s.c.Overseer Overseer (id=73121801940107272-127.0.0.1:33557_solr-n_0000000000) starting
   [junit4]   2> 1128104 INFO  (zkConnectionManagerCallback-2250-thread-1) [    ] o.a.s.c.c.ConnectionManager zkClient has connected
   [junit4]   2> 1128105 INFO  (jetty-launcher-2218-thread-4) [n:127.0.0.1:38345_solr    ] o.a.s.c.ZkController Register node as live in ZooKeeper:/live_nodes/127.0.0.1:38345_solr
   [junit4]   2> 1128301 INFO  (zkCallback-2242-thread-1) [    ] o.a.s.c.c.ZkStateReader Updated live nodes from ZooKeeper... (0) -> (1)
   [junit4]   2> 1128378 INFO  (zkCallback-2234-thread-1) [    ] o.a.s.c.c.ZkStateReader Updated live nodes from ZooKeeper... (0) -> (1)
   [junit4]   2> 1128467 INFO  (jetty-launcher-2218-thread-3) [n:127.0.0.1:33557_solr    ] o.a.s.c.c.ZkStateReader Updated live nodes from ZooKeeper... (0) -> (1)
   [junit4]   2> 1128469 INFO  (jetty-launcher-2218-thread-3) [n:127.0.0.1:33557_solr    ] o.a.s.c.s.i.ZkClientClusterStateProvider Cluster at 127.0.0.1:39011/solr ready
   [junit4]   2> 1128504 INFO  (OverseerStateUpdate-73121801940107272-127.0.0.1:33557_solr-n_0000000000) [    ] o.a.s.c.Overseer Starting to work on the main queue : 127.0.0.1:33557_solr
   [junit4]   2> 1128523 INFO  (jetty-launcher-2218-thread-1) [    ] o.a.s.c.ZkContainer Zookeeper client=127.0.0.1:39011/solr
   [junit4]   2> 1128525 INFO  (zkConnectionManagerCallback-2255-thread-1) [    ] o.a.s.c.c.ConnectionManager zkClient has connected
   [junit4]   2> 1128541 INFO  (jetty-launcher-2218-thread-3) [n:127.0.0.1:33557_solr    ] o.a.s.c.TransientSolrCoreCacheDefault Allocating transient cache for 2147483647 transient cores
   [junit4]   2> 1128541 INFO  (jetty-launcher-2218-thread-3) [n:127.0.0.1:33557_solr    ] o.a.s.c.ZkController Register node as live in ZooKeeper:/live_nodes/127.0.0.1:33557_solr
   [junit4]   2> 1128542 INFO  (jetty-launcher-2218-thread-4) [n:127.0.0.1:38345_solr    ] o.a.s.c.c.ZkStateReader Updated live nodes from ZooKeeper... (0) -> (2)
   [junit4]   2> 1128578 INFO  (zkCallback-2249-thread-1) [    ] o.a.s.c.c.ZkStateReader Updated live nodes from ZooKeeper... (1) -> (2)
   [junit4]   2> 1128614 INFO  (zkConnectionManagerCallback-2259-thread-1) [    ] o.a.s.c.c.ConnectionManager zkClient has connected
   [junit4]   2> 1128630 INFO  (zkCallback-2234-thread-1) [    ] o.a.s.c.c.ZkStateReader Updated live nodes from ZooKeeper... (1) -> (2)
   [junit4]   2> 1128651 INFO  (zkCallback-2242-thread-1) [    ] o.a.s.c.c.ZkStateReader Updated live nodes from ZooKeeper... (1) -> (2)
   [junit4]   2> 1128651 INFO  (jetty-launcher-2218-thread-4) [n:127.0.0.1:38345_solr    ] o.a.s.c.s.i.ZkClientClusterStateProvider Cluster at 127.0.0.1:39011/solr ready
   [junit4]   2> 1128671 INFO  (jetty-launcher-2218-thread-3) [n:127.0.0.1:33557_solr    ] o.a.s.h.a.MetricsHistoryHandler No .system collection, keeping metrics history in memory.
   [junit4]   2> 1128705 INFO  (jetty-launcher-2218-thread-4) [n:127.0.0.1:38345_solr    ] o.a.s.h.a.MetricsHistoryHandler No .system collection, keeping metrics history in memory.
   [junit4]   2> 1128870 INFO  (zkConnectionManagerCallback-2263-thread-1) [    ] o.a.s.c.c.ConnectionManager zkClient has connected
   [junit4]   2> 1128982 INFO  (jetty-launcher-2218-thread-2) [    ] o.a.s.c.ZkContainer Zookeeper client=127.0.0.1:39011/solr
   [junit4]   2> 1128998 INFO  (jetty-launcher-2218-thread-3) [n:127.0.0.1:33557_solr    ] o.a.s.m.r.SolrJmxReporter JMX monitoring for 'solr_33557.solr.node' (registry 'solr.node') enabled at server: com.sun.jmx.mbeanserver.JmxMBeanServer@79b5912c
   [junit4]   2> 1129033 INFO  (jetty-launcher-2218-thread-4) [n:127.0.0.1:38345_solr    ] o.a.s.m.r.SolrJmxReporter JMX monitoring for 'solr_38345.solr.node' (registry 'solr.node') enabled at server: com.sun.jmx.mbeanserver.JmxMBeanServer@79b5912c
   [junit4]   2> 1129070 INFO  (zkConnectionManagerCallback-2267-thread-1) [    ] o.a.s.c.c.ConnectionManager zkClient has connected
   [junit4]   2> 1129106 INFO  (jetty-launcher-2218-thread-4) [n:127.0.0.1:38345_solr    ] o.a.s.m.r.SolrJmxReporter JMX monitoring for 'solr_38345.solr.jvm' (registry 'solr.jvm') enabled at server: com.sun.jmx.mbeanserver.JmxMBeanServer@79b5912c
   [junit4]   2> 1129106 INFO  (jetty-launcher-2218-thread-4) [n:127.0.0.1:38345_solr    ] o.a.s.m.r.SolrJmxReporter JMX monitoring for 'solr_38345.solr.jetty' (registry 'solr.jetty') enabled at server: com.sun.jmx.mbeanserver.JmxMBeanServer@79b5912c
   [junit4]   2> 1129108 INFO  (jetty-launcher-2218-thread-4) [n:127.0.0.1:38345_solr    ] o.a.s.c.CorePropertiesLocator Found 0 core definitions underneath /home/jenkins/jenkins-slave/workspace/Lucene-Solr-NightlyTests-master/checkout/solr/build/solr-core/test/J2/temp/solr.cloud.DeleteReplicaTest_2E8973372122B4FA-001/tempDir-001/node4/.
   [junit4]   2> 1129128 INFO  (jetty-launcher-2218-thread-3) [n:127.0.0.1:33557_solr    ] o.a.s.m.r.SolrJmxReporter JMX monitoring for 'solr_33557.solr.jvm' (registry 'solr.jvm') enabled at server: com.sun.jmx.mbeanserver.JmxMBeanServer@79b5912c
   [junit4]   2> 1129128 INFO  (jetty-launcher-2218-thread-3) [n:127.0.0.1:33557_solr    ] o.a.s.m.r.SolrJmxReporter JMX monitoring for 'solr_33557.solr.jetty' (registry 'solr.jetty') enabled at server: com.sun.jmx.mbeanserver.JmxMBeanServer@79b5912c
   [junit4]   2> 1129129 INFO  (jetty-launcher-2218-thread-3) [n:127.0.0.1:33557_solr    ] o.a.s.c.CorePropertiesLocator Found 0 core definitions underneath /home/jenkins/jenkins-slave/workspace/Lucene-Solr-NightlyTests-master/checkout/solr/build/solr-core/test/J2/temp/solr.cloud.DeleteReplicaTest_2E8973372122B4FA-001/tempDir-001/node3/.
   [junit4]   2> 1129145 INFO  (jetty-launcher-2218-thread-1) [n:127.0.0.1:44991_solr    ] o.a.s.c.c.ZkStateReader Updated live nodes from ZooKeeper... (0) -> (2)
   [junit4]   2> 1129201 INFO  (jetty-launcher-2218-thread-1) [n:127.0.0.1:44991_solr    ] o.a.s.c.TransientSolrCoreCacheDefault Allocating transient cache for 2147483647 transient cores
   [junit4]   2> 1129201 INFO  (jetty-launcher-2218-thread-1) [n:127.0.0.1:44991_solr    ] o.a.s.c.ZkController Register node as live in ZooKeeper:/live_nodes/127.0.0.1:44991_solr
   [junit4]   2> 1129216 INFO  (zkCallback-2234-thread-1) [    ] o.a.s.c.c.ZkStateReader Updated live nodes from ZooKeeper... (2) -> (3)
   [junit4]   2> 1129240 INFO  (zkCallback-2242-thread-2) [    ] o.a.s.c.c.ZkStateReader Updated live nodes from ZooKeeper... (2) -> (3)
   [junit4]   2> 1129241 INFO  (zkCallback-2249-thread-1) [    ] o.a.s.c.c.ZkStateReader Updated live nodes from ZooKeeper... (2) -> (3)
   [junit4]   2> 1129460 INFO  (zkCallback-2262-thread-1) [    ] o.a.s.c.c.ZkStateReader Updated live nodes from ZooKeeper... (2) -> (3)
   [junit4]   2> 1129550 INFO  (zkConnectionManagerCallback-2269-thread-1) [    ] o.a.s.c.c.ConnectionManager zkClient has connected
   [junit4]   2> 1129566 INFO  (zkCallback-2254-thread-1) [    ] o.a.s.c.c.ZkStateReader Updated live nodes from ZooKeeper... (2) -> (3)
   [junit4]   2> 1129769 INFO  (zkConnectionManagerCallback-2276-thread-1) [    ] o.a.s.c.c.ConnectionManager zkClient has connected
   [junit4]   2> 1129770 INFO  (jetty-launcher-2218-thread-1) [n:127.0.0.1:44991_solr    ] o.a.s.c.c.ZkStateReader Updated live nodes from ZooKeeper... (0) -> (3)
   [junit4]   2> 1129785 INFO  (jetty-launcher-2218-thread-2) [n:127.0.0.1:46043_solr    ] o.a.s.c.c.ZkStateReader Updated live nodes from ZooKeeper... (0) -> (3)
   [junit4]   2> 1129806 INFO  (jetty-launcher-2218-thread-1) [n:127.0.0.1:44991_solr    ] o.a.s.c.s.i.ZkClientClusterStateProvider Cluster at 127.0.0.1:39011/solr ready
   [junit4]   2> 1129838 INFO  (jetty-launcher-2218-thread-1) [n:127.0.0.1:44991_solr    ] o.a.s.h.a.MetricsHistoryHandler No .system collection, keeping metrics history in memory.
   [junit4]   2> 1129899 INFO  (jetty-launcher-2218-thread-2) [n:127.0.0.1:46043_solr    ] o.a.s.c.TransientSolrCoreCacheDefault Allocating transient cache for 2147483647 transient cores
   [junit4]   2> 1129899 INFO  (jetty-launcher-2218-thread-2) [n:127.0.0.1:46043_solr    ] o.a.s.c.ZkController Register node as live in ZooKeeper:/live_nodes/127.0.0.1:46043_solr
   [junit4]   2> 1129968 INFO  (zkCallback-2249-thread-1) [    ] o.a.s.c.c.ZkStateReader Updated live nodes from ZooKeeper... (3) -> (4)
   [junit4]   2> 1129970 INFO  (zkCallback-2242-thread-1) [    ] o.a.s.c.c.ZkStateReader Updated live nodes from ZooKeeper... (3) -> (4)
   [junit4]   2> 1129972 INFO  (zkCallback-2262-thread-1) [    ] o.a.s.c.c.ZkStateReader Updated live nodes from ZooKeeper... (3) -> (4)
   [junit4]   2> 1129984 INFO  (zkCallback-2234-thread-1) [    ] o.a.s.c.c.ZkStateReader Updated live nodes from ZooKeeper... (3) -> (4)
   [junit4]   2> 1130021 INFO  (zkCallback-2268-thread-1) [    ] o.a.s.c.c.ZkStateReader Updated live nodes from ZooKeeper... (3) -> (4)
   [junit4]   2> 1130042 INFO  (jetty-launcher-2218-thread-1) [n:127.0.0.1:44991_solr    ] o.a.s.m.r.SolrJmxReporter JMX monitoring for 'solr_44991.solr.node' (registry 'solr.node') enabled at server: com.sun.jmx.mbeanserver.JmxMBeanServer@79b5912c
   [junit4]   2> 1130128 INFO  (jetty-launcher-2218-thread-1) [n:127.0.0.1:44991_solr    ] o.a.s.m.r.SolrJmxReporter JMX monitoring for 'solr_44991.solr.jvm' (registry 'solr.jvm') enabled at server: com.sun.jmx.mbeanserver.JmxMBeanServer@79b5912c
   [junit4]   2> 1130128 INFO  (jetty-launcher-2218-thread-1) [n:127.0.0.1:44991_solr    ] o.a.s.m.r.SolrJmxReporter JMX monitoring for 'solr_44991.solr.jetty' (registry 'solr.jetty') enabled at server: com.sun.jmx.mbeanserver.JmxMBeanServer@79b5912c
   [junit4]   2> 1130129 INFO  (jetty-launcher-2218-thread-1) [n:127.0.0.1:44991_solr    ] o.a.s.c.CorePropertiesLocator Found 0 core definitions underneath /home/jenkins/jenkins-slave/workspace/Lucene-Solr-NightlyTests-master/checkout/solr/build/solr-core/test/J2/temp/solr.cloud.DeleteReplicaTest_2E8973372122B4FA-001/tempDir-001/node1/.
   [junit4]   2> 1130131 INFO  (zkCallback-2275-thread-1) [    ] o.a.s.c.c.ZkStateReader Updated live nodes from ZooKeeper... (3) -> (4)
   [junit4]   2> 1130147 INFO  (zkCallback-2254-thread-1) [    ] o.a.s.c.c.ZkStateReader Updated live nodes from ZooKeeper... (3) -> (4)
   [junit4]   2> 1130249 INFO  (zkConnectionManagerCallback-2284-thread-1) [    ] o.a.s.c.c.ConnectionManager zkClient has connected
   [junit4]   2> 1130395 INFO  (jetty-launcher-2218-thread-2) [n:127.0.0.1:46043_solr    ] o.a.s.c.c.ZkStateReader Updated live nodes from ZooKeeper... (0) -> (4)
   [junit4]   2> 1130469 INFO  (jetty-launcher-2218-thread-2) [n:127.0.0.1:46043_solr    ] o.a.s.c.s.i.ZkClientClusterStateProvider Cluster at 127.0.0.1:39011/solr ready
   [junit4]   2> 1130469 INFO  (jetty-launcher-2218-thread-2) [n:127.0.0.1:46043_solr    ] o.a.s.h.a.MetricsHistoryHandler No .system collection, keeping metrics history in memory.
   [junit4]   2> 1130543 INFO  (jetty-launcher-2218-thread-2) [n:127.0.0.1:46043_solr    ] o.a.s.m.r.SolrJmxReporter JMX monitoring for 'solr_46043.solr.node' (registry 'solr.node') enabled at server: com.sun.jmx.mbeanserver.JmxMBeanServer@79b5912c
   [junit4]   2> 1130579 INFO  (jetty-launcher-2218-thread-2) [n:127.0.0.1:46043_solr    ] o.a.s.m.r.SolrJmxReporter JMX monitoring for 'solr_46043.solr.jvm' (registry 'solr.jvm') enabled at server: com.sun.jmx.mbeanserver.JmxMBeanServer@79b5912c
   [junit4]   2> 1130579 INFO  (jetty-launcher-2218-thread-2) [n:127.0.0.1:46043_solr    ] o.a.s.m.r.SolrJmxReporter JMX monitoring for 'solr_46043.solr.jetty' (registry 'solr.jetty') enabled at server: com.sun.jmx.mbeanserver.JmxMBeanServer@79b5912c
   [junit4]   2> 1130580 INFO  (jetty-launcher-2218-thread-2) [n:127.0.0.1:46043_solr    ] o.a.s.c.CorePropertiesLocator Found 0 core definitions underneath /home/jenkins/jenkins-slave/workspace/Lucene-Solr-NightlyTests-master/checkout/solr/build/solr-core/test/J2/temp/solr.cloud.DeleteReplicaTest_2E8973372122B4FA-001/tempDir-001/node2/.
   [junit4]   2> 1130887 INFO  (zkConnectionManagerCallback-2287-thread-1) [    ] o.a.s.c.c.ConnectionManager zkClient has connected
   [junit4]   2> 1130961 INFO  (zkConnectionManagerCallback-2292-thread-1) [    ] o.a.s.c.c.ConnectionManager zkClient has connected
   [junit4]   2> 1131034 INFO  (SUITE-DeleteReplicaTest-seed#[2E8973372122B4FA]-worker) [    ] o.a.s.c.c.ZkStateReader Updated live nodes from ZooKeeper... (0) -> (4)
   [junit4]   2> 1131108 INFO  (SUITE-DeleteReplicaTest-seed#[2E8973372122B4FA]-worker) [    ] o.a.s.c.s.i.ZkClientClusterStateProvider Cluster at 127.0.0.1:39011/solr ready
   [junit4]   2> 1131459 INFO  (TEST-DeleteReplicaTest.deleteLiveReplicaTest-seed#[2E8973372122B4FA]) [    ] o.a.s.SolrTestCaseJ4 ###Starting deleteLiveReplicaTest
   [junit4]   2> 1131482 INFO  (qtp1387351581-7888) [n:127.0.0.1:44991_solr    ] o.a.s.h.a.CollectionsHandler Invoked Collection Action :create with params collection.configName=conf&name=delLiveColl&nrtReplicas=2&action=CREATE&numShards=2&wt=javabin&version=2 and sendToOCPQueue=true
   [junit4]   2> 1131571 INFO  (OverseerThreadFactory-2621-thread-1) [    ] o.a.s.c.a.c.CreateCollectionCmd Create collection delLiveColl
   [junit4]   2> 1132179 INFO  (OverseerStateUpdate-73121801940107272-127.0.0.1:33557_solr-n_0000000000) [    ] o.a.s.c.o.SliceMutator createReplica() {
   [junit4]   2>   "operation":"ADDREPLICA",
   [junit4]   2>   "collection":"delLiveColl",
   [junit4]   2>   "shard":"shard1",
   [junit4]   2>   "core":"delLiveColl_shard1_replica_n1",
   [junit4]   2>   "state":"down",
   [junit4]   2>   "base_url":"http://127.0.0.1:33557/solr",
   [junit4]   2>   "type":"NRT",
   [junit4]   2>   "waitForFinalState":"false"}
   [junit4]   2> 1132214 INFO  (OverseerStateUpdate-73121801940107272-127.0.0.1:33557_solr-n_0000000000) [    ] o.a.s.c.o.SliceMutator createReplica() {
   [junit4]   2>   "operation":"ADDREPLICA",
   [junit4]   2>   "collection":"delLiveColl",
   [junit4]   2>   "shard":"shard1",
   [junit4]   2>   "core":"delLiveColl_shard1_replica_n3",
   [junit4]   2>   "state":"down",
   [junit4]   2>   "base_url":"http://127.0.0.1:46043/solr",
   [junit4]   2>   "type":"NRT",
   [junit4]   2>   "waitForFinalState":"false"}
   [junit4]   2> 1132216 INFO  (OverseerStateUpdate-73121801940107272-127.0.0.1:33557_solr-n_0000000000) [    ] o.a.s.c.o.SliceMutator createReplica() {
   [junit4]   2>   "operation":"ADDREPLICA",
   [junit4]   2>   "collection":"delLiveColl",
   [junit4]   2>   "shard":"shard2",
   [junit4]   2>   "core":"delLiveColl_shard2_replica_n4",
   [junit4]   2>   "state":"down",
   [junit4]   2>   "base_url":"http://127.0.0.1:44991/solr",
   [junit4]   2>   "type":"NRT",
   [junit4]   2>   "waitForFinalState":"false"}
   [junit4]   2> 1132250 INFO  (OverseerStateUpdate-73121801940107272-127.0.0.1:33557_solr-n_0000000000) [    ] o.a.s.c.o.SliceMutator createReplica() {
   [junit4]   2>   "operation":"ADDREPLICA",
   [junit4]   2>   "collection":"delLiveColl",
   [junit4]   2>   "shard":"shard2",
   [junit4]   2>   "core":"delLiveColl_shard2_replica_n6",
   [junit4]   2>   "state":"down",
   [junit4]   2>   "base_url":"http://127.0.0.1:38345/solr",
   [junit4]   2>   "type":"NRT",
   [junit4]   2>   "waitForFinalState":"false"}
   [junit4]   2> 1132620 INFO  (qtp1387351581-7883) [n:127.0.0.1:44991_solr    x:delLiveColl_shard2_replica_n4] o.a.s.h.a.CoreAdminOperation core create command qt=/admin/cores&coreNodeName=core_node7&collection.configName=conf&newCollection=true&name=delLiveColl_shard2_replica_n4&action=CREATE&numShards=2&collection=delLiveColl&shard=shard2&wt=javabin&version=2&replicaType=NRT
   [junit4]   2> 1132622 INFO  (qtp2132429858-7866) [n:127.0.0.1:38345_solr    x:delLiveColl_shard2_replica_n6] o.a.s.h.a.CoreAdminOperation core create command qt=/admin/cores&coreNodeName=core_node8&collection.configName=conf&newCollection=true&name=delLiveColl_shard2_replica_n6&action=CREATE&numShards=2&collection=delLiveColl&shard=shard2&wt=javabin&version=2&replicaType=NRT
   [junit4]   2> 1132622 INFO  (qtp2132429858-7866) [n:127.0.0.1:38345_solr    x:delLiveColl_shard2_replica_n6] o.a.s.c.TransientSolrCoreCacheDefault Allocating transient cache for 2147483647 transient cores
   [junit4]   2> 1132636 INFO  (qtp602024173-7874) [n:127.0.0.1:33557_solr    x:delLiveColl_shard1_replica_n1] o.a.s.h.a.CoreAdminOperation core create command qt=/admin/cores&coreNodeName=core_node2&collection.configName=conf&newCollection=true&name=delLiveColl_shard1_replica_n1&action=CREATE&numShards=2&collection=delLiveColl&shard=shard1&wt=javabin&version=2&replicaType=NRT
   [junit4]   2> 1132663 INFO  (qtp1287394799-7857) [n:127.0.0.1:46043_solr    x:delLiveColl_shard1_replica_n3] o.a.s.h.a.CoreAdminOperation core create command qt=/admin/cores&coreNodeName=core_node5&collection.configName=conf&newCollection=true&name=delLiveColl_shard1_replica_n3&action=CREATE&numShards=2&collection=delLiveColl&shard=shard1&wt=javabin&version=2&replicaType=NRT
   [junit4]   2> 1133971 INFO  (qtp2132429858-7866) [n:127.0.0.1:38345_solr c:delLiveColl s:shard2 r:core_node8 x:delLiveColl_shard2_replica_n6] o.a.s.c.SolrConfig Using Lucene MatchVersion: 8.0.0
   [junit4]   2> 1134095 INFO  (qtp1387351581-7883) [n:127.0.0.1:44991_solr c:delLiveColl s:shard2 r:core_node7 x:delLiveColl_shard2_replica_n4] o.a.s.c.SolrConfig Using Lucene MatchVersion: 8.0.0
   [junit4]   2> 1134099 INFO  (qtp602024173-7874) [n:127.0.0.1:33557_solr c:delLiveColl s:shard1 r:core_node2 x:delLiveColl_shard1_replica_n1] o.a.s.c.SolrConfig Using Lucene MatchVersion: 8.0.0
   [junit4]   2> 1134117 INFO  (qtp2132429858-7866) [n:127.0.0.1:38345_solr c:delLiveColl s:shard2 r:core_node8 x:delLiveColl_shard2_replica_n6] o.a.s.s.IndexSchema [delLiveColl_shard2_replica_n6] Schema name=minimal
   [junit4]   2> 1134119 INFO  (qtp1287394799-7857) [n:127.0.0.1:46043_solr c:delLiveColl s:shard1 r:core_node5 x:delLiveColl_shard1_replica_n3] o.a.s.c.SolrConfig Using Lucene MatchVersion: 8.0.0
   [junit4]   2> 1134386 INFO  (qtp2132429858-7866) [n:127.0.0.1:38345_solr c:delLiveColl s:shard2 r:core_node8 x:delLiveColl_shard2_replica_n6] o.a.s.s.IndexSchema Loaded schema minimal/1.1 with uniqueid field id
   [junit4]   2> 1134386 INFO  (qtp2132429858-7866) [n:127.0.0.1:38345_solr c:delLiveColl s:shard2 r:core_node8 x:delLiveColl_shard2_replica_n6] o.a.s.c.CoreContainer Creating SolrCore 'delLiveColl_shard2_replica_n6' using configuration from collection delLiveColl, trusted=true
   [junit4]   2> 1134387 INFO  (qtp2132429858-7866) [n:127.0.0.1:38345_solr c:delLiveColl s:shard2 r:core_node8 x:delLiveColl_shard2_replica_n6] o.a.s.m.r.SolrJmxReporter JMX monitoring for 'solr_38345.solr.core.delLiveColl.shard2.replica_n6' (registry 'solr.core.delLiveColl.shard2.replica_n6') enabled at server: com.sun.jmx.mbeanserver.JmxMBeanServer@79b5912c
   [junit4]   2> 1134387 INFO  (qtp2132429858-7866) [n:127.0.0.1:38345_solr c:delLiveColl s:shard2 r:core_node8 x:delLiveColl_shard2_replica_n6] o.a.s.c.SolrCore solr.RecoveryStrategy.Builder
   [junit4]   2> 1134387 INFO  (qtp2132429858-7866) [n:127.0.0.1:38345_solr c:delLiveColl s:shard2 r:core_node8 x:delLiveColl_shard2_replica_n6] o.a.s.c.SolrCore [[delLiveColl_shard2_replica_n6] ] Opening new SolrCore at [/home/jenkins/jenkins-slave/workspace/Lucene-Solr-NightlyTests-master/checkout/solr/build/solr-core/test/J2/temp/solr.cloud.DeleteReplicaTest_2E8973372122B4FA-001/tempDir-001/node4/delLiveColl_shard2_replica_n6], dataDir=[/home/jenkins/jenkins-slave/workspace/Lucene-Solr-NightlyTests-master/checkout/solr/build/solr-core/test/J2/temp/solr.cloud.DeleteReplicaTest_2E8973372122B4FA-001/tempDir-001/node4/./delLiveColl_shard2_replica_n6/data/]
   [junit4]   2> 1134448 INFO  (qtp602024173-7874) [n:127.0.0.1:33557_solr c:delLiveColl s:shard1 r:core_node2 x:delLiveColl_shard1_replica_n1] o.a.s.s.IndexSchema [delLiveColl_shard1_replica_n1] Schema name=minimal
   [junit4]   2> 1134450 INFO  (qtp602024173-7874) [n:127.0.0.1:33557_solr c:delLiveColl s:shard1 r:core_node2 x:delLiveColl_shard1_replica_n1] o.a.s.s.IndexSchema Loaded schema minimal/1.1 with uniqueid field id
   [junit4]   2> 1134450 INFO  (qtp602024173-7874) [n:127.0.0.1:33557_solr c:delLiveColl s:shard1 r:core_node2 x:delLiveColl_shard1_replica_n1] o.a.s.c.CoreContainer Creating SolrCore 'delLiveColl_shard1_replica_n1' using configuration from collection delLiveColl, trusted=true
   [junit4]   2> 1134459 INFO  (qtp1387351581-7883) [n:127.0.0.1:44991_solr c:delLiveColl s:shard2 r:core_node7 x:delLiveColl_shard2_replica_n4] o.a.s.s.IndexSchema [delLiveColl_shard2_replica_n4] Schema name=minimal
   [junit4]   2> 1134461 INFO  (qtp1387351581-7883) [n:127.0.0.1:44991_solr c:delLiveColl s:shard2 r:core_node7 x:delLiveColl_shard2_replica_n4] o.a.s.s.IndexSchema Loaded schema minimal/1.1 with uniqueid field id
   [junit4]   2> 1134461 INFO  (qtp1387351581-7883) [n:127.0.0.1:44991_solr c:delLiveColl s:shard2 r:core_node7 x:delLiveColl_shard2_replica_n4] o.a.s.c.CoreContainer Creating SolrCore 'delLiveColl_shard2_replica_n4' using configuration from collection delLiveColl, trusted=true
   [junit4]   2> 1134461 INFO  (qtp1387351581-7883) [n:127.0.0.1:44991_solr c:delLiveColl s:shard2 r:core_node7 x:delLiveColl_shard2_replica_n4] o.a.s.m.r.SolrJmxReporter JMX monitoring for 'solr_44991.solr.core.delLiveColl.shard2.replica_n4' (registry 'solr.core.delLiveColl.shard2.replica_n4') enabled at server: com.sun.jmx.mbeanserver.JmxMBeanServer@79b5912c
   [junit4]   2> 1134462 INFO  (qtp1387351581-7883) [n:127.0.0.1:44991_solr c:delLiveColl s:shard2 r:core_node7 x:delLiveColl_shard2_replica_n4] o.a.s.c.SolrCore solr.RecoveryStrategy.Builder
   [junit4]   2> 1134462 INFO  (qtp1387351581-7883) [n:127.0.0.1:44991_solr c:delLiveColl s:shard2 r:core_node7 x:delLiveColl_shard2_replica_n4] o.a.s.c.SolrCore [[delLiveColl_shard2_replica_n4] ] Opening new SolrCore at [/home/jenkins/jenkins-slave/workspace/Lucene-Solr-NightlyTests-master/checkout/solr/build/solr-core/test/J2/temp/solr.cloud.DeleteReplicaTest_2E8973372122B4FA-001/tempDir-001/node1/delLiveColl_shard2_replica_n4], dataDir=[/home/jenkins/jenkins-slave/workspace/Lucene-Solr-NightlyTests-master/checkout/solr/build/solr-core/test/J2/temp/solr.cloud.DeleteReplicaTest_2E8973372122B4FA-001/tempDir-001/node1/./delLiveColl_shard2_replica_n4/data/]
   [junit4]   2> 1134464 INFO  (qtp1287394799-7857) [n:127.0.0.1:46043_solr c:delLiveColl s:shard1 r:core_node5 x:delLiveColl_shard1_replica_n3] o.a.s.s.IndexSchema [delLiveColl_shard1_replica_n3] Schema name=minimal
   [junit4]   2> 1134466 INFO  (qtp1287394799-7857) [n:127.0.0.1:46043_solr c:delLiveColl s:shard1 r:core_node5 x:delLiveColl_shard1_replica_n3] o.a.s.s.IndexSchema Loaded schema minimal/1.1 with uniqueid field id
   [junit4]   2> 1134466 INFO  (qtp1287394799-7857) [n:127.0.0.1:46043_solr c:delLiveColl s:shard1 r:core_node5 x:delLiveColl_shard1_replica_n3] o.a.s.c.CoreContainer Creating SolrCore 'delLiveColl_shard1_replica_n3' using configuration from collection delLiveColl, trusted=true
   [junit4]   2> 1134466 INFO  (qtp1287394799-7857) [n:127.0.0.1:46043_solr c:delLiveColl s:shard1 r:core_node5 x:delLiveColl_shard1_replica_n3] o.a.s.m.r.SolrJmxReporter JMX monitoring for 'solr_46043.solr.core.delLiveColl.shard1.replica_n3' (registry 'solr.core.delLiveColl.shard1.replica_n3') enabled at server: com.sun.jmx.mbeanserver.JmxMBeanServer@79b5912c
   [junit4]   2> 1134466 INFO  (qtp1287394799-7857) [n:127.0.0.1:46043_solr c:delLiveColl s:shard1 r:core_node5 x:delLiveColl_shard1_replica_n3] o.a.s.c.SolrCore solr.RecoveryStrategy.Builder
   [junit4]   2> 1134466 INFO  (qtp1287394799-7857) [n:127.0.0.1:46043_solr c:delLiveColl s:shard1 r:core_node5 x:delLiveColl_shard1_replica_n3] o.a.s.c.SolrCore [[delLiveColl_shard1_replica_n3] ] Opening new SolrCore at [/home/jenkins/jenkins-slave/workspace/Lucene-Solr-NightlyTests-master/checkout/solr/build/solr-core/test/J2/temp/solr.cloud.DeleteReplicaTest_2E8973372122B4FA-001/tempDir-001/node2/delLiveColl_shard1_replica_n3], dataDir=[/home/jenkins/jenkins-slave/workspace/Lucene-Solr-NightlyTests-master/checkout/solr/build/solr-core/test/J2/temp/solr.cloud.DeleteReplicaTest_2E8973372122B4FA-001/tempDir-001/node2/./delLiveColl_shard1_replica_n3/data/]
   [junit4]   2> 1134499 INFO  (qtp602024173-7874) [n:127.0.0.1:33557_solr c:delLiveColl s:shard1 r:core_node2 x:delLiveColl_shard1_replica_n1] o.a.s.m.r.SolrJmxReporter JMX monitoring for 'solr_33557.solr.core.delLiveColl.shard1.replica_n1' (registry 'solr.core.delLiveColl.shard1.replica_n1') enabled at server: com.sun.jmx.mbeanserver.JmxMBeanServer@79b5912c
   [junit4]   2> 1134499 INFO  (qtp602024173-7874) [n:127.0.0.1:33557_solr c:delLiveColl s:shard1 r:core_node2 x:delLiveColl_shard1_replica_n1] o.a.s.c.SolrCore solr.RecoveryStrategy.Builder
   [junit4]   2> 1134499 INFO  (qtp602024173-7874) [n:127.0.0.1:33557_solr c:delLiveColl s:shard1 r:core_node2 x:delLiveColl_shard1_replica_n1] o.a.s.c.SolrCore [[delLiveColl_shard1_replica_n1] ] Opening new SolrCore at [/home/jenkins/jenkins-slave/workspace/Lucene-Solr-NightlyTests-master/checkout/solr/build/solr-core/test/J2/temp/solr.cloud.DeleteReplicaTest_2E8973372122B4FA-001/tempDir-001/node3/delLiveColl_shard1_replica_n1], dataDir=[/home/jenkins/jenkins-slave/workspace/Lucene-Solr-NightlyTests-master/checkout/solr/build/solr-core/test/J2/temp/solr.cloud.DeleteReplicaTest_2E8973372122B4FA-001/tempDir-001/node3/./delLiveColl_shard1_replica_n1/data/]
   [junit4]   2> 1135141 INFO  (qtp2132429858-7866) [n:127.0.0.1:38345_solr c:delLiveColl s:shard2 r:core_node8 x:delLiveColl_shard2_replica_n6] o.a.s.u.UpdateHandler Using UpdateLog implementation: org.apache.solr.update.UpdateLog
   [junit4]   2> 1135141 INFO  (qtp2132429858-7866) [n:127.0.0.1:38345_solr c:delLiveColl s:shard2 r:core_node8 x:delLiveColl_shard2_replica_n6] o.a.s.u.UpdateLog Initializing UpdateLog: dataDir=null defaultSyncLevel=FLUSH numRecordsToKeep=100 maxNumLogsToKeep=10 numVersionBuckets=65536
   [junit4]   2> 1135143 INFO  (qtp2132429858-7866) [n:127.0.0.1:38345_solr c:delLiveColl s:shard2 r:core_node8 x:delLiveColl_shard2_replica_n6] o.a.s.u.CommitTracker Hard AutoCommit: disabled
   [junit4]   2> 1135143 INFO  (qtp2132429858-7866) [n:127.0.0.1:38345_solr c:delLiveColl s:shard2 r:core_node8 x:delLiveColl_shard2_replica_n6] o.a.s.u.CommitTracker Soft AutoCommit: disabled
   [junit4]   2> 1135158 INFO  (qtp2132429858-7866) [n:127.0.0.1:38345_solr c:delLiveColl s:shard2 r:core_node8 x:delLiveColl_shard2_replica_n6] o.a.s.s.SolrIndexSearcher Opening [Searcher@2d3d8b75[delLiveColl_shard2_replica_n6] main]
   [junit4]   2> 1135159 INFO  (qtp2132429858-7866) [n:127.0.0.1:38345_solr c:delLiveColl s:shard2 r:core_node8 x:delLiveColl_shard2_replica_n6] o.a.s.r.ManagedResourceStorage Configured ZooKeeperStorageIO with znodeBase: /configs/conf
   [junit4]   2> 1135159 INFO  (qtp2132429858-7866) [n:127.0.0.1:38345_solr c:delLiveColl s:shard2 r:core_node8 x:delLiveColl_shard2_replica_n6] o.a.s.r.ManagedResourceStorage Loaded null at path _rest_managed.json using ZooKeeperStorageIO:path=/configs/conf
   [junit4]   2> 1135178 INFO  (qtp1387351581-7883) [n:127.0.0.1:44991_solr c:delLiveColl s:shard2 r:core_node7 x:delLiveColl_shard2_replica_n4] o.a.s.u.UpdateHandler Using UpdateLog implementation: org.apache.solr.update.UpdateLog
   [junit4]   2> 1135178 INFO  (qtp1387351581-7883) [n:127.0.0.1:44991_solr c:delLiveColl s:shard2 r:core_node7 x:delLiveColl_shard2_replica_n4] o.a.s.u.UpdateLog Initializing UpdateLog: dataDir=null defaultSyncLevel=FLUSH numRecordsToKeep=100 maxNumLogsToKeep=10 numVersionBuckets=65536
   [junit4]   2> 1135198 INFO  (qtp602024173-7874) [n:127.0.0.1:33557_solr c:delLiveColl s:shard1 r:core_node2 x:delLiveColl_shard1_replica_n1] o.a.s.u.UpdateHandler Using UpdateLog implementation: org.apache.solr.update.UpdateLog
   [junit4]   2> 1135198 INFO  (qtp602024173-7874) [n:127.0.0.1:33557_solr c:delLiveColl s:shard1 r:core_node2 x:delLiveColl_shard1_replica_n1] o.a.s.u.UpdateLog Initializing UpdateLog: dataDir=null defaultSyncLevel=FLUSH numRecordsToKeep=100 maxNumLogsToKeep=10 numVersionBuckets=65536
   [junit4]   2> 1135220 INFO  (qtp2132429858-7866) [n:127.0.0.1:38345_solr c:delLiveColl s:shard2 r:core_node8 x:delLiveColl_shard2_replica_n6] o.a.s.h.ReplicationHandler Commits will be reserved for 10000ms.
   [junit4]   2> 1135220 INFO  (qtp2132429858-7866) [n:127.0.0.1:38345_solr c:delLiveColl s:shard2 r:core_node8 x:delLiveColl_shard2_replica_n6] o.a.s.u.UpdateLog Could not find max version in index or recent updates, using new clock 1608411913963700224
   [junit4]   2> 1135239 INFO  (qtp1387351581-7883) [n:127.0.0.1:44991_solr c:delLiveColl s:shard2 r:core_node7 x:delLiveColl_shard2_replica_n4] o.a.s.u.CommitTracker Hard AutoCommit: disabled
   [junit4]   2> 1135239 INFO  (qtp1387351581-7883) [n:127.0.0.1:44991_solr c:delLiveColl s:shard2 r:core_node7 x:delLiveColl_shard2_replica_n4] o.a.s.u.CommitTracker Soft AutoCommit: disabled
   [junit4]   2> 1135239 INFO  (qtp602024173-7874) [n:127.0.0.1:33557_solr c:delLiveColl s:shard1 r:core_node2 x:delLiveColl_shard1_replica_n1] o.a.s.u.CommitTracker Hard AutoCommit: disabled
   [junit4]   2> 1135239 INFO  (qtp602024173-7874) [n:127.0.0.1:33557_solr c:delLiveColl s:shard1 r:core_node2 x:delLiveColl_shard1_replica_n1] o.a.s.u.CommitTracker Soft AutoCommit: disabled
   [junit4]   2> 1135258 INFO  (qtp2132429858-7866) [n:127.0.0.1:38345_solr c:delLiveColl s:shard2 r:core_node8 x:delLiveColl_shard2_replica_n6] o.a.s.c.ZkShardTerms Successful update of terms at /collections/delLiveColl/terms/shard2 to Terms{values={core_node8=0}, version=0}
   [junit4]   2> 1135273 INFO  (searcherExecutor-2640-thread-1-processing-n:127.0.0.1:38345_solr x:delLiveColl_shard2_replica_n6 c:delLiveColl s:shard2 r:core_node8) [n:127.0.0.1:38345_solr c:delLiveColl s:shard2 r:core_node8 x:delLiveColl_shard2_replica_n6] o.a.s.c.SolrCore [delLiveColl_shard2_replica_n6] Registered new searcher Searcher@2d3d8b75[delLiveColl_shard2_replica_n6] main{ExitableDirectoryReader(UninvertingDirectoryReader())}
   [junit4]   2> 1135273 INFO  (qtp1387351581-7883) [n:127.0.0.1:44991_solr c:delLiveColl s:shard2 r:core_node7 x:delLiveColl_shard2_replica_n4] o.a.s.s.SolrIndexSearcher Opening [Searcher@73f7f369[delLiveColl_shard2_replica_n4] main]
   [junit4]   2> 1135273 INFO  (qtp602024173-7874) [n:127.0.0.1:33557_solr c:delLiveColl s:shard1 r:core_node2 x:delLiveColl_shard1_replica_n1] o.a.s.s.SolrIndexSearcher Opening [Searcher@46edcecf[delLiveColl_shard1_replica_n1] main]
   [junit4]   2> 1135284 INFO  (qtp1387351581-7883) [n:127.0.0.1:44991_solr c:delLiveColl s:shard2 r:core_node7 x:delLiveColl_shard2_replica_n4] o.a.s.r.ManagedResourceStorage Configured ZooKeeperStorageIO with znodeBase: /configs/conf
   [junit4]   2> 1135284 INFO  (qtp1387351581-7883) [n:127.0.0.1:44991_solr c:delLiveColl s:shard2 r:core_node7 x:delLiveColl_shard2_replica_n4] o.a.s.r.ManagedResourceStorage Loaded null at path _rest_managed.json using ZooKeeperStorageIO:path=/configs/conf
   [junit4]   2> 1135285 INFO  (qtp1387351581-7883) [n:127.0.0.1:44991_solr c:delLiveColl s:shard2 r:core_node7 x:delLiveColl_shard2_replica_n4] o.a.s.h.ReplicationHandler Commits will be reserved for 10000ms.
   [junit4]   2> 1135292 INFO  (qtp602024173-7874) [n:127.0.0.1:33557_solr c:delLiveColl s:shard1 r:core_node2 x:delLiveColl_shard1_replica_n1] o.a.s.r.ManagedResourceStorage Configured ZooKeeperStorageIO with znodeBase: /configs/conf
   [junit4]   2> 1135292 INFO  (qtp602024173-7874) [n:127.0.0.1:33557_solr c:delLiveColl s:shard1 r:core_node2 x:delLiveColl_shard1_replica_n1] o.a.s.r.ManagedResourceStorage Loaded null at path _rest_managed.json using ZooKeeperStorageIO:path=/configs/conf
   [junit4]   2> 1135293 INFO  (qtp602024173-7874) [n:127.0.0.1:33557_solr c:delLiveColl s:shard1 r:core_node2 x:delLiveColl_shard1_replica_n1] o.a.s.h.ReplicationHandler Commits will be reserved for 10000ms.
   [junit4]   2> 1135296 INFO  (qtp1287394799-7857) [n:127.0.0.1:46043_solr c:delLiveColl s:shard1 r:core_node5 x:delLiveColl_shard1_replica_n3] o.a.s.u.UpdateHandler Using UpdateLog implementation: org.apache.solr.update.UpdateLog
   [junit4]   2> 1135296 INFO  (qtp1287394799-7857) [n:127.0.0.1:46043_solr c:delLiveColl s:shard1 r:core_node5 x:delLiveColl_shard1_replica_n3] o.a.s.u.UpdateLog Initializing UpdateLog: dataDir=null defaultSyncLevel=FLUSH numRecordsToKeep=100 maxNumLogsToKeep=10 numVersionBuckets=65536
   [junit4]   2> 1135297 INFO  (qtp1287394799-7857) [n:127.0.0.1:46043_solr c:delLiveColl s:shard1 r:core_node5 x:delLiveColl_shard1_replica_n3] o.a.s.u.CommitTracker Hard AutoCommit: disabled
   [junit4]   2> 1135297 INFO  (qtp1287394799-7857) [n:127.0.0.1:46043_solr c:delLiveColl s:shard1 r:core_node5 x:delLiveColl_shard1_replica_n3] o.a.s.u.CommitTracker Soft AutoCommit: disabled
   [junit4]   2> 1135298 INFO  (qtp602024173-7874) [n:127.0.0.1:33557_solr c:delLiveColl s:shard1 r:core_node2 x:delLiveColl_shard1_replica_n1] o.a.s.u.UpdateLog Could not find max version in index or recent updates, using new clock 1608411914045489152
   [junit4]   2> 1135304 INFO  (searcherExecutor-2641-thread-1-processing-n:127.0.0.1:33557_solr x:delLiveColl_shard1_replica_n1 c:delLiveColl s:shard1 r:core_node2) [n:127.0.0.1:33557_solr c:delLiveColl s:shard1 r:core_node2 x:delLiveColl_shard1_replica_n1] o.a.s.c.SolrCore [delLiveColl_shard1_replica_n1] Registered new searcher Searcher@46edcecf[delLiveColl_shard1_replica_n1] main{ExitableDirectoryReader(UninvertingDirectoryReader())}
   [junit4]   2> 1135312 INFO  (qtp1387351581-7883) [n:127.0.0.1:44991_solr c:delLiveColl s:shard2 r:core_node7 x:delLiveColl_shard2_replica_n4] o.a.s.u.UpdateLog Could not find max version in index or recent updates, using new clock 1608411914060169216
   [junit4]   2> 1135332 INFO  (qtp1287394799-7857) [n:127.0.0.1:46043_solr c:delLiveColl s:shard1 r:core_node5 x:delLiveColl_shard1_replica_n3] o.a.s.s.SolrIndexSearcher Opening [Searcher@6671ad44[delLiveColl_shard1_replica_n3] main]
   [junit4]   2> 1135341 INFO  (qtp1387351581-7883) [n:127.0.0.1:44991_solr c:delLiveColl s:shard2 r:core_node7 x:delLiveColl_shard2_replica_n4] o.a.s.c.ZkShardTerms Successful update of terms at /collections/delLiveColl/terms/shard2 to Terms{values={core_node7=0, core_node8=0}, version=1}
   [junit4]   2> 1135349 INFO  (searcherExecutor-2642-thread-1-processing-n:127.0.0.1:44991_solr x:delLiveColl_shard2_replica_n4 c:delLiveColl s:shard2 r:core_node7) [n:127.0.0.1:44991_solr c:delLiveColl s:shard2 r:core_node7 x:delLiveColl_shard2_replica_n4] o.a.s.c.SolrCore [delLiveColl_shard2_replica_n4] Registered new searcher Searcher@73f7f369[delLiveColl_shard2_replica_n4] main{ExitableDirectoryReader(UninvertingDirectoryReader())}
   [junit4]   2> 1135422 INFO  (qtp1287394799-7857) [n:127.0.0.1:46043_solr c:delLiveColl s:shard1 r:core_node5 x:delLiveColl_shard1_replica_n3] o.a.s.r.ManagedResourceStorage Configured ZooKeeperStorageIO with znodeBase: /configs/conf
   [junit4]   2> 1135442 INFO  (qtp1287394799-7857) [n:127.0.0.1:46043_solr c:delLiveColl s:shard1 r:core_node5 x:delLiveColl_shard1_replica_n3] o.a.s.r.ManagedResourceStorage Loaded null at path _rest_managed.json using ZooKeeperStorageIO:path=/configs/conf
   [junit4]   2> 1135443 INFO  (qtp1287394799-7857) [n:127.0.0.1:46043_solr c:delLiveColl s:shard1 r:core_node5 x:delLiveColl_shard1_replica_n3] o.a.s.h.ReplicationHandler Commits will be reserved for 10000ms.
   [junit4]   2> 1135443 INFO  (qtp1287394799-7857) [n:127.0.0.1:46043_solr c:delLiveColl s:shard1 r:core_node5 x:delLiveColl_shard1_replica_n3] o.a.s.u.UpdateLog Could not find max version in index or recent updates, using new clock 1608411914197532672
   [junit4]   2> 1135445 INFO  (searcherExecutor-2643-thread-1-processing-n:127.0.0.1:46043_solr x:delLiveColl_shard1_replica_n3 c:delLiveColl s:shard1 r:core_node5) [n:127.0.0.1:46043_solr c:delLiveColl s:shard1 r:core_node5 x:delLiveColl_shard1_replica_n3] o.a.s.c.SolrCore [delLiveColl_shard1_replica_n3] Registered new searcher Searcher@6671ad44[delLiveColl_shard1_replica_n3] main{ExitableDirectoryReader(UninvertingDirectoryReader())}
   [junit4]   2> 1135491 INFO  (qtp2132429858-7866) [n:127.0.0.1:38345_solr c:delLiveColl s:shard2 r:core_node8 x:delLiveColl_shard2_replica_n6] o.a.s.c.ShardLeaderElectionContext Enough replicas found to continue.
   [junit4]   2> 1135491 INFO  (qtp2132429858-7866) [n:127.0.0.1:38345_solr c:delLiveColl s:shard2 r:core_node8 x:delLiveColl_shard2_replica_n6] o.a.s.c.ShardLeaderElectionContext I may be the new leader - try and sync
   [junit4]   2> 1135491 INFO  (qtp2132429858-7866) [n:127.0.0.1:38345_solr c:delLiveColl s:shard2 r:core_node8 x:delLiveColl_shard2_replica_n6] o.a.s.c.SyncStrategy Sync replicas to http://127.0.0.1:38345/solr/delLiveColl_shard2_replica_n6/
   [junit4]   2> 1135540 INFO  (qtp2132429858-7866) [n:127.0.0.1:38345_solr c:delLiveColl s:shard2 r:core_node8 x:delLiveColl_shard2_replica_n6] o.a.s.u.PeerSync PeerSync: core=delLiveColl_shard2_replica_n6 url=http://127.0.0.1:38345/solr START replicas=[http://127.0.0.1:44991/solr/delLiveColl_shard2_replica_n4/] nUpdates=100
   [junit4]   2> 1135552 INFO  (qtp602024173-7874) [n:127.0.0.1:33557_solr c:delLiveColl s:shard1 r:core_node2 x:delLiveColl_shard1_replica_n1] o.a.s.c.ZkShardTerms Successful update of terms at /collections/delLiveColl/terms/shard1 to Terms{values={core_node2=0}, version=0}
   [junit4]   2> 1135553 INFO  (qtp1287394799-7857) [n:127.0.0.1:46043_solr c:delLiveColl s:shard1 r:core_node5 x:delLiveColl_shard1_replica_n3] o.a.s.c.ZkShardTerms Successful update of terms at /collections/delLiveColl/terms/shard1 to Terms{values={core_node2=0, core_node5=0}, version=1}
   [junit4]   2> 1135556 INFO  (qtp2132429858-7866) [n:127.0.0.1:38345_solr c:delLiveColl s:shard2 r:core_node8 x:delLiveColl_shard2_replica_n6] o.a.s.u.PeerSync PeerSync: core=delLiveColl_shard2_replica_n6 url=http://127.0.0.1:38345/solr DONE.  We have no versions.  sync failed.
   [junit4]   2> 1135615 INFO  (qtp1387351581-7884) [n:127.0.0.1:44991_solr c:delLiveColl s:shard2 r:core_node7 x:delLiveColl_shard2_replica_n4] o.a.s.c.S.Request [delLiveColl_shard2_replica_n4]  webapp=/solr path=/get params={distrib=false&qt=/get&fingerprint=false&getVersions=100&wt=javabin&version=2} status=0 QTime=54
   [junit4]   2> 1135615 INFO  (qtp2132429858-7866) [n:127.0.0.1:38345_solr c:delLiveColl s:shard2 r:core_node8 x:delLiveColl_shard2_replica_n6] o.a.s.c.SyncStrategy Leader's attempt to sync with shard failed, moving to the next candidate
   [junit4]   2> 1135615 INFO  (qtp2132429858-7866) [n:127.0.0.1:38345_solr c:delLiveColl s:shard2 r:core_node8 x:delLiveColl_shard2_replica_n6] o.a.s.c.ShardLeaderElectionContext We failed sync, but we have no versions - we can't sync in that case - we were active before, so become leader anyway
   [junit4]   2> 1135615 INFO  (qtp2132429858-7866) [n:127.0.0.1:38345_solr c:delLiveColl s:shard2 r:core_node8 x:delLiveColl_shard2_replica_n6] o.a.s.c.ShardLeaderElectionContext Found all replicas participating in election, clear LIR
   [junit4]   2> 1135781 INFO  (qtp602024173-7874) [n:127.0.0.1:33557_solr c:delLiveColl s:shard1 r:core_node2 x:delLiveColl_shard1_replica_n1] o.a.s.c.ShardLeaderElectionContext Enough replicas found to continue.
   [junit4]   2> 1135781 INFO  (qtp602024173-7874) [n:127.0.0.1:33557_solr c:delLiveColl s:shard1 r:core_node2 x:delLiveColl_shard1_replica_n1] o.a.s.c.ShardLeaderElectionContext I may be the new leader - try and sync
   [junit4]   2> 1135781 INFO  (qtp602024173-7874) [n:127.0.0.1:33557_solr c:delLiveColl s:shard1 r:core_node2 x:delLiveColl_shard1_replica_n1] o.a.s.c.SyncStrategy Sync replicas to http://127.0.0.1:33557/solr/delLiveColl_shard1_replica_n1/
   [junit4]   2> 1135788 INFO  (qtp602024173-7874) [n:127.0.0.1:33557_solr c:delLiveColl s:shard1 r:core_node2 x:delLiveColl_shard1_replica_n1] o.a.s.u.PeerSync PeerSync: core=delLiveColl_shard1_replica_n1 url=http://127.0.0.1:33557/solr START replicas=[http://127.0.0.1:46043/solr/delLiveColl_shard1_replica_n3/] nUpdates=100
   [junit4]   2> 1135808 INFO  (qtp602024173-7874) [n:127.0.0.1:33557_solr c:delLiveColl s:shard1 r:core_node2 x:delLiveColl_shard1_replica_n1] o.a.s.u.PeerSync PeerSync: core=delLiveColl_shard1_replica_n1 url=http://127.0.0.1:33557/solr DONE.  We have no versions.  sync failed.
   [junit4]   2> 1135870 INFO  (qtp1287394799-7851) [n:127.0.0.1:46043_solr c:delLiveColl s:shard1 r:core_node5 x:delLiveColl_shard1_replica_n3] o.a.s.c.S.Request [delLiveColl_shard1_replica_n3]  webapp=/solr path=/get params={distrib=false&qt=/get&fingerprint=false&getVersions=100&wt=javabin&version=2} status=0 QTime=1
   [junit4]   2> 1135877 INFO  (qtp602024173-7874) [n:127.0.0.1:33557_solr c:delLiveColl s:shard1 r:core_node2 x:delLiveColl_shard1_replica_n1] o.a.s.c.SyncStrategy Leader's attempt to sync with shard failed, moving to the next candidate
   [junit4]   2> 1135877 INFO  (qtp602024173-7874) [n:127.0.0.1:33557_solr c:delLiveColl s:shard1 r:core_node2 x:delLiveColl_shard1_replica_n1] o.a.s.c.ShardLeaderElectionContext We failed sync, but we have no versions - we can't sync in that case - we were active before, so become leader anyway
   [junit4]   2> 1135877 INFO  (qtp602024173-7874) [n:127.0.0.1:33557_solr c:delLiveColl s:shard1 r:core_node2 x:delLiveColl_shard1_replica_n1] o.a.s.c.ShardLeaderElectionContext Found all replicas participating in election, clear LIR
   [junit4]   2> 1135880 INFO  (qtp602024173-7874) [n:127.0.0.1:33557_solr c:delLiveColl s:shard1 r:core_node2 x:delLiveColl_shard1_replica_n1] o.a.s.c.ShardLeaderElectionContext I am the new leader: http://127.0.0.1:33557/solr/delLiveColl_shard1_replica_n1/ shard1
   [junit4]   2> 1135932 INFO  (qtp2132429858-7866) [n:127.0.0.1:38345_solr c:delLiveColl s:shard2 r:core_node8 x:delLiveColl_shard2_replica_n6] o.a.s.c.ShardLeaderElectionContext I am the new leader: http://127.0.0.1:38345/solr/delLiveColl_shard2_replica_n6/ shard2
   [junit4]   2> 1136097 INFO  (qtp602024173-7874) [n:127.0.0.1:33557_solr c:delLiveColl s:shard1 r:core_node2 x:delLiveColl_shard1_replica_n1] o.a.s.c.ZkController I am the leader, no recovery necessary
   [junit4]   2> 1136097 INFO  (qtp2132429858-7866) [n:127.0.0.1:38345_solr c:delLiveColl s:shard2 r:core_node8 x:delLiveColl_shard2_replica_n6] o.a.s.c.ZkController I am the leader, no recovery necessary
   [junit4]   2> 1136100 INFO  (qtp2132429858-7866) [n:127.0.0.1:38345_solr c:delLiveColl s:shard2 r:core_node8 x:delLiveColl_shard2_replica_n6] o.a.s.s.HttpSolrCall [admin] webapp=null path=/admin/cores params={qt=/admin/cores&coreNodeName=core_node8&collection.configName=conf&newCollection=true&name=delLiveColl_shard2_replica_n6&action=CREATE&numShards=2&collection=delLiveColl&shard=shard2&wt=javabin&version=2&replicaType=NRT} status=0 QTime=3478
   [junit4]   2> 1136223 INFO  (qtp602024173-7874) [n:127.0.0.1:33557_solr c:delLiveColl s:shard1 r:core_node2 x:delLiveColl_shard1_replica_n1] o.a.s.s.HttpSolrCall [admin] webapp=null path=/admin/cores params={qt=/admin/cores&coreNodeName=core_node2&collection.configName=conf&newCollection=true&name=delLiveColl_shard1_replica_n1&action=CREATE&numShards=2&collection=delLiveColl&shard=shard1&wt=javabin&version=2&replicaType=NRT} status=0 QTime=3587
   [junit4]   2> 1136332 INFO  (zkCallback-2242-thread-2) [    ] o.a.s.c.c.ZkStateReader A cluster state change: [WatchedEvent state:SyncConnected type:NodeDataChanged path:/collections/delLiveColl/state.json] for collection [delLiveColl] has occurred - updating... (live nodes size: [4])
   [junit4]   2> 1136348 INFO  (zkCallback-2234-thread-1) [    ] o.a.s.c.c.ZkStateReader A cluster state change: [WatchedEvent state:SyncConnected type:NodeDataChanged path:/collections/delLiveColl/state.json] for collection [delLiveColl] has occurred - updating... (live nodes size: [4])
   [junit4]   2> 1136355 INFO  (qtp1387351581-7883) [n:127.0.0.1:44991_solr c:delLiveColl s:shard2 r:core_node7 x:delLiveColl_shard2_replica_n4] o.a.s.s.HttpSolrCall [admin] webapp=null path=/admin/cores params={qt=/admin/cores&coreNodeName=core_node7&collection.configName=conf&newCollection=true&name=delLiveColl_shard2_replica_n4&action=CREATE&numShards=2&collection=delLiveColl&shard=shard2&wt=javabin&version=2&replicaType=NRT} status=0 QTime=3735
   [junit4]   2> 1136463 INFO  (zkCallback-2262-thread-1) [    ] o.a.s.c.c.ZkStateReader A cluster state change: [WatchedEvent state:SyncConnected type:NodeDataChanged path:/collections/delLiveColl/state.json] for collection [delLiveColl] has occurred - updating... (live nodes size: [4])
   [junit4]   2> 1136463 INFO  (zkCallback-2234-thread-1) [    ] o.a.s.c.c.ZkStateReader A cluster state change: [WatchedEvent state:SyncConnected type:NodeDataChanged path:/collections/delLiveColl/state.json] for collection [delLiveColl] has occurred - updating... (live nodes size: [4])
   [junit4]   2> 1136463 INFO  (zkCallback-2242-thread-2) [    ] o.a.s.c.c.ZkStateReader A cluster state change: [WatchedEvent state:SyncConnected type:NodeDataChanged path:/collections/delLiveColl/state.json] for collection [delLiveColl] has occurred - updating... (live nodes size: [4])
   [junit4]   2> 1136733 INFO  (qtp1287394799-7857) [n:127.0.0.1:46043_solr c:delLiveColl s:shard1 r:core_node5 x:delLiveColl_shard1_replica_n3] o.a.s.s.HttpSolrCall [admin] webapp=null path=/admin/cores params={qt=/admin/cores&coreNodeName=core_node5&collection.configName=conf&newCollection=true&name=delLiveColl_shard1_replica_n3&action=CREATE&numShards=2&collection=delLiveColl&shard=shard1&wt=javabin&version=2&replicaType=NRT} status=0 QTime=4070
   [junit4]   2> 1136856 INFO  (qtp1387351581-7888) [n:127.0.0.1:44991_solr    ] o.a.s.h.a.CollectionsHandler Wait for new collection to be active for at most 30 seconds. Check all shard replicas
   [junit4]   2> 1136893 INFO  (zkCallback-2242-thread-2) [    ] o.a.s.c.c.ZkStateReader A cluster state change: [WatchedEvent state:SyncConnected type:NodeDataChanged path:/collections/delLiveColl/state.json] for collection [delLiveColl] has occurred - updating... (live nodes size: [4])
   [junit4]   2> 1136894 INFO  (zkCallback-2234-thread-1) [    ] o.a.s.c.c.ZkStateReader A cluster state change: [WatchedEvent state:SyncConnected type:NodeDataChanged path:/collections/delLiveColl/state.json] for collection [delLiveColl] has occurred - updating... (live nodes size: [4])
   [junit4]   2> 1136894 INFO  (zkCallback-2262-thread-1) [    ] o.a.s.c.c.ZkStateReader A cluster state change: [WatchedEvent state:SyncConnected type:NodeDataChanged path:/collections/delLiveColl/state.json] for collection [delLiveColl] has occurred - updating... (live nodes size: [4])
   [junit4]   2> 1136912 INFO  (zkCallback-2268-thread-1) [    ] o.a.s.c.c.ZkStateReader A cluster state change: [WatchedEvent state:SyncConnected type:NodeDataChanged path:/collections/delLiveColl/state.json] for collection [delLiveColl] has occurred - updating... (live nodes size: [4])
   [junit4]   2> 1137750 INFO  (OverseerCollectionConfigSetProcessor-73121801940107272-127.0.0.1:33557_solr-n_0000000000) [    ] o.a.s.c.OverseerTaskQueue Response ZK path: /overseer/collection-queue-work/qnr-0000000000 doesn't exist.  Requestor may have disconnected from ZooKeeper
   [junit4]   2> 1137856 INFO  (qtp1387351581-7888) [n:127.0.0.1:44991_solr    ] o.a.s.s.HttpSolrCall [admin] webapp=null path=/admin/collections params={collection.configName=conf&name=delLiveColl&nrtReplicas=2&action=CREATE&numShards=2&wt=javabin&version=2} status=0 QTime=6374
   [junit4]   2> 1137869 INFO  (qtp2132429858-7861) [n:127.0.0.1:38345_solr    ] o.a.s.s.HttpSolrCall [admin] webapp=null path=/admin/cores params={action=STATUS&indexInfo=true&wt=javabin&version=2} status=0 QTime=1
   [junit4]   2> 1137872 INFO  (qtp1387351581-7890) [n:127.0.0.1:44991_solr    ] o.a.s.h.a.CollectionsHandler Invoked Collection Action :deletereplica with params replica=core_node8&action=DELETEREPLICA&collection=delLiveColl&shard=shard2&onlyIfDown=true&wt=javabin&version=2 and sendToOCPQueue=true
   [junit4]   2> 1137899 ERROR (OverseerThreadFactory-2621-thread-2) [ c:delLiveColl s:shard2 r:core_node8 ] o.a.s.c.a.c.OverseerCollectionMessageHandler Collection: delLiveColl operation: deletereplica failed:org.apache.solr.common.SolrException: Attempted to remove replica : delLiveColl/shard2/core_node8 with onlyIfDown='true', but state is 'active'
   [junit4]   2> at org.apache.solr.cloud.api.collections.DeleteReplicaCmd.deleteCore(DeleteReplicaCmd.java:218)
   [junit4]   2> at org.apache.solr.cloud.api.collections.DeleteReplicaCmd.deleteReplica(DeleteReplicaCmd.java:95)
   [junit4]   2> at org.apache.solr.cloud.api.collections.DeleteReplicaCmd.call(DeleteReplicaCmd.java:66)
   [junit4]   2> at org.apache.solr.cloud.api.collections.OverseerCollectionMessageHandler.processMessage(OverseerCollectionMessageHandler.java:259)
   [junit4]   2> at org.apache.solr.cloud.OverseerTaskProcessor$Runner.run(OverseerTaskProcessor.java:473)
   [junit4]   2> at org.apache.solr.common.util.ExecutorUtil$MDCAwareThreadPoolExecutor.lambda$execute$0(ExecutorUtil.java:209)
   [junit4]   2> at java.util.concurrent.ThreadPoolExecutor.runWorker(ThreadPoolExecutor.java:1149)
   [junit4]   2> at java.util.concurrent.ThreadPoolExecutor$Worker.run(ThreadPoolExecutor.java:624)
   [junit4]   2> at java.lang.Thread.run(Thread.java:748)
   [junit4]   2>
   [junit4]   2> 1137953 INFO  (OverseerCollectionConfigSetProcessor-73121801940107272-127.0.0.1:33557_solr-n_0000000000) [    ] o.a.s.c.OverseerTaskQueue Response ZK path: /overseer/collection-queue-work/qnr-0000000002 doesn't exist.  Requestor may have disconnected from ZooKeeper
   [junit4]   2> 1137989 INFO  (qtp1387351581-7890) [n:127.0.0.1:44991_solr c:delLiveColl   ] o.a.s.s.HttpSolrCall [admin] webapp=null path=/admin/collections params={replica=core_node8&action=DELETEREPLICA&collection=delLiveColl&shard=shard2&onlyIfDown=true&wt=javabin&version=2} status=400 QTime=117
   [junit4]   2> 1137992 INFO  (qtp1387351581-7890) [n:127.0.0.1:44991_solr    ] o.a.s.h.a.CollectionsHandler Invoked Collection Action :deletereplica with params replica=core_node8&action=DELETEREPLICA&collection=delLiveColl&shard=shard2&wt=javabin&version=2 and sendToOCPQueue=true
   [junit4]   2> 1138017 INFO  (qtp2132429858-7862) [n:127.0.0.1:38345_solr    x:delLiveColl_shard2_replica_n6] o.a.s.m.SolrMetricManager Closing metric reporters for registry=solr.core.delLiveColl.shard2.replica_n6, tag=null
   [junit4]   2> 1138017 INFO  (qtp2132429858-7862) [n:127.0.0.1:38345_solr    x:delLiveColl_shard2_replica_n6] o.a.s.m.r.SolrJmxReporter Closing reporter [org.apache.solr.metrics.reporters.SolrJmxReporter@2ffe411f: rootName = solr_38345, domain = solr.core.delLiveColl.shard2.replica_n6, service url = null, agent id = null] for registry solr.core.delLiveColl.shard2.replica_n6 / com.codahale.metrics.MetricRegistry@6e431629
   [junit4]   2> 1138140 INFO  (qtp2132429858-7862) [n:127.0.0.1:38345_solr    x:delLiveColl_shard2_replica_n6] o.a.s.c.SolrCore [delLiveColl_shard2_replica_n6]  CLOSING SolrCore org.apache.solr.core.SolrCore@2459f74b
   [junit4]   2> 1138140 INFO  (qtp2132429858-7862) [n:127.0.0.1:38345_solr    x:delLiveColl_shard2_replica_n6] o.a.s.m.SolrMetricManager Closing metric reporters for registry=solr.core.delLiveColl.shard2.replica_n6, tag=2459f74b
   [junit4]   2> 1138140 INFO  (qtp2132429858-7862) [n:127.0.0.1:38345_solr    x:delLiveColl_shard2_replica_n6] o.a.s.m.SolrMetricManager Closing metric reporters for registry=solr.collection.delLiveColl.shard2.leader, tag=2459f74b
   [junit4]   2> 1138273 INFO  (qtp2132429858-7862) [n:127.0.0.1:38345_solr    x:delLiveColl_shard2_replica_n6] o.a.s.c.ZkShardTerms Successful update of terms at /collections/delLiveColl/terms/shard2 to Terms{values={core_node7=0}, version=2}
   [junit4]   2> 1138311 INFO  (zkCallback-2262-thread-1) [n:127.0.0.1:44991_solr c:delLiveColl s:shard2 r:core_node7 x:delLiveColl_shard2_replica_n4] o.a.s.c.ShardLeaderElectionContext I may be the new leader - try and sync
   [junit4]   2> 1138331 INFO  (qtp2132429858-7862) [n:127.0.0.1:38345_solr    x:delLiveColl_shard2_replica_n6] o.a.s.s.HttpSolrCall [admin] webapp=null path=/admin/cores params={deleteInstanceDir=true&core=delLiveColl_shard2_replica_n6&deleteMetricsHistory=true&qt=/admin/cores&deleteDataDir=true&action=UNLOAD&wt=javabin&version=2&deleteIndex=true} status=0 QTime=314
   [junit4]   2> 1138509 INFO  (zkCallback-2242-thread-2) [    ] o.a.s.c.c.ZkStateReader A cluster state change: [WatchedEvent state:SyncConnected type:NodeDataChanged path:/collections/delLiveColl/state.json] for collection [delLiveColl] has occurred - updating... (live nodes size: [4])
   [junit4]   2> 1138522 INFO  (zkCallback-2268-thread-1) [    ] o.a.s.c.c.ZkStateReader A cluster state change: [WatchedEvent state:SyncConnected type:NodeDataChanged path:/collections/delLiveColl/state.json] for collection [delLiveColl] has occurred - updating... (live nodes size: [4])
   [junit4]   2> 1138523 INFO  (zkCallback-2234-thread-1) [    ] o.a.s.c.c.ZkStateReader A cluster state change: [WatchedEvent state:SyncConnected type:NodeDataChanged path:/collections/delLiveColl/state.json] for collection [delLiveColl] has occurred - updating... (live nodes size: [4])
   [junit4]   2> 1138526 INFO  (zkCallback-2262-thread-2) [    ] o.a.s.c.c.ZkStateReader A cluster state change: [WatchedEvent state:SyncConnected type:NodeDataChanged path:/collections/delLiveColl/state.json] for collection [delLiveColl] has occurred - updating... (live nodes size: [4])
   [junit4]   2> 1138600 INFO  (qtp1387351581-7890) [n:127.0.0.1:44991_solr c:delLiveColl   ] o.a.s.s.HttpSolrCall [admin] webapp=null path=/admin/collections params={replica=core_node8&action=DELETEREPLICA&collection=delLiveColl&shard=shard2&wt=javabin&version=2} status=0 QTime=607
   [junit4]   2> 1138636 INFO  (TEST-DeleteReplicaTest.deleteLiveReplicaTest-seed#[2E8973372122B4FA]) [    ] o.a.s.SolrTestCaseJ4 ###Ending deleteLiveReplicaTest
   [junit4]   2> 1138819 INFO  (TEST-DeleteReplicaTest.deleteReplicaAndVerifyDirectoryCleanup-seed#[2E8973372122B4FA]) [    ] o.a.s.SolrTestCaseJ4 ###Starting deleteReplicaAndVerifyDirectoryCleanup
   [junit4]   2> 1138831 INFO  (qtp1387351581-7889) [n:127.0.0.1:44991_solr    ] o.a.s.h.a.CollectionsHandler Invoked Collection Action :create with params collection.configName=conf&name=deletereplica_test&nrtReplicas=2&action=CREATE&numShards=1&wt=javabin&version=2 and sendToOCPQueue=true
   [junit4]   2> 1138858 INFO  (OverseerThreadFactory-2621-thread-4) [    ] o.a.s.c.a.c.CreateCollectionCmd Create collection deletereplica_test
   [junit4]   2> 1138858 INFO  (OverseerCollectionConfigSetProcessor-73121801940107272-127.0.0.1:33557_solr-n_0000000000) [    ] o.a.s.c.OverseerTaskQueue Response ZK path: /overseer/collection-queue-work/qnr-0000000004 doesn't exist.  Requestor may have disconnected from ZooKeeper
   [junit4]   2> 1139343 INFO  (OverseerStateUpdate-73121801940107272-127.0.0.1:33557_solr-n_0000000000) [    ] o.a.s.c.o.SliceMutator createReplica() {
   [junit4]   2>   "operation":"ADDREPLICA",
   [junit4]   2>   "collection":"deletereplica_test",
   [junit4]   2>   "shard":"shard1",
   [junit4]   2>   "core":"deletereplica_test_shard1_replica_n1",
   [junit4]   2>   "state":"down",
   [junit4]   2>   "base_url":"http://127.0.0.1:44991/solr",
   [junit4]   2>   "type":"NRT",
   [junit4]   2>   "waitForFinalState":"false"}
   [junit4]   2> 1139357 INFO  (OverseerStateUpdate-73121801940107272-127.0.0.1:33557_solr-n_0000000000) [    ] o.a.s.c.o.SliceMutator createReplica() {
   [junit4]   2>   "operation":"ADDREPLICA",
   [junit4]   2>   "collection":"deletereplica_test",
   [junit4]   2>   "shard":"shard1",
   [junit4]   2>   "core":"deletereplica_test_shard1_replica_n2",
   [junit4]   2>   "state":"down",
   [junit4]   2>   "base_url":"http://127.0.0.1:46043/solr",
   [junit4]   2>   "type":"NRT",
   [junit4]   2>   "waitForFinalState":"false"}
   [junit4]   2> 1139557 INFO  (qtp1387351581-7887) [n:127.0.0.1:44991_solr    x:deletereplica_test_shard1_replica_n1] o.a.s.h.a.CoreAdminOperation core create command qt=/admin/cores&coreNodeName=core_node3&collection.configName=conf&newCollection=true&name=deletereplica_test_shard1_replica_n1&action=CREATE&numShards=1&collection=deletereplica_test&shard=shard1&wt=javabin&version=2&replicaType=NRT
   [junit4]   2> 1139563 INFO  (qtp1287394799-7853) [n:127.0.0.1:46043_solr    x:deletereplica_test_shard1_replica_n2] o.a.s.h.a.CoreAdminOperation core create command qt=/admin/cores&coreNodeName=core_node4&collection.configName=conf&newCollection=true&name=deletereplica_test_shard1_replica_n2&action=CREATE&numShards=1&collection=deletereplica_test&shard=shard1&wt=javabin&version=2&replicaType=NRT
   [junit4]   2> 1140815 INFO  (zkCallback-2262-thread-1) [n:127.0.0.1:44991_solr c:delLiveColl s:shard2 r:core_node7 x:delLiveColl_shard2_replica_n4] o.a.s.c.SyncStrategy Sync replicas to http://127.0.0.1:44991/solr/delLiveColl_shard2_replica_n4/
   [junit4]   2> 1140815 INFO  (zkCallback-2262-thread-1) [n:127.0.0.1:44991_solr c:delLiveColl s:shard2 r:core_node7 x:delLiveColl_shard2_replica_n4] o.a.s.c.SyncStrategy Sync Success - now sync replicas to me
   [junit4]   2> 1140815 INFO  (zkCallback-2262-thread-1) [n:127.0.0.1:44991_solr c:delLiveColl s:shard2 r:core_node7 x:delLiveColl_shard2_replica_n4] o.a.s.c.SyncStrategy http://127.0.0.1:44991/solr/delLiveColl_shard2_replica_n4/ has no replicas
   [junit4]   2> 1140837 INFO  (zkCallback-2262-thread-1) [n:127.0.0.1:44991_solr c:delLiveColl s:shard2 r:core_node7 x:delLiveColl_shard2_replica_n4] o.a.s.c.ShardLeaderElectionContext I am the new leader: http://127.0.0.1:44991/solr/delLiveColl_shard2_replica_n4/ shard2
   [junit4]   2> 1141093 INFO  (qtp1287394799-7853) [n:127.0.0.1:46043_solr c:deletereplica_test s:shard1 r:core_node4 x:deletereplica_test_shard1_replica_n2] o.a.s.c.SolrConfig Using Lucene MatchVersion: 8.0.0
   [junit4]   2> 1141108 INFO  (zkCallback-2262-thread-1) [    ] o.a.s.c.c.ZkStateReader A cluster state change: [WatchedEvent state:SyncConnected type:NodeDataChanged path:/collections/delLiveColl/state.json] for collection [delLiveColl] has occurred - updating... (live nodes size: [4])
   [junit4]   2> 1141108 INFO  (zkCallback-2242-thread-2) [    ] o.a.s.c.c.ZkStateReader A cluster state change: [WatchedEvent state:SyncConnected type:NodeDataChanged path:/collections/delLiveColl/state.json] for collection [delLiveColl] has occurred - updating... (live nodes size: [4])
   [junit4]   2> 1141140 INFO  (zkCallback-2268-thread-1) [    ] o.a.s.c.c.ZkStateReader A cluster state change: [WatchedEvent state:SyncConnected type:NodeDataChanged path:/collections/delLiveColl/state.json] for collection [delLiveColl] has occurred - updating... (live nodes size: [4])
   [junit4]   2> 1141165 INFO  (qtp1387351581-7887) [n:127.0.0.1:44991_solr c:deletereplica_test s:shard1 r:core_node3 x:deletereplica_test_shard1_replica_n1] o.a.s.c.SolrConfig Using Lucene MatchVersion: 8.0.0
   [junit4]   2> 1141167 INFO  (qtp1287394799-7853) [n:127.0.0.1:46043_solr c:deletereplica_test s:shard1 r:core_node4 x:deletereplica_test_shard1_replica_n2] o.a.s.s.IndexSchema [deletereplica_test_shard1_replica_n2] Schema name=minimal
   [junit4]   2> 1141181 INFO  (qtp1287394799-7853) [n:127.0.0.1:46043_solr c:deletereplica_test s:shard1 r:core_node4 x:deletereplica_test_shard1_replica_n2] o.a.s.s.IndexSchema Loaded schema minimal/1.1 with uniqueid field id
   [junit4]   2> 1141182 INFO  (qtp1287394799-7853) [n:127.0.0.1:46043_solr c:deletereplica_test s:shard1 r:core_node4 x:deletereplica_test_shard1_replica_n2] o.a.s.c.CoreContainer Creating SolrCore 'deletereplica_test_shard1_replica_n2' using configuration from collection deletereplica_test, trusted=true
   [junit4]   2> 1141182 INFO  (qtp1287394799-7853) [n:127.0.0.1:46043_solr c:deletereplica_test s:shard1 r:core_node4 x:deletereplica_test_shard1_replica_n2] o.a.s.m.r.SolrJmxReporter JMX monitoring for 'solr_46043.solr.core.deletereplica_test.shard1.replica_n2' (registry 'solr.core.deletereplica_test.shard1.replica_n2') enabled at server: com.sun.jmx.mbeanserver.JmxMBeanServer@79b5912c
   [junit4]   2> 1141182 INFO  (qtp1287394799-7853) [n:127.0.0.1:46043_solr c:deletereplica_test s:shard1 r:core_node4 x:deletereplica_test_shard1_replica_n2] o.a.s.c.SolrCore solr.RecoveryStrategy.Builder
   [junit4]   2> 1141182 INFO  (qtp1287394799-7853) [n:127.0.0.1:46043_solr c:deletereplica_test s:shard1 r:core_node4 x:deletereplica_test_shard1_replica_n2] o.a.s.c.SolrCore [[deletereplica_test_shard1_replica_n2] ] Opening new SolrCore at [/home/jenkins/jenkins-slave/workspace/Lucene-Solr-NightlyTests-master/checkout/solr/build/solr-core/test/J2/temp/solr.cloud.DeleteReplicaTest_2E8973372122B4FA-001/tempDir-001/node2/deletereplica_test_shard1_replica_n2], dataDir=[/home/jenkins/jenkins-slave/workspace/Lucene-Solr-NightlyTests-master/checkout/solr/build/solr-core/test/J2/temp/solr.cloud.DeleteReplicaTest_2E8973372122B4FA-001/tempDir-001/node2/./deletereplica_test_shard1_replica_n2/data/]
   [junit4]   2> 1141219 INFO  (qtp1387351581-7887) [n:127.0.0.1:44991_solr c:deletereplica_test s:shard1 r:core_node3 x:deletereplica_test_shard1_replica_n1] o.a.s.s.IndexSchema [deletereplica_test_shard1_replica_n1] Schema name=minimal
   [junit4]   2> 1141237 INFO  (qtp1387351581-7887) [n:127.0.0.1:44991_solr c:deletereplica_test s:shard1 r:

[...truncated too long message...]

esource] Do not set property disallowed.ivy.jars.list as its length is 0.

-ivy-fail-disallowed-ivy-version:

ivy-fail:

ivy-configure:
[ivy:configure] :: loading settings :: file = /home/jenkins/jenkins-slave/workspace/Lucene-Solr-NightlyTests-master/checkout/lucene/top-level-ivy-settings.xml

resolve:

ivy-availability-check:
[loadresource] Do not set property disallowed.ivy.jars.list as its length is 0.

-ivy-fail-disallowed-ivy-version:

ivy-fail:

ivy-fail:

ivy-configure:
[ivy:configure] :: loading settings :: file = /home/jenkins/jenkins-slave/workspace/Lucene-Solr-NightlyTests-master/checkout/lucene/top-level-ivy-settings.xml

resolve:

ivy-availability-check:
[loadresource] Do not set property disallowed.ivy.jars.list as its length is 0.

-ivy-fail-disallowed-ivy-version:

ivy-fail:

ivy-configure:
[ivy:configure] :: loading settings :: file = /home/jenkins/jenkins-slave/workspace/Lucene-Solr-NightlyTests-master/checkout/lucene/top-level-ivy-settings.xml

resolve:

ivy-availability-check:
[loadresource] Do not set property disallowed.ivy.jars.list as its length is 0.

-ivy-fail-disallowed-ivy-version:

ivy-fail:

ivy-fail:

ivy-configure:
[ivy:configure] :: loading settings :: file = /home/jenkins/jenkins-slave/workspace/Lucene-Solr-NightlyTests-master/checkout/lucene/top-level-ivy-settings.xml

resolve:

ivy-availability-check:
[loadresource] Do not set property disallowed.ivy.jars.list as its length is 0.

-ivy-fail-disallowed-ivy-version:

ivy-fail:

ivy-fail:

ivy-configure:
[ivy:configure] :: loading settings :: file = /home/jenkins/jenkins-slave/workspace/Lucene-Solr-NightlyTests-master/checkout/lucene/top-level-ivy-settings.xml

resolve:

ivy-availability-check:
[loadresource] Do not set property disallowed.ivy.jars.list as its length is 0.

-ivy-fail-disallowed-ivy-version:

ivy-fail:

ivy-fail:

ivy-configure:
[ivy:configure] :: loading settings :: file = /home/jenkins/jenkins-slave/workspace/Lucene-Solr-NightlyTests-master/checkout/lucene/top-level-ivy-settings.xml

resolve:

ivy-availability-check:
[loadresource] Do not set property disallowed.ivy.jars.list as its length is 0.

-ivy-fail-disallowed-ivy-version:

ivy-fail:

ivy-fail:

ivy-configure:
[ivy:configure] :: loading settings :: file = /home/jenkins/jenkins-slave/workspace/Lucene-Solr-NightlyTests-master/checkout/lucene/top-level-ivy-settings.xml

resolve:

ivy-availability-check:
[loadresource] Do not set property disallowed.ivy.jars.list as its length is 0.

-ivy-fail-disallowed-ivy-version:

ivy-fail:

ivy-fail:

ivy-configure:
[ivy:configure] :: loading settings :: file = /home/jenkins/jenkins-slave/workspace/Lucene-Solr-NightlyTests-master/checkout/lucene/top-level-ivy-settings.xml

resolve:

ivy-availability-check:
[loadresource] Do not set property disallowed.ivy.jars.list as its length is 0.

-ivy-fail-disallowed-ivy-version:

ivy-fail:

ivy-fail:

ivy-configure:
[ivy:configure] :: loading settings :: file = /home/jenkins/jenkins-slave/workspace/Lucene-Solr-NightlyTests-master/checkout/lucene/top-level-ivy-settings.xml

resolve:

ivy-availability-check:
[loadresource] Do not set property disallowed.ivy.jars.list as its length is 0.

-ivy-fail-disallowed-ivy-version:

ivy-fail:

ivy-fail:

ivy-configure:
[ivy:configure] :: loading settings :: file = /home/jenkins/jenkins-slave/workspace/Lucene-Solr-NightlyTests-master/checkout/lucene/top-level-ivy-settings.xml

resolve:

ivy-availability-check:
[loadresource] Do not set property disallowed.ivy.jars.list as its length is 0.

-ivy-fail-disallowed-ivy-version:

ivy-fail:

ivy-fail:

ivy-configure:
[ivy:configure] :: loading settings :: file = /home/jenkins/jenkins-slave/workspace/Lucene-Solr-NightlyTests-master/checkout/lucene/top-level-ivy-settings.xml

resolve:

ivy-availability-check:
[loadresource] Do not set property disallowed.ivy.jars.list as its length is 0.

-ivy-fail-disallowed-ivy-version:

ivy-fail:

ivy-fail:

ivy-configure:
[ivy:configure] :: loading settings :: file = /home/jenkins/jenkins-slave/workspace/Lucene-Solr-NightlyTests-master/checkout/lucene/top-level-ivy-settings.xml

resolve:

ivy-availability-check:
[loadresource] Do not set property disallowed.ivy.jars.list as its length is 0.

-ivy-fail-disallowed-ivy-version:

ivy-fail:

ivy-fail:

ivy-configure:
[ivy:configure] :: loading settings :: file = /home/jenkins/jenkins-slave/workspace/Lucene-Solr-NightlyTests-master/checkout/lucene/top-level-ivy-settings.xml

resolve:

jar-checksums:
    [mkdir] Created dir: /home/jenkins/jenkins-slave/workspace/Lucene-Solr-NightlyTests-master/checkout/solr/null141340589
     [copy] Copying 238 files to /home/jenkins/jenkins-slave/workspace/Lucene-Solr-NightlyTests-master/checkout/solr/null141340589
   [delete] Deleting directory /home/jenkins/jenkins-slave/workspace/Lucene-Solr-NightlyTests-master/checkout/solr/null141340589

check-working-copy:
[ivy:cachepath] :: resolving dependencies :: org.eclipse.jgit#org.eclipse.jgit-caller;working
[ivy:cachepath] confs: [default]
[ivy:cachepath] found org.eclipse.jgit#org.eclipse.jgit;4.6.0.201612231935-r in public
[ivy:cachepath] found com.jcraft#jsch;0.1.53 in public
[ivy:cachepath] found com.googlecode.javaewah#JavaEWAH;1.1.6 in public
[ivy:cachepath] found org.apache.httpcomponents#httpclient;4.3.6 in public
[ivy:cachepath] found org.apache.httpcomponents#httpcore;4.3.3 in public
[ivy:cachepath] found commons-logging#commons-logging;1.1.3 in public
[ivy:cachepath] found commons-codec#commons-codec;1.6 in public
[ivy:cachepath] found org.slf4j#slf4j-api;1.7.2 in public
[ivy:cachepath] :: resolution report :: resolve 119ms :: artifacts dl 29ms
        ---------------------------------------------------------------------
        |                  |            modules            ||   artifacts   |
        |       conf       | number| search|dwnlded|evicted|| number|dwnlded|
        ---------------------------------------------------------------------
        |      default     |   8   |   0   |   0   |   0   ||   8   |   0   |
        ---------------------------------------------------------------------
[wc-checker] Initializing working copy...
[wc-checker] SLF4J: Failed to load class "org.slf4j.impl.StaticLoggerBinder".
[wc-checker] SLF4J: Defaulting to no-operation (NOP) logger implementation
[wc-checker] SLF4J: See http://www.slf4j.org/codes.html#StaticLoggerBinder for further details.
[wc-checker] Checking working copy status...

-jenkins-base:

BUILD SUCCESSFUL
Total time: 583 minutes 55 seconds
Archiving artifacts
java.lang.InterruptedException: no matches found within 10000
        at hudson.FilePath$34.hasMatch(FilePath.java:2678)
        at hudson.FilePath$34.invoke(FilePath.java:2557)
        at hudson.FilePath$34.invoke(FilePath.java:2547)
        at hudson.FilePath$FileCallableWrapper.call(FilePath.java:2918)
Also:   hudson.remoting.Channel$CallSiteStackTrace: Remote call to lucene2
                at hudson.remoting.Channel.attachCallSiteStackTrace(Channel.java:1741)
                at hudson.remoting.UserRequest$ExceptionResponse.retrieve(UserRequest.java:357)
                at hudson.remoting.Channel.call(Channel.java:955)
                at hudson.FilePath.act(FilePath.java:1036)
                at hudson.FilePath.act(FilePath.java:1025)
                at hudson.FilePath.validateAntFileMask(FilePath.java:2547)
                at hudson.tasks.ArtifactArchiver.perform(ArtifactArchiver.java:243)
                at hudson.tasks.BuildStepCompatibilityLayer.perform(BuildStepCompatibilityLayer.java:81)
                at hudson.tasks.BuildStepMonitor$1.perform(BuildStepMonitor.java:20)
                at hudson.model.AbstractBuild$AbstractBuildExecution.perform(AbstractBuild.java:744)
                at hudson.model.AbstractBuild$AbstractBuildExecution.performAllBuildSteps(AbstractBuild.java:690)
                at hudson.model.Build$BuildExecution.post2(Build.java:186)
                at hudson.model.AbstractBuild$AbstractBuildExecution.post(AbstractBuild.java:635)
                at hudson.model.Run.execute(Run.java:1819)
                at hudson.model.FreeStyleBuild.run(FreeStyleBuild.java:43)
                at hudson.model.ResourceController.execute(ResourceController.java:97)
                at hudson.model.Executor.run(Executor.java:429)
Caused: hudson.FilePath$TunneledInterruptedException
        at hudson.FilePath$FileCallableWrapper.call(FilePath.java:2920)
        at hudson.remoting.UserRequest.perform(UserRequest.java:212)
        at hudson.remoting.UserRequest.perform(UserRequest.java:54)
        at hudson.remoting.Request$2.run(Request.java:369)
        at hudson.remoting.InterceptingExecutorService$1.call(InterceptingExecutorService.java:72)
        at java.util.concurrent.FutureTask.run(FutureTask.java:266)
        at java.util.concurrent.ThreadPoolExecutor.runWorker(ThreadPoolExecutor.java:1142)
        at java.util.concurrent.ThreadPoolExecutor$Worker.run(ThreadPoolExecutor.java:617)
        at java.lang.Thread.run(Thread.java:748)
Caused: java.lang.InterruptedException: java.lang.InterruptedException: no matches found within 10000
        at hudson.FilePath.act(FilePath.java:1038)
        at hudson.FilePath.act(FilePath.java:1025)
        at hudson.FilePath.validateAntFileMask(FilePath.java:2547)
        at hudson.tasks.ArtifactArchiver.perform(ArtifactArchiver.java:243)
        at hudson.tasks.BuildStepCompatibilityLayer.perform(BuildStepCompatibilityLayer.java:81)
        at hudson.tasks.BuildStepMonitor$1.perform(BuildStepMonitor.java:20)
        at hudson.model.AbstractBuild$AbstractBuildExecution.perform(AbstractBuild.java:744)
        at hudson.model.AbstractBuild$AbstractBuildExecution.performAllBuildSteps(AbstractBuild.java:690)
        at hudson.model.Build$BuildExecution.post2(Build.java:186)
        at hudson.model.AbstractBuild$AbstractBuildExecution.post(AbstractBuild.java:635)
        at hudson.model.Run.execute(Run.java:1819)
        at hudson.model.FreeStyleBuild.run(FreeStyleBuild.java:43)
        at hudson.model.ResourceController.execute(ResourceController.java:97)
        at hudson.model.Executor.run(Executor.java:429)
No artifacts found that match the file pattern "**/*.events,heapdumps/**,**/hs_err_pid*". Configuration error?
Recording test results
Build step 'Publish JUnit test result report' changed build result to UNSTABLE
Email was triggered for: Unstable (Test Failures)
Sending email for trigger: Unstable (Test Failures)


---------------------------------------------------------------------
To unsubscribe, e-mail: [hidden email]
For additional commands, e-mail: [hidden email]
Reply | Threaded
Open this post in threaded view
|

[JENKINS] Lucene-Solr-NightlyTests-master - Build # 1610 - Failure

Apache Jenkins Server-2
Build: https://builds.apache.org/job/Lucene-Solr-NightlyTests-master/1610/

1 tests failed.
FAILED:  org.apache.lucene.document.TestLatLonLineShapeQueries.testRandomBig

Error Message:
Java heap space

Stack Trace:
java.lang.OutOfMemoryError: Java heap space
        at __randomizedtesting.SeedInfo.seed([D36D4582A546D584:543A380D341FA904]:0)
        at org.apache.lucene.util.bkd.HeapPointWriter.writePackedValue(HeapPointWriter.java:106)
        at org.apache.lucene.util.bkd.HeapPointWriter.append(HeapPointWriter.java:127)
        at org.apache.lucene.util.bkd.PointReader.split(PointReader.java:68)
        at org.apache.lucene.util.bkd.OfflinePointReader.split(OfflinePointReader.java:169)
        at org.apache.lucene.util.bkd.BKDWriter.build(BKDWriter.java:1787)
        at org.apache.lucene.util.bkd.BKDWriter.build(BKDWriter.java:1801)
        at org.apache.lucene.util.bkd.BKDWriter.build(BKDWriter.java:1801)
        at org.apache.lucene.util.bkd.BKDWriter.build(BKDWriter.java:1801)
        at org.apache.lucene.util.bkd.BKDWriter.build(BKDWriter.java:1801)
        at org.apache.lucene.util.bkd.BKDWriter.build(BKDWriter.java:1801)
        at org.apache.lucene.util.bkd.BKDWriter.build(BKDWriter.java:1801)
        at org.apache.lucene.util.bkd.BKDWriter.build(BKDWriter.java:1801)
        at org.apache.lucene.util.bkd.BKDWriter.finish(BKDWriter.java:1004)
        at org.apache.lucene.codecs.lucene60.Lucene60PointsWriter.writeField(Lucene60PointsWriter.java:130)
        at org.apache.lucene.codecs.PointsWriter.mergeOneField(PointsWriter.java:62)
        at org.apache.lucene.codecs.lucene60.Lucene60PointsWriter.merge(Lucene60PointsWriter.java:223)
        at org.apache.lucene.index.SegmentMerger.mergePoints(SegmentMerger.java:201)
        at org.apache.lucene.index.SegmentMerger.merge(SegmentMerger.java:161)
        at org.apache.lucene.index.IndexWriter.mergeMiddle(IndexWriter.java:4436)
        at org.apache.lucene.index.IndexWriter.merge(IndexWriter.java:4058)
        at org.apache.lucene.index.SerialMergeScheduler.merge(SerialMergeScheduler.java:40)
        at org.apache.lucene.index.IndexWriter.maybeMerge(IndexWriter.java:2160)
        at org.apache.lucene.index.IndexWriter.processEvents(IndexWriter.java:5093)
        at org.apache.lucene.index.IndexWriter.updateDocument(IndexWriter.java:1602)
        at org.apache.lucene.index.IndexWriter.addDocument(IndexWriter.java:1218)
        at org.apache.lucene.document.BaseLatLonShapeTestCase.indexRandomShapes(BaseLatLonShapeTestCase.java:214)
        at org.apache.lucene.document.BaseLatLonShapeTestCase.verify(BaseLatLonShapeTestCase.java:192)
        at org.apache.lucene.document.BaseLatLonShapeTestCase.doTestRandom(BaseLatLonShapeTestCase.java:173)
        at org.apache.lucene.document.BaseLatLonShapeTestCase.testRandomBig(BaseLatLonShapeTestCase.java:149)
        at sun.reflect.NativeMethodAccessorImpl.invoke0(Native Method)
        at sun.reflect.NativeMethodAccessorImpl.invoke(NativeMethodAccessorImpl.java:62)
        at sun.reflect.DelegatingMethodAccessorImpl.invoke(DelegatingMethodAccessorImpl.java:43)




Build Log:
[...truncated 10032 lines...]
   [junit4] Suite: org.apache.lucene.document.TestLatLonLineShapeQueries
   [junit4]   2> NOTE: download the large Jenkins line-docs file by running 'ant get-jenkins-line-docs' in the lucene directory.
   [junit4]   2> NOTE: reproduce with: ant test  -Dtestcase=TestLatLonLineShapeQueries -Dtests.method=testRandomBig -Dtests.seed=D36D4582A546D584 -Dtests.multiplier=2 -Dtests.nightly=true -Dtests.slow=true -Dtests.linedocsfile=/home/jenkins/jenkins-slave/workspace/Lucene-Solr-NightlyTests-master/test-data/enwiki.random.lines.txt -Dtests.locale=sr-RS -Dtests.timezone=America/Port_of_Spain -Dtests.asserts=true -Dtests.file.encoding=ISO-8859-1
   [junit4] ERROR    232s J2 | TestLatLonLineShapeQueries.testRandomBig <<<
   [junit4]    > Throwable #1: java.lang.OutOfMemoryError: Java heap space
   [junit4]    > at __randomizedtesting.SeedInfo.seed([D36D4582A546D584:543A380D341FA904]:0)
   [junit4]    > at org.apache.lucene.util.bkd.HeapPointWriter.writePackedValue(HeapPointWriter.java:106)
   [junit4]    > at org.apache.lucene.util.bkd.HeapPointWriter.append(HeapPointWriter.java:127)
   [junit4]    > at org.apache.lucene.util.bkd.PointReader.split(PointReader.java:68)
   [junit4]    > at org.apache.lucene.util.bkd.OfflinePointReader.split(OfflinePointReader.java:169)
   [junit4]    > at org.apache.lucene.util.bkd.BKDWriter.build(BKDWriter.java:1787)
   [junit4]    > at org.apache.lucene.util.bkd.BKDWriter.build(BKDWriter.java:1801)
   [junit4]    > at org.apache.lucene.util.bkd.BKDWriter.build(BKDWriter.java:1801)
   [junit4]    > at org.apache.lucene.util.bkd.BKDWriter.build(BKDWriter.java:1801)
   [junit4]    > at org.apache.lucene.util.bkd.BKDWriter.build(BKDWriter.java:1801)
   [junit4]    > at org.apache.lucene.util.bkd.BKDWriter.build(BKDWriter.java:1801)
   [junit4]    > at org.apache.lucene.util.bkd.BKDWriter.build(BKDWriter.java:1801)
   [junit4]    > at org.apache.lucene.util.bkd.BKDWriter.build(BKDWriter.java:1801)
   [junit4]    > at org.apache.lucene.util.bkd.BKDWriter.finish(BKDWriter.java:1004)
   [junit4]    > at org.apache.lucene.codecs.lucene60.Lucene60PointsWriter.writeField(Lucene60PointsWriter.java:130)
   [junit4]    > at org.apache.lucene.codecs.PointsWriter.mergeOneField(PointsWriter.java:62)
   [junit4]    > at org.apache.lucene.codecs.lucene60.Lucene60PointsWriter.merge(Lucene60PointsWriter.java:223)
   [junit4]    > at org.apache.lucene.index.SegmentMerger.mergePoints(SegmentMerger.java:201)
   [junit4]    > at org.apache.lucene.index.SegmentMerger.merge(SegmentMerger.java:161)
   [junit4]    > at org.apache.lucene.index.IndexWriter.mergeMiddle(IndexWriter.java:4436)
   [junit4]    > at org.apache.lucene.index.IndexWriter.merge(IndexWriter.java:4058)
   [junit4]    > at org.apache.lucene.index.SerialMergeScheduler.merge(SerialMergeScheduler.java:40)
   [junit4]    > at org.apache.lucene.index.IndexWriter.maybeMerge(IndexWriter.java:2160)
   [junit4]    > at org.apache.lucene.index.IndexWriter.processEvents(IndexWriter.java:5093)
   [junit4]    > at org.apache.lucene.index.IndexWriter.updateDocument(IndexWriter.java:1602)
   [junit4]    > at org.apache.lucene.index.IndexWriter.addDocument(IndexWriter.java:1218)
   [junit4]    > at org.apache.lucene.document.BaseLatLonShapeTestCase.indexRandomShapes(BaseLatLonShapeTestCase.java:214)
   [junit4]    > at org.apache.lucene.document.BaseLatLonShapeTestCase.verify(BaseLatLonShapeTestCase.java:192)
   [junit4]    > at org.apache.lucene.document.BaseLatLonShapeTestCase.doTestRandom(BaseLatLonShapeTestCase.java:173)
   [junit4]    > at org.apache.lucene.document.BaseLatLonShapeTestCase.testRandomBig(BaseLatLonShapeTestCase.java:149)
   [junit4]   2> NOTE: leaving temporary files on disk at: /x1/jenkins/jenkins-slave/workspace/Lucene-Solr-NightlyTests-master/checkout/lucene/build/sandbox/test/J2/temp/lucene.document.TestLatLonLineShapeQueries_D36D4582A546D584-001
   [junit4]   2> NOTE: test params are: codec=Lucene70, sim=Asserting(org.apache.lucene.search.similarities.AssertingSimilarity@775c3d5a), locale=sr-RS, timezone=America/Port_of_Spain
   [junit4]   2> NOTE: Linux 4.4.0-130-generic amd64/Oracle Corporation 1.8.0_172 (64-bit)/cpus=4,threads=1,free=276291192,total=298844160
   [junit4]   2> NOTE: All tests run in this JVM: [TestLatLonLineShapeQueries]
   [junit4] Completed [17/21 (1!)] on J2 in 427.22s, 4 tests, 1 error <<< FAILURES!

[...truncated 10 lines...]
   [junit4] JVM J2: stdout was not empty, see: /x1/jenkins/jenkins-slave/workspace/Lucene-Solr-NightlyTests-master/checkout/lucene/build/sandbox/test/temp/junit4-J2-20180811_094516_7012176838337953017409.sysout
   [junit4] >>> JVM J2 emitted unexpected output (verbatim) ----
   [junit4] java.lang.OutOfMemoryError: Java heap space
   [junit4] Dumping heap to /x1/jenkins/jenkins-slave/workspace/Lucene-Solr-NightlyTests-master/checkout/heapdumps/java_pid24571.hprof ...
   [junit4] Heap dump file created [420960969 bytes in 0.633 secs]
   [junit4] <<< JVM J2: EOF ----

[...truncated 14442 lines...]
BUILD FAILED
/x1/jenkins/jenkins-slave/workspace/Lucene-Solr-NightlyTests-master/checkout/build.xml:651: The following error occurred while executing this line:
/x1/jenkins/jenkins-slave/workspace/Lucene-Solr-NightlyTests-master/checkout/build.xml:585: Some of the tests produced a heap dump, but did not fail. Maybe a suppressed OutOfMemoryError? Dumps created:
* java_pid24571.hprof

Total time: 263 minutes 12 seconds
Build step 'Invoke Ant' marked build as failure
Archiving artifacts
Recording test results
Email was triggered for: Failure - Any
Sending email for trigger: Failure - Any


---------------------------------------------------------------------
To unsubscribe, e-mail: [hidden email]
For additional commands, e-mail: [hidden email]
Reply | Threaded
Open this post in threaded view
|

[JENKINS] Lucene-Solr-NightlyTests-master - Build # 1611 - Still Failing

Apache Jenkins Server-2
Build: https://builds.apache.org/job/Lucene-Solr-NightlyTests-master/1611/

1 tests failed.
FAILED:  org.apache.lucene.document.TestLatLonLineShapeQueries.testRandomBig

Error Message:
Java heap space

Stack Trace:
java.lang.OutOfMemoryError: Java heap space
        at __randomizedtesting.SeedInfo.seed([A81EEFB2B3995378:2F49923D22C02FF8]:0)
        at org.apache.lucene.util.bkd.HeapPointWriter.writePackedValue(HeapPointWriter.java:106)
        at org.apache.lucene.util.bkd.HeapPointWriter.append(HeapPointWriter.java:127)
        at org.apache.lucene.util.bkd.PointReader.split(PointReader.java:68)
        at org.apache.lucene.util.bkd.BKDWriter.build(BKDWriter.java:1787)
        at org.apache.lucene.util.bkd.BKDWriter.build(BKDWriter.java:1801)
        at org.apache.lucene.util.bkd.BKDWriter.build(BKDWriter.java:1801)
        at org.apache.lucene.util.bkd.BKDWriter.build(BKDWriter.java:1801)
        at org.apache.lucene.util.bkd.BKDWriter.build(BKDWriter.java:1801)
        at org.apache.lucene.util.bkd.BKDWriter.build(BKDWriter.java:1814)
        at org.apache.lucene.util.bkd.BKDWriter.build(BKDWriter.java:1801)
        at org.apache.lucene.util.bkd.BKDWriter.build(BKDWriter.java:1801)
        at org.apache.lucene.util.bkd.BKDWriter.build(BKDWriter.java:1801)
        at org.apache.lucene.util.bkd.BKDWriter.build(BKDWriter.java:1801)
        at org.apache.lucene.util.bkd.BKDWriter.build(BKDWriter.java:1801)
        at org.apache.lucene.util.bkd.BKDWriter.finish(BKDWriter.java:1004)
        at org.apache.lucene.index.RandomCodec$1$1.writeField(RandomCodec.java:139)
        at org.apache.lucene.codecs.PointsWriter.mergeOneField(PointsWriter.java:62)
        at org.apache.lucene.codecs.PointsWriter.merge(PointsWriter.java:186)
        at org.apache.lucene.codecs.lucene60.Lucene60PointsWriter.merge(Lucene60PointsWriter.java:144)
        at org.apache.lucene.codecs.asserting.AssertingPointsFormat$AssertingPointsWriter.merge(AssertingPointsFormat.java:142)
        at org.apache.lucene.index.SegmentMerger.mergePoints(SegmentMerger.java:201)
        at org.apache.lucene.index.SegmentMerger.merge(SegmentMerger.java:161)
        at org.apache.lucene.index.IndexWriter.mergeMiddle(IndexWriter.java:4436)
        at org.apache.lucene.index.IndexWriter.merge(IndexWriter.java:4058)
        at org.apache.lucene.index.SerialMergeScheduler.merge(SerialMergeScheduler.java:40)
        at org.apache.lucene.index.IndexWriter.maybeMerge(IndexWriter.java:2160)
        at org.apache.lucene.index.IndexWriter.processEvents(IndexWriter.java:5093)
        at org.apache.lucene.index.IndexWriter.updateDocument(IndexWriter.java:1602)
        at org.apache.lucene.index.IndexWriter.addDocument(IndexWriter.java:1218)
        at org.apache.lucene.document.BaseLatLonShapeTestCase.indexRandomShapes(BaseLatLonShapeTestCase.java:214)
        at org.apache.lucene.document.BaseLatLonShapeTestCase.verify(BaseLatLonShapeTestCase.java:192)
        at org.apache.lucene.document.BaseLatLonShapeTestCase.doTestRandom(BaseLatLonShapeTestCase.java:173)




Build Log:
[...truncated 10038 lines...]
   [junit4] Suite: org.apache.lucene.document.TestLatLonLineShapeQueries
   [junit4]   2> NOTE: download the large Jenkins line-docs file by running 'ant get-jenkins-line-docs' in the lucene directory.
   [junit4]   2> NOTE: reproduce with: ant test  -Dtestcase=TestLatLonLineShapeQueries -Dtests.method=testRandomBig -Dtests.seed=A81EEFB2B3995378 -Dtests.multiplier=2 -Dtests.nightly=true -Dtests.slow=true -Dtests.linedocsfile=/home/jenkins/jenkins-slave/workspace/Lucene-Solr-NightlyTests-master/test-data/enwiki.random.lines.txt -Dtests.locale=es-HN -Dtests.timezone=Asia/Bahrain -Dtests.asserts=true -Dtests.file.encoding=UTF-8
   [junit4] ERROR    431s J1 | TestLatLonLineShapeQueries.testRandomBig <<<
   [junit4]    > Throwable #1: java.lang.OutOfMemoryError: Java heap space
   [junit4]    > at __randomizedtesting.SeedInfo.seed([A81EEFB2B3995378:2F49923D22C02FF8]:0)
   [junit4]    > at org.apache.lucene.util.bkd.HeapPointWriter.writePackedValue(HeapPointWriter.java:106)
   [junit4]    > at org.apache.lucene.util.bkd.HeapPointWriter.append(HeapPointWriter.java:127)
   [junit4]    > at org.apache.lucene.util.bkd.PointReader.split(PointReader.java:68)
   [junit4]    > at org.apache.lucene.util.bkd.BKDWriter.build(BKDWriter.java:1787)
   [junit4]    > at org.apache.lucene.util.bkd.BKDWriter.build(BKDWriter.java:1801)
   [junit4]    > at org.apache.lucene.util.bkd.BKDWriter.build(BKDWriter.java:1801)
   [junit4]    > at org.apache.lucene.util.bkd.BKDWriter.build(BKDWriter.java:1801)
   [junit4]    > at org.apache.lucene.util.bkd.BKDWriter.build(BKDWriter.java:1801)
   [junit4]    > at org.apache.lucene.util.bkd.BKDWriter.build(BKDWriter.java:1814)
   [junit4]    > at org.apache.lucene.util.bkd.BKDWriter.build(BKDWriter.java:1801)
   [junit4]    > at org.apache.lucene.util.bkd.BKDWriter.build(BKDWriter.java:1801)
   [junit4]    > at org.apache.lucene.util.bkd.BKDWriter.build(BKDWriter.java:1801)
   [junit4]    > at org.apache.lucene.util.bkd.BKDWriter.build(BKDWriter.java:1801)
   [junit4]    > at org.apache.lucene.util.bkd.BKDWriter.build(BKDWriter.java:1801)
   [junit4]    > at org.apache.lucene.util.bkd.BKDWriter.finish(BKDWriter.java:1004)
   [junit4]    > at org.apache.lucene.index.RandomCodec$1$1.writeField(RandomCodec.java:139)
   [junit4]    > at org.apache.lucene.codecs.PointsWriter.mergeOneField(PointsWriter.java:62)
   [junit4]    > at org.apache.lucene.codecs.PointsWriter.merge(PointsWriter.java:186)
   [junit4]    > at org.apache.lucene.codecs.lucene60.Lucene60PointsWriter.merge(Lucene60PointsWriter.java:144)
   [junit4]    > at org.apache.lucene.codecs.asserting.AssertingPointsFormat$AssertingPointsWriter.merge(AssertingPointsFormat.java:142)
   [junit4]    > at org.apache.lucene.index.SegmentMerger.mergePoints(SegmentMerger.java:201)
   [junit4]    > at org.apache.lucene.index.SegmentMerger.merge(SegmentMerger.java:161)
   [junit4]    > at org.apache.lucene.index.IndexWriter.mergeMiddle(IndexWriter.java:4436)
   [junit4]    > at org.apache.lucene.index.IndexWriter.merge(IndexWriter.java:4058)
   [junit4]    > at org.apache.lucene.index.SerialMergeScheduler.merge(SerialMergeScheduler.java:40)
   [junit4]    > at org.apache.lucene.index.IndexWriter.maybeMerge(IndexWriter.java:2160)
   [junit4]    > at org.apache.lucene.index.IndexWriter.processEvents(IndexWriter.java:5093)
   [junit4]    > at org.apache.lucene.index.IndexWriter.updateDocument(IndexWriter.java:1602)
   [junit4]    > at org.apache.lucene.index.IndexWriter.addDocument(IndexWriter.java:1218)
   [junit4]    > at org.apache.lucene.document.BaseLatLonShapeTestCase.indexRandomShapes(BaseLatLonShapeTestCase.java:214)
   [junit4]    > at org.apache.lucene.document.BaseLatLonShapeTestCase.verify(BaseLatLonShapeTestCase.java:192)
   [junit4]    > at org.apache.lucene.document.BaseLatLonShapeTestCase.doTestRandom(BaseLatLonShapeTestCase.java:173)
   [junit4]   2> NOTE: leaving temporary files on disk at: /x1/jenkins/jenkins-slave/workspace/Lucene-Solr-NightlyTests-master/checkout/lucene/build/sandbox/test/J1/temp/lucene.document.TestLatLonLineShapeQueries_A81EEFB2B3995378-001
   [junit4]   2> NOTE: test params are: codec=Asserting(Lucene70): {id=PostingsFormat(name=LuceneFixedGap)}, docValues:{shape=DocValuesFormat(name=Direct), id=DocValuesFormat(name=Asserting)}, maxPointsInLeafNode=1533, maxMBSortInHeap=5.719263158282112, sim=Asserting(org.apache.lucene.search.similarities.AssertingSimilarity@5ead75e2), locale=es-HN, timezone=Asia/Bahrain
   [junit4]   2> NOTE: Linux 4.4.0-130-generic amd64/Oracle Corporation 1.8.0_172 (64-bit)/cpus=4,threads=1,free=226797088,total=318767104
   [junit4]   2> NOTE: All tests run in this JVM: [TestDocValuesNumbersQuery, TestIntervalQuery, TestPayloadSpanUtil, TestBigIntegerPoint, TestHalfFloatPoint, TestLatLonLineShapeQueries]
   [junit4] Completed [20/21 (1!)] on J1 in 642.27s, 4 tests, 1 error <<< FAILURES!

[...truncated 1 lines...]
   [junit4] JVM J1: stdout was not empty, see: /x1/jenkins/jenkins-slave/workspace/Lucene-Solr-NightlyTests-master/checkout/lucene/build/sandbox/test/temp/junit4-J1-20180812_080309_1451991375210188394454.sysout
   [junit4] >>> JVM J1 emitted unexpected output (verbatim) ----
   [junit4] java.lang.OutOfMemoryError: Java heap space
   [junit4] Dumping heap to /x1/jenkins/jenkins-slave/workspace/Lucene-Solr-NightlyTests-master/checkout/heapdumps/java_pid5230.hprof ...
   [junit4] Heap dump file created [444937087 bytes in 0.867 secs]
   [junit4] <<< JVM J1: EOF ----

[...truncated 14623 lines...]
BUILD FAILED
/x1/jenkins/jenkins-slave/workspace/Lucene-Solr-NightlyTests-master/checkout/build.xml:651: The following error occurred while executing this line:
/x1/jenkins/jenkins-slave/workspace/Lucene-Solr-NightlyTests-master/checkout/build.xml:585: Some of the tests produced a heap dump, but did not fail. Maybe a suppressed OutOfMemoryError? Dumps created:
* java_pid5230.hprof

Total time: 266 minutes 54 seconds
Build step 'Invoke Ant' marked build as failure
Archiving artifacts
Recording test results
Email was triggered for: Failure - Any
Sending email for trigger: Failure - Any


---------------------------------------------------------------------
To unsubscribe, e-mail: [hidden email]
For additional commands, e-mail: [hidden email]
Reply | Threaded
Open this post in threaded view
|

[JENKINS] Lucene-Solr-NightlyTests-master - Build # 1612 - Still Failing

Apache Jenkins Server-2
Build: https://builds.apache.org/job/Lucene-Solr-NightlyTests-master/1612/

1 tests failed.
FAILED:  org.apache.lucene.document.TestLatLonPolygonShapeQueries.testRandomBig

Error Message:
Java heap space

Stack Trace:
java.lang.OutOfMemoryError: Java heap space
        at __randomizedtesting.SeedInfo.seed([8F70394600CE495B:82744C9919735DB]:0)
        at java.util.Arrays.copyOf(Arrays.java:3332)
        at java.lang.AbstractStringBuilder.ensureCapacityInternal(AbstractStringBuilder.java:124)
        at java.lang.AbstractStringBuilder.append(AbstractStringBuilder.java:448)
        at java.lang.StringBuilder.append(StringBuilder.java:136)
        at java.lang.StringBuilder.append(StringBuilder.java:131)
        at org.apache.lucene.store.MockIndexInputWrapper.toString(MockIndexInputWrapper.java:224)
        at java.lang.String.valueOf(String.java:2994)
        at java.lang.StringBuilder.append(StringBuilder.java:131)
        at org.apache.lucene.store.BufferedChecksumIndexInput.<init>(BufferedChecksumIndexInput.java:34)
        at org.apache.lucene.store.Directory.openChecksumInput(Directory.java:157)
        at org.apache.lucene.util.bkd.BKDWriter.verifyChecksum(BKDWriter.java:1371)
        at org.apache.lucene.util.bkd.BKDWriter.build(BKDWriter.java:1795)
        at org.apache.lucene.util.bkd.BKDWriter.finish(BKDWriter.java:1004)
        at org.apache.lucene.index.RandomCodec$1$1.writeField(RandomCodec.java:139)
        at org.apache.lucene.codecs.PointsWriter.mergeOneField(PointsWriter.java:62)
        at org.apache.lucene.codecs.PointsWriter.merge(PointsWriter.java:186)
        at org.apache.lucene.codecs.lucene60.Lucene60PointsWriter.merge(Lucene60PointsWriter.java:144)
        at org.apache.lucene.codecs.asserting.AssertingPointsFormat$AssertingPointsWriter.merge(AssertingPointsFormat.java:142)
        at org.apache.lucene.index.SegmentMerger.mergePoints(SegmentMerger.java:201)
        at org.apache.lucene.index.SegmentMerger.merge(SegmentMerger.java:161)
        at org.apache.lucene.index.IndexWriter.mergeMiddle(IndexWriter.java:4436)
        at org.apache.lucene.index.IndexWriter.merge(IndexWriter.java:4058)
        at org.apache.lucene.index.SerialMergeScheduler.merge(SerialMergeScheduler.java:40)
        at org.apache.lucene.index.IndexWriter.maybeMerge(IndexWriter.java:2160)
        at org.apache.lucene.index.IndexWriter.forceMerge(IndexWriter.java:1993)
        at org.apache.lucene.index.IndexWriter.forceMerge(IndexWriter.java:1944)
        at org.apache.lucene.document.BaseLatLonShapeTestCase.indexRandomShapes(BaseLatLonShapeTestCase.java:226)
        at org.apache.lucene.document.BaseLatLonShapeTestCase.verify(BaseLatLonShapeTestCase.java:192)
        at org.apache.lucene.document.BaseLatLonShapeTestCase.doTestRandom(BaseLatLonShapeTestCase.java:173)
        at org.apache.lucene.document.BaseLatLonShapeTestCase.testRandomBig(BaseLatLonShapeTestCase.java:149)
        at sun.reflect.NativeMethodAccessorImpl.invoke0(Native Method)
        at sun.reflect.NativeMethodAccessorImpl.invoke(NativeMethodAccessorImpl.java:62)




Build Log:
[...truncated 10097 lines...]
   [junit4] Suite: org.apache.lucene.document.TestLatLonPolygonShapeQueries
   [junit4]   2> NOTE: download the large Jenkins line-docs file by running 'ant get-jenkins-line-docs' in the lucene directory.
   [junit4]   2> NOTE: reproduce with: ant test  -Dtestcase=TestLatLonPolygonShapeQueries -Dtests.method=testRandomBig -Dtests.seed=8F70394600CE495B -Dtests.multiplier=2 -Dtests.nightly=true -Dtests.slow=true -Dtests.linedocsfile=/home/jenkins/jenkins-slave/workspace/Lucene-Solr-NightlyTests-master/test-data/enwiki.random.lines.txt -Dtests.locale=hi-IN -Dtests.timezone=Africa/Maputo -Dtests.asserts=true -Dtests.file.encoding=US-ASCII
   [junit4] ERROR    219s J1 | TestLatLonPolygonShapeQueries.testRandomBig <<<
   [junit4]    > Throwable #1: java.lang.OutOfMemoryError: Java heap space
   [junit4]    > at __randomizedtesting.SeedInfo.seed([8F70394600CE495B:82744C9919735DB]:0)
   [junit4]    > at java.util.Arrays.copyOf(Arrays.java:3332)
   [junit4]    > at java.lang.AbstractStringBuilder.ensureCapacityInternal(AbstractStringBuilder.java:124)
   [junit4]    > at java.lang.AbstractStringBuilder.append(AbstractStringBuilder.java:448)
   [junit4]    > at java.lang.StringBuilder.append(StringBuilder.java:136)
   [junit4]    > at java.lang.StringBuilder.append(StringBuilder.java:131)
   [junit4]    > at org.apache.lucene.store.MockIndexInputWrapper.toString(MockIndexInputWrapper.java:224)
   [junit4]    > at java.lang.String.valueOf(String.java:2994)
   [junit4]    > at java.lang.StringBuilder.append(StringBuilder.java:131)
   [junit4]    > at org.apache.lucene.store.BufferedChecksumIndexInput.<init>(BufferedChecksumIndexInput.java:34)
   [junit4]    > at org.apache.lucene.store.Directory.openChecksumInput(Directory.java:157)
   [junit4]    > at org.apache.lucene.util.bkd.BKDWriter.verifyChecksum(BKDWriter.java:1371)
   [junit4]    > at org.apache.lucene.util.bkd.BKDWriter.build(BKDWriter.java:1795)
   [junit4]    > at org.apache.lucene.util.bkd.BKDWriter.finish(BKDWriter.java:1004)
   [junit4]    > at org.apache.lucene.index.RandomCodec$1$1.writeField(RandomCodec.java:139)
   [junit4]    > at org.apache.lucene.codecs.PointsWriter.mergeOneField(PointsWriter.java:62)
   [junit4]    > at org.apache.lucene.codecs.PointsWriter.merge(PointsWriter.java:186)
   [junit4]    > at org.apache.lucene.codecs.lucene60.Lucene60PointsWriter.merge(Lucene60PointsWriter.java:144)
   [junit4]    > at org.apache.lucene.codecs.asserting.AssertingPointsFormat$AssertingPointsWriter.merge(AssertingPointsFormat.java:142)
   [junit4]    > at org.apache.lucene.index.SegmentMerger.mergePoints(SegmentMerger.java:201)
   [junit4]    > at org.apache.lucene.index.SegmentMerger.merge(SegmentMerger.java:161)
   [junit4]    > at org.apache.lucene.index.IndexWriter.mergeMiddle(IndexWriter.java:4436)
   [junit4]    > at org.apache.lucene.index.IndexWriter.merge(IndexWriter.java:4058)
   [junit4]    > at org.apache.lucene.index.SerialMergeScheduler.merge(SerialMergeScheduler.java:40)
   [junit4]    > at org.apache.lucene.index.IndexWriter.maybeMerge(IndexWriter.java:2160)
   [junit4]    > at org.apache.lucene.index.IndexWriter.forceMerge(IndexWriter.java:1993)
   [junit4]    > at org.apache.lucene.index.IndexWriter.forceMerge(IndexWriter.java:1944)
   [junit4]    > at org.apache.lucene.document.BaseLatLonShapeTestCase.indexRandomShapes(BaseLatLonShapeTestCase.java:226)
   [junit4]    > at org.apache.lucene.document.BaseLatLonShapeTestCase.verify(BaseLatLonShapeTestCase.java:192)
   [junit4]    > at org.apache.lucene.document.BaseLatLonShapeTestCase.doTestRandom(BaseLatLonShapeTestCase.java:173)
   [junit4]    > at org.apache.lucene.document.BaseLatLonShapeTestCase.testRandomBig(BaseLatLonShapeTestCase.java:149)
   [junit4]   2> NOTE: leaving temporary files on disk at: /x1/jenkins/jenkins-slave/workspace/Lucene-Solr-NightlyTests-master/checkout/lucene/build/sandbox/test/J1/temp/lucene.document.TestLatLonPolygonShapeQueries_8F70394600CE495B-001
   [junit4]   2> NOTE: test params are: codec=Asserting(Lucene70): {id=PostingsFormat(name=LuceneVarGapFixedInterval)}, docValues:{shape=DocValuesFormat(name=Lucene70), id=DocValuesFormat(name=Direct)}, maxPointsInLeafNode=349, maxMBSortInHeap=5.48016334834354, sim=Asserting(org.apache.lucene.search.similarities.AssertingSimilarity@169d586c), locale=hi-IN, timezone=Africa/Maputo
   [junit4]   2> NOTE: Linux 4.4.0-130-generic amd64/Oracle Corporation 1.8.0_172 (64-bit)/cpus=4,threads=1,free=184525592,total=353370112
   [junit4]   2> NOTE: All tests run in this JVM: [TestLatLonPolygonShapeQueries]
   [junit4] Completed [17/21 (1!)] on J1 in 548.80s, 4 tests, 1 error <<< FAILURES!

[...truncated 11 lines...]
   [junit4] JVM J1: stdout was not empty, see: /x1/jenkins/jenkins-slave/workspace/Lucene-Solr-NightlyTests-master/checkout/lucene/build/sandbox/test/temp/junit4-J1-20180813_080729_6019214693037968956078.sysout
   [junit4] >>> JVM J1 emitted unexpected output (verbatim) ----
   [junit4] java.lang.OutOfMemoryError: Java heap space
   [junit4] Dumping heap to /x1/jenkins/jenkins-slave/workspace/Lucene-Solr-NightlyTests-master/checkout/heapdumps/java_pid21009.hprof ...
   [junit4] Heap dump file created [538417528 bytes in 0.866 secs]
   [junit4] <<< JVM J1: EOF ----

[...truncated 14591 lines...]
BUILD FAILED
/x1/jenkins/jenkins-slave/workspace/Lucene-Solr-NightlyTests-master/checkout/build.xml:651: The following error occurred while executing this line:
/x1/jenkins/jenkins-slave/workspace/Lucene-Solr-NightlyTests-master/checkout/build.xml:585: Some of the tests produced a heap dump, but did not fail. Maybe a suppressed OutOfMemoryError? Dumps created:
* java_pid21009.hprof

Total time: 305 minutes 19 seconds
Build step 'Invoke Ant' marked build as failure
Archiving artifacts
Recording test results
Email was triggered for: Failure - Any
Sending email for trigger: Failure - Any


---------------------------------------------------------------------
To unsubscribe, e-mail: [hidden email]
For additional commands, e-mail: [hidden email]