[JENKINS] Lucene-Solr-SmokeRelease-7.2 - Build # 10 - Failure

classic Classic list List threaded Threaded
2 messages Options
Reply | Threaded
Open this post in threaded view
|

[JENKINS] Lucene-Solr-SmokeRelease-7.2 - Build # 10 - Failure

Apache Jenkins Server-2
Build: https://builds.apache.org/job/Lucene-Solr-SmokeRelease-7.2/10/

No tests ran.

Build Log:
[...truncated 9 lines...]
ERROR: Error cloning remote repo 'origin'
hudson.plugins.git.GitException: Command "git fetch --tags --progress git://git.apache.org/lucene-solr.git +refs/heads/*:refs/remotes/origin/*" returned status code 128:
stdout:
stderr: remote: Counting objects: 68803          
remote: Counting objects: 181630          
remote: Counting objects: 310253          
remote: Counting objects: 417997          
remote: Counting objects: 519240          
remote: Counting objects: 622146          
remote: Counting objects: 764206          
remote: Counting objects: 904518          
remote: Counting objects: 938165, done.        
remote: Compressing objects:   0% (1/185505)          
remote: Compressing objects:   1% (1856/185505)          
remote: Compressing objects:   2% (3711/185505)          
remote: Compressing objects:   3% (5566/185505)          
remote: Compressing objects:   4% (7421/185505)          
remote: Compressing objects:   5% (9276/185505)          
remote: Compressing objects:   6% (11131/185505)          
remote: Compressing objects:   7% (12986/185505)          
remote: Compressing objects:   8% (14841/185505)          
remote: Compressing objects:   9% (16696/185505)          
remote: Compressing objects:  10% (18551/185505)          
remote: Compressing objects:  11% (20406/185505)          
remote: Compressing objects:  12% (22261/185505)          
remote: Compressing objects:  13% (24116/185505)          
remote: Compressing objects:  14% (25971/185505)          
remote: Compressing objects:  15% (27826/185505)          
remote: Compressing objects:  16% (29681/185505)          
remote: Compressing objects:  17% (31536/185505)          
remote: Compressing objects:  18% (33391/185505)          
remote: Compressing objects:  19% (35246/185505)          
remote: Compressing objects:  20% (37101/185505)          
remote: Compressing objects:  21% (38957/185505)          
remote: Compressing objects:  22% (40812/185505)          
remote: Compressing objects:  23% (42667/185505)          
remote: Compressing objects:  24% (44522/185505)          
remote: Compressing objects:  25% (46377/185505)          
remote: Compressing objects:  26% (48232/185505)          
remote: Compressing objects:  27% (50087/185505)          
remote: Compressing objects:  28% (51942/185505)          
remote: Compressing objects:  29% (53797/185505)          
remote: Compressing objects:  30% (55652/185505)          
remote: Compressing objects:  31% (57507/185505)          
remote: Compressing objects:  32% (59362/185505)          
remote: Compressing objects:  33% (61217/185505)          
remote: Compressing objects:  34% (63072/185505)          
remote: Compressing objects:  35% (64927/185505)          
remote: Compressing objects:  36% (66782/185505)          
remote: Compressing objects:  37% (68637/185505)          
remote: Compressing objects:  38% (70492/185505)          
remote: Compressing objects:  39% (72347/185505)          
remote: Compressing objects:  40% (74202/185505)          
remote: Compressing objects:  41% (76058/185505)          
remote: Compressing objects:  42% (77913/185505)          
remote: Compressing objects:  43% (79768/185505)          
remote: Compressing objects:  44% (81623/185505)          
remote: Compressing objects:  45% (83478/185505)          
remote: Compressing objects:  46% (85333/185505)          
remote: Compressing objects:  47% (87188/185505)          
remote: Compressing objects:  48% (89043/185505)          
remote: Compressing objects:  49% (90898/185505)          
remote: Compressing objects:  50% (92753/185505)          
remote: Compressing objects:  51% (94608/185505)          
remote: Compressing objects:  52% (96463/185505)          
remote: Compressing objects:  53% (98318/185505)          
remote: Compressing objects:  54% (100173/185505)          
remote: Compressing objects:  55% (102028/185505)          
remote: Compressing objects:  56% (103883/185505)          
remote: Compressing objects:  57% (105738/185505)          
remote: Compressing objects:  58% (107593/185505)          
remote: Compressing objects:  59% (109448/185505)          
remote: Compressing objects:  60% (111303/185505)          
remote: Compressing objects:  61% (113159/185505)          
remote: Compressing objects:  62% (115014/185505)          
remote: Compressing objects:  63% (116869/185505)          
remote: Compressing objects:  64% (118724/185505)          
remote: Compressing objects:  65% (120579/185505)          
remote: Compressing objects:  66% (122434/185505)          
remote: Compressing objects:  67% (124289/185505)          
remote: Compressing objects:  68% (126144/185505)          
remote: Compressing objects:  69% (127999/185505)          
remote: Compressing objects:  70% (129854/185505)          
remote: Compressing objects:  71% (131709/185505)          
remote: Compressing objects:  72% (133564/185505)          
remote: Compressing objects:  73% (135419/185505)          
remote: Compressing objects:  74% (137274/185505)          
remote: Compressing objects:  75% (139129/185505)          
remote: Compressing objects:  76% (140984/185505)          
remote: Compressing objects:  77% (142839/185505)          
remote: Compressing objects:  78% (144694/185505)          
remote: Compressing objects:  79% (146549/185505)          
remote: Compressing objects:  80% (148404/185505)          
remote: Compressing objects:  81% (150260/185505)          
remote: Compressing objects:  82% (152115/185505)          
remote: Compressing objects:  83% (153970/185505)          
remote: Compressing objects:  84% (155825/185505)          
remote: Compressing objects:  85% (157680/185505)          
remote: Compressing objects:  86% (159535/185505)          
remote: Compressing objects:  87% (161390/185505)          
remote: Compressing objects:  88% (163245/185505)          
remote: Compressing objects:  89% (165100/185505)          
remote: Compressing objects:  90% (166955/185505)          
remote: Compressing objects:  91% (168810/185505)          
remote: Compressing objects:  92% (170665/185505)          
remote: Compressing objects:  92% (172000/185505)          
remote: Compressing objects:  93% (172520/185505)          
remote: Compressing objects:  94% (174375/185505)          
remote: Compressing objects:  95% (176230/185505)          
remote: Compressing objects:  96% (178085/185505)          
remote: Compressing objects:  97% (179940/185505)          
remote: Compressing objects:  97% (180519/185505)          
remote: Compressing objects:  98% (181795/185505)          
remote: Compressing objects:  99% (183650/185505)          
remote: Compressing objects: 100% (185505/185505)          
remote: Compressing objects: 100% (185505/185505), done.        
Receiving objects:   0% (1/938165)  
Receiving objects:   1% (9382/938165), 1.33 MiB | 2.63 MiB/s  
Receiving objects:   1% (14999/938165), 1.33 MiB | 2.63 MiB/s  
Receiving objects:   2% (18764/938165), 3.11 MiB | 3.10 MiB/s  
Receiving objects:   3% (28145/938165), 3.11 MiB | 3.10 MiB/s  
Receiving objects:   4% (37527/938165), 8.24 MiB | 5.47 MiB/s  
Receiving objects:   5% (46909/938165), 8.24 MiB | 5.47 MiB/s  
Receiving objects:   6% (56290/938165), 8.24 MiB | 5.47 MiB/s  
Receiving objects:   6% (60131/938165), 13.16 MiB | 6.10 MiB/s  
Receiving objects:   7% (65672/938165), 13.16 MiB | 6.10 MiB/s  
Receiving objects:   8% (75054/938165), 13.16 MiB | 6.10 MiB/s  
Receiving objects:   9% (84435/938165), 13.16 MiB | 6.10 MiB/s  
Receiving objects:  10% (93817/938165), 13.16 MiB | 6.10 MiB/s  
Receiving objects:  11% (103199/938165), 15.93 MiB | 5.99 MiB/s  
Receiving objects:  12% (112580/938165), 15.93 MiB | 5.99 MiB/s  
Receiving objects:  13% (121962/938165), 15.93 MiB | 5.99 MiB/s  
Receiving objects:  14% (131344/938165), 15.93 MiB | 5.99 MiB/s  
Receiving objects:  14% (131508/938165), 15.93 MiB | 5.99 MiB/s  
Receiving objects:  15% (140725/938165), 15.93 MiB | 5.99 MiB/s  
Receiving objects:  16% (150107/938165), 19.08 MiB | 6.04 MiB/s  
Receiving objects:  17% (159489/938165), 19.08 MiB | 6.04 MiB/s  
Receiving objects:  18% (168870/938165), 19.08 MiB | 6.04 MiB/s  
Receiving objects:  19% (178252/938165), 19.08 MiB | 6.04 MiB/s  
Receiving objects:  20% (187633/938165), 19.08 MiB | 6.04 MiB/s  
Receiving objects:  21% (197015/938165), 21.85 MiB | 5.97 MiB/s  
Receiving objects:  22% (206397/938165), 21.85 MiB | 5.97 MiB/s  
Receiving objects:  23% (215778/938165), 21.85 MiB | 5.97 MiB/s  
Receiving objects:  23% (218252/938165), 21.85 MiB | 5.97 MiB/s  
Receiving objects:  24% (225160/938165), 21.85 MiB | 5.97 MiB/s  
Receiving objects:  25% (234542/938165), 24.18 MiB | 5.81 MiB/s  
Receiving objects:  26% (243923/938165), 24.18 MiB | 5.81 MiB/s  
Receiving objects:  27% (253305/938165), 24.18 MiB | 5.81 MiB/s  
Receiving objects:  28% (262687/938165), 24.18 MiB | 5.81 MiB/s  
Receiving objects:  29% (272068/938165), 24.18 MiB | 5.81 MiB/s  
Receiving objects:  30% (281450/938165), 26.84 MiB | 5.75 MiB/s  
Receiving objects:  31% (290832/938165), 26.84 MiB | 5.75 MiB/s  
Receiving objects:  32% (300213/938165), 26.84 MiB | 5.75 MiB/s  
Receiving objects:  32% (301314/938165), 26.84 MiB | 5.75 MiB/s  
Receiving objects:  33% (309595/938165), 29.12 MiB | 5.96 MiB/s  
Receiving objects:  34% (318977/938165), 29.12 MiB | 5.96 MiB/s  
Receiving objects:  35% (328358/938165), 29.12 MiB | 5.96 MiB/s  
Receiving objects:  36% (337740/938165), 29.12 MiB | 5.96 MiB/s  
Receiving objects:  37% (347122/938165), 29.12 MiB | 5.96 MiB/s  
Receiving objects:  38% (356503/938165), 29.12 MiB | 5.96 MiB/s  
Receiving objects:  39% (365885/938165), 32.61 MiB | 6.33 MiB/s  
Receiving objects:  40% (375266/938165), 32.61 MiB | 6.33 MiB/s  
Receiving objects:  41% (384648/938165), 32.61 MiB | 6.33 MiB/s  
Receiving objects:  41% (389974/938165), 32.61 MiB | 6.33 MiB/s  
Receiving objects:  42% (394030/938165), 37.02 MiB | 6.06 MiB/s  
Receiving objects:  42% (395223/938165), 40.23 MiB | 5.87 MiB/s  
Receiving objects:  42% (396830/938165), 45.65 MiB | 5.76 MiB/s  
Receiving objects:  42% (399295/938165), 50.93 MiB | 5.78 MiB/s  
Receiving objects:  43% (403411/938165), 53.40 MiB | 5.66 MiB/s  
Receiving objects:  43% (407615/938165), 56.32 MiB | 5.68 MiB/s  
Receiving objects:  44% (412793/938165), 56.32 MiB | 5.68 MiB/s  
Receiving objects:  45% (422175/938165), 59.34 MiB | 5.55 MiB/s  
Receiving objects:  45% (429647/938165), 62.14 MiB | 5.27 MiB/s  
Receiving objects:  46% (431556/938165), 62.14 MiB | 5.27 MiB/s  
Receiving objects:  47% (440938/938165), 62.14 MiB | 5.27 MiB/s  
Receiving objects:  48% (450320/938165), 64.83 MiB | 5.16 MiB/s  
Receiving objects:  48% (454234/938165), 66.93 MiB | 5.01 MiB/s  
Receiving objects:  49% (459701/938165), 66.93 MiB | 5.01 MiB/s  
Receiving objects:  49% (464841/938165), 70.95 MiB | 4.76 MiB/s  
Receiving objects:  50% (469083/938165), 70.95 MiB | 4.76 MiB/s  
Receiving objects:  50% (473354/938165), 76.07 MiB | 4.76 MiB/s  
Receiving objects:  50% (477481/938165), 78.77 MiB | 4.80 MiB/s  
Receiving objects:  51% (478465/938165), 78.77 MiB | 4.80 MiB/s  
Receiving objects:  52% (487846/938165), 81.38 MiB | 4.55 MiB/s  
Receiving objects:  52% (496896/938165), 84.93 MiB | 4.75 MiB/s  
Receiving objects:  53% (497228/938165), 84.93 MiB | 4.75 MiB/s  
Receiving objects:  54% (506610/938165), 87.46 MiB | 4.71 MiB/s  
Receiving objects:  54% (515954/938165), 89.61 MiB | 4.74 MiB/s  
Receiving objects:  55% (515991/938165), 89.61 MiB | 4.74 MiB/s  
fatal: The remote end hung up unexpectedly
fatal: early EOF
fatal: index-pack failed

        at org.jenkinsci.plugins.gitclient.CliGitAPIImpl.launchCommandIn(CliGitAPIImpl.java:1970)
        at org.jenkinsci.plugins.gitclient.CliGitAPIImpl.launchCommandWithCredentials(CliGitAPIImpl.java:1689)
        at org.jenkinsci.plugins.gitclient.CliGitAPIImpl.access$300(CliGitAPIImpl.java:71)
        at org.jenkinsci.plugins.gitclient.CliGitAPIImpl$1.execute(CliGitAPIImpl.java:380)
        at org.jenkinsci.plugins.gitclient.CliGitAPIImpl$2.execute(CliGitAPIImpl.java:589)
        at org.jenkinsci.plugins.gitclient.RemoteGitImpl$CommandInvocationHandler$1.call(RemoteGitImpl.java:153)
        at org.jenkinsci.plugins.gitclient.RemoteGitImpl$CommandInvocationHandler$1.call(RemoteGitImpl.java:146)
        at hudson.remoting.UserRequest.perform(UserRequest.java:207)
        at hudson.remoting.UserRequest.perform(UserRequest.java:53)
        at hudson.remoting.Request$2.run(Request.java:358)
        at hudson.remoting.InterceptingExecutorService$1.call(InterceptingExecutorService.java:72)
        at java.util.concurrent.FutureTask.run(FutureTask.java:266)
        at java.util.concurrent.ThreadPoolExecutor.runWorker(ThreadPoolExecutor.java:1142)
        at java.util.concurrent.ThreadPoolExecutor$Worker.run(ThreadPoolExecutor.java:617)
        at java.lang.Thread.run(Thread.java:748)
        Suppressed: hudson.remoting.Channel$CallSiteStackTrace: Remote call to lucene
                at hudson.remoting.Channel.attachCallSiteStackTrace(Channel.java:1693)
                at hudson.remoting.UserResponse.retrieve(UserRequest.java:310)
                at hudson.remoting.Channel.call(Channel.java:908)
                at org.jenkinsci.plugins.gitclient.RemoteGitImpl$CommandInvocationHandler.execute(RemoteGitImpl.java:146)
                at sun.reflect.GeneratedMethodAccessor2096.invoke(Unknown Source)
                at sun.reflect.DelegatingMethodAccessorImpl.invoke(DelegatingMethodAccessorImpl.java:43)
                at java.lang.reflect.Method.invoke(Method.java:498)
                at org.jenkinsci.plugins.gitclient.RemoteGitImpl$CommandInvocationHandler.invoke(RemoteGitImpl.java:132)
                at com.sun.proxy.$Proxy160.execute(Unknown Source)
                at hudson.plugins.git.GitSCM.retrieveChanges(GitSCM.java:1083)
                at hudson.plugins.git.GitSCM.checkout(GitSCM.java:1123)
                at hudson.scm.SCM.checkout(SCM.java:495)
                at hudson.model.AbstractProject.checkout(AbstractProject.java:1202)
                at hudson.model.AbstractBuild$AbstractBuildExecution.defaultCheckout(AbstractBuild.java:574)
                at jenkins.scm.SCMCheckoutStrategy.checkout(SCMCheckoutStrategy.java:86)
                at hudson.model.AbstractBuild$AbstractBuildExecution.run(AbstractBuild.java:499)
                at hudson.model.Run.execute(Run.java:1724)
                at hudson.model.FreeStyleBuild.run(FreeStyleBuild.java:43)
                at hudson.model.ResourceController.execute(ResourceController.java:97)
                at hudson.model.Executor.run(Executor.java:421)
ERROR: Error cloning remote repo 'origin'
Retrying after 10 seconds
 > git rev-parse --is-inside-work-tree # timeout=10
Fetching changes from the remote Git repository
 > git config remote.origin.url git://git.apache.org/lucene-solr.git # timeout=10
Cleaning workspace
 > git rev-parse --verify HEAD # timeout=10
No valid HEAD. Skipping the resetting
 > git clean -fdx # timeout=10
Fetching upstream changes from git://git.apache.org/lucene-solr.git
 > git --version # timeout=10
 > git fetch --tags --progress git://git.apache.org/lucene-solr.git +refs/heads/*:refs/remotes/origin/*
 > git rev-parse refs/remotes/origin/branch_7_2^{commit} # timeout=10
 > git rev-parse refs/remotes/origin/origin/branch_7_2^{commit} # timeout=10
Checking out Revision 72afa6e7514a913e565b04a2586692e5a7e746e8 (refs/remotes/origin/branch_7_2)
 > git config core.sparsecheckout # timeout=10
 > git checkout -f 72afa6e7514a913e565b04a2586692e5a7e746e8
Commit message: "SOLR-11847: Resume publishing maven snapshot artifacts as part of Ant target jenkins-maven-nightly"
 > git rev-list b2b6438b37073bee1fca40374e85bf91aa457c0b # timeout=10
No emails were triggered.
[Lucene-Solr-SmokeRelease-7.2] $ /home/jenkins/tools/ant/apache-ant-1.8.4/bin/ant nightly-smoke
Buildfile: /x1/jenkins/jenkins-slave/workspace/Lucene-Solr-SmokeRelease-7.2/build.xml

clean:

clean:

clean:

ivy-availability-check:
[loadresource] Do not set property disallowed.ivy.jars.list as its length is 0.

-ivy-fail-disallowed-ivy-version:

ivy-fail:

ivy-configure:
[ivy:configure] :: Apache Ivy 2.4.0 - 20141213170938 :: http://ant.apache.org/ivy/ ::
[ivy:configure] :: loading settings :: file = /x1/jenkins/jenkins-slave/workspace/Lucene-Solr-SmokeRelease-7.2/lucene/top-level-ivy-settings.xml

resolve-groovy:
[ivy:cachepath] :: resolving dependencies :: org.codehaus.groovy#groovy-all-caller;working
[ivy:cachepath] confs: [default]
[ivy:cachepath] found org.codehaus.groovy#groovy-all;2.4.12 in public
[ivy:cachepath] :: resolution report :: resolve 1076ms :: artifacts dl 27ms
        ---------------------------------------------------------------------
        |                  |            modules            ||   artifacts   |
        |       conf       | number| search|dwnlded|evicted|| number|dwnlded|
        ---------------------------------------------------------------------
        |      default     |   1   |   0   |   0   |   0   ||   1   |   0   |
        ---------------------------------------------------------------------

resolve-markdown:
[ivy:cachepath] :: resolving dependencies :: #;working@lucene1-us-west
[ivy:cachepath] confs: [default]
[ivy:cachepath] found com.vladsch.flexmark#flexmark;0.16.1 in public
[ivy:cachepath] found com.vladsch.flexmark#flexmark-util;0.16.1 in public
[ivy:cachepath] found com.vladsch.flexmark#flexmark-ext-autolink;0.16.1 in public
[ivy:cachepath] found org.nibor.autolink#autolink;0.6.0 in public
[ivy:cachepath] found com.vladsch.flexmark#flexmark-formatter;0.16.1 in public
[ivy:cachepath] found com.vladsch.flexmark#flexmark-ext-abbreviation;0.16.1 in public
[ivy:cachepath] :: resolution report :: resolve 1349ms :: artifacts dl 73ms
        ---------------------------------------------------------------------
        |                  |            modules            ||   artifacts   |
        |       conf       | number| search|dwnlded|evicted|| number|dwnlded|
        ---------------------------------------------------------------------
        |      default     |   6   |   0   |   0   |   0   ||   6   |   0   |
        ---------------------------------------------------------------------

install-maven-tasks:
[ivy:cachepath] :: resolving dependencies :: org.apache.maven#maven-ant-tasks-caller;working
[ivy:cachepath] confs: [master]
[ivy:cachepath] found org.apache.maven#maven-ant-tasks;2.1.3 in public
[ivy:cachepath] :: resolution report :: resolve 108ms :: artifacts dl 16ms
        ---------------------------------------------------------------------
        |                  |            modules            ||   artifacts   |
        |       conf       | number| search|dwnlded|evicted|| number|dwnlded|
        ---------------------------------------------------------------------
        |      master      |   1   |   0   |   0   |   0   ||   1   |   0   |
        ---------------------------------------------------------------------

nightly-smoke:
 [python32] Python 3.4.3

clean:
   [delete] Deleting directory /x1/jenkins/jenkins-slave/workspace/Lucene-Solr-SmokeRelease-7.2/lucene/build

check-lucene-core-uptodate:

compile-lucene-core:

-check-git-state:

-git-cleanroot:

-copy-git-state:
    [mkdir] Created dir: /x1/jenkins/jenkins-slave/workspace/Lucene-Solr-SmokeRelease-7.2/lucene/build
     [copy] Copying 1 file to /x1/jenkins/jenkins-slave/workspace/Lucene-Solr-SmokeRelease-7.2/lucene/build

git-autoclean:

ivy-availability-check:
[loadresource] Do not set property disallowed.ivy.jars.list as its length is 0.

-ivy-fail-disallowed-ivy-version:

ivy-fail:

ivy-configure:
[ivy:configure] :: loading settings :: file = /x1/jenkins/jenkins-slave/workspace/Lucene-Solr-SmokeRelease-7.2/lucene/top-level-ivy-settings.xml

resolve:

init:

-clover.disable:

-clover.load:

-clover.classpath:

-clover.setup:

clover:

compile-core:
    [mkdir] Created dir: /x1/jenkins/jenkins-slave/workspace/Lucene-Solr-SmokeRelease-7.2/lucene/build/core/classes/java
    [javac] Compiling 825 source files to /x1/jenkins/jenkins-slave/workspace/Lucene-Solr-SmokeRelease-7.2/lucene/build/core/classes/java
    [javac] Note: Some input files use or override a deprecated API.
    [javac] Note: Recompile with -Xlint:deprecation for details.
    [javac] Creating empty /x1/jenkins/jenkins-slave/workspace/Lucene-Solr-SmokeRelease-7.2/lucene/build/core/classes/java/org/apache/lucene/util/graph/package-info.class
    [javac] Creating empty /x1/jenkins/jenkins-slave/workspace/Lucene-Solr-SmokeRelease-7.2/lucene/build/core/classes/java/org/apache/lucene/document/package-info.class
    [javac] Creating empty /x1/jenkins/jenkins-slave/workspace/Lucene-Solr-SmokeRelease-7.2/lucene/build/core/classes/java/org/apache/lucene/package-info.class
    [javac] Creating empty /x1/jenkins/jenkins-slave/workspace/Lucene-Solr-SmokeRelease-7.2/lucene/build/core/classes/java/org/apache/lucene/util/bkd/package-info.class
    [javac] Creating empty /x1/jenkins/jenkins-slave/workspace/Lucene-Solr-SmokeRelease-7.2/lucene/build/core/classes/java/org/apache/lucene/codecs/compressing/package-info.class
    [javac] Creating empty /x1/jenkins/jenkins-slave/workspace/Lucene-Solr-SmokeRelease-7.2/lucene/build/core/classes/java/org/apache/lucene/codecs/lucene60/package-info.class
    [javac] Creating empty /x1/jenkins/jenkins-slave/workspace/Lucene-Solr-SmokeRelease-7.2/lucene/build/core/classes/java/org/apache/lucene/codecs/package-info.class
    [javac] Creating empty /x1/jenkins/jenkins-slave/workspace/Lucene-Solr-SmokeRelease-7.2/lucene/build/core/classes/java/org/apache/lucene/util/package-info.class
    [javac] Creating empty /x1/jenkins/jenkins-slave/workspace/Lucene-Solr-SmokeRelease-7.2/lucene/build/core/classes/java/org/apache/lucene/index/package-info.class
    [javac] Creating empty /x1/jenkins/jenkins-slave/workspace/Lucene-Solr-SmokeRelease-7.2/lucene/build/core/classes/java/org/apache/lucene/util/fst/package-info.class
    [javac] Creating empty /x1/jenkins/jenkins-slave/workspace/Lucene-Solr-SmokeRelease-7.2/lucene/build/core/classes/java/org/apache/lucene/analysis/tokenattributes/package-info.class
    [javac] Creating empty /x1/jenkins/jenkins-slave/workspace/Lucene-Solr-SmokeRelease-7.2/lucene/build/core/classes/java/org/apache/lucene/search/package-info.class
    [javac] Creating empty /x1/jenkins/jenkins-slave/workspace/Lucene-Solr-SmokeRelease-7.2/lucene/build/core/classes/java/org/apache/lucene/codecs/lucene62/package-info.class
    [javac] Creating empty /x1/jenkins/jenkins-slave/workspace/Lucene-Solr-SmokeRelease-7.2/lucene/build/core/classes/java/org/apache/lucene/util/packed/package-info.class
    [javac] Creating empty /x1/jenkins/jenkins-slave/workspace/Lucene-Solr-SmokeRelease-7.2/lucene/build/core/classes/java/org/apache/lucene/util/mutable/package-info.class
    [javac] Creating empty /x1/jenkins/jenkins-slave/workspace/Lucene-Solr-SmokeRelease-7.2/lucene/build/core/classes/java/org/apache/lucene/codecs/lucene70/package-info.class
    [javac] Creating empty /x1/jenkins/jenkins-slave/workspace/Lucene-Solr-SmokeRelease-7.2/lucene/build/core/classes/java/org/apache/lucene/codecs/perfield/package-info.class
    [javac] Creating empty /x1/jenkins/jenkins-slave/workspace/Lucene-Solr-SmokeRelease-7.2/lucene/build/core/classes/java/org/apache/lucene/analysis/package-info.class
    [javac] Creating empty /x1/jenkins/jenkins-slave/workspace/Lucene-Solr-SmokeRelease-7.2/lucene/build/core/classes/java/org/apache/lucene/analysis/standard/package-info.class
    [javac] Creating empty /x1/jenkins/jenkins-slave/workspace/Lucene-Solr-SmokeRelease-7.2/lucene/build/core/classes/java/org/apache/lucene/store/package-info.class
    [javac] Creating empty /x1/jenkins/jenkins-slave/workspace/Lucene-Solr-SmokeRelease-7.2/lucene/build/core/classes/java/org/apache/lucene/codecs/blocktree/package-info.class
    [javac] Creating empty /x1/jenkins/jenkins-slave/workspace/Lucene-Solr-SmokeRelease-7.2/lucene/build/core/classes/java/org/apache/lucene/search/spans/package-info.class
    [javac] Creating empty /x1/jenkins/jenkins-slave/workspace/Lucene-Solr-SmokeRelease-7.2/lucene/build/core/classes/java/org/apache/lucene/search/similarities/package-info.class
    [javac] Creating empty /x1/jenkins/jenkins-slave/workspace/Lucene-Solr-SmokeRelease-7.2/lucene/build/core/classes/java/org/apache/lucene/util/automaton/package-info.class
    [javac] Creating empty /x1/jenkins/jenkins-slave/workspace/Lucene-Solr-SmokeRelease-7.2/lucene/build/core/classes/java/org/apache/lucene/codecs/lucene50/package-info.class
    [javac] Creating empty /x1/jenkins/jenkins-slave/workspace/Lucene-Solr-SmokeRelease-7.2/lucene/build/core/classes/java/org/apache/lucene/geo/package-info.class
     [copy] Copying 3 files to /x1/jenkins/jenkins-slave/workspace/Lucene-Solr-SmokeRelease-7.2/lucene/build/core/classes/java

jar-core:

-check-git-state:

-git-cleanroot:

-copy-git-state:

git-autoclean:

ivy-availability-check:
[loadresource] Do not set property disallowed.ivy.jars.list as its length is 0.

-ivy-fail-disallowed-ivy-version:

ivy-fail:

ivy-configure:
[ivy:configure] :: loading settings :: file = /x1/jenkins/jenkins-slave/workspace/Lucene-Solr-SmokeRelease-7.2/lucene/top-level-ivy-settings.xml

resolve:

init:

-clover.disable:

-clover.load:

-clover.classpath:

-clover.setup:

clover:

compile-core:

jar-core:
      [jar] Building jar: /x1/jenkins/jenkins-slave/workspace/Lucene-Solr-SmokeRelease-7.2/lucene/build/core/lucene-core-7.2.1.jar

jar-test-framework:

-check-git-state:

-git-cleanroot:

-copy-git-state:

git-autoclean:

ivy-availability-check:
[loadresource] Do not set property disallowed.ivy.jars.list as its length is 0.

-ivy-fail-disallowed-ivy-version:

ivy-fail:

ivy-configure:
[ivy:configure] :: loading settings :: file = /x1/jenkins/jenkins-slave/workspace/Lucene-Solr-SmokeRelease-7.2/lucene/top-level-ivy-settings.xml

resolve:

init:

compile-lucene-core:

compile-codecs:

-check-git-state:

-git-cleanroot:

-copy-git-state:

git-autoclean:

ivy-availability-check:
[loadresource] Do not set property disallowed.ivy.jars.list as its length is 0.

-ivy-fail-disallowed-ivy-version:

ivy-fail:

ivy-configure:
[ivy:configure] :: loading settings :: file = /x1/jenkins/jenkins-slave/workspace/Lucene-Solr-SmokeRelease-7.2/lucene/top-level-ivy-settings.xml

resolve:

common.init:

compile-lucene-core:

init:

-clover.disable:

-clover.load:

-clover.classpath:

-clover.setup:

clover:

compile-core:
    [mkdir] Created dir: /x1/jenkins/jenkins-slave/workspace/Lucene-Solr-SmokeRelease-7.2/lucene/build/codecs/classes/java
    [javac] Compiling 67 source files to /x1/jenkins/jenkins-slave/workspace/Lucene-Solr-SmokeRelease-7.2/lucene/build/codecs/classes/java
    [javac] Note: Some input files use or override a deprecated API.
    [javac] Note: Recompile with -Xlint:deprecation for details.
    [javac] Creating empty /x1/jenkins/jenkins-slave/workspace/Lucene-Solr-SmokeRelease-7.2/lucene/build/codecs/classes/java/org/apache/lucene/codecs/bloom/package-info.class
    [javac] Creating empty /x1/jenkins/jenkins-slave/workspace/Lucene-Solr-SmokeRelease-7.2/lucene/build/codecs/classes/java/org/apache/lucene/codecs/memory/package-info.class
    [javac] Creating empty /x1/jenkins/jenkins-slave/workspace/Lucene-Solr-SmokeRelease-7.2/lucene/build/codecs/classes/java/org/apache/lucene/codecs/simpletext/package-info.class
    [javac] Creating empty /x1/jenkins/jenkins-slave/workspace/Lucene-Solr-SmokeRelease-7.2/lucene/build/codecs/classes/java/org/apache/lucene/codecs/blockterms/package-info.class
    [javac] Creating empty /x1/jenkins/jenkins-slave/workspace/Lucene-Solr-SmokeRelease-7.2/lucene/build/codecs/classes/java/org/apache/lucene/codecs/blocktreeords/package-info.class
     [copy] Copying 3 files to /x1/jenkins/jenkins-slave/workspace/Lucene-Solr-SmokeRelease-7.2/lucene/build/codecs/classes/java

-clover.disable:

-clover.load:

-clover.classpath:

-clover.setup:

clover:

common.compile-core:
    [mkdir] Created dir: /x1/jenkins/jenkins-slave/workspace/Lucene-Solr-SmokeRelease-7.2/lucene/build/test-framework/classes/java
    [javac] Compiling 188 source files to /x1/jenkins/jenkins-slave/workspace/Lucene-Solr-SmokeRelease-7.2/lucene/build/test-framework/classes/java
    [javac] Note: Some input files use or override a deprecated API.
    [javac] Note: Recompile with -Xlint:deprecation for details.
    [javac] Creating empty /x1/jenkins/jenkins-slave/workspace/Lucene-Solr-SmokeRelease-7.2/lucene/build/test-framework/classes/java/org/apache/lucene/codecs/asserting/package-info.class
    [javac] Creating empty /x1/jenkins/jenkins-slave/workspace/Lucene-Solr-SmokeRelease-7.2/lucene/build/test-framework/classes/java/org/apache/lucene/codecs/ramonly/package-info.class
    [javac] Creating empty /x1/jenkins/jenkins-slave/workspace/Lucene-Solr-SmokeRelease-7.2/lucene/build/test-framework/classes/java/org/apache/lucene/mockfile/package-info.class
    [javac] Creating empty /x1/jenkins/jenkins-slave/workspace/Lucene-Solr-SmokeRelease-7.2/lucene/build/test-framework/classes/java/org/apache/lucene/codecs/cheapbastard/package-info.class
    [javac] Creating empty /x1/jenkins/jenkins-slave/workspace/Lucene-Solr-SmokeRelease-7.2/lucene/build/test-framework/classes/java/org/apache/lucene/codecs/mockrandom/package-info.class
    [javac] Creating empty /x1/jenkins/jenkins-slave/workspace/Lucene-Solr-SmokeRelease-7.2/lucene/build/test-framework/classes/java/org/apache/lucene/codecs/cranky/package-info.class
    [javac] Creating empty /x1/jenkins/jenkins-slave/workspace/Lucene-Solr-SmokeRelease-7.2/lucene/build/test-framework/classes/java/org/apache/lucene/codecs/compressing/dummy/package-info.class
     [copy] Copying 4 files to /x1/jenkins/jenkins-slave/workspace/Lucene-Solr-SmokeRelease-7.2/lucene/build/test-framework/classes/java

compile-core:

jar-core:
      [jar] Building jar: /x1/jenkins/jenkins-slave/workspace/Lucene-Solr-SmokeRelease-7.2/lucene/build/test-framework/lucene-test-framework-7.2.1.jar

compile-test:

-check-git-state:

-git-cleanroot:

-copy-git-state:

git-autoclean:

ivy-availability-check:
[loadresource] Do not set property disallowed.ivy.jars.list as its length is 0.

-ivy-fail-disallowed-ivy-version:

ivy-fail:

ivy-configure:
[ivy:configure] :: loading settings :: file = /x1/jenkins/jenkins-slave/workspace/Lucene-Solr-SmokeRelease-7.2/lucene/top-level-ivy-settings.xml

resolve:

init:

-clover.disable:

-clover.load:

-clover.classpath:

-clover.setup:

clover:

compile-core:

compile-test-framework:

-check-git-state:

-git-cleanroot:

-copy-git-state:

git-autoclean:

ivy-availability-check:
[loadresource] Do not set property disallowed.ivy.jars.list as its length is 0.

-ivy-fail-disallowed-ivy-version:

ivy-fail:

ivy-configure:
[ivy:configure] :: loading settings :: file = /x1/jenkins/jenkins-slave/workspace/Lucene-Solr-SmokeRelease-7.2/lucene/top-level-ivy-settings.xml

resolve:

init:

compile-lucene-core:

compile-codecs:

-check-git-state:

-git-cleanroot:

-copy-git-state:

git-autoclean:

ivy-availability-check:
[loadresource] Do not set property disallowed.ivy.jars.list as its length is 0.

-ivy-fail-disallowed-ivy-version:

ivy-fail:

ivy-configure:
[ivy:configure] :: loading settings :: file = /x1/jenkins/jenkins-slave/workspace/Lucene-Solr-SmokeRelease-7.2/lucene/top-level-ivy-settings.xml

resolve:

common.init:

compile-lucene-core:

init:

-clover.disable:

-clover.load:

-clover.classpath:

-clover.setup:

clover:

compile-core:

-clover.disable:

-clover.load:

-clover.classpath:

-clover.setup:

clover:

common.compile-core:

compile-core:

compile-test:
    [mkdir] Created dir: /x1/jenkins/jenkins-slave/workspace/Lucene-Solr-SmokeRelease-7.2/lucene/build/core/classes/test
    [javac] Compiling 465 source files to /x1/jenkins/jenkins-slave/workspace/Lucene-Solr-SmokeRelease-7.2/lucene/build/core/classes/test
    [javac] Note: Some input files use or override a deprecated API.
    [javac] Note: Recompile with -Xlint:deprecation for details.
     [copy] Copying 3 files to /x1/jenkins/jenkins-slave/workspace/Lucene-Solr-SmokeRelease-7.2/lucene/build/core/classes/test

-check-git-state:

-git-cleanroot:

-copy-git-state:

git-autoclean:

ivy-availability-check:
[loadresource] Do not set property disallowed.ivy.jars.list as its length is 0.

-ivy-fail-disallowed-ivy-version:

ivy-fail:

ivy-configure:
[ivy:configure] :: loading settings :: file = /x1/jenkins/jenkins-slave/workspace/Lucene-Solr-SmokeRelease-7.2/lucene/top-level-ivy-settings.xml

resolve:

init:

compile-lucene-core:

compile-codecs:

-check-git-state:

-git-cleanroot:

-copy-git-state:

git-autoclean:

ivy-availability-check:
[loadresource] Do not set property disallowed.ivy.jars.list as its length is 0.

-ivy-fail-disallowed-ivy-version:

ivy-fail:

ivy-configure:
[ivy:configure] :: loading settings :: file = /x1/jenkins/jenkins-slave/workspace/Lucene-Solr-SmokeRelease-7.2/lucene/top-level-ivy-settings.xml

resolve:

common.init:

compile-lucene-core:

init:

-clover.disable:

-clover.load:

-clover.classpath:

-clover.setup:

clover:

compile-core:

-clover.disable:

-clover.load:

-clover.classpath:

-clover.setup:

clover:

common.compile-core:

compile-core:

compile-test-framework:

-check-git-state:

-git-cleanroot:

-copy-git-state:

git-autoclean:

ivy-availability-check:
[loadresource] Do not set property disallowed.ivy.jars.list as its length is 0.

-ivy-fail-disallowed-ivy-version:

ivy-fail:

ivy-configure:
[ivy:configure] :: loading settings :: file = /x1/jenkins/jenkins-slave/workspace/Lucene-Solr-SmokeRelease-7.2/lucene/top-level-ivy-settings.xml

resolve:

init:

compile-lucene-core:

compile-codecs:

-clover.disable:

-clover.load:

-clover.classpath:

-clover.setup:

clover:

common.compile-core:

compile-core:

compile-test:
    [mkdir] Created dir: /x1/jenkins/jenkins-slave/workspace/Lucene-Solr-SmokeRelease-7.2/lucene/build/test-framework/classes/test
    [javac] Compiling 45 source files to /x1/jenkins/jenkins-slave/workspace/Lucene-Solr-SmokeRelease-7.2/lucene/build/test-framework/classes/test

compile-test:

-check-git-state:

-git-cleanroot:

-copy-git-state:

git-autoclean:

ivy-availability-check:
[loadresource] Do not set property disallowed.ivy.jars.list as its length is 0.

-ivy-fail-disallowed-ivy-version:

ivy-fail:

ivy-configure:
[ivy:configure] :: loading settings :: file = /x1/jenkins/jenkins-slave/workspace/Lucene-Solr-SmokeRelease-7.2/lucene/top-level-ivy-settings.xml

resolve:

common.init:

compile-lucene-core:

init:

compile-test:

-check-git-state:

-git-cleanroot:

-copy-git-state:

git-autoclean:

ivy-availability-check:

ivy-configure:
[ivy:configure] :: loading settings :: file = /x1/jenkins/jenkins-slave/workspace/Lucene-Solr-SmokeRelease-7.2/lucene/top-level-ivy-settings.xml

resolve:

common.init:

compile-lucene-core:

init:

-clover.disable:

-clover.load:

-clover.classpath:

-clover.setup:

clover:

compile-core:
    [mkdir] Created dir: /x1/jenkins/jenkins-slave/workspace/Lucene-Solr-SmokeRelease-7.2/lucene/build/analysis/common/classes/java
    [javac] Compiling 465 source files to /x1/jenkins/jenkins-slave/workspace/Lucene-Solr-SmokeRelease-7.2/lucene/build/analysis/common/classes/java
    [javac] Note: Some input files use or override a deprecated API.
    [javac] Note: Recompile with -Xlint:deprecation for details.
    [javac] Creating empty /x1/jenkins/jenkins-slave/workspace/Lucene-Solr-SmokeRelease-7.2/lucene/build/analysis/common/classes/java/org/apache/lucene/analysis/hunspell/package-info.class
    [javac] Creating empty /x1/jenkins/jenkins-slave/workspace/Lucene-Solr-SmokeRelease-7.2/lucene/build/analysis/common/classes/java/org/apache/lucene/analysis/minhash/package-info.class
    [javac] Creating empty /x1/jenkins/jenkins-slave/workspace/Lucene-Solr-SmokeRelease-7.2/lucene/build/analysis/common/classes/java/org/apache/lucene/analysis/ga/package-info.class
    [javac] Creating empty /x1/jenkins/jenkins-slave/workspace/Lucene-Solr-SmokeRelease-7.2/lucene/build/analysis/common/classes/java/org/apache/lucene/analysis/ca/package-info.class
    [javac] Creating empty /x1/jenkins/jenkins-slave/workspace/Lucene-Solr-SmokeRelease-7.2/lucene/build/analysis/common/classes/java/org/apache/lucene/analysis/custom/package-info.class
    [javac] Creating empty /x1/jenkins/jenkins-slave/workspace/Lucene-Solr-SmokeRelease-7.2/lucene/build/analysis/common/classes/java/org/apache/lucene/analysis/sr/package-info.class
    [javac] Creating empty /x1/jenkins/jenkins-slave/workspace/Lucene-Solr-SmokeRelease-7.2/lucene/build/analysis/common/classes/java/org/apache/lucene/collation/package-info.class
    [javac] Creating empty /x1/jenkins/jenkins-slave/workspace/Lucene-Solr-SmokeRelease-7.2/lucene/build/analysis/common/classes/java/org/apache/lucene/analysis/sv/package-info.class
    [javac] Creating empty /x1/jenkins/jenkins-slave/workspace/Lucene-Solr-SmokeRelease-7.2/lucene/build/analysis/common/classes/java/org/apache/lucene/analysis/bg/package-info.class
    [javac] Creating empty /x1/jenkins/jenkins-slave/workspace/Lucene-Solr-SmokeRelease-7.2/lucene/build/analysis/common/classes/java/org/apache/lucene/analysis/payloads/package-info.class
    [javac] Creating empty /x1/jenkins/jenkins-slave/workspace/Lucene-Solr-SmokeRelease-7.2/lucene/build/analysis/common/classes/java/org/apache/lucene/analysis/ngram/package-info.class
    [javac] Creating empty /x1/jenkins/jenkins-slave/workspace/Lucene-Solr-SmokeRelease-7.2/lucene/build/analysis/common/classes/java/org/apache/lucene/analysis/core/package-info.class
    [javac] Creating empty /x1/jenkins/jenkins-slave/workspace/Lucene-Solr-SmokeRelease-7.2/lucene/build/analysis/common/classes/java/org/apache/lucene/analysis/bn/package-info.class
    [javac] Creating empty /x1/jenkins/jenkins-slave/workspace/Lucene-Solr-SmokeRelease-7.2/lucene/build/analysis/common/classes/java/org/apache/lucene/analysis/fr/package-info.class
    [javac] Creating empty /x1/jenkins/jenkins-slave/workspace/Lucene-Solr-SmokeRelease-7.2/lucene/build/analysis/common/classes/java/org/tartarus/snowball/ext/package-info.class
    [javac] Creating empty /x1/jenkins/jenkins-slave/workspace/Lucene-Solr-SmokeRelease-7.2/lucene/build/analysis/common/classes/java/org/apache/lucene/analysis/br/package-info.class
    [javac] Creating empty /x1/jenkins/jenkins-slave/workspace/Lucene-Solr-SmokeRelease-7.2/lucene/build/analysis/common/classes/java/org/apache/lucene/analysis/miscellaneous/package-info.class
    [javac] Creating empty /x1/jenkins/jenkins-slave/workspace/Lucene-Solr-SmokeRelease-7.2/lucene/build/analysis/common/classes/java/org/apache/lucene/analysis/sinks/package-info.class
    [javac] Creating empty /x1/jenkins/jenkins-slave/workspace/Lucene-Solr-SmokeRelease-7.2/lucene/build/analysis/common/classes/java/org/apache/lucene/analysis/cjk/package-info.class
    [javac] Creating empty /x1/jenkins/jenkins-slave/workspace/Lucene-Solr-SmokeRelease-7.2/lucene/build/analysis/common/classes/java/org/apache/lucene/analysis/synonym/package-info.class
    [javac] Creating empty /x1/jenkins/jenkins-slave/workspace/Lucene-Solr-SmokeRelease-7.2/lucene/build/analysis/common/classes/java/org/apache/lucene/analysis/wikipedia/package-info.class
    [javac] Creating empty /x1/jenkins/jenkins-slave/workspace/Lucene-Solr-SmokeRelease-7.2/lucene/build/analysis/common/classes/java/org/apache/lucene/analysis/fa/package-info.class
    [javac] Creating empty /x1/jenkins/jenkins-slave/workspace/Lucene-Solr-SmokeRelease-7.2/lucene/build/analysis/common/classes/java/org/apache/lucene/analysis/reverse/package-info.class
    [javac] Creating empty /x1/jenkins/jenkins-slave/workspace/Lucene-Solr-SmokeRelease-7.2/lucene/build/analysis/common/classes/java/org/apache/lucene/analysis/nl/package-info.class
    [javac] Creating empty /x1/jenkins/jenkins-slave/workspace/Lucene-Solr-SmokeRelease-7.2/lucene/build/analysis/common/classes/java/org/apache/lucene/analysis/ro/package-info.class
    [javac] Creating empty /x1/jenkins/jenkins-slave/workspace/Lucene-Solr-SmokeRelease-7.2/lucene/build/analysis/common/classes/java/org/apache/lucene/analysis/fi/package-info.class
    [javac] Creating empty /x1/jenkins/jenkins-slave/workspace/Lucene-Solr-SmokeRelease-7.2/lucene/build/analysis/common/classes/java/org/apache/lucene/analysis/ru/package-info.class
    [javac] Creating empty /x1/jenkins/jenkins-slave/workspace/Lucene-Solr-SmokeRelease-7.2/lucene/build/analysis/common/classes/java/org/apache/lucene/analysis/no/package-info.class
    [javac] Creating empty /x1/jenkins/jenkins-slave/workspace/Lucene-Solr-SmokeRelease-7.2/lucene/build/analysis/common/classes/java/org/apache/lucene/analysis/el/package-info.class
    [javac] Creating empty /x1/jenkins/jenkins-slave/workspace/Lucene-Solr-SmokeRelease-7.2/lucene/build/analysis/common/classes/java/org/apache/lucene/analysis/ckb/package-info.class
    [javac] Creating empty /x1/jenkins/jenkins-slave/workspace/Lucene-Solr-SmokeRelease-7.2/lucene/build/analysis/common/classes/java/org/tartarus/snowball/package-info.class
    [javac] Creating empty /x1/jenkins/jenkins-slave/workspace/Lucene-Solr-SmokeRelease-7.2/lucene/build/analysis/common/classes/java/org/apache/lucene/analysis/in/package-info.class
    [javac] Creating empty /x1/jenkins/jenkins-slave/workspace/Lucene-Solr-SmokeRelease-7.2/lucene/build/analysis/common/classes/java/org/apache/lucene/analysis/util/package-info.class
    [javac] Creating empty /x1/jenkins/jenkins-slave/workspace/Lucene-Solr-SmokeRelease-7.2/lucene/build/analysis/common/classes/java/org/apache/lucene/analysis/it/package-info.class
    [javac] Creating empty /x1/jenkins/jenkins-slave/workspace/Lucene-Solr-SmokeRelease-7.2/lucene/build/analysis/common/classes/java/org/apache/lucene/analysis/snowball/package-info.class
    [javac] Creating empty /x1/jenkins/jenkins-slave/workspace/Lucene-Solr-SmokeRelease-7.2/lucene/build/analysis/common/classes/java/org/apache/lucene/analysis/en/package-info.class
    [javac] Creating empty /x1/jenkins/jenkins-slave/workspace/Lucene-Solr-SmokeRelease-7.2/lucene/build/analysis/common/classes/java/org/apache/lucene/analysis/es/package-info.class
    [javac] Creating empty /x1/jenkins/jenkins-slave/workspace/Lucene-Solr-SmokeRelease-7.2/lucene/build/analysis/common/classes/java/org/apache/lucene/analysis/shingle/package-info.class
    [javac] Creating empty /x1/jenkins/jenkins-slave/workspace/Lucene-Solr-SmokeRelease-7.2/lucene/build/analysis/common/classes/java/org/apache/lucene/analysis/eu/package-info.class
    [javac] Creating empty /x1/jenkins/jenkins-slave/workspace/Lucene-Solr-SmokeRelease-7.2/lucene/build/analysis/common/classes/java/org/apache/lucene/analysis/ar/package-info.class
    [javac] Creating empty /x1/jenkins/jenkins-slave/workspace/Lucene-Solr-SmokeRelease-7.2/lucene/build/analysis/common/classes/java/org/apache/lucene/analysis/query/package-info.class
    [javac] Creating empty /x1/jenkins/jenkins-slave/workspace/Lucene-Solr-SmokeRelease-7.2/lucene/build/analysis/common/classes/java/org/apache/lucene/analysis/id/package-info.class
    [javac] Creating empty /x1/jenkins/jenkins-slave/workspace/Lucene-Solr-SmokeRelease-7.2/lucene/build/analysis/common/classes/java/org/apache/lucene/analysis/compound/hyphenation/package-info.class
    [javac] Creating empty /x1/jenkins/jenkins-slave/workspace/Lucene-Solr-SmokeRelease-7.2/lucene/build/analysis/common/classes/java/org/apache/lucene/analysis/charfilter/package-info.class
    [javac] Creating empty /x1/jenkins/jenkins-slave/workspace/Lucene-Solr-SmokeRelease-7.2/lucene/build/analysis/common/classes/java/org/apache/lucene/analysis/pt/package-info.class
    [javac] Creating empty /x1/jenkins/jenkins-slave/workspace/Lucene-Solr-SmokeRelease-7.2/lucene/build/analysis/common/classes/java/org/apache/lucene/analysis/lv/package-info.class
    [javac] Creating empty /x1/jenkins/jenkins-slave/workspace/Lucene-Solr-SmokeRelease-7.2/lucene/build/analysis/common/classes/java/org/apache/lucene/analysis/lt/package-info.class
    [javac] Creating empty /x1/jenkins/jenkins-slave/workspace/Lucene-Solr-SmokeRelease-7.2/lucene/build/analysis/common/classes/java/org/apache/lucene/analysis/hu/package-info.class
    [javac] Creating empty /x1/jenkins/jenkins-slave/workspace/Lucene-Solr-SmokeRelease-7.2/lucene/build/analysis/common/classes/java/org/apache/lucene/analysis/hy/package-info.class
    [javac] Creating empty /x1/jenkins/jenkins-slave/workspace/Lucene-Solr-SmokeRelease-7.2/lucene/build/analysis/common/classes/java/org/apache/lucene/analysis/pattern/package-info.class
    [javac] Creating empty /x1/jenkins/jenkins-slave/workspace/Lucene-Solr-SmokeRelease-7.2/lucene/build/analysis/common/classes/java/org/apache/lucene/analysis/cz/package-info.class
    [javac] Creating empty /x1/jenkins/jenkins-slave/workspace/Lucene-Solr-SmokeRelease-7.2/lucene/build/analysis/common/classes/java/org/apache/lucene/analysis/th/package-info.class
    [javac] Creating empty /x1/jenkins/jenkins-slave/workspace/Lucene-Solr-SmokeRelease-7.2/lucene/build/analysis/common/classes/java/org/apache/lucene/analysis/path/package-info.class
    [javac] Creating empty /x1/jenkins/jenkins-slave/workspace/Lucene-Solr-SmokeRelease-7.2/lucene/build/analysis/common/classes/java/org/apache/lucene/analysis/tr/package-info.class
    [javac] Creating empty /x1/jenkins/jenkins-slave/workspace/Lucene-Solr-SmokeRelease-7.2/lucene/build/analysis/common/classes/java/org/apache/lucene/analysis/da/package-info.class
    [javac] Creating empty /x1/jenkins/jenkins-slave/workspace/Lucene-Solr-SmokeRelease-7.2/lucene/build/analysis/common/classes/java/org/apache/lucene/analysis/de/package-info.class
    [javac] Creating empty /x1/jenkins/jenkins-slave/workspace/Lucene-Solr-SmokeRelease-7.2/lucene/build/analysis/common/classes/java/org/apache/lucene/analysis/hi/package-info.class
    [javac] Creating empty /x1/jenkins/jenkins-slave/workspace/Lucene-Solr-SmokeRelease-7.2/lucene/build/analysis/common/classes/java/org/apache/lucene/collation/tokenattributes/package-info.class
    [javac] Creating empty /x1/jenkins/jenkins-slave/workspace/Lucene-Solr-SmokeRelease-7.2/lucene/build/analysis/common/classes/java/org/apache/lucene/analysis/gl/package-info.class
    [javac] Creating empty /x1/jenkins/jenkins-slave/workspace/Lucene-Solr-SmokeRelease-7.2/lucene/build/analysis/common/classes/java/org/apache/lucene/analysis/commongrams/package-info.class
    [javac] Creating empty /x1/jenkins/jenkins-slave/workspace/Lucene-Solr-SmokeRelease-7.2/lucene/build/analysis/common/classes/java/org/apache/lucene/analysis/compound/package-info.class
     [copy] Copying 40 files to /x1/jenkins/jenkins-slave/workspace/Lucene-Solr-SmokeRelease-7.2/lucene/build/analysis/common/classes/java

compile-test-framework:

-check-git-state:

-git-cleanroot:

-copy-git-state:

git-autoclean:

ivy-availability-check:
[loadresource] Do not set property disallowed.ivy.jars.list as its length is 0.

-ivy-fail-disallowed-ivy-version:

ivy-fail:

ivy-configure:
[ivy:configure] :: loading settings :: file = /x1/jenkins/jenkins-slave/workspace/Lucene-Solr-SmokeRelease-7.2/lucene/top-level-ivy-settings.xml

resolve:

init:

compile-lucene-core:

compile-codecs:

-check-git-state:

-git-cleanroot:

-copy-git-state:

git-autoclean:

ivy-availability-check:
[loadresource] Do not set property disallowed.ivy.jars.list as its length is 0.

-ivy-fail-disallowed-ivy-version:

ivy-fail:

ivy-configure:
[ivy:configure] :: loading settings :: file = /x1/jenkins/jenkins-slave/workspace/Lucene-Solr-SmokeRelease-7.2/lucene/top-level-ivy-settings.xml

resolve:

common.init:

compile-lucene-core:

init:

-clover.disable:

-clover.load:

-clover.classpath:

-clover.setup:

clover:

compile-core:

-clover.disable:

-clover.load:

-clover.classpath:

-clover.setup:

clover:

common.compile-core:

compile-core:

common.compile-test:
    [mkdir] Created dir: /x1/jenkins/jenkins-slave/workspace/Lucene-Solr-SmokeRelease-7.2/lucene/build/analysis/common/classes/test
    [javac] Compiling 288 source files to /x1/jenkins/jenkins-slave/workspace/Lucene-Solr-SmokeRelease-7.2/lucene/build/analysis/common/classes/test
    [javac] Note: Some input files use or override a deprecated API.
    [javac] Note: Recompile with -Xlint:deprecation for details.
     [copy] Copying 114 files to /x1/jenkins/jenkins-slave/workspace/Lucene-Solr-SmokeRelease-7.2/lucene/build/analysis/common/classes/test

-check-git-state:

-git-cleanroot:

-copy-git-state:

git-autoclean:

ivy-availability-check:
[loadresource] Do not set property disallowed.ivy.jars.list as its length is 0.

-ivy-fail-disallowed-ivy-version:

ivy-fail:

ivy-configure:
[ivy:configure] :: loading settings :: file = /x1/jenkins/jenkins-slave/workspace/Lucene-Solr-SmokeRelease-7.2/lucene/top-level-ivy-settings.xml

resolve:

common.init:

compile-lucene-core:

init:

compile-test:

check-analyzers-common-uptodate:

jar-analyzers-common:

-check-git-state:

-git-cleanroot:

-copy-git-state:

git-autoclean:

ivy-availability-check:
[loadresource] Do not set property disallowed.ivy.jars.list as its length is 0.

-ivy-fail-disallowed-ivy-version:

ivy-fail:

ivy-configure:
[ivy:configure] :: loading settings :: file = /x1/jenkins/jenkins-slave/workspace/Lucene-Solr-SmokeRelease-7.2/lucene/top-level-ivy-settings.xml

resolve:

common.init:

compile-lucene-core:

init:

-clover.disable:

-clover.load:

-clover.classpath:

-clover.setup:

clover:

compile-core:

jar-core:
      [jar] Building jar: /x1/jenkins/jenkins-slave/workspace/Lucene-Solr-SmokeRelease-7.2/lucene/build/analysis/common/lucene-analyzers-common-7.2.1.jar

-check-git-state:

-git-cleanroot:

-copy-git-state:

git-autoclean:

ivy-availability-check:

ivy-configure:
[ivy:configure] :: loading settings :: file = /x1/jenkins/jenkins-slave/workspace/Lucene-Solr-SmokeRelease-7.2/lucene/top-level-ivy-settings.xml

resolve:

common.init:

compile-lucene-core:

init:

-clover.disable:

-clover.load:

-clover.classpath:

-clover.setup:

clover:

common.compile-core:
    [mkdir] Created dir: /x1/jenkins/jenkins-slave/workspace/Lucene-Solr-SmokeRelease-7.2/lucene/build/analysis/icu/classes/java
    [javac] Compiling 25 source files to /x1/jenkins/jenkins-slave/workspace/Lucene-Solr-SmokeRelease-7.2/lucene/build/analysis/icu/classes/java
    [javac] Note: /x1/jenkins/jenkins-slave/workspace/Lucene-Solr-SmokeRelease-7.2/lucene/analysis/icu/src/java/org/apache/lucene/analysis/icu/ICUTransformFilter.java uses or overrides a deprecated API.
    [javac] Note: Recompile with -Xlint:deprecation for details.
    [javac] Creating empty /x1/jenkins/jenkins-slave/workspace/Lucene-Solr-SmokeRelease-7.2/lucene/build/analysis/icu/classes/java/org/apache/lucene/analysis/icu/package-info.class
    [javac] Creating empty /x1/jenkins/jenkins-slave/workspace/Lucene-Solr-SmokeRelease-7.2/lucene/build/analysis/icu/classes/java/org/apache/lucene/analysis/icu/tokenattributes/package-info.class
    [javac] Creating empty /x1/jenkins/jenkins-slave/workspace/Lucene-Solr-SmokeRelease-7.2/lucene/build/analysis/icu/classes/java/org/apache/lucene/analysis/icu/segmentation/package-info.class
     [copy] Copying 6 files to /x1/jenkins/jenkins-slave/workspace/Lucene-Solr-SmokeRelease-7.2/lucene/build/analysis/icu/classes/java

compile-core:

compile-test-framework:

-check-git-state:

-git-cleanroot:

-copy-git-state:

git-autoclean:

ivy-availability-check:
[loadresource] Do not set property disallowed.ivy.jars.list as its length is 0.

-ivy-fail-disallowed-ivy-version:

ivy-fail:

ivy-configure:
[ivy:configure] :: loading settings :: file = /x1/jenkins/jenkins-slave/workspace/Lucene-Solr-SmokeRelease-7.2/lucene/top-level-ivy-settings.xml

resolve:

init:

compile-lucene-core:

compile-codecs:

-check-git-state:

-git-cleanroot:

-copy-git-state:

git-autoclean:

ivy-availability-check:
[loadresource] Do not set property disallowed.ivy.jars.list as its length is 0.

-ivy-fail-disallowed-ivy-version:

ivy-fail:

ivy-configure:
[ivy:configure] :: loading settings :: file = /x1/jenkins/jenkins-slave/workspace/Lucene-Solr-SmokeRelease-7.2/lucene/top-level-ivy-settings.xml

resolve:

common.init:

compile-lucene-core:

init:

-clover.disable:

-clover.load:

-clover.classpath:

-clover.setup:

clover:

compile-core:

-clover.disable:

-clover.load:

-clover.classpath:

-clover.setup:

clover:

common.compile-core:

compile-core:

common.compile-test:
    [mkdir] Created dir: /x1/jenkins/jenkins-slave/workspace/Lucene-Solr-SmokeRelease-7.2/lucene/build/analysis/icu/classes/test
    [javac] Compiling 16 source files to /x1/jenkins/jenkins-slave/workspace/Lucene-Solr-SmokeRelease-7.2/lucene/build/analysis/icu/classes/test
     [copy] Copying 3 files to /x1/jenkins/jenkins-slave/workspace/Lucene-Solr-SmokeRelease-7.2/lucene/build/analysis/icu/classes/test

-check-git-state:

-git-cleanroot:

-copy-git-state:

git-autoclean:

ivy-availability-check:
[loadresource] Do not set property disallowed.ivy.jars.list as its length is 0.

-ivy-fail-disallowed-ivy-version:

ivy-fail:

ivy-configure:
[ivy:configure] :: loading settings :: file = /x1/jenkins/jenkins-slave/workspace/Lucene-Solr-SmokeRelease-7.2/lucene/top-level-ivy-settings.xml

resolve:

common.init:

compile-lucene-core:

init:

module-build.compile-test:

check-analyzers-common-uptodate:

jar-analyzers-common:

-check-git-state:

-git-cleanroot:

-copy-git-state:

git-autoclean:

ivy-availability-check:

ivy-configure:
[ivy:configure] :: loading settings :: file = /x1/jenkins/jenkins-slave/workspace/Lucene-Solr-SmokeRelease-7.2/lucene/top-level-ivy-settings.xml

resolve:

common.init:

compile-lucene-core:

init:

-clover.disable:

-clover.load:

-clover.classpath:

-clover.setup:

clover:

common.compile-core:
    [mkdir] Created dir: /x1/jenkins/jenkins-slave/workspace/Lucene-Solr-SmokeRelease-7.2/lucene/build/analysis/kuromoji/classes/java
    [javac] Compiling 39 source files to /x1/jenkins/jenkins-slave/workspace/Lucene-Solr-SmokeRelease-7.2/lucene/build/analysis/kuromoji/classes/java
    [javac] Creating empty /x1/jenkins/jenkins-slave/workspace/Lucene-Solr-SmokeRelease-7.2/lucene/build/analysis/kuromoji/classes/java/org/apache/lucene/analysis/ja/dict/package-info.class
    [javac] Creating empty /x1/jenkins/jenkins-slave/workspace/Lucene-Solr-SmokeRelease-7.2/lucene/build/analysis/kuromoji/classes/java/org/apache/lucene/analysis/ja/package-info.class
    [javac] Creating empty /x1/jenkins/jenkins-slave/workspace/Lucene-Solr-SmokeRelease-7.2/lucene/build/analysis/kuromoji/classes/java/org/apache/lucene/analysis/ja/util/package-info.class
    [javac] Creating empty /x1/jenkins/jenkins-slave/workspace/Lucene-Solr-SmokeRelease-7.2/lucene/build/analysis/kuromoji/classes/java/org/apache/lucene/analysis/ja/tokenattributes/package-info.class
     [copy] Copying 14 files to /x1/jenkins/jenkins-slave/workspace/Lucene-Solr-SmokeRelease-7.2/lucene/build/analysis/kuromoji/classes/java

compile-core:

compile-test-framework:

-check-git-state:

-git-cleanroot:

-copy-git-state:

git-autoclean:

ivy-availability-check:
[loadresource] Do not set property disallowed.ivy.jars.list as its length is 0.

-ivy-fail-disallowed-ivy-version:

ivy-fail:

ivy-configure:
[ivy:configure] :: loading settings :: file = /x1/jenkins/jenkins-slave/workspace/Lucene-Solr-SmokeRelease-7.2/lucene/top-level-ivy-settings.xml

resolve:

init:

compile-lucene-core:

compile-codecs:

-check-git-state:

-git-cleanroot:

-copy-git-state:

git-autoclean:

ivy-availability-check:
[loadresource] Do not set property disallowed.ivy.jars.list as its length is 0.

-ivy-fail-disallowed-ivy-version:

ivy-fail:

ivy-configure:
[ivy:configure] :: loading settings :: file = /x1/jenkins/jenkins-slave/workspace/Lucene-Solr-SmokeRelease-7.2/lucene/top-level-ivy-settings.xml

resolve:

common.init:

compile-lucene-core:

init:

-clover.disable:

-clover.load:

-clover.classpath:

-clover.setup:

clover:

compile-core:

-clover.disable:

-clover.load:

-clover.classpath:

-clover.setup:

clover:

common.compile-core:

compile-core:

common.compile-test:
    [mkdir] Created dir: /x1/jenkins/jenkins-slave/workspace/Lucene-Solr-SmokeRelease-7.2/lucene/build/analysis/kuromoji/classes/test
    [javac] Compiling 22 source files to /x1/jenkins/jenkins-slave/workspace/Lucene-Solr-SmokeRelease-7.2/lucene/build/analysis/kuromoji/classes/test
     [copy] Copying 3 files to /x1/jenkins/jenkins-slave/workspace/Lucene-Solr-SmokeRelease-7.2/lucene/build/analysis/kuromoji/classes/test

resolve-icu:

ivy-availability-check:
[loadresource] Do not set property disallowed.ivy.jars.list as its length is 0.

-ivy-fail-disallowed-ivy-version:

ivy-fail:

ivy-configure:
[ivy:configure] :: loading settings :: file = /x1/jenkins/jenkins-slave/workspace/Lucene-Solr-SmokeRelease-7.2/lucene/top-level-ivy-settings.xml

resolve:

check-analyzers-common-uptodate:

jar-analyzers-common:

-clover.disable:

-clover.load:

-clover.classpath:

-clover.setup:

clover:

common.compile-core:

compile-core:

common.compile-tools:

-check-git-state:

-git-cleanroot:

-copy-git-state:

git-autoclean:

ivy-availability-check:
[loadresource] Do not set property disallowed.ivy.jars.list as its length is 0.

-ivy-fail-disallowed-ivy-version:

ivy-fail:

ivy-configure:
[ivy:configure] :: loading settings :: file = /x1/jenkins/jenkins-slave/workspace/Lucene-Solr-SmokeRelease-7.2/lucene/top-level-ivy-settings.xml

resolve:

init:

compile-core:
    [mkdir] Created dir: /x1/jenkins/jenkins-slave/workspace/Lucene-Solr-SmokeRelease-7.2/lucene/build/tools/classes/java
    [javac] Compiling 7 source files to /x1/jenkins/jenkins-slave/workspace/Lucene-Solr-SmokeRelease-7.2/lucene/build/tools/classes/java
     [copy] Copying 1 file to /x1/jenkins/jenkins-slave/workspace/Lucene-Solr-SmokeRelease-7.2/lucene/build/tools/classes/java

compile-tools:
    [mkdir] Created dir: /x1/jenkins/jenkins-slave/workspace/Lucene-Solr-SmokeRelease-7.2/lucene/build/analysis/kuromoji/classes/tools
    [javac] Compiling 9 source files to /x1/jenkins/jenkins-slave/workspace/Lucene-Solr-SmokeRelease-7.2/lucene/build/analysis/kuromoji/classes/tools

compile-tools-tests:
    [mkdir] Created dir: /x1/jenkins/jenkins-slave/workspace/Lucene-Solr-SmokeRelease-7.2/lucene/build/analysis/kuromoji/classes/tools-test
    [javac] Compiling 1 source file to /x1/jenkins/jenkins-slave/workspace/Lucene-Solr-SmokeRelease-7.2/lucene/build/analysis/kuromoji/classes/tools-test

compile-test:

-check-git-state:

-git-cleanroot:

-copy-git-state:

git-autoclean:

ivy-availability-check:
[loadresource] Do not set property disallowed.ivy.jars.list as its length is 0.

-ivy-fail-disallowed-ivy-version:

ivy-fail:

ivy-configure:
[ivy:configure] :: loading settings :: file = /x1/jenkins/jenkins-slave/workspace/Lucene-Solr-SmokeRelease-7.2/lucene/top-level-ivy-settings.xml

resolve:

common.init:

compile-lucene-core:

init:

compile-test:

check-analyzers-common-uptodate:

jar-analyzers-common:

-check-git-state:

-git-cleanroot:

-copy-git-state:

git-autoclean:

ivy-availability-check:

ivy-configure:
[ivy:configure] :: loading settings :: file = /x1/jenkins/jenkins-slave/workspace/Lucene-Solr-SmokeRelease-7.2/lucene/top-level-ivy-settings.xml

resolve:

common.init:

compile-lucene-core:

init:

-clover.disable:

-clover.load:

-clover.classpath:

-clover.setup:

clover:

common.compile-core:
    [mkdir] Created dir: /x1/jenkins/jenkins-slave/workspace/Lucene-Solr-SmokeRelease-7.2/lucene/build/analysis/morfologik/classes/java
    [javac] Compiling 8 source files to /x1/jenkins/jenkins-slave/workspace/Lucene-Solr-SmokeRelease-7.2/lucene/build/analysis/morfologik/classes/java
    [javac] Creating empty /x1/jenkins/jenkins-slave/workspace/Lucene-Solr-SmokeRelease-7.2/lucene/build/analysis/morfologik/classes/java/org/apache/lucene/analysis/uk/package-info.class
    [javac] Creating empty /x1/jenkins/jenkins-slave/workspace/Lucene-Solr-SmokeRelease-7.2/lucene/build/analysis/morfologik/classes/java/org/apache/lucene/analysis/morfologik/package-info.class
     [copy] Copying 3 files to /x1/jenkins/jenkins-slave/workspace/Lucene-Solr-SmokeRelease-7.2/lucene/build/analysis/morfologik/classes/java

compile-core:

compile-test-framework:

-check-git-state:

-git-cleanroot:

-copy-git-state:

git-autoclean:

ivy-availability-check:
[loadresource] Do not set property disallowed.ivy.jars.list as its length is 0.

-ivy-fail-disallowed-ivy-version:

ivy-fail:

ivy-configure:
[ivy:configure] :: loading settings :: file = /x1/jenkins/jenkins-slave/workspace/Lucene-Solr-SmokeRelease-7.2/lucene/top-level-ivy-settings.xml

resolve:

init:

compile-lucene-core:

compile-codecs:

-check-git-state:

-git-cleanroot:

-copy-git-state:

git-autoclean:

ivy-availability-check:
[loadresource] Do not set property disallowed.ivy.jars.list as its length is 0.

-ivy-fail-disallowed-ivy-version:

ivy-fail:

ivy-configure:
[ivy:configure] :: loading settings :: file = /x1/jenkins/jenkins-slave/workspace/Lucene-Solr-SmokeRelease-7.2/lucene/top-level-ivy-settings.xml

resolve:

common.init:

compile-lucene-core:

init:

-clover.disable:

-clover.load:

-clover.classpath:

-clover.setup:

clover:

compile-core:

-clover.disable:

-clover.load:

-clover.classpath:

-clover.setup:

clover:

common.compile-core:

compile-core:

common.compile-test:
    [mkdir] Created dir: /x1/jenkins/jenkins-slave/workspace/Lucene-Solr-SmokeRelease-7.2/lucene/build/analysis/morfologik/classes/test
    [javac] Compiling 3 source files to /x1/jenkins/jenkins-slave/workspace/Lucene-Solr-SmokeRelease-7.2/lucene/build/analysis/morfologik/classes/test

-check-git-state:

-git-cleanroot:

-copy-git-state:

git-autoclean:

ivy-availability-check:
[loadresource] Do not set property disallowed.ivy.jars.list as its length is 0.

-ivy-fail-disallowed-ivy-version:

ivy-fail:

ivy-configure:
[ivy:configure] :: loading settings :: file = /x1/jenkins/jenkins-slave/workspace/Lucene-Solr-SmokeRelease-7.2/lucene/top-level-ivy-settings.xml

resolve:

common.init:

compile-lucene-core:

init:

compile-test:

check-analyzers-common-uptodate:

jar-analyzers-common:

-check-git-state:

-git-cleanroot:

-copy-git-state:

git-autoclean:

ivy-availability-check:

ivy-configure:
[ivy:configure] :: loading settings :: file = /x1/jenkins/jenkins-slave/workspace/Lucene-Solr-SmokeRelease-7.2/lucene/top-level-ivy-settings.xml

resolve:

common.init:

compile-lucene-core:

init:

-clover.disable:

-clover.load:

-clover.classpath:

-clover.setup:

clover:

common.compile-core:
    [mkdir] Created dir: /x1/jenkins/jenkins-slave/workspace/Lucene-Solr-SmokeRelease-7.2/lucene/build/analysis/phonetic/classes/java
    [javac] Compiling 9 source files to /x1/jenkins/jenkins-slave/workspace/Lucene-Solr-SmokeRelease-7.2/lucene/build/analysis/phonetic/classes/java
    [javac] Creating empty /x1/jenkins/jenkins-slave/workspace/Lucene-Solr-SmokeRelease-7.2/lucene/build/analysis/phonetic/classes/java/org/apache/lucene/analysis/phonetic/package-info.class
     [copy] Copying 1 file to /x1/jenkins/jenkins-slave/workspace/Lucene-Solr-SmokeRelease-7.2/lucene/build/analysis/phonetic/classes/java

compile-core:

compile-test-framework:

-check-git-state:

-git-cleanroot:

-copy-git-state:

git-autoclean:

ivy-availability-check:
[loadresource] Do not set property disallowed.ivy.jars.list as its length is 0.

-ivy-fail-disallowed-ivy-version:

ivy-fail:

ivy-configure:
[ivy:configure] :: loading settings :: file = /x1/jenkins/jenkins-slave/workspace/Lucene-Solr-SmokeRelease-7.2/lucene/top-level-ivy-settings.xml

resolve:

init:

compile-lucene-core:

compile-codecs:

-check-git-state:

-git-cleanroot:

-copy-git-state:

git-autoclean:

ivy-availability-check:
[loadresource] Do not set property disallowed.ivy.jars.list as its length is 0.

-ivy-fail-disallowed-ivy-version:

ivy-fail:

ivy-configure:
[ivy:configure] :: loading settings :: file = /x1/jenkins/jenkins-slave/workspace/Lucene-Solr-SmokeRelease-7.2/lucene/top-level-ivy-settings.xml

resolve:

common.init:

compile-lucene-core:

init:

-clover.disable:

-clover.load:

-clover.classpath:

-clover.setup:

clover:

compile-core:

-clover.disable:

-clover.load:

-clover.classpath:

-clover.setup:

clover:

common.compile-core:

compile-core:

common.compile-test:
    [mkdir] Created dir: /x1/jenkins/jenkins-slave/workspace/Lucene-Solr-SmokeRelease-7.2/lucene/build/analysis/phonetic/classes/test
    [javac] Compiling 8 source files to /x1/jenkins/jenkins-slave/workspace/Lucene-Solr-SmokeRelease-7.2/lucene/build/analysis/phonetic/classes/test

-check-git-state:

-git-cleanroot:

-copy-git-state:

git-autoclean:

ivy-availability-check:
[loadresource] Do not set property disallowed.ivy.jars.list as its length is 0.

-ivy-fail-disallowed-ivy-version:

ivy-fail:

ivy-configure:
[ivy:configure] :: loading settings :: file = /x1/jenkins/jenkins-slave/workspace/Lucene-Solr-SmokeRelease-7.2/lucene/top-level-ivy-settings.xml

resolve:

common.init:

compile-lucene-core:

init:

compile-test:

check-analyzers-common-uptodate:

jar-analyzers-common:

-check-git-state:

-git-cleanroot:

-copy-git-state:

git-autoclean:

ivy-availability-check:

ivy-configure:
[ivy:configure] :: loading settings :: file = /x1/jenkins/jenkins-slave/workspace/Lucene-Solr-SmokeRelease-7.2/lucene/top-level-ivy-settings.xml

resolve:

common.init:

compile-lucene-core:

init:

-clover.disable:

-clover.load:

-clover.classpath:

-clover.setup:

clover:

common.compile-core:
    [mkdir] Created dir: /x1/jenkins/jenkins-slave/workspace/Lucene-Solr-SmokeRelease-7.2/lucene/build/analysis/smartcn/classes/java
    [javac] Compiling 20 source files to /x1/jenkins/jenkins-slave/workspace/Lucene-Solr-SmokeRelease-7.2/lucene/build/analysis/smartcn/classes/java
    [javac] Creating empty /x1/jenkins/jenkins-slave/workspace/Lucene-Solr-SmokeRelease-7.2/lucene/build/analysis/smartcn/classes/java/org/apache/lucene/analysis/cn/smart/hhmm/package-info.class
    [javac] Creating empty /x1/jenkins/jenkins-slave/workspace/Lucene-Solr-SmokeRelease-7.2/lucene/build/analysis/smartcn/classes/java/org/apache/lucene/analysis/cn/smart/package-info.class
     [copy] Copying 4 files to /x1/jenkins/jenkins-slave/workspace/Lucene-Solr-SmokeRelease-7.2/lucene/build/analysis/smartcn/classes/java

compile-core:

compile-test-framework:

-check-git-state:

-git-cleanroot:

-copy-git-state:

git-autoclean:

ivy-availability-check:
[loadresource] Do not set property disallowed.ivy.jars.list as its length is 0.

-ivy-fail-disallowed-ivy-version:

ivy-fail:

ivy-configure:
[ivy:configure] :: loading settings :: file = /x1/jenkins/jenkins-slave/workspace/Lucene-Solr-SmokeRelease-7.2/lucene/top-level-ivy-settings.xml

resolve:

init:

compile-lucene-core:

compile-codecs:

-check-git-state:

-git-cleanroot:

-copy-git-state:

git-autoclean:

ivy-availability-check:
[loadresource] Do not set property disallowed.ivy.jars.list as its length is 0.

-ivy-fail-disallowed-ivy-version:

ivy-fail:

ivy-configure:
[ivy:configure] :: loading settings :: file = /x1/jenkins/jenkins-slave/workspace/Lucene-Solr-SmokeRelease-7.2/lucene/top-level-ivy-settings.xml

resolve:

common.init:

compile-lucene-core:

init:

-clover.disable:

-clover.load:

-clover.classpath:

-clover.setup:

clover:

compile-core:

-clover.disable:

-clover.load:

-clover.classpath:

-clover.setup:

clover:

common.compile-core:

compile-core:

common.compile-test:
    [mkdir] Created dir: /x1/jenkins/jenkins-slave/workspace/Lucene-Solr-SmokeRelease-7.2/lucene/build/analysis/smartcn/classes/test
    [javac] Compiling 2 source files to /x1/jenkins/jenkins-slave/workspace/Lucene-Solr-SmokeRelease-7.2/lucene/build/analysis/smartcn/classes/test

-check-git-state:

-git-cleanroot:

-copy-git-state:

git-autoclean:

ivy-availability-check:
[loadresource] Do not set property disallowed.ivy.jars.list as its length is 0.

-ivy-fail-disallowed-ivy-version:

ivy-fail:

ivy-configure:
[ivy:configure] :: loading settings :: file = /x1/jenkins/jenkins-slave/workspace/Lucene-Solr-SmokeRelease-7.2/lucene/top-level-ivy-settings.xml

resolve:

common.init:

compile-lucene-core:

init:

compile-test:

check-analyzers-common-uptodate:

jar-analyzers-common:

-check-git-state:

-git-cleanroot:

-copy-git-state:

git-autoclean:

ivy-availability-check:

ivy-configure:
[ivy:configure] :: loading settings :: file = /x1/jenkins/jenkins-slave/workspace/Lucene-Solr-SmokeRelease-7.2/lucene/top-level-ivy-settings.xml

resolve:

common.init:

compile-lucene-core:

init:

-clover.disable:

-clover.load:

-clover.classpath:

-clover.setup:

clover:

common.compile-core:
    [mkdir] Created dir: /x1/jenkins/jenkins-slave/workspace/Lucene-Solr-SmokeRelease-7.2/lucene/build/analysis/stempel/classes/java
    [javac] Compiling 20 source files to /x1/jenkins/jenkins-slave/workspace/Lucene-Solr-SmokeRelease-7.2/lucene/build/analysis/stempel/classes/java
    [javac] Creating empty /x1/jenkins/jenkins-slave/workspace/Lucene-Solr-SmokeRelease-7.2/lucene/build/analysis/stempel/classes/java/org/apache/lucene/analysis/stempel/package-info.class
    [javac] Creating empty /x1/jenkins/jenkins-slave/workspace/Lucene-Solr-SmokeRelease-7.2/lucene/build/analysis/stempel/classes/java/org/apache/lucene/analysis/pl/package-info.class
    [javac] Creating empty /x1/jenkins/jenkins-slave/workspace/Lucene-Solr-SmokeRelease-7.2/lucene/build/analysis/stempel/classes/java/org/egothor/stemmer/package-info.class
     [copy] Copying 3 files to /x1/jenkins/jenkins-slave/workspace/Lucene-Solr-SmokeRelease-7.2/lucene/build/analysis/stempel/classes/java

compile-core:

compile-test-framework:

-check-git-state:

-git-cleanroot:

-copy-git-state:

git-autoclean:

ivy-availability-check:
[loadresource] Do not set property disallowed.ivy.jars.list as its length is 0.

-ivy-fail-disallowed-ivy-version:

ivy-fail:

ivy-configure:
[ivy:configure] :: loading settings :: file = /x1/jenkins/jenkins-slave/workspace/Lucene-Solr-SmokeRelease-7.2/lucene/top-level-ivy-settings.xml

resolve:

init:

compile-lucene-core:

compile-codecs:

-check-git-state:

-git-cleanroot:

-copy-git-state:

git-autoclean:

ivy-availability-check:
[loadresource] Do not set property disallowed.ivy.jars.list as its length is 0.

-ivy-fail-disallowed-ivy-version:

ivy-fail:

ivy-configure:
[ivy:configure] :: loading settings :: file = /x1/jenkins/jenkins-slave/workspace/Lucene-Solr-SmokeRelease-7.2/lucene/top-level-ivy-settings.xml

resolve:

common.init:

compile-lucene-core:

init:

-clover.disable:

-clover.load:

-clover.classpath:

-clover.setup:

clover:

compile-core:

-clover.disable:

-clover.load:

-clover.classpath:

-clover.setup:

clover:

common.compile-core:

compile-core:

common.compile-test:
    [mkdir] Created dir: /x1/jenkins/jenkins-slave/workspace/Lucene-Solr-SmokeRelease-7.2/lucene/build/analysis/stempel/classes/test
    [javac] Compiling 4 source files to /x1/jenkins/jenkins-slave/workspace/Lucene-Solr-SmokeRelease-7.2/lucene/build/analysis/stempel/classes/test
     [copy] Copying 1 file to /x1/jenkins/jenkins-slave/workspace/Lucene-Solr-SmokeRelease-7.2/lucene/build/analysis/stempel/classes/test

-check-git-state:

-git-cleanroot:

-copy-git-state:

git-autoclean:

ivy-availability-check:
[loadresource] Do not set property disallowed.ivy.jars.list as its length is 0.

-ivy-fail-disallowed-ivy-version:

ivy-fail:

ivy-configure:
[ivy:configure] :: loading settings :: file = /x1/jenkins/jenkins-slave/workspace/Lucene-Solr-SmokeRelease-7.2/lucene/top-level-ivy-settings.xml

resolve:

common.init:

compile-lucene-core:

init:

compile-test:

check-analyzers-common-uptodate:

jar-analyzers-common:

-check-git-state:

-git-cleanroot:

-copy-git-state:

git-autoclean:

ivy-availability-check:

ivy-configure:
[ivy:configure] :: loading settings :: file = /x1/jenkins/jenkins-slave/workspace/Lucene-Solr-SmokeRelease-7.2/lucene/top-level-ivy-settings.xml

resolve:

common.init:

compile-lucene-core:

init:

-clover.disable:

-clover.load:

-clover.classpath:

-clover.setup:

clover:

common.compile-core:
    [mkdir] Created dir: /x1/jenkins/jenkins-slave/workspace/Lucene-Solr-SmokeRelease-7.2/lucene/build/analysis/uima/classes/java
    [javac] Compiling 13 source files to /x1/jenkins/jenkins-slave/workspace/Lucene-Solr-SmokeRelease-7.2/lucene/build/analysis/uima/classes/java
    [javac] Creating empty /x1/jenkins/jenkins-slave/workspace/Lucene-Solr-SmokeRelease-7.2/lucene/build/analysis/uima/classes/java/org/apache/lucene/analysis/uima/ae/package-info.class
    [javac] Creating empty /x1/jenkins/jenkins-slave/workspace/Lucene-Solr-SmokeRelease-7.2/lucene/build/analysis/uima/classes/java/org/apache/lucene/analysis/uima/package-info.class
     [copy] Copying 2 files to /x1/jenkins/jenkins-slave/workspace/Lucene-Solr-SmokeRelease-7.2/lucene/build/analysis/uima/classes/java

compile-core:

compile-test-framework:

-check-git-state:

-git-cleanroot:

-copy-git-state:

git-autoclean:

ivy-availability-check:
[loadresource] Do not set property disallowed.ivy.jars.list as its length is 0.

-ivy-fail-disallowed-ivy-version:

ivy-fail:

ivy-configure:
[ivy:configure] :: loading settings :: file = /x1/jenkins/jenkins-slave/workspace/Lucene-Solr-SmokeRelease-7.2/lucene/top-level-ivy-settings.xml

resolve:

init:

compile-lucene-core:

compile-codecs:

-check-git-state:

-git-cleanroot:

-copy-git-state:

git-autoclean:

ivy-availability-check:
[loadresource] Do not set property disallowed.ivy.jars.list as its length is 0.

-ivy-fail-disallowed-ivy-version:

ivy-fail:

ivy-configure:
[ivy:configure] :: loading settings :: file = /x1/jenkins/jenkins-slave/workspace/Lucene-Solr-SmokeRelease-7.2/lucene/top-level-ivy-settings.xml

resolve:

common.init:

compile-lucene-core:

init:

-clover.disable:

-clover.load:

-clover.classpath:

-clover.setup:

clover:

compile-core:

-clover.disable:

-clover.load:

-clover.classpath:

-clover.setup:

clover:

common.compile-core:

compile-core:

common.compile-test:
    [mkdir] Created dir: /x1/jenkins/jenkins-slave/workspace/Lucene-Solr-SmokeRelease-7.2/lucene/build/analysis/uima/classes/test
    [javac] Compiling 8 source files to /x1/jenkins/jenkins-slave/workspace/Lucene-Solr-SmokeRelease-7.2/lucene/build/analysis/uima/classes/test

-check-git-state:

-git-cleanroot:

-copy-git-state:

git-autoclean:

ivy-availability-check:
[loadresource] Do not set property disallowed.ivy.jars.list as its length is 0.

-ivy-fail-disallowed-ivy-version:

ivy-fail:

ivy-configure:
[ivy:configure] :: loading settings :: file = /x1/jenkins/jenkins-slave/workspace/Lucene-Solr-SmokeRelease-7.2/lucene/top-level-ivy-settings.xml

resolve:

common.init:

compile-lucene-core:

init:

compile-test:

-check-git-state:

-git-cleanroot:

-copy-git-state:

git-autoclean:

ivy-availability-check:

ivy-configure:
[ivy:configure] :: loading settings :: file = /x1/jenkins/jenkins-slave/workspace/Lucene-Solr-SmokeRelease-7.2/lucene/top-level-ivy-settings.xml

resolve:

common.init:

compile-lucene-core:

init:

-clover.disable:

-clover.load:

-clover.classpath:

-clover.setup:

clover:

compile-core:
    [mkdir] Created dir: /x1/jenkins/jenkins-slave/workspace/Lucene-Solr-SmokeRelease-7.2/lucene/build/backward-codecs/classes/java
    [javac] Compiling 12 source files to /x1/jenkins/jenkins-slave/workspace/Lucene-Solr-SmokeRelease-7.2/lucene/build/backward-codecs/classes/java
    [javac] Note: Some input files use or override a deprecated API.
    [javac] Note: Recompile with -Xlint:deprecation for details.
    [javac] Creating empty /x1/jenkins/jenkins-slave/workspace/Lucene-Solr-SmokeRelease-7.2/lucene/build/backward-codecs/classes/java/org/apache/lucene/codecs/lucene54/package-info.class
    [javac] Creating empty /x1/jenkins/jenkins-slave/workspace/Lucene-Solr-SmokeRelease-7.2/lucene/build/backward-codecs/classes/java/org/apache/lucene/codecs/lucene53/package-info.class
     [copy] Copying 3 files to /x1/jenkins/jenkins-slave/workspace/Lucene-Solr-SmokeRelease-7.2/lucene/build/backward-codecs/classes/java

compile-test-framework:

-check-git-state:

-git-cleanroot:

-copy-git-state:

git-autoclean:

ivy-availability-check:
[loadresource] Do not set property disallowed.ivy.jars.list as its length is 0.

-ivy-fail-disallowed-ivy-version:

ivy-fail:

ivy-configure:
[ivy:configure] :: loading settings :: file = /x1/jenkins/jenkins-slave/workspace/Lucene-Solr-SmokeRelease-7.2/lucene/top-level-ivy-settings.xml

resolve:

init:

compile-lucene-core:

compile-codecs:

-check-git-state:

-git-cleanroot:

-copy-git-state:

git-autoclean:

ivy-availability-check:
[loadresource] Do not set property disallowed.ivy.jars.list as its length is 0.

-ivy-fail-disallowed-ivy-version:

ivy-fail:

ivy-configure:
[ivy:configure] :: loading settings :: file = /x1/jenkins/jenkins-slave/workspace/Lucene-Solr-SmokeRelease-7.2/lucene/top-level-ivy-settings.xml

resolve:

common.init:

compile-lucene-core:

init:

-clover.disable:

-clover.load:

-clover.classpath:

-clover.setup:

clover:

compile-core:

-clover.disable:

-clover.load:

-clover.classpath:

-clover.setup:

clover:

common.compile-core:

compile-core:

common.compile-test:
    [mkdir] Created dir: /x1/jenkins/jenkins-slave/workspace/Lucene-Solr-SmokeRelease-7.2/lucene/build/backward-codecs/classes/test
    [javac] Compiling 14 source files to /x1/jenkins/jenkins-slave/workspace/Lucene-Solr-SmokeRelease-7.2/lucene/build/backward-codecs/classes/test
    [javac] Note: Some input files use or override a deprecated API.
    [javac] Note: Recompile with -Xlint:deprecation for details.
     [copy] Copying 190 files to /x1/jenkins/jenkins-slave/workspace/Lucene-Solr-SmokeRelease-7.2/lucene/build/backward-codecs/classes/test

copy-alg-files-for-testing:
     [copy] Copying 37 files to /x1/jenkins/jenkins-slave/workspace/Lucene-Solr-SmokeRelease-7.2/lucene/build/benchmark/classes/test/conf

-check-git-state:

-git-cleanroot:

-copy-git-state:

git-autoclean:

ivy-availability-check:
[loadresource] Do not set property disallowed.ivy.jars.list as its length is 0.

-ivy-fail-disallowed-ivy-version:

ivy-fail:

ivy-configure:
[ivy:configure] :: loading settings :: file = /x1/jenkins/jenkins-slave/workspace/Lucene-Solr-SmokeRelease-7.2/lucene/top-level-ivy-settings.xml

resolve:

common.init:

compile-lucene-core:

module-build.init:

check-memory-uptodate:

jar-memory:

check-queryparser-uptodate:

jar-queryparser:

check-queries-uptodate:

jar-queries:

-check-git-state:

-git-cleanroot:

-copy-git-state:

git-autoclean:

ivy-availability-check:
[loadresource] Do not set property disallowed.ivy.jars.list as its length is 0.

-ivy-fail-disallowed-ivy-version:

ivy-fail:

ivy-configure:
[ivy:configure] :: loading settings :: file = /x1/jenkins/jenkins-slave/workspace/Lucene-Solr-SmokeRelease-7.2/lucene/top-level-ivy-settings.xml

resolve:

common.init:

compile-lucene-core:

init:

-clover.disable:

-clover.load:

-clover.classpath:

-clover.setup:

clover:

compile-core:
    [mkdir] Created dir: /x1/jenkins/jenkins-slave/workspace/Lucene-Solr-SmokeRelease-7.2/lucene/build/queries/classes/java
    [javac] Compiling 86 source files to /x1/jenkins/jenkins-slave/workspace/Lucene-Solr-SmokeRelease-7.2/lucene/build/queries/classes/java
    [javac] /x1/jenkins/jenkins-slave/workspace/Lucene-Solr-SmokeRelease-7.2/lucene/queries/src/java/org/apache/lucene/queries/function/FunctionQuery.java:59: warning: [rawtypes] found raw type: Map
    [javac]     protected final Map context;
    [javac]                     ^
    [javac]   missing type arguments for generic class Map<K,V>
    [javac]   where K,V are type-variables:
    [javac]     K extends Object declared in interface Map
    [javac]     V extends Object declared in interface Map
    [javac] /x1/jenkins/jenkins-slave/workspace/Lucene-Solr-SmokeRelease-7.2/lucene/queries/src/java/org/apache/lucene/queries/function/ValueSource.java:54: warning: [rawtypes] found raw type: Map
    [javac]   public abstract FunctionValues getValues(Map context, LeafReaderContext readerContext) throws IOException;
    [javac]                                            ^
    [javac]   missing type arguments for generic class Map<K,V>
    [javac]   where K,V are type-variables:
    [javac]     K extends Object declared in interface Map
    [javac]     V extends Object declared in interface Map
    [javac] /x1/jenkins/jenkins-slave/workspace/Lucene-Solr-SmokeRelease-7.2/lucene/queries/src/java/org/apache/lucene/queries/function/ValueSource.java:78: warning: [rawtypes] found raw type: Map
    [javac]   public void createWeight(Map context, IndexSearcher searcher) throws IOException {
    [javac]                            ^
    [javac]   missing type arguments for generic class Map<K,V>
    [javac]   where K,V are type-variables:
    [javac]     K extends Object declared in interface Map
    [javac]     V extends Object declared in interface Map
    [javac] /x1/jenkins/jenkins-slave/workspace/Lucene-Solr-SmokeRelease-7.2/lucene/queries/src/java/org/apache/lucene/queries/function/ValueSource.java:84: warning: [rawtypes] found raw type: Map
    [javac]   public static Map newContext(IndexSearcher searcher) {
    [javac]                 ^
    [javac]   missing type arguments for generic class Map<K,V>
    [javac]   where K,V are type-variables:
    [javac]     K extends Object declared in interface Map
    [javac]     V extends Object declared in interface Map
    [javac] /x1/jenkins/jenkins-slave/workspace/Lucene-Solr-SmokeRelease-7.2/lucene/queries/src/java/org/apache/lucene/queries/function/ValueSource.java:85: warning: [rawtypes] found raw type: Map
    [javac]     Map context = new IdentityHashMap();
    [javac]     ^
    [javac]   missing type arguments for generic class Map<K,V>
    [javac]   where K,V are type-variables:
    [javac]     K extends Object declared in interface Map
    [javac]     V extends Object declared in interface Map
    [javac] /x1/jenkins/jenkins-slave/workspace/Lucene-Solr-SmokeRelease-7.2/lucene/queries/src/java/org/apache/lucene/queries/function/ValueSource.java:85: warning: [rawtypes] found raw type: IdentityHashMap
    [javac]     Map context = new IdentityHashMap();
    [javac]                       ^
    [javac]   missing type arguments for generic class IdentityHashMap<K,V>
    [javac]   where K,V are type-variables:
    [javac]     K extends Object declared in class IdentityHashMap
    [javac]     V extends Object declared in class IdentityHashMap
    [javac] /x1/jenkins/jenkins-slave/workspace/Lucene-Solr-SmokeRelease-7.2/lucene/queries/src/java/org/apache/lucene/queries/function/ValueSource.java:86: warning: [unchecked] unchecked call to put(K,V) as a member of the raw type Map
    [javac]     context.put("searcher", searcher);
    [javac]                ^
    [javac]   where K,V are type-variables:
    [javac]     K extends Object declared in interface Map
    [javac]     V extends Object declared in interface Map
    [javac] /x1/jenkins/jenkins-slave/workspace/Lucene-Solr-SmokeRelease-7.2/lucene/queries/src/java/org/apache/lucene/queries/function/ValueSource.java:132: warning: [rawtypes] found raw type: Map
    [javac]       Map context = new IdentityHashMap<>();
    [javac]       ^
    [javac]   missing type arguments for generic class Map<K,V>
    [javac]   where K,V are type-variables:
    [javac]     K extends Object declared in interface Map
    [javac]     V extends Object declared in interface Map
    [javac] /x1/jenkins/jenkins-slave/workspace/Lucene-Solr-SmokeRelease-7.2/lucene/queries/src/java/org/apache/lucene/queries/function/ValueSource.java:134: warning: [unchecked] unchecked call to put(K,V) as a member of the raw type Map
    [javac]       context.put("scorer", scorer);
    [javac]                  ^
    [javac]   where K,V are type-variables:
    [javac]     K extends Object declared in interface Map
    [javac]     V extends Object declared in interface Map
    [javac] /x1/jenkins/jenkins-slave/workspace/Lucene-Solr-SmokeRelease-7.2/lucene/queries/src/java/org/apache/lucene/queries/function/ValueSource.java:208: warning: [rawtypes] found raw type: Map
    [javac]       Map context = new HashMap<>();
    [javac]       ^
    [javac]   missing type arguments for generic class Map<K,V>
    [javac]   where K,V are type-variables:
    [javac]     K extends Object declared in interface Map
    [javac]     V extends Object declared in interface Map
    [javac] /x1/jenkins/jenkins-slave/workspace/Lucene-Solr-SmokeRelease-7.2/lucene/queries/src/java/org/apache/lucene/queries/function/ValueSource.java:210: warning: [unchecked] unchecked call to put(K,V) as a member of the raw type Map
    [javac]       context.put("scorer", scorer);
    [javac]                  ^
    [javac]   where K,V are type-variables:
    [javac]     K extends Object declared in interface Map
    [javac]     V extends Object declared in interface Map
    [javac] /x1/jenkins/jenkins-slave/workspace/Lucene-Solr-SmokeRelease-7.2/lucene/queries/src/java/org/apache/lucene/queries/function/ValueSource.java:211: warning: [unchecked] unchecked call to put(K,V) as a member of the raw type Map
    [javac]       context.put("searcher", searcher);
    [javac]                  ^
    [javac]   where K,V are type-variables:
    [javac]     K extends Object declared in interface Map
    [javac]     V extends Object declared in interface Map
    [javac] /x1/jenkins/jenkins-slave/workspace/Lucene-Solr-SmokeRelease-7.2/lucene/queries/src/java/org/apache/lucene/queries/function/ValueSource.java:245: warning: [rawtypes] found raw type: Map
    [javac]       Map context = new HashMap<>();
    [javac]       ^
    [javac]   missing type arguments for generic class Map<K,V>
    [javac]   where K,V are type-variables:
    [javac]     K extends Object declared in interface Map
    [javac]     V extends Object declared in interface Map
    [javac] /x1/jenkins/jenkins-slave/workspace/Lucene-Solr-SmokeRelease-7.2/lucene/queries/src/java/org/apache/lucene/queries/function/ValueSource.java:248: warning: [unchecked] unchecked call to put(K,V) as a member of the raw type Map
    [javac]       context.put("scorer", scorer);
    [javac]                  ^
    [javac]   where K,V are type-variables:
    [javac]     K extends Object declared in interface Map
    [javac]     V extends Object declared in interface Map
    [javac] /x1/jenkins/jenkins-slave/workspace/Lucene-Solr-SmokeRelease-7.2/lucene/queries/src/java/org/apache/lucene/queries/function/ValueSource.java:249: warning: [unchecked] unchecked call to put(K,V) as a member of the raw type Map
    [javac]       context.put("searcher", searcher);
    [javac]                  ^
    [javac]   where K,V are type-variables:
    [javac]     K extends Object declared in interface Map
    [javac]     V extends Object declared in interface Map
    [javac] /x1/jenkins/jenkins-slave/workspace/Lucene-Solr-SmokeRelease-7.2/lucene/queries/src/java/org/apache/lucene/queries/function/ValueSource.java:293: warning: [rawtypes] found raw type: Map
    [javac]     public FunctionValues getValues(Map context, LeafReaderContext readerContext) throws IOException {
    [javac]                                     ^
    [javac]   missing type arguments for generic class Map<K,V>
    [javac]   where K,V are type-variables:
    [javac]     K extends Object declared in interface Map
    [javac]     V extends Object declared in interface Map
    [javac] /x1/jenkins/jenkins-slave/workspace/Lucene-Solr-SmokeRelease-7.2/lucene/queries/src/java/org/apache/lucene/queries/function/ValueSource.java:375: warning: [rawtypes] found raw type: Map
    [javac]       Map context = newContext(searcher);
    [javac]       ^
    [javac]   missing type arguments for generic class Map<K,V>
    [javac]   where K,V are type-variables:
    [javac]     K extends Object declared in interface Map
    [javac]     V extends Object declared in interface Map
    [javac] /x1/jenkins/jenkins-slave/workspace/Lucene-Solr-SmokeRelease-7.2/lucene/queries/src/java/org/apache/lucene/queries/function/ValueSource.java:382: warning: [rawtypes] found raw type: Map
    [javac]     private final Map context;
    [javac]                   ^
    [javac]   missing type arguments for generic class Map<K,V>
    [javac]   where K,V are type-variables:
    [javac]     K extends Object declared in interface Map
    [javac]     V extends Object declared in interface Map
    [javac] /x1/jenkins/jenkins-slave/workspace/Lucene-Solr-SmokeRelease-7.2/lucene/queries/src/java/org/apache/lucene/queries/function/ValueSource.java:384: warning: [rawtypes] found raw type: Map
    [javac]     public ValueSourceComparatorSource(Map context) {
    [javac]                                        ^
    [javac]   missing type arguments for generic class Map<K,V>
    [javac]   where K,V are type-variables:
    [javac]     K extends Object declared in interface Map
    [javac]     V extends Object declared in interface Map
    [javac] /x1/jenkins/jenkins-slave/workspace/Lucene-Solr-SmokeRelease-7.2/lucene/queries/src/java/org/apache/lucene/queries/function/ValueSource.java:404: warning: [rawtypes] found raw type: Map
    [javac]     private final Map fcontext;
    [javac]                   ^
    [javac]   missing type arguments for generic class Map<K,V>
    [javac]   where K,V are type-variables:
    [javac]     K extends Object declared in interface Map
    [javac]     V extends Object declared in interface Map
    [javac] /x1/jenkins/jenkins-slave/workspace/Lucene-Solr-SmokeRelease-7.2/lucene/queries/src/java/org/apache/lucene/queries/function/ValueSource.java:407: warning: [rawtypes] found raw type: Map
    [javac]     ValueSourceComparator(Map fcontext, int numHits) {
    [javac]                           ^
    [javac]   missing type arguments for generic class Map<K,V>
    [javac]   where K,V are type-variab

[...truncated too long message...]

lr-7.2.1/solr/core/test-lib/hadoop-common-2.7.4-tests.jar:/x1/jenkins/jenkins-slave/workspace/Lucene-Solr-SmokeRelease-7.2/lucene/build/smokeTestRelease/tmp/unpack/solr-7.2.1/solr/core/test-lib/hadoop-hdfs-2.7.4-tests.jar:/x1/jenkins/jenkins-slave/workspace/Lucene-Solr-SmokeRelease-7.2/lucene/build/smokeTestRelease/tmp/unpack/solr-7.2.1/solr/core/test-lib/hadoop-minikdc-2.7.4.jar:/x1/jenkins/jenkins-slave/workspace/Lucene-Solr-SmokeRelease-7.2/lucene/build/smokeTestRelease/tmp/unpack/solr-7.2.1/solr/core/test-lib/htrace-core-3.2.0-incubating.jar:/x1/jenkins/jenkins-slave/workspace/Lucene-Solr-SmokeRelease-7.2/lucene/build/smokeTestRelease/tmp/unpack/solr-7.2.1/solr/core/test-lib/jersey-core-1.9.jar:/x1/jenkins/jenkins-slave/workspace/Lucene-Solr-SmokeRelease-7.2/lucene/build/smokeTestRelease/tmp/unpack/solr-7.2.1/solr/core/test-lib/jersey-server-1.9.jar:/x1/jenkins/jenkins-slave/workspace/Lucene-Solr-SmokeRelease-7.2/lucene/build/smokeTestRelease/tmp/unpack/solr-7.2.1/solr/core/test-lib/jetty-6.1.26.jar:/x1/jenkins/jenkins-slave/workspace/Lucene-Solr-SmokeRelease-7.2/lucene/build/smokeTestRelease/tmp/unpack/solr-7.2.1/solr/core/test-lib/jetty-sslengine-6.1.26.jar:/x1/jenkins/jenkins-slave/workspace/Lucene-Solr-SmokeRelease-7.2/lucene/build/smokeTestRelease/tmp/unpack/solr-7.2.1/solr/core/test-lib/jetty-util-6.1.26.jar:/x1/jenkins/jenkins-slave/workspace/Lucene-Solr-SmokeRelease-7.2/lucene/build/smokeTestRelease/tmp/unpack/solr-7.2.1/solr/core/test-lib/mina-core-2.0.0-M5.jar:/x1/jenkins/jenkins-slave/workspace/Lucene-Solr-SmokeRelease-7.2/lucene/build/smokeTestRelease/tmp/unpack/solr-7.2.1/solr/core/test-lib/mockito-core-2.6.2.jar:/x1/jenkins/jenkins-slave/workspace/Lucene-Solr-SmokeRelease-7.2/lucene/build/smokeTestRelease/tmp/unpack/solr-7.2.1/solr/core/test-lib/netty-all-4.0.36.Final.jar:/x1/jenkins/jenkins-slave/workspace/Lucene-Solr-SmokeRelease-7.2/lucene/build/smokeTestRelease/tmp/unpack/solr-7.2.1/solr/core/test-lib/objenesis-2.5.jar:/x1/jenkins/jenkins-slave/workspace/Lucene-Solr-SmokeRelease-7.2/lucene/build/smokeTestRelease/tmp/unpack/solr-7.2.1/lucene/build/analysis/icu/lucene-analyzers-icu-7.2.1-SNAPSHOT.jar:/x1/jenkins/jenkins-slave/workspace/Lucene-Solr-SmokeRelease-7.2/lucene/build/smokeTestRelease/tmp/unpack/solr-7.2.1/solr/build/contrib/solr-analysis-extras/classes/java:/x1/jenkins/jenkins-slave/workspace/Lucene-Solr-SmokeRelease-7.2/lucene/build/smokeTestRelease/tmp/unpack/solr-7.2.1/lucene/build/queryparser/classes/test:/x1/jenkins/jenkins-slave/workspace/Lucene-Solr-SmokeRelease-7.2/lucene/build/smokeTestRelease/tmp/unpack/solr-7.2.1/lucene/build/backward-codecs/classes/test:/x1/jenkins/jenkins-slave/workspace/Lucene-Solr-SmokeRelease-7.2/lucene/build/smokeTestRelease/tmp/unpack/solr-7.2.1/solr/contrib/analysis-extras/lib/icu4j-59.1.jar:/home/jenkins/tools/ant/apache-ant-1.8.4/lib/ant-launcher.jar:/x1/jenkins/.ant/lib/ivy-2.4.0.jar:/home/jenkins/tools/ant/apache-ant-1.8.4/lib/ant-junit.jar:/home/jenkins/tools/ant/apache-ant-1.8.4/lib/ant-apache-log4j.jar:/home/jenkins/tools/ant/apache-ant-1.8.4/lib/ant-junit4.jar:/home/jenkins/tools/ant/apache-ant-1.8.4/lib/ant-jai.jar:/home/jenkins/tools/ant/apache-ant-1.8.4/lib/ant-javamail.jar:/home/jenkins/tools/ant/apache-ant-1.8.4/lib/ant-apache-bsf.jar:/home/jenkins/tools/ant/apache-ant-1.8.4/lib/ant-commons-net.jar:/home/jenkins/tools/ant/apache-ant-1.8.4/lib/ant-antlr.jar:/home/jenkins/tools/ant/apache-ant-1.8.4/lib/ant-jsch.jar:/home/jenkins/tools/ant/apache-ant-1.8.4/lib/ant-apache-oro.jar:/home/jenkins/tools/ant/apache-ant-1.8.4/lib/ant-commons-logging.jar:/home/jenkins/tools/ant/apache-ant-1.8.4/lib/ant.jar:/home/jenkins/tools/ant/apache-ant-1.8.4/lib/ant-netrexx.jar:/home/jenkins/tools/ant/apache-ant-1.8.4/lib/ant-testutil.jar:/home/jenkins/tools/ant/apache-ant-1.8.4/lib/ant-jdepend.jar:/home/jenkins/tools/ant/apache-ant-1.8.4/lib/ant-apache-bcel.jar:/home/jenkins/tools/ant/apache-ant-1.8.4/lib/ant-apache-xalan2.jar:/home/jenkins/tools/ant/apache-ant-1.8.4/lib/ant-apache-resolver.jar:/home/jenkins/tools/ant/apache-ant-1.8.4/lib/ant-jmf.jar:/home/jenkins/tools/ant/apache-ant-1.8.4/lib/ant-apache-regexp.jar:/home/jenkins/tools/ant/apache-ant-1.8.4/lib/ant-swing.jar:/usr/local/asfpackages/java/jdk1.8.0_144/lib/tools.jar:/x1/jenkins/.ivy2/cache/com.carrotsearch.randomizedtesting/junit4-ant/jars/junit4-ant-2.5.3.jar com.carrotsearch.ant.tasks.junit4.slave.SlaveMainSafe -eventsfile /x1/jenkins/jenkins-slave/workspace/Lucene-Solr-SmokeRelease-7.2/lucene/build/smokeTestRelease/tmp/unpack/solr-7.2.1/solr/build/solr-core/test/temp/junit4-J1-20180112_020100_2835106812985966417328.events @/x1/jenkins/jenkins-slave/workspace/Lucene-Solr-SmokeRelease-7.2/lucene/build/smokeTestRelease/tmp/unpack/solr-7.2.1/solr/build/solr-core/test/temp/junit4-J1-20180112_020100_2835746866356379966922.suites -stdin
   [smoker]    [junit4] ERROR: JVM J1 ended with an exception: Forked process returned with error code: 1. Very likely a JVM crash.  See process stdout at: /x1/jenkins/jenkins-slave/workspace/Lucene-Solr-SmokeRelease-7.2/lucene/build/smokeTestRelease/tmp/unpack/solr-7.2.1/solr/build/solr-core/test/temp/junit4-J1-20180112_020100_2832297675995387591674.sysout See process stderr at: /x1/jenkins/jenkins-slave/workspace/Lucene-Solr-SmokeRelease-7.2/lucene/build/smokeTestRelease/tmp/unpack/solr-7.2.1/solr/build/solr-core/test/temp/junit4-J1-20180112_020100_2834492279977392996710.syserr
   [smoker]    [junit4] at com.carrotsearch.ant.tasks.junit4.JUnit4.executeSlave(JUnit4.java:1519)
   [smoker]    [junit4] at com.carrotsearch.ant.tasks.junit4.JUnit4.access$000(JUnit4.java:126)
   [smoker]    [junit4] at com.carrotsearch.ant.tasks.junit4.JUnit4$2.call(JUnit4.java:982)
   [smoker]    [junit4] at com.carrotsearch.ant.tasks.junit4.JUnit4$2.call(JUnit4.java:979)
   [smoker]    [junit4] at java.util.concurrent.FutureTask.run(FutureTask.java:266)
   [smoker]    [junit4] at java.util.concurrent.ThreadPoolExecutor.runWorker(ThreadPoolExecutor.java:1149)
   [smoker]    [junit4] at java.util.concurrent.ThreadPoolExecutor$Worker.run(ThreadPoolExecutor.java:624)
   [smoker]    [junit4] at java.lang.Thread.run(Thread.java:748)
   [smoker]
   [smoker] BUILD FAILED
   [smoker] /x1/jenkins/jenkins-slave/workspace/Lucene-Solr-SmokeRelease-7.2/lucene/build/smokeTestRelease/tmp/unpack/solr-7.2.1/solr/build.xml:262: The following error occurred while executing this line:
   [smoker] /x1/jenkins/jenkins-slave/workspace/Lucene-Solr-SmokeRelease-7.2/lucene/build/smokeTestRelease/tmp/unpack/solr-7.2.1/solr/common-build.xml:556: The following error occurred while executing this line:
   [smoker] /x1/jenkins/jenkins-slave/workspace/Lucene-Solr-SmokeRelease-7.2/lucene/build/smokeTestRelease/tmp/unpack/solr-7.2.1/lucene/common-build.xml:1512: The following error occurred while executing this line:
   [smoker] /x1/jenkins/jenkins-slave/workspace/Lucene-Solr-SmokeRelease-7.2/lucene/build/smokeTestRelease/tmp/unpack/solr-7.2.1/lucene/common-build.xml:1038: At least one slave process threw an exception, first: Forked process returned with error code: 1. Very likely a JVM crash.  See process stdout at: /x1/jenkins/jenkins-slave/workspace/Lucene-Solr-SmokeRelease-7.2/lucene/build/smokeTestRelease/tmp/unpack/solr-7.2.1/solr/build/solr-core/test/temp/junit4-J0-20180112_020100_2777037025472718825319.sysout See process stderr at: /x1/jenkins/jenkins-slave/workspace/Lucene-Solr-SmokeRelease-7.2/lucene/build/smokeTestRelease/tmp/unpack/solr-7.2.1/solr/build/solr-core/test/temp/junit4-J0-20180112_020100_2778718552433139683838.syserr
   [smoker]
   [smoker] Total time: 125 minutes 36 seconds
   [smoker]
   [smoker]
   [smoker] Traceback (most recent call last):
   [smoker]   File "/x1/jenkins/jenkins-slave/workspace/Lucene-Solr-SmokeRelease-7.2/dev-tools/scripts/smokeTestRelease.py", line 1484, in <module>
   [smoker]     main()
   [smoker]   File "/x1/jenkins/jenkins-slave/workspace/Lucene-Solr-SmokeRelease-7.2/dev-tools/scripts/smokeTestRelease.py", line 1428, in main
   [smoker]     smokeTest(c.java, c.url, c.revision, c.version, c.tmp_dir, c.is_signed, ' '.join(c.test_args))
   [smoker]   File "/x1/jenkins/jenkins-slave/workspace/Lucene-Solr-SmokeRelease-7.2/dev-tools/scripts/smokeTestRelease.py", line 1474, in smokeTest
   [smoker]     gitRevision, version, testArgs, baseURL)
   [smoker]   File "/x1/jenkins/jenkins-slave/workspace/Lucene-Solr-SmokeRelease-7.2/dev-tools/scripts/smokeTestRelease.py", line 622, in unpackAndVerify
   [smoker]     verifyUnpacked(java, project, artifact, unpackPath, gitRevision, version, testArgs, tmpDir, baseURL)
   [smoker]   File "/x1/jenkins/jenkins-slave/workspace/Lucene-Solr-SmokeRelease-7.2/dev-tools/scripts/smokeTestRelease.py", line 733, in verifyUnpacked
   [smoker]     java.run_java8('ant clean test -Dtests.slow=false %s' % testArgs, '%s/test.log' % unpackPath)
   [smoker]   File "/x1/jenkins/jenkins-slave/workspace/Lucene-Solr-SmokeRelease-7.2/dev-tools/scripts/smokeTestRelease.py", line 1233, in run_java
   [smoker]     run('%s; %s' % (cmd_prefix, cmd), logfile)
   [smoker]   File "/x1/jenkins/jenkins-slave/workspace/Lucene-Solr-SmokeRelease-7.2/dev-tools/scripts/smokeTestRelease.py", line 547, in run
   [smoker]     raise RuntimeError('command "%s" failed; see log file %s' % (command, logPath))
   [smoker] RuntimeError: command "export JAVA_HOME="/home/jenkins/tools/java/latest1.8" PATH="/home/jenkins/tools/java/latest1.8/bin:$PATH" JAVACMD="/home/jenkins/tools/java/latest1.8/bin/java"; ant clean test -Dtests.slow=false -Dtests.slow=false" failed; see log file /x1/jenkins/jenkins-slave/workspace/Lucene-Solr-SmokeRelease-7.2/lucene/build/smokeTestRelease/tmp/unpack/solr-7.2.1/test.log

BUILD FAILED
/x1/jenkins/jenkins-slave/workspace/Lucene-Solr-SmokeRelease-7.2/build.xml:631: exec returned: 1

Total time: 408 minutes 42 seconds
Build step 'Invoke Ant' marked build as failure
Email was triggered for: Failure - Any
Sending email for trigger: Failure - Any


---------------------------------------------------------------------
To unsubscribe, e-mail: [hidden email]
For additional commands, e-mail: [hidden email]
Reply | Threaded
Open this post in threaded view
|

[JENKINS] Lucene-Solr-SmokeRelease-7.2 - Build # 11 - Still Failing

Apache Jenkins Server-2
Build: https://builds.apache.org/job/Lucene-Solr-SmokeRelease-7.2/11/

No tests ran.

Build Log:
[...truncated 28043 lines...]
prepare-release-no-sign:
    [mkdir] Created dir: /home/jenkins/jenkins-slave/workspace/Lucene-Solr-SmokeRelease-7.2/lucene/build/smokeTestRelease/dist
     [copy] Copying 476 files to /home/jenkins/jenkins-slave/workspace/Lucene-Solr-SmokeRelease-7.2/lucene/build/smokeTestRelease/dist/lucene
     [copy] Copying 215 files to /home/jenkins/jenkins-slave/workspace/Lucene-Solr-SmokeRelease-7.2/lucene/build/smokeTestRelease/dist/solr
   [smoker] Java 1.8 JAVA_HOME=/home/jenkins/tools/java/latest1.8
   [smoker] NOTE: output encoding is UTF-8
   [smoker]
   [smoker] Load release URL "file:/home/jenkins/jenkins-slave/workspace/Lucene-Solr-SmokeRelease-7.2/lucene/build/smokeTestRelease/dist/"...
   [smoker]
   [smoker] Test Lucene...
   [smoker]   test basics...
   [smoker]   get KEYS
   [smoker]     0.2 MB in 0.01 sec (43.0 MB/sec)
   [smoker]   check changes HTML...
   [smoker]   download lucene-7.2.1-src.tgz...
   [smoker]     32.0 MB in 0.02 sec (1296.3 MB/sec)
   [smoker]     verify md5/sha1 digests
   [smoker]   download lucene-7.2.1.tgz...
   [smoker]     71.0 MB in 0.06 sec (1252.5 MB/sec)
   [smoker]     verify md5/sha1 digests
   [smoker]   download lucene-7.2.1.zip...
   [smoker]     81.5 MB in 0.07 sec (1250.4 MB/sec)
   [smoker]     verify md5/sha1 digests
   [smoker]   unpack lucene-7.2.1.tgz...
   [smoker]     verify JAR metadata/identity/no javax.* or java.* classes...
   [smoker]     test demo with 1.8...
   [smoker]       got 6227 hits for query "lucene"
   [smoker]     checkindex with 1.8...
   [smoker]     check Lucene's javadoc JAR
   [smoker]   unpack lucene-7.2.1.zip...
   [smoker]     verify JAR metadata/identity/no javax.* or java.* classes...
   [smoker]     test demo with 1.8...
   [smoker]       got 6227 hits for query "lucene"
   [smoker]     checkindex with 1.8...
   [smoker]     check Lucene's javadoc JAR
   [smoker]   unpack lucene-7.2.1-src.tgz...
   [smoker]     make sure no JARs/WARs in src dist...
   [smoker]     run "ant validate"
   [smoker]     run tests w/ Java 8 and testArgs='-Dtests.slow=false'...
   [smoker]     test demo with 1.8...
   [smoker]       got 214 hits for query "lucene"
   [smoker]     checkindex with 1.8...
   [smoker]     generate javadocs w/ Java 8...
   [smoker]
   [smoker] Crawl/parse...
   [smoker]
   [smoker] Verify...
   [smoker]   confirm all releases have coverage in TestBackwardsCompatibility
   [smoker]     find all past Lucene releases...
   [smoker]     run TestBackwardsCompatibility..
   [smoker]     success!
   [smoker]
   [smoker] Test Solr...
   [smoker]   test basics...
   [smoker]   get KEYS
   [smoker]     0.2 MB in 0.00 sec (64.1 MB/sec)
   [smoker]   check changes HTML...
   [smoker]   download solr-7.2.1-src.tgz...
   [smoker]     54.1 MB in 0.35 sec (154.0 MB/sec)
   [smoker]     verify md5/sha1 digests
   [smoker]   download solr-7.2.1.tgz...
   [smoker]     146.1 MB in 0.83 sec (175.1 MB/sec)
   [smoker]     verify md5/sha1 digests
   [smoker]   download solr-7.2.1.zip...
   [smoker]     147.1 MB in 0.60 sec (243.7 MB/sec)
   [smoker]     verify md5/sha1 digests
   [smoker]   unpack solr-7.2.1.tgz...
   [smoker]     verify JAR metadata/identity/no javax.* or java.* classes...
   [smoker]     unpack lucene-7.2.1.tgz...
   [smoker]       **WARNING**: skipping check of /home/jenkins/jenkins-slave/workspace/Lucene-Solr-SmokeRelease-7.2/lucene/build/smokeTestRelease/tmp/unpack/solr-7.2.1/contrib/dataimporthandler-extras/lib/javax.mail-1.5.1.jar: it has javax.* classes
   [smoker]       **WARNING**: skipping check of /home/jenkins/jenkins-slave/workspace/Lucene-Solr-SmokeRelease-7.2/lucene/build/smokeTestRelease/tmp/unpack/solr-7.2.1/contrib/dataimporthandler-extras/lib/activation-1.1.1.jar: it has javax.* classes
   [smoker]     copying unpacked distribution for Java 8 ...
   [smoker]     test solr example w/ Java 8...
   [smoker]       start Solr instance (log=/home/jenkins/jenkins-slave/workspace/Lucene-Solr-SmokeRelease-7.2/lucene/build/smokeTestRelease/tmp/unpack/solr-7.2.1-java8/solr-example.log)...
   [smoker] No process found for Solr node running on port 8983
   [smoker]       Running techproducts example on port 8983 from /home/jenkins/jenkins-slave/workspace/Lucene-Solr-SmokeRelease-7.2/lucene/build/smokeTestRelease/tmp/unpack/solr-7.2.1-java8
   [smoker] Creating Solr home directory /home/jenkins/jenkins-slave/workspace/Lucene-Solr-SmokeRelease-7.2/lucene/build/smokeTestRelease/tmp/unpack/solr-7.2.1-java8/example/techproducts/solr
   [smoker]
   [smoker] Starting up Solr on port 8983 using command:
   [smoker] "bin/solr" start -p 8983 -s "example/techproducts/solr"
   [smoker]
   [smoker] Waiting up to 180 seconds to see Solr running on port 8983 [|]   [/]   [-]   [\]  
   [smoker] Started Solr server on port 8983 (pid=25523). Happy searching!
   [smoker]
   [smoker]     
   [smoker] Created new core 'techproducts'
   [smoker] Indexing tech product example docs from /home/jenkins/jenkins-slave/workspace/Lucene-Solr-SmokeRelease-7.2/lucene/build/smokeTestRelease/tmp/unpack/solr-7.2.1-java8/example/exampledocs
   [smoker] SimplePostTool version 5.0.0
   [smoker] Posting files to [base] url http://localhost:8983/solr/techproducts/update using content-type application/xml...
   [smoker] POSTing file utf8-example.xml to [base]
   [smoker] POSTing file solr.xml to [base]
   [smoker] POSTing file mp500.xml to [base]
   [smoker] POSTing file sd500.xml to [base]
   [smoker] POSTing file ipod_other.xml to [base]
   [smoker] POSTing file vidcard.xml to [base]
   [smoker] POSTing file ipod_video.xml to [base]
   [smoker] POSTing file money.xml to [base]
   [smoker] POSTing file monitor.xml to [base]
   [smoker] POSTing file mem.xml to [base]
   [smoker] POSTing file hd.xml to [base]
   [smoker] POSTing file manufacturers.xml to [base]
   [smoker] POSTing file monitor2.xml to [base]
   [smoker] POSTing file gb18030-example.xml to [base]
   [smoker] 14 files indexed.
   [smoker] COMMITting Solr index changes to http://localhost:8983/solr/techproducts/update...
   [smoker] Time spent: 0:00:02.190
   [smoker]
   [smoker] Solr techproducts example launched successfully. Direct your Web browser to http://localhost:8983/solr to visit the Solr Admin UI
   [smoker]       test utf8...
   [smoker]       run query...
   [smoker]       stop server using: bin/solr stop -p 8983
   [smoker] Sending stop command to Solr running on port 8983 ... waiting up to 180 seconds to allow Jetty process 25523 to stop gracefully.
   [smoker]  [|]   [/]   [-]   [\]        unpack solr-7.2.1.zip...
   [smoker]     verify JAR metadata/identity/no javax.* or java.* classes...
   [smoker]     unpack lucene-7.2.1.tgz...
   [smoker]       **WARNING**: skipping check of /home/jenkins/jenkins-slave/workspace/Lucene-Solr-SmokeRelease-7.2/lucene/build/smokeTestRelease/tmp/unpack/solr-7.2.1/contrib/dataimporthandler-extras/lib/javax.mail-1.5.1.jar: it has javax.* classes
   [smoker]       **WARNING**: skipping check of /home/jenkins/jenkins-slave/workspace/Lucene-Solr-SmokeRelease-7.2/lucene/build/smokeTestRelease/tmp/unpack/solr-7.2.1/contrib/dataimporthandler-extras/lib/activation-1.1.1.jar: it has javax.* classes
   [smoker]     copying unpacked distribution for Java 8 ...
   [smoker]     test solr example w/ Java 8...
   [smoker]       start Solr instance (log=/home/jenkins/jenkins-slave/workspace/Lucene-Solr-SmokeRelease-7.2/lucene/build/smokeTestRelease/tmp/unpack/solr-7.2.1-java8/solr-example.log)...
   [smoker] No process found for Solr node running on port 8983
   [smoker]       Running techproducts example on port 8983 from /home/jenkins/jenkins-slave/workspace/Lucene-Solr-SmokeRelease-7.2/lucene/build/smokeTestRelease/tmp/unpack/solr-7.2.1-java8
   [smoker] Creating Solr home directory /home/jenkins/jenkins-slave/workspace/Lucene-Solr-SmokeRelease-7.2/lucene/build/smokeTestRelease/tmp/unpack/solr-7.2.1-java8/example/techproducts/solr
   [smoker]
   [smoker] Starting up Solr on port 8983 using command:
   [smoker] "bin/solr" start -p 8983 -s "example/techproducts/solr"
   [smoker]
   [smoker] Waiting up to 180 seconds to see Solr running on port 8983 [|]   [/]   [-]   [\]   [|]   [/]   [-]   [\]  
   [smoker] Started Solr server on port 8983 (pid=25988). Happy searching!
   [smoker]
   [smoker]     
   [smoker] Created new core 'techproducts'
   [smoker] Indexing tech product example docs from /home/jenkins/jenkins-slave/workspace/Lucene-Solr-SmokeRelease-7.2/lucene/build/smokeTestRelease/tmp/unpack/solr-7.2.1-java8/example/exampledocs
   [smoker] SimplePostTool version 5.0.0
   [smoker] Posting files to [base] url http://localhost:8983/solr/techproducts/update using content-type application/xml...
   [smoker] POSTing file utf8-example.xml to [base]
   [smoker] POSTing file solr.xml to [base]
   [smoker] POSTing file mp500.xml to [base]
   [smoker] POSTing file sd500.xml to [base]
   [smoker] POSTing file ipod_other.xml to [base]
   [smoker] POSTing file vidcard.xml to [base]
   [smoker] POSTing file ipod_video.xml to [base]
   [smoker] POSTing file money.xml to [base]
   [smoker] POSTing file monitor.xml to [base]
   [smoker] POSTing file mem.xml to [base]
   [smoker] POSTing file hd.xml to [base]
   [smoker] POSTing file manufacturers.xml to [base]
   [smoker] POSTing file monitor2.xml to [base]
   [smoker] POSTing file gb18030-example.xml to [base]
   [smoker] 14 files indexed.
   [smoker] COMMITting Solr index changes to http://localhost:8983/solr/techproducts/update...
   [smoker] Time spent: 0:00:02.262
   [smoker]
   [smoker] Solr techproducts example launched successfully. Direct your Web browser to http://localhost:8983/solr to visit the Solr Admin UI
   [smoker]       test utf8...
   [smoker]       run query...
   [smoker]       stop server using: bin/solr stop -p 8983
   [smoker] Sending stop command to Solr running on port 8983 ... waiting up to 180 seconds to allow Jetty process 25988 to stop gracefully.
   [smoker]  [|]   [/]   [-]   [\]        unpack solr-7.2.1-src.tgz...
   [smoker]     make sure no JARs/WARs in src dist...
   [smoker]     run "ant validate documentation-lint"
   [smoker]     run tests w/ Java 8 and testArgs='-Dtests.slow=false'...
   [smoker]
   [smoker] command "export JAVA_HOME="/home/jenkins/tools/java/latest1.8" PATH="/home/jenkins/tools/java/latest1.8/bin:$PATH" JAVACMD="/home/jenkins/tools/java/latest1.8/bin/java"; ant clean test -Dtests.slow=false -Dtests.slow=false" failed:
   [smoker] Buildfile: /home/jenkins/jenkins-slave/workspace/Lucene-Solr-SmokeRelease-7.2/lucene/build/smokeTestRelease/tmp/unpack/solr-7.2.1/solr/build.xml
   [smoker]
   [smoker] clean:
   [smoker]    [delete] Deleting directory /home/jenkins/jenkins-slave/workspace/Lucene-Solr-SmokeRelease-7.2/lucene/build/smokeTestRelease/tmp/unpack/solr-7.2.1/solr/build
   [smoker]
   [smoker] ivy-availability-check:
   [smoker] [loadresource] Do not set property disallowed.ivy.jars.list as its length is 0.
   [smoker]
   [smoker] -ivy-fail-disallowed-ivy-version:
   [smoker]
   [smoker] ivy-fail:
   [smoker]
   [smoker] ivy-configure:
   [smoker] [ivy:configure] :: Apache Ivy 2.4.0 - 20141213170938 :: http://ant.apache.org/ivy/ ::
   [smoker] [ivy:configure] :: loading settings :: file = /home/jenkins/jenkins-slave/workspace/Lucene-Solr-SmokeRelease-7.2/lucene/build/smokeTestRelease/tmp/unpack/solr-7.2.1/lucene/top-level-ivy-settings.xml
   [smoker]
   [smoker] resolve-groovy:
   [smoker] [ivy:cachepath] :: resolving dependencies :: org.codehaus.groovy#groovy-all-caller;working
   [smoker] [ivy:cachepath] confs: [default]
   [smoker] [ivy:cachepath] found org.codehaus.groovy#groovy-all;2.4.12 in public
   [smoker] [ivy:cachepath] :: resolution report :: resolve 412ms :: artifacts dl 14ms
   [smoker] ---------------------------------------------------------------------
   [smoker] |                  |            modules            ||   artifacts   |
   [smoker] |       conf       | number| search|dwnlded|evicted|| number|dwnlded|
   [smoker] ---------------------------------------------------------------------
   [smoker] |      default     |   1   |   0   |   0   |   0   ||   1   |   0   |
   [smoker] ---------------------------------------------------------------------
   [smoker]
   [smoker] -init-totals:
   [smoker]     [mkdir] Created dir: /home/jenkins/jenkins-slave/workspace/Lucene-Solr-SmokeRelease-7.2/lucene/build/smokeTestRelease/tmp/unpack/solr-7.2.1/solr/build/solr
   [smoker]
   [smoker] -clover.load:
   [smoker]
   [smoker] test-solr-core:
   [smoker]
   [smoker] test:
   [smoker]
   [smoker] -clover.disable:
   [smoker]
   [smoker] ivy-availability-check:
   [smoker] [loadresource] Do not set property disallowed.ivy.jars.list as its length is 0.
   [smoker]
   [smoker] -ivy-fail-disallowed-ivy-version:
   [smoker]
   [smoker] ivy-fail:
   [smoker]
   [smoker] ivy-configure:
   [smoker] [ivy:configure] :: loading settings :: file = /home/jenkins/jenkins-slave/workspace/Lucene-Solr-SmokeRelease-7.2/lucene/build/smokeTestRelease/tmp/unpack/solr-7.2.1/lucene/top-level-ivy-settings.xml
   [smoker]
   [smoker] -clover.load:
   [smoker]
   [smoker] -clover.classpath:
   [smoker]
   [smoker] -clover.setup:
   [smoker]
   [smoker] clover:
   [smoker]
   [smoker] check-analyzers-icu-uptodate:
   [smoker]
   [smoker] jar-analyzers-icu:
   [smoker]
   [smoker] -compile-test-lucene-queryparser:
   [smoker]
   [smoker] -check-git-state:
   [smoker]
   [smoker] -git-cleanroot:
   [smoker]
   [smoker] -copy-git-state:
   [smoker]
   [smoker] git-autoclean:
   [smoker]
   [smoker] ivy-availability-check:
   [smoker] [loadresource] Do not set property disallowed.ivy.jars.list as its length is 0.
   [smoker]
   [smoker] -ivy-fail-disallowed-ivy-version:
   [smoker]
   [smoker] ivy-fail:
   [smoker]
   [smoker] ivy-configure:
   [smoker] [ivy:configure] :: loading settings :: file = /home/jenkins/jenkins-slave/workspace/Lucene-Solr-SmokeRelease-7.2/lucene/build/smokeTestRelease/tmp/unpack/solr-7.2.1/lucene/top-level-ivy-settings.xml
   [smoker]
   [smoker] resolve:
   [smoker]
   [smoker] common.init:
   [smoker]
   [smoker] compile-lucene-core:
   [smoker]
   [smoker] -check-git-state:
   [smoker]
   [smoker] -git-cleanroot:
   [smoker]
   [smoker] -copy-git-state:
   [smoker]
   [smoker] git-autoclean:
   [smoker]
   [smoker] ivy-availability-check:
   [smoker] [loadresource] Do not set property disallowed.ivy.jars.list as its length is 0.
   [smoker]
   [smoker] -ivy-fail-disallowed-ivy-version:
   [smoker]
   [smoker] ivy-fail:
   [smoker]
   [smoker] ivy-configure:
   [smoker] [ivy:configure] :: loading settings :: file = /home/jenkins/jenkins-slave/workspace/Lucene-Solr-SmokeRelease-7.2/lucene/build/smokeTestRelease/tmp/unpack/solr-7.2.1/lucene/top-level-ivy-settings.xml
   [smoker]
   [smoker] resolve:
   [smoker]
   [smoker] init:
   [smoker]
   [smoker] -clover.disable:
   [smoker]
   [smoker] -clover.load:
   [smoker]
   [smoker] -clover.classpath:
   [smoker]
   [smoker] -clover.setup:
   [smoker]
   [smoker] clover:
   [smoker]
   [smoker] compile-core:
   [smoker]
   [smoker] init:
   [smoker]
   [smoker] compile-test:
   [smoker]
   [smoker] check-queries-uptodate:
   [smoker]
   [smoker] jar-queries:
   [smoker]
   [smoker] check-sandbox-uptodate:
   [smoker]
   [smoker] jar-sandbox:
   [smoker]
   [smoker] -check-git-state:
   [smoker]
   [smoker] -git-cleanroot:
   [smoker]
   [smoker] -copy-git-state:
   [smoker]
   [smoker] git-autoclean:
   [smoker]
   [smoker] ivy-availability-check:
   [smoker]
   [smoker] ivy-configure:
   [smoker] [ivy:configure] :: loading settings :: file = /home/jenkins/jenkins-slave/workspace/Lucene-Solr-SmokeRelease-7.2/lucene/build/smokeTestRelease/tmp/unpack/solr-7.2.1/lucene/top-level-ivy-settings.xml
   [smoker]
   [smoker] resolve:
   [smoker]
   [smoker] common.init:
   [smoker]
   [smoker] compile-lucene-core:
   [smoker]
   [smoker] init:
   [smoker]
   [smoker] -clover.disable:
   [smoker]
   [smoker] -clover.load:
   [smoker]
   [smoker] -clover.classpath:
   [smoker]
   [smoker] -clover.setup:
   [smoker]
   [smoker] clover:
   [smoker]
   [smoker] common.compile-core:
   [smoker]
   [smoker] compile-core:
   [smoker]
   [smoker] compile-test-framework:
   [smoker]
   [smoker] -check-git-state:
   [smoker]
   [smoker] -git-cleanroot:
   [smoker]
   [smoker] -copy-git-state:
   [smoker]
   [smoker] git-autoclean:
   [smoker]
   [smoker] ivy-availability-check:
   [smoker] [loadresource] Do not set property disallowed.ivy.jars.list as its length is 0.
   [smoker]
   [smoker] -ivy-fail-disallowed-ivy-version:
   [smoker]
   [smoker] ivy-fail:
   [smoker]
   [smoker] ivy-configure:
   [smoker] [ivy:configure] :: loading settings :: file = /home/jenkins/jenkins-slave/workspace/Lucene-Solr-SmokeRelease-7.2/lucene/build/smokeTestRelease/tmp/unpack/solr-7.2.1/lucene/top-level-ivy-settings.xml
   [smoker]
   [smoker] resolve:
   [smoker]
   [smoker] init:
   [smoker]
   [smoker] compile-lucene-core:
   [smoker]
   [smoker] compile-codecs:
   [smoker]
   [smoker] -check-git-state:
   [smoker]
   [smoker] -git-cleanroot:
   [smoker]
   [smoker] -copy-git-state:
   [smoker]
   [smoker] git-autoclean:
   [smoker]
   [smoker] ivy-availability-check:
   [smoker] [loadresource] Do not set property disallowed.ivy.jars.list as its length is 0.
   [smoker]
   [smoker] -ivy-fail-disallowed-ivy-version:
   [smoker]
   [smoker] ivy-fail:
   [smoker]
   [smoker] ivy-configure:
   [smoker] [ivy:configure] :: loading settings :: file = /home/jenkins/jenkins-slave/workspace/Lucene-Solr-SmokeRelease-7.2/lucene/build/smokeTestRelease/tmp/unpack/solr-7.2.1/lucene/top-level-ivy-settings.xml
   [smoker]
   [smoker] resolve:
   [smoker]
   [smoker] common.init:
   [smoker]
   [smoker] compile-lucene-core:
   [smoker]
   [smoker] init:
   [smoker]
   [smoker] -clover.disable:
   [smoker]
   [smoker] -clover.load:
   [smoker]
   [smoker] -clover.classpath:
   [smoker]
   [smoker] -clover.setup:
   [smoker]
   [smoker] clover:
   [smoker]
   [smoker] compile-core:
   [smoker]
   [smoker] -clover.disable:
   [smoker]
   [smoker] -clover.load:
   [smoker]
   [smoker] -clover.classpath:
   [smoker]
   [smoker] -clover.setup:
   [smoker]
   [smoker] clover:
   [smoker]
   [smoker] common.compile-core:
   [smoker]
   [smoker] compile-core:
   [smoker]
   [smoker] common.compile-test:
   [smoker]
   [smoker] -compile-test-lucene-backward-codecs:
   [smoker]
   [smoker] -check-git-state:
   [smoker]
   [smoker] -git-cleanroot:
   [smoker]
   [smoker] -copy-git-state:
   [smoker]
   [smoker] git-autoclean:
   [smoker]
   [smoker] ivy-availability-check:
   [smoker] [loadresource] Do not set property disallowed.ivy.jars.list as its length is 0.
   [smoker]
   [smoker] -ivy-fail-disallowed-ivy-version:
   [smoker]
   [smoker] ivy-fail:
   [smoker]
   [smoker] ivy-configure:
   [smoker] [ivy:configure] :: loading settings :: file = /home/jenkins/jenkins-slave/workspace/Lucene-Solr-SmokeRelease-7.2/lucene/build/smokeTestRelease/tmp/unpack/solr-7.2.1/lucene/top-level-ivy-settings.xml
   [smoker]
   [smoker] resolve:
   [smoker]
   [smoker] common.init:
   [smoker]
   [smoker] compile-lucene-core:
   [smoker]
   [smoker] -check-git-state:
   [smoker]
   [smoker] -git-cleanroot:
   [smoker]
   [smoker] -copy-git-state:
   [smoker]
   [smoker] git-autoclean:
   [smoker]
   [smoker] ivy-availability-check:
   [smoker] [loadresource] Do not set property disallowed.ivy.jars.list as its length is 0.
   [smoker]
   [smoker] -ivy-fail-disallowed-ivy-version:
   [smoker]
   [smoker] ivy-fail:
   [smoker]
   [smoker] ivy-configure:
   [smoker] [ivy:configure] :: loading settings :: file = /home/jenkins/jenkins-slave/workspace/Lucene-Solr-SmokeRelease-7.2/lucene/build/smokeTestRelease/tmp/unpack/solr-7.2.1/lucene/top-level-ivy-settings.xml
   [smoker]
   [smoker] resolve:
   [smoker]
   [smoker] init:
   [smoker]
   [smoker] -clover.disable:
   [smoker]
   [smoker] -clover.load:
   [smoker]
   [smoker] -clover.classpath:
   [smoker]
   [smoker] -clover.setup:
   [smoker]
   [smoker] clover:
   [smoker]
   [smoker] compile-core:
   [smoker]
   [smoker] init:
   [smoker]
   [smoker] compile-test:
   [smoker]
   [smoker] -check-git-state:
   [smoker]
   [smoker] -git-cleanroot:
   [smoker]
   [smoker] -copy-git-state:
   [smoker]
   [smoker] git-autoclean:
   [smoker]
   [smoker] ivy-availability-check:
   [smoker]
   [smoker] ivy-configure:
   [smoker] [ivy:configure] :: loading settings :: file = /home/jenkins/jenkins-slave/workspace/Lucene-Solr-SmokeRelease-7.2/lucene/build/smokeTestRelease/tmp/unpack/solr-7.2.1/lucene/top-level-ivy-settings.xml
   [smoker]
   [smoker] resolve:
   [smoker]
   [smoker] common.init:
   [smoker]
   [smoker] compile-lucene-core:
   [smoker]
   [smoker] init:
   [smoker]
   [smoker] -clover.disable:
   [smoker]
   [smoker] -clover.load:
   [smoker]
   [smoker] -clover.classpath:
   [smoker]
   [smoker] -clover.setup:
   [smoker]
   [smoker] clover:
   [smoker]
   [smoker] compile-core:
   [smoker]
   [smoker] compile-test-framework:
   [smoker]
   [smoker] -check-git-state:
   [smoker]
   [smoker] -git-cleanroot:
   [smoker]
   [smoker] -copy-git-state:
   [smoker]
   [smoker] git-autoclean:
   [smoker]
   [smoker] ivy-availability-check:
   [smoker] [loadresource] Do not set property disallowed.ivy.jars.list as its length is 0.
   [smoker]
   [smoker] -ivy-fail-disallowed-ivy-version:
   [smoker]
   [smoker] ivy-fail:
   [smoker]
   [smoker] ivy-configure:
   [smoker] [ivy:configure] :: loading settings :: file = /home/jenkins/jenkins-slave/workspace/Lucene-Solr-SmokeRelease-7.2/lucene/build/smokeTestRelease/tmp/unpack/solr-7.2.1/lucene/top-level-ivy-settings.xml
   [smoker]
   [smoker] resolve:
   [smoker]
   [smoker] init:
   [smoker]
   [smoker] compile-lucene-core:
   [smoker]
   [smoker] compile-codecs:
   [smoker]
   [smoker] -check-git-state:
   [smoker]
   [smoker] -git-cleanroot:
   [smoker]
   [smoker] -copy-git-state:
   [smoker]
   [smoker] git-autoclean:
   [smoker]
   [smoker] ivy-availability-check:
   [smoker] [loadresource] Do not set property disallowed.ivy.jars.list as its length is 0.
   [smoker]
   [smoker] -ivy-fail-disallowed-ivy-version:
   [smoker]
   [smoker] ivy-fail:
   [smoker]
   [smoker] ivy-configure:
   [smoker] [ivy:configure] :: loading settings :: file = /home/jenkins/jenkins-slave/workspace/Lucene-Solr-SmokeRelease-7.2/lucene/build/smokeTestRelease/tmp/unpack/solr-7.2.1/lucene/top-level-ivy-settings.xml
   [smoker]
   [smoker] resolve:
   [smoker]
   [smoker] common.init:
   [smoker]
   [smoker] compile-lucene-core:
   [smoker]
   [smoker] init:
   [smoker]
   [smoker] -clover.disable:
   [smoker]
   [smoker] -clover.load:
   [smoker]
   [smoker] -clover.classpath:
   [smoker]
   [smoker] -clover.setup:
   [smoker]
   [smoker] clover:
   [smoker]
   [smoker] compile-core:
   [smoker]
   [smoker] -clover.disable:
   [smoker]
   [smoker] -clover.load:
   [smoker]
   [smoker] -clover.classpath:
   [smoker]
   [smoker] -clover.setup:
   [smoker]
   [smoker] clover:
   [smoker]
   [smoker] common.compile-core:
   [smoker]
   [smoker] compile-core:
   [smoker]
   [smoker] common.compile-test:
   [smoker]
   [smoker] -compile-analysis-extras:
   [smoker]
   [smoker] check-analyzers-icu-uptodate:
   [smoker]
   [smoker] jar-analyzers-icu:
   [smoker]
   [smoker] compile-solr-core:
   [smoker]
   [smoker] compile-solrj:
   [smoker]
   [smoker] check-lucene-core-uptodate:
   [smoker]
   [smoker] jar-lucene-core:
   [smoker]
   [smoker] check-backward-codecs-uptodate:
   [smoker]
   [smoker] jar-backward-codecs:
   [smoker]
   [smoker] check-analyzers-phonetic-uptodate:
   [smoker]
   [smoker] jar-analyzers-phonetic:
   [smoker]
   [smoker] check-analyzers-kuromoji-uptodate:
   [smoker]
   [smoker] jar-analyzers-kuromoji:
   [smoker]
   [smoker] check-codecs-uptodate:
   [smoker]
   [smoker] jar-codecs:
   [smoker]
   [smoker] check-expressions-uptodate:
   [smoker]
   [smoker] jar-expressions:
   [smoker]
   [smoker] check-suggest-uptodate:
   [smoker]
   [smoker] jar-suggest:
   [smoker]
   [smoker] check-highlighter-uptodate:
   [smoker]
   [smoker] jar-highlighter:
   [smoker]
   [smoker] check-memory-uptodate:
   [smoker]
   [smoker] jar-memory:
   [smoker]
   [smoker] check-misc-uptodate:
   [smoker]
   [smoker] jar-misc:
   [smoker]
   [smoker] check-spatial-extras-uptodate:
   [smoker]
   [smoker] jar-spatial-extras:
   [smoker]
   [smoker] check-spatial3d-uptodate:
   [smoker]
   [smoker] jar-spatial3d:
   [smoker]
   [smoker] check-grouping-uptodate:
   [smoker]
   [smoker] jar-grouping:
   [smoker]
   [smoker] check-queries-uptodate:
   [smoker]
   [smoker] jar-queries:
   [smoker]
   [smoker] check-queryparser-uptodate:
   [smoker]
   [smoker] jar-queryparser:
   [smoker]
   [smoker] check-join-uptodate:
   [smoker]
   [smoker] jar-join:
   [smoker]
   [smoker] check-sandbox-uptodate:
   [smoker]
   [smoker] jar-sandbox:
   [smoker]
   [smoker] check-classification-uptodate:
   [smoker]
   [smoker] jar-classification:
   [smoker]
   [smoker] prep-lucene-jars:
   [smoker]
   [smoker] resolve-example:
   [smoker]
   [smoker] ivy-availability-check:
   [smoker] [loadresource] Do not set property disallowed.ivy.jars.list as its length is 0.
   [smoker]
   [smoker] -ivy-fail-disallowed-ivy-version:
   [smoker]
   [smoker] ivy-fail:
   [smoker]
   [smoker] ivy-configure:
   [smoker] [ivy:configure] :: loading settings :: file = /home/jenkins/jenkins-slave/workspace/Lucene-Solr-SmokeRelease-7.2/lucene/build/smokeTestRelease/tmp/unpack/solr-7.2.1/lucene/top-level-ivy-settings.xml
   [smoker]
   [smoker] resolve:
   [smoker]
   [smoker] resolve-server:
   [smoker]
   [smoker] ivy-availability-check:
   [smoker] [loadresource] Do not set property disallowed.ivy.jars.list as its length is 0.
   [smoker]
   [smoker] -ivy-fail-disallowed-ivy-version:
   [smoker]
   [smoker] ivy-fail:
   [smoker]
   [smoker] ivy-fail:
   [smoker]
   [smoker] ivy-configure:
   [smoker] [ivy:configure] :: loading settings :: file = /home/jenkins/jenkins-slave/workspace/Lucene-Solr-SmokeRelease-7.2/lucene/build/smokeTestRelease/tmp/unpack/solr-7.2.1/lucene/top-level-ivy-settings.xml
   [smoker]
   [smoker] resolve:
   [smoker]
   [smoker] -check-git-state:
   [smoker]
   [smoker] -git-cleanroot:
   [smoker]
   [smoker] -copy-git-state:
   [smoker]
   [smoker] git-autoclean:
   [smoker]
   [smoker] ivy-availability-check:
   [smoker] [loadresource] Do not set property disallowed.ivy.jars.list as its length is 0.
   [smoker]
   [smoker] -ivy-fail-disallowed-ivy-version:
   [smoker]
   [smoker] ivy-fail:
   [smoker]
   [smoker] ivy-fail:
   [smoker]
   [smoker] ivy-configure:
   [smoker] [ivy:configure] :: loading settings :: file = /home/jenkins/jenkins-slave/workspace/Lucene-Solr-SmokeRelease-7.2/lucene/build/smokeTestRelease/tmp/unpack/solr-7.2.1/lucene/top-level-ivy-settings.xml
   [smoker]
   [smoker] resolve:
   [smoker]
   [smoker] common.init:
   [smoker]
   [smoker] compile-lucene-core:
   [smoker]
   [smoker] -check-git-state:
   [smoker]
   [smoker] -git-cleanroot:
   [smoker]
   [smoker] -copy-git-state:
   [smoker]
   [smoker] git-autoclean:
   [smoker]
   [smoker] ivy-availability-check:
   [smoker] [loadresource] Do not set property disallowed.ivy.jars.list as its length is 0.
   [smoker]
   [smoker] -ivy-fail-disallowed-ivy-version:
   [smoker]
   [smoker] ivy-fail:
   [smoker]
   [smoker] ivy-configure:
   [smoker] [ivy:configure] :: loading settings :: file = /home/jenkins/jenkins-slave/workspace/Lucene-Solr-SmokeRelease-7.2/lucene/build/smokeTestRelease/tmp/unpack/solr-7.2.1/lucene/top-level-ivy-settings.xml
   [smoker]
   [smoker] resolve:
   [smoker]
   [smoker] init:
   [smoker]
   [smoker] -clover.disable:
   [smoker]
   [smoker] -clover.load:
   [smoker]
   [smoker] -clover.classpath:
   [smoker]
   [smoker] -clover.setup:
   [smoker]
   [smoker] clover:
   [smoker]
   [smoker] compile-core:
   [smoker]
   [smoker] init:
   [smoker]
   [smoker] -clover.disable:
   [smoker]
   [smoker] -clover.load:
   [smoker]
   [smoker] -clover.classpath:
   [smoker]
   [smoker] -clover.setup:
   [smoker]
   [smoker] clover:
   [smoker]
   [smoker] common.compile-core:
   [smoker]     [mkdir] Created dir: /home/jenkins/jenkins-slave/workspace/Lucene-Solr-SmokeRelease-7.2/lucene/build/smokeTestRelease/tmp/unpack/solr-7.2.1/solr/build/solr-solrj/classes/java
   [smoker]     [javac] Compiling 538 source files to /home/jenkins/jenkins-slave/workspace/Lucene-Solr-SmokeRelease-7.2/lucene/build/smokeTestRelease/tmp/unpack/solr-7.2.1/solr/build/solr-solrj/classes/java
   [smoker]     [javac] Note: Some input files use or override a deprecated API.
   [smoker]     [javac] Note: Recompile with -Xlint:deprecation for details.
   [smoker]     [javac] Note: Some input files use unchecked or unsafe operations.
   [smoker]     [javac] Note: Recompile with -Xlint:unchecked for details.
   [smoker]     [javac] Creating empty /home/jenkins/jenkins-slave/workspace/Lucene-Solr-SmokeRelease-7.2/lucene/build/smokeTestRelease/tmp/unpack/solr-7.2.1/solr/build/solr-solrj/classes/java/org/apache/solr/client/solrj/beans/package-info.class
   [smoker]     [javac] Creating empty /home/jenkins/jenkins-slave/workspace/Lucene-Solr-SmokeRelease-7.2/lucene/build/smokeTestRelease/tmp/unpack/solr-7.2.1/solr/build/solr-solrj/classes/java/org/apache/solr/client/solrj/io/stream/expr/package-info.class
   [smoker]     [javac] Creating empty /home/jenkins/jenkins-slave/workspace/Lucene-Solr-SmokeRelease-7.2/lucene/build/smokeTestRelease/tmp/unpack/solr-7.2.1/solr/build/solr-solrj/classes/java/org/apache/solr/common/cloud/rule/package-info.class
   [smoker]     [javac] Creating empty /home/jenkins/jenkins-slave/workspace/Lucene-Solr-SmokeRelease-7.2/lucene/build/smokeTestRelease/tmp/unpack/solr-7.2.1/solr/build/solr-solrj/classes/java/org/apache/solr/common/luke/package-info.class
   [smoker]     [javac] Creating empty /home/jenkins/jenkins-slave/workspace/Lucene-Solr-SmokeRelease-7.2/lucene/build/smokeTestRelease/tmp/unpack/solr-7.2.1/solr/build/solr-solrj/classes/java/org/apache/solr/client/solrj/io/stream/package-info.class
   [smoker]     [javac] Creating empty /home/jenkins/jenkins-slave/workspace/Lucene-Solr-SmokeRelease-7.2/lucene/build/smokeTestRelease/tmp/unpack/solr-7.2.1/solr/build/solr-solrj/classes/java/org/apache/solr/client/solrj/io/ops/package-info.class
   [smoker]     [javac] Creating empty /home/jenkins/jenkins-slave/workspace/Lucene-Solr-SmokeRelease-7.2/lucene/build/smokeTestRelease/tmp/unpack/solr-7.2.1/solr/build/solr-solrj/classes/java/org/apache/solr/common/package-info.class
   [smoker]     [javac] Creating empty /home/jenkins/jenkins-slave/workspace/Lucene-Solr-SmokeRelease-7.2/lucene/build/smokeTestRelease/tmp/unpack/solr-7.2.1/solr/build/solr-solrj/classes/java/org/apache/solr/client/solrj/cloud/autoscaling/package-info.class
   [smoker]     [javac] Creating empty /home/jenkins/jenkins-slave/workspace/Lucene-Solr-SmokeRelease-7.2/lucene/build/smokeTestRelease/tmp/unpack/solr-7.2.1/solr/build/solr-solrj/classes/java/org/apache/solr/client/solrj/cloud/package-info.class
   [smoker]     [javac] Creating empty /home/jenkins/jenkins-slave/workspace/Lucene-Solr-SmokeRelease-7.2/lucene/build/smokeTestRelease/tmp/unpack/solr-7.2.1/solr/build/solr-solrj/classes/java/org/apache/solr/client/solrj/io/comp/package-info.class
   [smoker]     [javac] Creating empty /home/jenkins/jenkins-slave/workspace/Lucene-Solr-SmokeRelease-7.2/lucene/build/smokeTestRelease/tmp/unpack/solr-7.2.1/solr/build/solr-solrj/classes/java/org/apache/solr/client/solrj/util/package-info.class
   [smoker]     [javac] Creating empty /home/jenkins/jenkins-slave/workspace/Lucene-Solr-SmokeRelease-7.2/lucene/build/smokeTestRelease/tmp/unpack/solr-7.2.1/solr/build/solr-solrj/classes/java/org/apache/solr/client/solrj/request/schema/package-info.class
   [smoker]     [javac] Creating empty /home/jenkins/jenkins-slave/workspace/Lucene-Solr-SmokeRelease-7.2/lucene/build/smokeTestRelease/tmp/unpack/solr-7.2.1/solr/build/solr-solrj/classes/java/org/apache/solr/client/solrj/response/schema/package-info.class
   [smoker]     [javac] Creating empty /home/jenkins/jenkins-slave/workspace/Lucene-Solr-SmokeRelease-7.2/lucene/build/smokeTestRelease/tmp/unpack/solr-7.2.1/solr/build/solr-solrj/classes/java/org/apache/solr/client/solrj/response/package-info.class
   [smoker]     [javac] Creating empty /home/jenkins/jenkins-slave/workspace/Lucene-Solr-SmokeRelease-7.2/lucene/build/smokeTestRelease/tmp/unpack/solr-7.2.1/solr/build/solr-solrj/classes/java/org/apache/solr/common/util/package-info.class
   [smoker]     [javac] Creating empty /home/jenkins/jenkins-slave/workspace/Lucene-Solr-SmokeRelease-7.2/lucene/build/smokeTestRelease/tmp/unpack/solr-7.2.1/solr/build/solr-solrj/classes/java/org/apache/solr/client/solrj/request/package-info.class
   [smoker]     [javac] Creating empty /home/jenkins/jenkins-slave/workspace/Lucene-Solr-SmokeRelease-7.2/lucene/build/smokeTestRelease/tmp/unpack/solr-7.2.1/solr/build/solr-solrj/classes/java/org/apache/solr/client/solrj/package-info.class
   [smoker]     [javac] Creating empty /home/jenkins/jenkins-slave/workspace/Lucene-Solr-SmokeRelease-7.2/lucene/build/smokeTestRelease/tmp/unpack/solr-7.2.1/solr/build/solr-solrj/classes/java/org/apache/solr/common/cloud/package-info.class
   [smoker]     [javac] Creating empty /home/jenkins/jenkins-slave/workspace/Lucene-Solr-SmokeRelease-7.2/lucene/build/smokeTestRelease/tmp/unpack/solr-7.2.1/solr/build/solr-solrj/classes/java/org/apache/solr/common/params/package-info.class
   [smoker]     [javac] Creating empty /home/jenkins/jenkins-slave/workspace/Lucene-Solr-SmokeRelease-7.2/lucene/build/smokeTestRelease/tmp/unpack/solr-7.2.1/solr/build/solr-solrj/classes/java/org/apache/solr/client/solrj/impl/package-info.class
   [smoker]     [javac] Creating empty /home/jenkins/jenkins-slave/workspace/Lucene-Solr-SmokeRelease-7.2/lucene/build/smokeTestRelease/tmp/unpack/solr-7.2.1/solr/build/solr-solrj/classes/java/org/apache/solr/client/solrj/io/eq/package-info.class
   [smoker]     [javac] Creating empty /home/jenkins/jenkins-slave/workspace/Lucene-Solr-SmokeRelease-7.2/lucene/build/smokeTestRelease/tmp/unpack/solr-7.2.1/solr/build/solr-solrj/classes/java/org/apache/solr/client/solrj/io/eval/package-info.class
   [smoker]     [javac] Creating empty /home/jenkins/jenkins-slave/workspace/Lucene-Solr-SmokeRelease-7.2/lucene/build/smokeTestRelease/tmp/unpack/solr-7.2.1/solr/build/solr-solrj/classes/java/org/apache/solr/client/solrj/io/stream/metrics/package-info.class
   [smoker]     [javac] Creating empty /home/jenkins/jenkins-slave/workspace/Lucene-Solr-SmokeRelease-7.2/lucene/build/smokeTestRelease/tmp/unpack/solr-7.2.1/solr/build/solr-solrj/classes/java/org/apache/solr/client/solrj/io/sql/package-info.class
   [smoker]     [javac] Creating empty /home/jenkins/jenkins-slave/workspace/Lucene-Solr-SmokeRelease-7.2/lucene/build/smokeTestRelease/tmp/unpack/solr-7.2.1/solr/build/solr-solrj/classes/java/org/apache/solr/client/solrj/io/graph/package-info.class
   [smoker]     [javac] Creating empty /home/jenkins/jenkins-slave/workspace/Lucene-Solr-SmokeRelease-7.2/lucene/build/smokeTestRelease/tmp/unpack/solr-7.2.1/solr/build/solr-solrj/classes/java/org/apache/solr/client/solrj/io/package-info.class
   [smoker]      [copy] Copying 60 files to /home/jenkins/jenkins-slave/workspace/Lucene-Solr-SmokeRelease-7.2/lucene/build/smokeTestRelease/tmp/unpack/solr-7.2.1/solr/build/solr-solrj/classes/java
   [smoker]
   [smoker] compile-core:
   [smoker]
   [smoker] check-lucene-core-uptodate:
   [smoker]
   [smoker] jar-lucene-core:
   [smoker]
   [smoker] check-backward-codecs-uptodate:
   [smoker]
   [smoker] jar-backward-codecs:
   [smoker]
   [smoker] check-analyzers-phonetic-uptodate:
   [smoker]
   [smoker] jar-analyzers-phonetic:
   [smoker]
   [smoker] check-analyzers-kuromoji-uptodate:
   [smoker]
   [smoker] jar-analyzers-kuromoji:
   [smoker]
   [smoker] check-codecs-uptodate:
   [smoker]
   [smoker] jar-codecs:
   [smoker]
   [smoker] check-expressions-uptodate:
   [smoker]
   [smoker] jar-expressions:
   [smoker]
   [smoker] check-suggest-uptodate:
   [smoker]
   [smoker] jar-suggest:
   [smoker]
   [smoker] check-highlighter-uptodate:
   [smoker]
   [smoker] jar-highlighter:
   [smoker]
   [smoker] check-memory-uptodate:
   [smoker]
   [smoker] jar-memory:
   [smoker]
   [smoker] check-misc-uptodate:
   [smoker]
   [smoker] jar-misc:
   [smoker]
   [smoker] check-spatial-extras-uptodate:
   [smoker]
   [smoker] jar-spatial-extras:
   [smoker]
   [smoker] check-spatial3d-uptodate:
   [smoker]
   [smoker] jar-spatial3d:
   [smoker]
   [smoker] check-grouping-uptodate:
   [smoker]
   [smoker] jar-grouping:
   [smoker]
   [smoker] check-queries-uptodate:
   [smoker]
   [smoker] jar-queries:
   [smoker]
   [smoker] check-queryparser-uptodate:
   [smoker]
   [smoker] jar-queryparser:
   [smoker]
   [smoker] check-join-uptodate:
   [smoker]
   [smoker] jar-join:
   [smoker]
   [smoker] check-sandbox-uptodate:
   [smoker]
   [smoker] jar-sandbox:
   [smoker]
   [smoker] check-classification-uptodate:
   [smoker]
   [smoker] jar-classification:
   [smoker]
   [smoker] prep-lucene-jars:
   [smoker]
   [smoker] resolve-example:
   [smoker]
   [smoker] ivy-availability-check:
   [smoker] [loadresource] Do not set property disallowed.ivy.jars.list as its length is 0.
   [smoker]
   [smoker] -ivy-fail-disallowed-ivy-version:
   [smoker]
   [smoker] ivy-fail:
   [smoker]
   [smoker] ivy-configure:
   [smoker] [ivy:configure] :: loading settings :: file = /home/jenkins/jenkins-slave/workspace/Lucene-Solr-SmokeRelease-7.2/lucene/build/smokeTestRelease/tmp/unpack/solr-7.2.1/lucene/top-level-ivy-settings.xml
   [smoker]
   [smoker] resolve:
   [smoker]
   [smoker] resolve-server:
   [smoker]
   [smoker] ivy-availability-check:
   [smoker] [loadresource] Do not set property disallowed.ivy.jars.list as its length is 0.
   [smoker]
   [smoker] -ivy-fail-disallowed-ivy-version:
   [smoker]
   [smoker] ivy-fail:
   [smoker]
   [smoker] ivy-fail:
   [smoker]
   [smoker] ivy-configure:
   [smoker] [ivy:configure] :: loading settings :: file = /home/jenkins/jenkins-slave/workspace/Lucene-Solr-SmokeRelease-7.2/lucene/build/smokeTestRelease/tmp/unpack/solr-7.2.1/lucene/top-level-ivy-settings.xml
   [smoker]
   [smoker] resolve:
   [smoker]
   [smoker] -check-git-state:
   [smoker]
   [smoker] -git-cleanroot:
   [smoker]
   [smoker] -copy-git-state:
   [smoker]
   [smoker] git-autoclean:
   [smoker]
   [smoker] ivy-availability-check:
   [smoker] [loadresource] Do not set property disallowed.ivy.jars.list as its length is 0.
   [smoker]
   [smoker] -ivy-fail-disallowed-ivy-version:
   [smoker]
   [smoker] ivy-fail:
   [smoker]
   [smoker] ivy-fail:
   [smoker]
   [smoker] ivy-configure:
   [smoker] [ivy:configure] :: loading settings :: file = /home/jenkins/jenkins-slave/workspace/Lucene-Solr-SmokeRelease-7.2/lucene/build/smokeTestRelease/tmp/unpack/solr-7.2.1/lucene/top-level-ivy-settings.xml
   [smoker]
   [smoker] resolve:
   [smoker]
   [smoker] common.init:
   [smoker]
   [smoker] compile-lucene-core:
   [smoker]
   [smoker] -check-git-state:
   [smoker]
   [smoker] -git-cleanroot:
   [smoker]
   [smoker] -copy-git-state:
   [smoker]
   [smoker] git-autoclean:
   [smoker]
   [smoker] ivy-availability-check:
   [smoker] [loadresource] Do not set property disallowed.ivy.jars.list as its length is 0.
   [smoker]
   [smoker] -ivy-fail-disallowed-ivy-version:
   [smoker]
   [smoker] ivy-fail:
   [smoker]
   [smoker] ivy-configure:
   [smoker] [ivy:configure] :: loading settings :: file = /home/jenkins/jenkins-slave/workspace/Lucene-Solr-SmokeRelease-7.2/lucene/build/smokeTestRelease/tmp/unpack/solr-7.2.1/lucene/top-level-ivy-settings.xml
   [smoker]
   [smoker] resolve:
   [smoker]
   [smoker] init:
   [smoker]
   [smoker] -clover.disable:
   [smoker]
   [smoker] -clover.load:
   [smoker]
   [smoker] -clover.classpath:
   [smoker]
   [smoker] -clover.setup:
   [smoker]
   [smoker] clover:
   [smoker]
   [smoker] compile-core:
   [smoker]
   [smoker] init:
   [smoker]
   [smoker] -clover.disable:
   [smoker]
   [smoker] -clover.load:
   [smoker]
   [smoker] -clover.classpath:
   [smoker]
   [smoker] -clover.setup:
   [smoker]
   [smoker] clover:
   [smoker]
   [smoker] common.compile-core:
   [smoker]     [mkdir] Created dir: /home/jenkins/jenkins-slave/workspace/Lucene-Solr-SmokeRelease-7.2/lucene/build/smokeTestRelease/tmp/unpack/solr-7.2.1/solr/build/solr-core/classes/java
   [smoker]     [javac] Compiling 1156 source files to /home/jenkins/jenkins-slave/workspace/Lucene-Solr-SmokeRelease-7.2/lucene/build/smokeTestRelease/tmp/unpack/solr-7.2.1/solr/build/solr-core/classes/java
   [smoker]     [javac] Note: Some input files use or override a deprecated API.
   [smoker]     [javac] Note: Recompile with -Xlint:deprecation for details.
   [smoker]     [javac] Note: Some input files use unchecked or unsafe operations.
   [smoker]     [javac] Note: Recompile with -Xlint:unchecked for details.
   [smoker]     [javac] Creating empty /home/jenkins/jenkins-slave/workspace/Lucene-Solr-SmokeRelease-7.2/lucene/build/smokeTestRelease/tmp/unpack/solr-7.2.1/solr/build/solr-core/classes/java/org/apache/solr/logging/log4j/package-info.class
   [smoker]     [javac] Creating empty /home/jenkins/jenkins-slave/workspace/Lucene-Solr-SmokeRelease-7.2/lucene/build/smokeTestRelease/tmp/unpack/solr-7.2.1/solr/build/solr-core/classes/java/org/apache/solr/client/solrj/embedded/package-info.class
   [smoker]     [javac] Creating empty /home/jenkins/jenkins-slave/workspace/Lucene-Solr-SmokeRelease-7.2/lucene/build/smokeTestRelease/tmp/unpack/solr-7.2.1/solr/build/solr-core/classes/java/org/apache/solr/internal/csv/package-info.class
   [smoker]     [javac] Creating empty /home/jenkins/jenkins-slave/workspace/Lucene-Solr-SmokeRelease-7.2/lucene/build/smokeTestRelease/tmp/unpack/solr-7.2.1/solr/build/solr-core/classes/java/org/apache/solr/search/function/distance/package-info.class
   [smoker]     [javac] Creating empty /home/jenkins/jenkins-slave/workspace/Lucene-Solr-SmokeRelease-7.2/lucene/build/smokeTestRelease/tmp/unpack/solr-7.2.1/solr/build/solr-core/classes/java/org/apache/solr/search/grouping/distributed/requestfactory/package-info.class
   [smoker]     [javac] Creating empty /home/jenkins/jenkins-slave/workspace/Lucene-Solr-SmokeRelease-7.2/lucene/build/smokeTestRelease/tmp/unpack/solr-7.2.1/solr/build/solr-core/classes/java/org/apache/solr/search/grouping/collector/package-info.class
   [smoker]     [javac] Creating empty /home/jenkins/jenkins-slave/workspace/Lucene-Solr-SmokeRelease-7.2/lucene/build/smokeTestRelease/tmp/unpack/solr-7.2.1/solr/build/solr-core/classes/java/org/apache/solr/search/grouping/distributed/command/package-info.class
   [smoker]     [javac] Creating empty /home/jenkins/jenkins-slave/workspace/Lucene-Solr-SmokeRelease-7.2/lucene/build/smokeTestRelease/tmp/unpack/solr-7.2.1/solr/build/solr-core/classes/java/org/apache/solr/spelling/package-info.class
   [smoker]     [javac] Creating empty /home/jenkins/jenkins-slave/workspace/Lucene-Solr-SmokeRelease-7.2/lucene/build/smokeTestRelease/tmp/unpack/solr-7.2.1/solr/build/solr-core/classes/java/org/apache/solr/cloud/package-info.class
   [smoker]     [javac] Creating empty /home/jenkins/jenkins-slave/workspace/Lucene-Solr-SmokeRelease-7.2/lucene/build/smokeTestRelease/tmp/unpack/solr-7.2.1/solr/build/solr-core/classes/java/org/apache/solr/uninverting/package-info.class
   [smoker]     [javac] Creating empty /home/jenkins/jenkins-slave/workspace/Lucene-Solr-SmokeRelease-7.2/lucene/build/smokeTestRelease/tmp/unpack/solr-7.2.1/solr/build/solr-core/classes/java/org/apache/solr/spelling/suggest/fst/package-info.class
   [smoker]     [javac] Creating empty /home/jenkins/jenkins-slave/workspace/Lucene-Solr-SmokeRelease-7.2/lucene/build/smokeTestRelease/tmp/unpack/solr-7.2.1/solr/build/solr-core/classes/java/org/apache/solr/util/plugin/package-info.class
   [smoker]     [javac] Creating empty /home/jenkins/jenkins-slave/workspace/Lucene-Solr-SmokeRelease-7.2/lucene/build/smokeTestRelease/tmp/unpack/solr-7.2.1/solr/build/solr-core/classes/java/org/apache/solr/search/function/package-info.class
   [smoker]     [javac] Creating empty /home/jenkins/jenkins-slave/workspace/Lucene-Solr-SmokeRelease-7.2/lucene/build/smokeTestRelease/tmp/unpack/solr-7.2.1/solr/build/solr-core/classes/java/org/apache/solr/store/blockcache/package-info.class
   [smoker]     [javac] Creating empty /home/jenkins/jenkins-slave/workspace/Lucene-Solr-SmokeRelease-7.2/lucene/build/smokeTestRelease/tmp/unpack/solr-7.2.1/solr/build/solr-core/classes/java/org/apache/solr/index/package-info.class
   [smoker]     [javac] Creating empty /home/jenkins/jenkins-slave/workspace/Lucene-Solr-SmokeRelease-7.2/lucene/build/smokeTestRelease/tmp/unpack/solr-7.2.1/solr/build/solr-core/classes/java/org/apache/solr/util/hll/package-info.class
   [smoker]     [javac] Creating empty /home/jenkins/jenkins-slave/workspace/Lucene-Solr-SmokeRelease-7.2/lucene/build/smokeTestRelease/tmp/unpack/solr-7.2.1/solr/build/solr-core/classes/java/org/apache/solr/search/package-info.class
   [smoker]     [javac] Creating empty /home/jenkins/jenkins-slave/workspace/Lucene-Solr-SmokeRelease-7.2/lucene/build/smokeTestRelease/tmp/unpack/solr-7.2.1/solr/build/solr-core/classes/java/org/apache/solr/metrics/reporters/solr/package-info.class
   [smoker]     [javac] Creating empty /home/jenkins/jenkins-slave/workspace/Lucene-Solr-SmokeRelease-7.2/lucene/build/smokeTestRelease/tmp/unpack/solr-7.2.1/solr/build/solr-core/classes/java/org/apache/solr/analysis/package-info.class
   [smoker]     [javac] Creating empty /home/jenkins/jenkins-slave/workspace/Lucene-Solr-SmokeRelease-7.2/lucene/build/smokeTestRelease/tmp/unpack/solr-7.2.1/solr/build/solr-core/classes/java/org/apache/solr/handler/package-info.class
   [smoker]     [javac] Creating empty /home/jenkins/jenkins-slave/workspace/Lucene-Solr-SmokeRelease-7.2/lucene/build/smokeTestRelease/tmp/unpack/solr-7.2.1/solr/build/solr-core/classes/java/org/apache/solr/search/grouping/distributed/responseprocessor/package-info.class
   [smoker]     [javac] Creating empty /home/jenkins/jenkins-slave/workspace/Lucene-Solr-SmokeRelease-7.2/lucene/build/smokeTestRelease/tmp/unpack/solr-7.2.1/solr/build/solr-core/classes/java/org/apache/solr/search/join/package-info.class
   [smoker]     [javac] Creating empty /home/jenkins/jenkins-slave/workspace/Lucene-Solr-SmokeRelease-7.2/lucene/build/smokeTestRelease/tmp/unpack/solr-7.2.1/solr/build/solr-core/classes/java/org/apache/solr/security/package-info.class
   [smoker]     [javac] Creating empty /home/jenkins/jenkins-slave/workspace/Lucene-Solr-SmokeRelease-7.2/lucene/build/smokeTestRelease/tmp/unpack/solr-7.2.1/solr/build/solr-core/classes/java/org/apache/solr/cloud/rule/package-info.class
   [smoker]     [javac] Creating empty /home/jenkins/jenkins-slave/workspace/Lucene-Solr-SmokeRelease-7.2/lucene/build/smokeTestRelease/tmp/unpack/solr-7.2.1/solr/build/solr-core/classes/java/org/apache/solr/index/hdfs/package-info.class
   [smoker]     [javac] Creating empty /home/jenkins/jenkins-slave/workspace/Lucene-Solr-SmokeRelease-7.2/lucene/build/smokeTestRelease/tmp/unpack/solr-7.2.1/solr/build/solr-core/classes/java/org/apache/solr/cloud/overseer/package-info.class
   [smoker]     [javac] Creating empty /home/jenkins/jenkins-slave/workspace/Lucene-Solr-SmokeRelease-7.2/lucene/build/smokeTestRelease/tmp/unpack/solr-7.2.1/solr/build/solr-core/classes/java/org/apache/solr/rest/package-info.class
   [smoker]     [javac] Creating empty /home/jenkins/jenkins-slave/workspace/Lucene-Solr-SmokeRelease-7.2/lucene/build/smokeTestRelease/tmp/unpack/solr-7.2.1/solr/build/solr-core/classes/java/org/apache/solr/core/backup/package-info.class
   [smoker]     [javac] Creating empty /home/jenkins/jenkins-slave/workspace/Lucene-Solr-SmokeRelease-7.2/lucene/build/smokeTestRelease/tmp/unpack/solr-7.2.1/solr/build/solr-core/classes/java/org/apache/solr/spelling/suggest/jaspell/package-info.class
   [smoker]     [javac] Creating empty /home/jenkins/jenkins-slave/workspace/Lucene-Solr-SmokeRelease-7.2/lucene/build/smokeTestRelease/tmp/unpack/solr-7.2.1/solr/build/solr-core/classes/java/org/apache/solr/search/grouping/package-info.class
   [smoker]     [javac] Creating empty /home/jenkins/jenkins-slave/workspace/Lucene-Solr-SmokeRelease-7.2/lucene/build/smokeTestRelease/tmp/unpack/solr-7.2.1/solr/build/solr-core/classes/java/org/apache/solr/servlet/package-info.class
   [smoker]     [javac] Creating empty /home/jenkins/jenkins-slave/workspace/Lucene-Solr-SmokeRelease-7.2/lucene/build/smokeTestRelease/tmp/unpack/solr-7.2.1/solr/build/solr-core/classes/java/org/apache/solr/schema/package-info.class
   [smoker]     [javac] Creating empty /home/jenkins/jenkins-slave/workspace/Lucene-Solr-SmokeRelease-7.2/lucene/build/smokeTestRelease/tmp/unpack/solr-7.2.1/solr/build/solr-core/classes/java/org/apache/solr/search/grouping/distributed/package-info.class
   [smoker]     [javac] Creating empty /home/jenkins/jenkins-slave/workspace/Lucene-Solr-SmokeRelease-7.2/lucene/build/smokeTestRelease/tmp/unpack/solr-7.2.1/solr/build/solr-core/classes/java/org/apache/solr/handler/loader/package-info.class
   [smoker]     [javac] Creating empty /home/jenkins/jenkins-slave/workspace/Lucene-Solr-SmokeRelease-7.2/lucene/build/smokeTestRelease/tmp/unpack/solr-7.2.1/solr/build/solr-core/classes/java/org/apache/solr/handler/sql/package-info.class
   [smoker]     [javac] Creating empty /home/jenkins/jenkins-slave/workspace/Lucene-Solr-SmokeRelease-7.2/lucene/build/smokeTestRelease/tmp/unpack/solr-7.2.1/solr/build/solr-core/classes/java/org/apache/solr/legacy/package-info.class
   [smoker]     [javac] Creating empty /home/jenkins/jenkins-slave/workspace/Lucene-Solr-SmokeRelease-7.2/lucene/build/smokeTestRelease/tmp/unpack/solr-7.2.1/solr/build/solr-core/classes/java/org/apache/solr/response/package-info.class
   [smoker]     [javac] Creating empty /home/jenkins/jenkins-slave/workspace/Lucene-Solr-SmokeRelease-7.2/lucene/build/smokeTestRelease/tmp/unpack/solr-7.2.1/solr/build/solr-core/classes/java/org/apache/solr/search/stats/package-info.class
   [smoker]     [javac] Creating empty /home/jenkins/jenkins-slave/workspace/Lucene-Solr-SmokeRelease-7.2/lucene/build/smokeTestRelease/tmp/unpack/solr-7.2.1/solr/build/solr-core/classes/java/org/apache/solr/util/package-info.class
   [smoker]     [javac] Creating empty /home/jenkins/jenkins-slave/workspace/Lucene-Solr-SmokeRelease-7.2/lucene/build/smokeTestRelease/tmp/unpack/solr-7.2.1/solr/build/solr-core/classes/java/org/apache/solr/search/grouping/endresulttransformer/package-info.class
   [smoker]     [javac] Creating empty /home/jenkins/jenkins-slave/workspace/Lucene-Solr-SmokeRelease-7.2/lucene/build/smokeTestRelease/tmp/unpack/solr-7.2.1/solr/build/solr-core/classes/java/org/apache/solr/rest/schema/analysis/package-info.class
   [smoker]     [javac] Creating empty /home/jenkins/jenkins-slave/workspace/Lucene-Solr-SmokeRelease-7.2/lucene/build/smokeTestRelease/tmp/unpack/solr-7.2.1/solr/build/solr-core/classes/java/org/apache/solr/handler/admin/package-info.class
   [smoker]     [javac] Creating empty /home/jenkins/jenkins-slave/workspace/Lucene-Solr-SmokeRelease-7.2/lucene/build/smokeTestRelease/tmp/unpack/solr-7.2.1/solr/build/solr-core/classes/java/org/apache/solr/search/similarities/package-info.class
   [smoker]     [javac] Creating empty /home/jenkins/jenkins-slave/workspace/Lucene-Solr-SmokeRelease-7.2/lucene/build/smokeTestRelease/tmp/unpack/solr-7.2.1/solr/build/solr-core/classes/java/org/apache/solr/spelling/suggest/tst/package-info.class
   [smoker]     [javac] Creating empty /home/jenkins/jenkins-slave/workspace/Lucene-Solr-SmokeRelease-7.2/lucene/build/smokeTestRelease/tmp/unpack/solr-7.2.1/solr/build/solr-core/classes/java/org/apache/solr/util/stats/package-info.class
   [smoker]     [javac] Creating empty /home/jenkins/jenkins-slave/workspace/Lucene-Solr-SmokeRelease-7.2/lucene/build/smokeTestRelease/tmp/unpack/solr-7.2.1/solr/build/solr-core/classes/java/org/apache/solr/response/transform/package-info.class
   [smoker]     [javac] Creating empty /home/jenkins/jenkins-slave/workspace/Lucene-Solr-SmokeRelease-7.2/lucene/build/smokeTestRelease/tmp/unpack/solr-7.2.1/solr/build/solr-core/classes/java/org/apache/solr/search/grouping/distributed/shardresultserializer/package-info.class
   [smoker]     [javac] Creating empty /home/jenkins/jenkins-slave/workspace/Lucene-Solr-SmokeRelease-7.2/lucene/build/smokeTestRelease/tmp/unpack/solr-7.2.1/solr/build/solr-core/classes/java/org/apache/solr/update/processor/package-info.class
   [smoker]     [javac] Creating empty /home/jenkins/jenkins-slave/workspace/Lucene-Solr-SmokeRelease-7.2/lucene/build/smokeTestRelease/tmp/unpack/solr-7.2.1/solr/build/solr-core/classes/java/org/apache/solr/metrics/reporters/package-info.class
   [smoker]     [javac] Creating empty /home/jenkins/jenkins-slave/workspace/Lucene-Solr-SmokeRelease-7.2/lucene/build/smokeTestRelease/tmp/unpack/solr-7.2.1/solr/build/solr-core/classes/java/org/apache/solr/core/snapshots/package-info.class
   [smoker]     [javac] Creating empty /home/jenkins/jenkins-slave/workspace/Lucene-Solr-SmokeRelease-7.2/lucene/build/smokeTestRelease/tmp/unpack/solr-7.2.1/solr/build/solr-core/classes/java/org/apache/solr/core/package-info.class
   [smoker]     [javac] Creating empty /home/jenkins/jenkins-slave/workspace/Lucene-Solr-SmokeRelease-7.2/lucene/build/smokeTestRelease/tmp/unpack/solr-7.2.1/solr/build/solr-core/classes/java/org/apache/solr/request/package-info.class
   [smoker]     [javac] Creating empty /home/jenkins/jenkins-slave/workspace/Lucene-Solr-SmokeRelease-7.2/lucene/build/smokeTestRelease/tmp/unpack/solr-7.2.1/solr/build/solr-core/classes/java/org/apache/solr/search/mlt/package-info.class
   [smoker]     [javac] Creating empty /home/jenkins/jenkins-slave/workspace/Lucene-Solr-SmokeRelease-7.2/lucene/build/smokeTestRelease/tmp/unpack/solr-7.2.1/solr/build/solr-core/classes/java/org/apache/solr/logging/jul/package-info.class
   [smoker]     [javac] Creating empty /home/jenkins/jenkins-slave/workspace/Lucene-Solr-SmokeRelease-7.2/lucene/build/smokeTestRelease/tmp/unpack/solr-7.2.1/solr/build/solr-core/classes/java/org/apache/solr/rest/schema/package-info.class
   [smoker]     [javac] Creating empty /home/jenkins/jenkins-slave/workspace/Lucene-Solr-SmokeRelease-7.2/lucene/build/smokeTestRelease/tmp/unpack/solr-7.2.1/solr/build/solr-core/classes/java/org/apache/solr/util/configuration/package-info.class
   [smoker]     [javac] Creating empty /home/jenkins/jenkins-slave/workspace/Lucene-Solr-SmokeRelease-7.2/lucene/build/smokeTestRelease/tmp/unpack/solr-7.2.1/solr/build/solr-core/classes/java/org/apache/solr/highlight/package-info.class
   [smoker]     [javac] Creating empty /home/jenkins/jenkins-slave/workspace/Lucene-Solr-SmokeRelease-7.2/lucene/build/smokeTestRelease/tmp/unpack/solr-7.2.1/solr/build/solr-core/classes/java/org/apache/solr/metrics/package-info.class
   [smoker]     [javac] Creating empty /home/jenkins/jenkins-slave/workspace/Lucene-Solr-SmokeRelease-7.2/lucene/build/smokeTestRelease/tmp/unpack/solr-7.2.1/solr/build/solr-core/classes/java/org/apache/solr/servlet/cache/package-info.class
   [smoker]     [javac] Creating empty /home/jenkins/jenkins-slave/workspace/Lucene-Solr-SmokeRelease-7.2/lucene/build/smokeTestRelease/tmp/unpack/solr-7.2.1/solr/build/solr-core/classes/java/org/apache/solr/metrics/reporters/jmx/package-info.class
   [smoker]     [javac] Creating empty /home/jenkins/jenkins-slave/workspace/Lucene-Solr-SmokeRelease-7.2/lucene/build/smokeTestRelease/tmp/unpack/solr-7.2.1/solr/build/solr-core/classes/java/org/apache/solr/core/backup/repository/package-info.class
   [smoker]     [javac] Creating empty /home/jenkins/jenkins-slave/workspace/Lucene-Solr-SmokeRelease-7.2/lucene/build/smokeTestRelease/tmp/unpack/solr-7.2.1/solr/build/solr-core/classes/java/org/apache/solr/package-info.class
   [smoker]     [javac] Creating empty /home/jenkins/jenkins-slave/workspace/Lucene-Solr-SmokeRelease-7.2/lucene/build/smokeTestRelease/tmp/unpack/solr-7.2.1/solr/build/solr-core/classes/java/org/apache/solr/util/configuration/providers/package-info.class
   [smoker]     [javac] Creating empty /home/jenkins/jenkins-slave/workspace/Lucene-Solr-SmokeRelease-7.2/lucene/build/smokeTestRelease/tmp/unpack/solr-7.2.1/solr/build/solr-core/classes/java/org/apache/solr/parser/package-info.class
   [smoker]     [javac] Creating empty /home/jenkins/jenkins-slave/workspace/Lucene-Solr-SmokeRelease-7.2/lucene/build/smokeTestRelease/tmp/unpack/solr-7.2.1/solr/build/solr-core/classes/java/org/apache/solr/api/package-info.class
   [smoker]     [javac] Creating empty /home/jenkins/jenkins-slave/workspace/Lucene-Solr-SmokeRelease-7.2/lucene/build/smokeTestRelease/tmp/unpack/solr-7.2.1/solr/build/solr-core/classes/java/org/apache/solr/cloud/autoscaling/package-info.class
   [smoker]     [javac] Creating empty /home/jenkins/jenkins-slave/workspace/Lucene-Solr-SmokeRelease-7.2/lucene/build/smokeTestRelease/tmp/unpack/solr-7.2.1/solr/build/solr-core/classes/java/org/apache/solr/store/hdfs/package-info.class
   [smoker]     [javac] Creating empty /home/jenkins/jenkins-slave/workspace/Lucene-Solr-SmokeRelease-7.2/lucene/build/smokeTestRelease/tmp/unpack/solr-7.2.1/solr/build/solr-core/classes/java/org/apache/solr/spelling/suggest/package-info.class
   [smoker]     [javac] Creating empty /home/jenkins/jenkins-slave/workspace/Lucene-Solr-SmokeRelease-7.2/lucene/build/smokeTestRelease/tmp/unpack/solr-7.2.1/solr/build/solr-core/classes/java/org/apache/solr/handler/component/package-info.class
   [smoker]     [javac] Creating empty /home/jenkins/jenkins-slave/workspace/Lucene-Solr-SmokeRelease-7.2/lucene/build/smokeTestRelease/tmp/unpack/solr-7.2.1/solr/build/solr-core/classes/java/org/apache/solr/logging/package-info.class
   [smoker]     [javac] Creating empty /home/jenkins/jenkins-slave/workspace/Lucene-Solr-SmokeRelease-7.2/lucene/build/smokeTestRelease/tmp/unpack/solr-7.2.1/solr/build/solr-core/classes/java/org/apache/solr/update/package-info.class
   [smoker]     [javac] Creating empty /home/jenkins/jenkins-slave/workspace/Lucene-Solr-SmokeRelease-7.2/lucene/build/smokeTestRelease/tmp/unpack/solr-7.2.1/solr/build/solr-core/classes/java/org/apache/solr/internal/csv/writer/package-info.class
   [smoker]     [javac] Creating empty /home/jenkins/jenkins-slave/workspace/Lucene-Solr-SmokeRelease-7.2/lucene/build/smokeTestRelease/tmp/unpack/solr-7.2.1/solr/build/solr-core/classes/java/org/apache/solr/util/xslt/package-info.class
   [smoker]      [copy] Copying 4 files to /home/jenkins/jenkins-slave/workspace/Lucene-Solr-SmokeRelease-7.2/lucene/build/smokeTestRelease/tmp/unpack/solr-7.2.1/solr/build/solr-core/classes/java
   [smoker]
   [smoker] common-solr.compile-core:
   [smoker]
   [smoker] compile-core:
   [smoker]
   [smoker] compile-solrj:
   [smoker]
   [smoker] check-lucene-core-uptodate:
   [smoker]
   [smoker] jar-lucene-core:
   [smoker]
   [smoker] check-backward-codecs-uptodate:
   [smoker]
   [smoker] jar-backward-codecs:
   [smoker]
   [smoker] check-analyzers-phonetic-uptodate:
   [smoker]
   [smoker] jar-analyzers-phonetic:
   [smoker]
   [smoker] check-analyzers-kuromoji-uptodate:
   [smoker]
   [smoker] jar-analyzers-kuromoji:
   [smoker]
   [smoker] check-codecs-uptodate:
   [smoker]
   [smoker] jar-codecs:
   [smoker]
   [smoker] check-expressions-uptodate:
   [smoker]
   [smoker] jar-expressions:
   [smoker]
   [smoker] check-suggest-uptodate:
   [smoker]
   [smoker] jar-suggest:
   [smoker]
   [smoker] check-highlighter-uptodate:
   [smoker]
   [smoker] jar-highlighter:
   [smoker]
   [smoker] check-memory-uptodate:
   [smoker]
   [smoker] jar-memory:
   [smoker]
   [smoker] check-misc-uptodate:
   [smoker]
   [smoker] jar-misc:
   [smoker]
   [smoker] check-spatial-extras-uptodate:
   [smoker]
   [smoker] jar-spatial-extras:
   [smoker]
   [smoker] check-spatial3d-uptodate:
   [smoker]
   [smoker] jar-spatial3d:
   [smoker]
   [smoker] check-grouping-uptodate:
   [smoker]
   [smoker] jar-grouping:
   [smoker]
   [smoker] check-queries-uptodate:
   [smoker]
   [smoker] jar-queries:
   [smoker]
   [smoker] check-queryparser-uptodate:
   [smoker]
   [smoker] jar-queryparser:
   [smoker]
   [smoker] check-join-uptodate:
   [smoker]
   [smoker] jar-join:
   [smoker]
   [smoker] check-sandbox-uptodate:
   [smoker]
   [smoker] jar-sandbox:
   [smoker]
   [smoker] check-classification-uptodate:
   [smoker]
   [smoker] jar-classification:
   [smoker]
   [smoker] prep-lucene-jars:
   [smoker]
   [smoker] resolve-example:
   [smoker]
   [smoker] ivy-availability-check:
   [smoker] [loadresource] Do not set property disallowed.ivy.jars.list as its length is 0.
   [smoker]
   [smoker] -ivy-fail-disallowed-ivy-version:
   [smoker]
   [smoker] ivy-fail:
   [smoker]
   [smoker] ivy-configure:
   [smoker] [ivy:configure] :: loading settings :: file = /home/jenkins/jenkins-slave/workspace/Lucene-Solr-SmokeRelease-7.2/lucene/build/smokeTestRelease/tmp/unpack/solr-7.2.1/lucene/top-level-ivy-settings.xml
   [smoker]
   [smoker] resolve:
   [smoker]
   [smoker] resolve-server:
   [smoker]
   [smoker] ivy-availability-check:
   [smoker] [loadresource] Do not set property disallowed.ivy.jars.list as its length is 0.
   [smoker]
   [smoker] -ivy-fail-disallowed-ivy-version:
   [smoker]
   [smoker] ivy-fail:
   [smoker]
   [smoker] ivy-fail:
   [smoker]
   [smoker] ivy-configure:
   [smoker] [ivy:configure] :: loading settings :: file = /home/jenkins/jenkins-slave/workspace/Lucene-Solr-SmokeRelease-7.2/lucene/build/smokeTestRelease/tmp/unpack/solr-7.2.1/lucene/top-level-ivy-settings.xml
   [smoker]
   [smoker] resolve:
   [smoker]
   [smoker] -check-git-state:
   [smoker]
   [smoker] -git-cleanroot:
   [smoker]
   [smoker] -copy-git-state:
   [smoker]
   [smoker] git-autoclean:
   [smoker]
   [smoker] ivy-availability-check:
   [smoker] [loadresource] Do not set property disallowed.ivy.jars.list as its length is 0.
   [smoker]
   [smoker] -ivy-fail-disallowed-ivy-version:
   [smoker]
   [smoker] ivy-fail:
   [smoker]
   [smoker] ivy-fail:
   [smoker]
   [smoker] ivy-configure:
   [smoker] [ivy:configure] :: loading settings :: file = /home/jenkins/jenkins-slave/workspace/Lucene-Solr-SmokeRelease-7.2/lucene/build/smokeTestRelease/tmp/unpack/solr-7.2.1/lucene/top-level-ivy-settings.xml
   [smoker]
   [smoker] resolve:
   [smoker]
   [smoker] common.init:
   [smoker]
   [smoker] compile-lucene-core:
   [smoker]
   [smoker] -check-git-state:
   [smoker]
   [smoker] -git-cleanroot:
   [smoker]
   [smoker] -copy-git-state:
   [smoker]
   [smoker] git-autoclean:
   [smoker]
   [smoker] ivy-availability-check:
   [smoker] [loadresource] Do not set property disallowed.ivy.jars.list as its length is 0.
   [smoker]
   [smoker] -ivy-fail-disallowed-ivy-version:
   [smoker]
   [smoker] ivy-fail:
   [smoker]
   [smoker] ivy-configure:
   [smoker] [ivy:configure] :: loading settings :: file = /home/jenkins/jenkins-slave/workspace/Lucene-Solr-SmokeRelease-7.2/lucene/build/smokeTestRelease/tmp/unpack/solr-7.2.1/lucene/top-level-ivy-settings.xml
   [smoker]
   [smoker] resolve:
   [smoker]
   [smoker] init:
   [smoker]
   [smoker] -clover.disable:
   [smoker]
   [smoker] -clover.load:
   [smoker]
   [smoker] -clover.classpath:
   [smoker]
   [smoker] -clover.setup:
   [smoker]
   [smoker] clover:
   [smoker]
   [smoker] compile-core:
   [smoker]
   [smoker] init:
   [smoker]
   [smoker] -clover.disable:
   [smoker]
   [smoker] -clover.load:
   [smoker]
   [smoker] -clover.classpath:
   [smoker]
   [smoker] -clover.setup:
   [smoker]
   [smoker] clover:
   [smoker]
   [smoker] common.compile-core:
   [smoker]
   [smoker] compile-core:
   [smoker]
   [smoker] check-lucene-core-uptodate:
   [smoker]
   [smoker] jar-lucene-core:
   [smoker]
   [smoker] check-backward-codecs-uptodate:
   [smoker]
   [smoker] jar-backward-codecs:
   [smoker]
   [smoker] check-analyzers-phonetic-uptodate:
   [smoker]
   [smoker] jar-analyzers-phonetic:
   [smoker]
   [smoker] check-analyzers-kuromoji-uptodate:
   [smoker]
   [smoker] jar-analyzers-kuromoji:
   [smoker]
   [smoker] check-codecs-uptodate:
   [smoker]
   [smoker] jar-codecs:
   [smoker]
   [smoker] check-expressions-uptodate:
   [smoker]
   [smoker] jar-expressions:
   [smoker]
   [smoker] check-suggest-uptodate:
   [smoker]
   [smoker] jar-suggest:
   [smoker]
   [smoker] check-highlighter-uptodate:
   [smoker]
   [smoker] jar-highlighter:
   [smoker]
   [smoker] check-memory-uptodate:
   [smoker]
   [smoker] jar-memory:
   [smoker]
   [smoker] check-misc-uptodate:
   [smoker]
   [smoker] jar-misc:
   [smoker]
   [smoker] check-spatial-extras-uptodate:
   [smoker]
   [smoker] jar-spatial-extras:
   [smoker]
   [smoker] check-spatial3d-uptodate:
   [smoker]
   [smoker] jar-spatial3d:
   [smoker]
   [smoker] check-grouping-uptodate:
   [smoker]
   [smoker] jar-grouping:
   [smoker]
   [smoker] check-queries-uptodate:
   [smoker]
   [smoker] jar-queries:
   [smoker]
   [smoker] check-queryparser-uptodate:
   [smoker]
   [smoker] jar-queryparser:
   [smoker]
   [smoker] check-join-uptodate:
   [smoker]
   [smoker] jar-join:
   [smoker]
   [smoker] check-sandbox-uptodate:
   [smoker]
   [smoker] jar-sandbox:
   [smoker]
   [smoker] check-classification-uptodate:
   [smoker]
   [smoker] jar-classification:
   [smoker]
   [smoker] prep-lucene-jars:
   [smoker]
   [smoker] resolve-example:
   [smoker]
   [smoker] ivy-availability-check:
   [smoker] [loadresource] Do not set property disallowed.ivy.jars.list as its length is 0.
   [smoker]
   [smoker] -ivy-fail-disallowed-ivy-version:
   [smoker]
   [smoker] ivy-fail:
   [smoker]
   [smoker] ivy-configure:
   [smoker] [ivy:configure] :: loading settings :: file = /home/jenkins/jenkins-slave/workspace/Lucene-Solr-SmokeRelease-7.2/lucene/build/smokeTestRelease/tmp/unpack/solr-7.2.1/lucene/top-level-ivy-settings.xml
   [smoker]
   [smoker] resolve:
   [smoker]
   [smoker] resolve-server:
   [smoker]
   [smoker] ivy-availability-check:
   [smoker] [loadresource] Do not set property disallowed.ivy.jars.list as its length is 0.
   [smoker]
   [smoker] -ivy-fail-disallowed-ivy-version:
   [smoker]
   [smoker] ivy-fail:
   [smoker]
   [smoker] ivy-fail:
   [smoker]
   [smoker] ivy-configure:
   [smoker] [ivy:configure] :: loading settings :: file = /home/jenkins/jenkins-slave/workspace/Lucene-Solr-SmokeRelease-7.2/lucene/build/smokeTestRelease/tmp/unpack/solr-7.2.1/lucene/top-level-ivy-settings.xml
   [smoker]
   [smoker] resolve:
   [smoker]
   [smoker] -check-git-state:
   [smoker]
   [smoker] -git-cleanroot:
   [smoker]
   [smoker] -copy-git-state:
   [smoker]
   [smoker] git-autoclean:
   [smoker]
   [smoker] ivy-availability-check:
   [smoker] [loadresource] Do not set property disallowed.ivy.jars.list as its length is 0.
   [smoker]
   [smoker] -ivy-fail-disallowed-ivy-version:
   [smoker]
   [smoker] ivy-fail:
   [smoker]
   [smoker] ivy-fail:
   [smoker]
   [smoker] ivy-configure:
   [smoker] [ivy:configure] :: loading settings :: file = /home/jenkins/jenkins-slave/workspace/Lucene-Solr-SmokeRelease-7.2/lucene/build/smokeTestRelease/tmp/unpack/solr-7.2.1/lucene/top-level-ivy-settings.xml
   [smoker]
   [smoker] resolve:
   [smoker]
   [smoker] common.init:
   [smoker]
   [smoker] compile-lucene-core:
   [smoker]
   [smoker] -check-git-state:
   [smoker]
   [smoker] -git-cleanroot:
   [smoker]
   [smoker] -copy-git-state:
   [smoker]
   [smoker] git-autoclean:
   [smoker]
   [smoker] ivy-availability-check:
   [smoker] [loadresource] Do not set property disallowed.ivy.jars.list as its length is 0.
   [smoker]
   [smoker] -ivy-fail-disallowed-ivy-version:
   [smoker]
   [smoker] ivy-fail:
   [smoker]
   [smoker] ivy-configure:
   [smoker] [ivy:configure] :: loading settings :: file = /home/jenkins/jenkins-slave/workspace/Lucene-Solr-SmokeRelease-7.2/lucene/build/smokeTestRelease/tmp/unpack/solr-7.2.1/lucene/top-level-ivy-settings.xml
   [smoker]
   [smoker] resolve:
   [smoker]
   [smoker] init:
   [smoker]
   [smoker] -clover.disable:
   [smoker]
   [smoker] -clover.load:
   [smoker]
   [smoker] -clover.classpath:
   [smoker]
   [smoker] -clover.setup:
   [smoker]
   [smoker] clover:
   [smoker]
   [smoker] compile-core:
   [smoker]
   [smoker] init:
   [smoker]
   [smoker] -clover.disable:
   [smoker]
   [smoker] -clover.load:
   [smoker]
   [smoker] -clover.classpath:
   [smoker]
   [smoker] -clover.setup:
   [smoker]
   [smoker] clover:
   [smoker]
   [smoker] common.compile-core:
   [smoker]     [mkdir] Created dir: /home/jenkins/jenkins-slave/workspace/Lucene-Solr-SmokeRelease-7.2/lucene/build/smokeTestRelease/tmp/unpack/solr-7.2.1/solr/build/contrib/solr-analysis-extras/classes/java
   [smoker]     [javac] Compiling 1 source file to /home/jenkins/jenkins-slave/workspace/Lucene-Solr-SmokeRelease-7.2/lucene/build/smokeTestRelease/tmp/unpack/solr-7.2.1/solr/build/contrib/solr-analysis-extras/classes/java
   [smoker]     [javac] Note: /home/jenkins/jenkins-slave/workspace/Lucene-Solr-SmokeRelease-7.2/lucene/build/smokeTestRelease/tmp/unpack/solr-7.2.1/solr/contrib/analysis-extras/src/java/org/apache/solr/schema/ICUCollationField.java uses or overrides a deprecated API.
   [smoker]     [javac] Note: Recompile with -Xlint:deprecation for details.
   [smoker]
   [smoker] common-solr.compile-core:
   [smoker]
   [smoker] solr-contrib-build.compile-core:
   [smoker]
   [smoker] compile-core:
   [smoker]
   [smoker] compile:
   [smoker]
   [smoker] compile-solr-test-framework:
   [smoker]
   [smoker] ivy-availability-check:
   [smoker] [loadresource] Do not set property disallowed.ivy.jars.list as its length is 0.
   [smoker]
   [smoker] -ivy-fail-disallowed-ivy-version:
   [smoker]
   [smoker] ivy-fail:
   [smoker]
   [smoker] ivy-configure:
   [smoker] [ivy:configure] :: loading settings :: file = /home/jenkins/jenkins-slave/workspace/Lucene-Solr-SmokeRelease-7.2/lucene/build/smokeTestRelease/tmp/unpack/solr-7.2.1/lucene/top-level-ivy-settings.xml
   [smoker]
   [smoker] resolve:
   [smoker]
   [smoker] compile-solr-core:
   [smoker]
   [smoker] compile-solrj:
   [smoker]
   [smoker] check-lucene-core-uptodate:
   [smoker]
   [smoker] jar-lucene-core:
   [smoker]
   [smoker] check-backward-codecs-uptodate:
   [smoker]
   [smoker] jar-backward-codecs:
   [smoker]
   [smoker] check-analyzers-phonetic-uptodate:
   [smoker]
   [smoker] jar-analyzers-phonetic:
   [smoker]
   [smoker] check-analyzers-kuromoji-uptodate:
   [smoker]
   [smoker] jar-analyzers-kuromoji:
   [smoker]
   [smoker] check-codecs-uptodate:
   [smoker]
   [smoker] jar-codecs:
   [smoker]
   [smoker] check-expressions-uptodate:
   [smoker]
   [smoker] jar-expressions:
   [smoker]
   [smoker] check-suggest-uptodate:
   [smoker]
   [smoker] jar-suggest:
   [smoker]
   [smoker] check-highlighter-uptodate:
   [smoker]
   [smoker] jar-highlighter:
   [smoker]
   [smoker] check-memory-uptodate:
   [smoker]
   [smoker] jar-memory:
   [smoker]
   [smoker] check-misc-uptodate:
   [smoker]
   [smoker] jar-misc:
   [smoker]
   [smoker] check-spatial-extras-uptodate:
   [smoker]
   [smoker] jar-spatial-extras:
   [smoker]
   [smoker] check-spatial3d-uptodate:
   [smoker]
   [smoker] jar-spatial3d:
   [smoker]
   [smoker] check-grouping-uptodate:
   [smoker]
   [smoker] jar-grouping:
   [smoker]
   [smoker] check-queries-uptodate:
   [smoker]
   [smoker] jar-queries:
   [smoker]
   [smoker] check-queryparser-uptodate:
   [smoker]
   [smoker] jar-queryparser:
   [smoker]
   [smoker] check-join-uptodate:
   [smoker]
   [smoker] jar-join:
   [smoker]
   [smoker] check-sandbox-uptodate:
   [smoker]
   [smoker] jar-sandbox:
   [smoker]
   [smoker] check-classification-uptodate:
   [smoker]
   [smoker] jar-classification:
   [smoker]
   [smoker] prep-lucene-jars:
   [smoker]
   [smoker] resolve-example:
   [smoker]
   [smoker] ivy-availability-check:
   [smoker] [loadresource] Do not set property disallowed.ivy.jars.list as its length is 0.
   [smoker]
   [smoker] -ivy-fail-disallowed-ivy-version:
   [smoker]
   [smoker] ivy-fail:
   [smoker]
   [smoker] ivy-configure:
   [smoker] [ivy:configure] :: loading settings :: file = /home/jenkins/jenkins-slave/workspace/Lucene-Solr-SmokeRelease-7.2/lucene/build/smokeTestRelease/tmp/unpack/solr-7.2.1/lucene/top-level-ivy-settings.xml
   [smoker]
   [smoker] resolve:
   [smoker]
   [smoker] resolve-server:
   [smoker]
   [smoker] ivy-availability-check:
   [smoker] [loadresource] Do not set property disallowed.ivy.jars.list as its length is 0.
   [smoker]
   [smoker] -ivy-fail-disallowed-ivy-version:
   [smoker]
   [smoker] ivy-fail:
   [smoker]
   [smoker] ivy-fail:
   [smoker]
   [smoker] ivy-configure:
   [smoker] [ivy:configure] :: loading settings :: file = /home/jenkins/jenkins-slave/workspace/Lucene-Solr-SmokeRelease-7.2/lucene/build/smokeTestRelease/tmp/unpack/solr-7.2.1/lucene/top-level-ivy-settings.xml
   [smoker]
   [smoker] resolve:
   [smoker]
   [smoker] -check-git-state:
   [smoker]
   [smoker] -git-cleanroot:
   [smoker]
   [smoker] -copy-git-state:
   [smoker]
   [smoker] git-autoclean:
   [smoker]
   [smoker] ivy-availability-check:
   [smoker] [loadresource] Do not set property disallowed.ivy.jars.list as its length is 0.
   [smoker]
   [smoker] -ivy-fail-disallowed-ivy-version:
   [smoker]
   [smoker] ivy-fail:
   [smoker]
   [smoker] ivy-fail:
   [smoker]
   [smoker] ivy-configure:
   [smoker] [ivy:configure] :: loading settings :: file = /home/jenkins/jenkins-slave/workspace/Lucene-Solr-SmokeRelease-7.2/lucene/build/smokeTestRelease/tmp/unpack/solr-7.2.1/lucene/top-level-ivy-settings.xml
   [smoker]
   [smoker] resolve:
   [smoker]
   [smoker] common.init:
   [smoker]
   [smoker] compile-lucene-core:
   [smoker]
   [smoker] -check-git-state:
   [smoker]
   [smoker] -git-cleanroot:
   [smoker]
   [smoker] -copy-git-state:
   [smoker]
   [smoker] git-autoclean:
   [smoker]
   [smoker] ivy-availability-check:
   [smoker] [loadresource] Do not set property disallowed.ivy.jars.list as its length is 0.
   [smoker]
   [smoker] -ivy-fail-disallowed-ivy-version:
   [smoker]
   [smoker] ivy-fail:
   [smoker]
   [smoker] ivy-configure:
   [smoker] [ivy:configure] :: loading settings :: file = /home/jenkins/jenkins-slave/workspace/Lucene-Solr-SmokeRelease-7.2/lucene/build/smokeTestRelease/tmp/unpack/solr-7.2.1/lucene/top-level-ivy-settings.xml
   [smoker]
   [smoker] resolve:
   [smoker]
   [smoker] init:
   [smoker]
   [smoker] -clover.disable:
   [smoker]
   [smoker] -clover.load:
   [smoker]
   [smoker] -clover.classpath:
   [smoker]
   [smoker] -clover.setup:
   [smoker]
   [smoker] clover:
   [smoker]
   [smoker] compile-core:
   [smoker]
   [smoker] init:
   [smoker]
   [smoker] -clover.disable:
   [smoker]
   [smoker] -clover.load:
   [smoker]
   [smoker] -clover.classpath:
   [smoker]
   [smoker] -clover.setup:
   [smoker]
   [smoker] clover:
   [smoker]
   [smoker] common.compile-core:
   [smoker]
   [smoker] compile-core:
   [smoker]
   [smoker] check-lucene-core-uptodate:
   [smoker]
   [smoker] jar-lucene-core:
   [smoker]
   [smoker] check-backward-codecs-uptodate:
   [smoker]
   [smoker] jar-backward-codecs:
   [smoker]
   [smoker] check-analyzers-phonetic-uptodate:
   [smoker]
   [smoker] jar-analyzers-phonetic:
   [smoker]
   [smoker] check-analyzers-kuromoji-uptodate:
   [smoker]
   [smoker] jar-analyzers-kuromoji:
   [smoker]
   [smoker] check-codecs-uptodate:
   [smoker]
   [smoker] jar-codecs:
   [smoker]
   [smoker] check-expressions-uptodate:
   [smoker]
   [smoker] jar-expressions:
   [smoker]
   [smoker] check-suggest-uptodate:
   [smoker]
   [smoker] jar-suggest:
   [smoker]
   [smoker] check-highlighter-uptodate:
   [smoker]
   [smoker] jar-highlighter:
   [smoker]
   [smoker] check-memory-uptodate:
   [smoker]
   [smoker] jar-memory:
   [smoker]
   [smoker] check-misc-uptodate:
   [smoker]
   [smoker] jar-misc:
   [smoker]
   [smoker] check-spatial-extras-uptodate:
   [smoker]
   [smoker] jar-spatial-extras:
   [smoker]
   [smoker] check-spatial3d-uptodate:
   [smoker]
   [smoker] jar-spatial3d:
   [smoker]
   [smoker] check-grouping-uptodate:
   [smoker]
   [smoker] jar-grouping:
   [smoker]
   [smoker] check-queries-uptodate:
   [smoker]
   [smoker] jar-queries:
   [smoker]
   [smoker] check-queryparser-uptodate:
   [smoker]
   [smoker] jar-queryparser:
   [smoker]
   [smoker] check-join-uptodate:
   [smoker]
   [smoker] jar-join:
   [smoker]
   [smoker] check-sandbox-uptodate:
   [smoker]
   [smoker] jar-sandbox:
   [smoker]
   [smoker] check-classification-uptodate:
   [smoker]
   [smoker] jar-classification:
   [smoker]
   [smoker] prep-lucene-jars:
   [smoker]
   [smoker] resolve-example:
   [smoker]
   [smoker] ivy-availability-check:
   [smoker] [loadresource] Do not set property disallowed.ivy.jars.list as its length is 0.
   [smoker]
   [smoker] -ivy-fail-disallowed-ivy-version:
   [smoker]
   [smoker] ivy-fail:
   [smoker]
   [smoker] ivy-configure:
   [smoker] [ivy:configure] :: loading settings :: file = /home/jenkins/jenkins-slave/workspace/Lucene-Solr-SmokeRelease-7.2/lucene/build/smokeTestRelease/tmp/unpack/solr-7.2.1/lucene/top-level-ivy-settings.xml
   [smoker]
   [smoker] resolve:
   [smoker]
   [smoker] resolve-server:
   [smoker]
   [smoker] ivy-availability-check:
   [smoker] [loadresource] Do not set property disallowed.ivy.jars.list as its length is 0.
   [smoker]
   [smoker] -ivy-fail-disallowed-ivy-version:
   [smoker]
   [smoker] ivy-fail:
   [smoker]
   [smoker] ivy-fail:
   [smoker]
   [smoker] ivy-configure:
   [smoker] [ivy:configure] :: loading settings :: file = /home/jenkins/jenkins-slave/workspace/Lucene-Solr-SmokeRelease-7.2/lucene/build/smokeTestRelease/tmp/unpack/solr-7.2.1/lucene/top-level-ivy-settings.xml
   [smoker]
   [smoker] resolve:
   [smoker]
   [smoker] -check-git-state:
   [smoker]
   [smoker] -git-cleanroot:
   [smoker]
   [smoker] -copy-git-state:
   [smoker]
   [smoker] git-autoclean:
   [smoker]
   [smoker] ivy-availability-check:
   [smoker] [loadresource] Do not set property disallowed.ivy.jars.list as its length is 0.
   [smoker]
   [smoker] -ivy-fail-disallowed-ivy-version:
   [smoker]
   [smoker] ivy-fail:
   [smoker]
   [smoker] ivy-fail:
   [smoker]
   [smoker] ivy-configure:
   [smoker] [ivy:configure] :: loading settings :: file = /home/jenkins/jenkins-slave/workspace/Lucene-Solr-SmokeRelease-7.2/lucene/build/smokeTestRelease/tmp/unpack/solr-7.2.1/lucene/top-level-ivy-settings.xml
   [smoker]
   [smoker] resolve:
   [smoker]
   [smoker] common.init:
   [smoker]
   [smoker] compile-lucene-core:
   [smoker]
   [smoker] -check-git-state:
   [smoker]
   [smoker] -git-cleanroot:
   [smoker]
   [smoker] -copy-git-state:
   [smoker]
   [smoker] git-autoclean:
   [smoker]
   [smoker] ivy-availability-check:
   [smoker] [loadresource] Do not set property disallowed.ivy.jars.list as its length is 0.
   [smoker]
   [smoker] -ivy-fail-disallowed-ivy-version:
   [smoker]
   [smoker] ivy-fail:
   [smoker]
   [smoker] ivy-configure:
   [smoker] [ivy:configure] :: loading settings :: file = /home/jenkins/jenkins-slave/workspace/Lucene-Solr-SmokeRelease-7.2/lucene/build/smokeTestRelease/tmp/unpack/solr-7.2.1/lucene/top-level-ivy-settings.xml
   [smoker]
   [smoker] resolve:
   [smoker]
   [smoker] init:
   [smoker]
   [smoker] -clover.disable:
   [smoker]
   [smoker] -clover.load:
   [smoker]
   [smoker] -clover.classpath:
   [smoker]
   [smoker] -clover.setup:
   [smoker]
   [smoker] clover:
   [smoker]
   [smoker] compile-core:
   [smoker]
   [smoker] init:
   [smoker]
   [smoker] -clover.disable:
   [smoker]
   [smoker] -clover.load:
   [smoker]
   [smoker] -clover.classpath:
   [smoker]
   [smoker] -clover.setup:
   [smoker]
   [smoker] clover:
   [smoker]
   [smoker] common.compile-core:
   [smoker]
   [smoker] common-solr.compile-core:
   [smoker]
   [smoker] compile-core:
   [smoker]
   [smoker] compile-test-framework:
   [smoker]
   [smoker] compile-test-framework:
   [smoker]
   [smoker] -check-git-state:
   [smoker]
   [smoker] -git-cleanroot:
   [smoker]
   [smoker] -copy-git-state:
   [smoker]
   [smoker] git-autoclean:
   [smoker]
   [smoker] ivy-availability-check:
   [smoker] [loadresource] Do not set property disallowed.ivy.jars.list as its length is 0.
   [smoker]
   [smoker] -ivy-fail-disallowed-ivy-version:
   [smoker]
   [smoker] ivy-fail:
   [smoker]
   [smoker] ivy-configure:
   [smoker] [ivy:configure] :: loading settings :: file = /home/jenkins/jenkins-slave/workspace/Lucene-Solr-SmokeRelease-7.2/lucene/build/smokeTestRelease/tmp/unpack/solr-7.2.1/lucene/top-level-ivy-settings.xml
   [smoker]
   [smoker] resolve:
   [smoker]
   [smoker] init:
   [smoker]
   [smoker] compile-lucene-core:
   [smoker]
   [smoker] -check-git-state:
   [smoker]
   [smoker] -git-cleanroot:
   [smoker]
   [smoker] -copy-git-state:
   [smoker]
   [smoker] git-autoclean:
   [smoker]
   [smoker] ivy-availability-check:
   [smoker] [loadresource] Do not set property disallowed.ivy.jars.list as its length is 0.
   [smoker]
   [smoker] -ivy-fail-disallowed-ivy-version:
   [smoker]
   [smoker] ivy-fail:
   [smoker]
   [smoker] ivy-configure:
   [smoker] [ivy:configure] :: loading settings :: file = /home/jenkins/jenkins-slave/workspace/Lucene-Solr-SmokeRelease-7.2/lucene/build/smokeTestRelease/tmp/unpack/solr-7.2.1/lucene/top-level-ivy-settings.xml
   [smoker]
   [smoker] resolve:
   [smoker]
   [smoker] init:
   [smoker]
   [smoker] -clover.disable:
   [smoker]
   [smoker] -clover.load:
   [smoker]
   [smoker] -clover.classpath:
   [smoker]
   [smoker] -clover.setup:
   [smoker]
   [smoker] clover:
   [smoker]
   [smoker] compile-core:
   [smoker]
   [smoker] compile-codecs:
   [smoker]
   [smoker] -check-git-state:
   [smoker]
   [smoker] -git-cleanroot:
   [smoker]
   [smoker] -copy-git-state:
   [smoker]
   [smoker] git-autoclean:
   [smoker]
   [smoker] ivy-availability-check:
   [smoker] [loadresource] Do not set property disallowed.ivy.jars.list as its length is 0.
   [smoker]
   [smoker] -ivy-fail-disallowed-ivy-version:
   [smoker]
   [smoker] ivy-fail:
   [smoker]
   [smoker] ivy-configure:
   [smoker] [ivy:configure] :: loading settings :: file = /home/jenkins/jenkins-slave/workspace/Lucene-Solr-SmokeRelease-7.2/lucene/build/smokeTestRelease/tmp/unpack/solr-7.2.1/lucene/top-level-ivy-settings.xml
   [smoker]
   [smoker] resolve:
   [smoker]
   [smoker] common.init:
   [smoker]
   [smoker] compile-lucene-core:
   [smoker]
   [smoker] init:
   [smoker]
   [smoker] -clover.disable:
   [smoker]
   [smoker] -clover.load:
   [smoker]
   [smoker] -clover.classpath:
   [smoker]
   [smoker] -clover.setup:
   [smoker]
   [smoker] clover:
   [smoker]
   [smoker] compile-core:
   [smoker]
   [smoker] -clover.disable:
   [smoker]
   [smoker] -clover.load:
   [smoker]
   [smoker] -clover.classpath:
   [smoker]
   [smoker] -clover.setup:
   [smoker]
   [smoker] clover:
   [smoker]
   [smoker] common.compile-core:
   [smoker]
   [smoker] compile-core:
   [smoker]
   [smoker] compile-core:
   [smoker]     [mkdir] Created dir: /home/jenkins/jenkins-slave/workspace/Lucene-Solr-SmokeRelease-7.2/lucene/build/smokeTestRelease/tmp/unpack/solr-7.2.1/solr/build/solr-test-framework/classes/java
   [smoker]     [javac] Compiling 50 source files to /home/jenkins/jenkins-slave/workspace/Lucene-Solr-SmokeRelease-7.2/lucene/build/smokeTestRelease/tmp/unpack/solr-7.2.1/solr/build/solr-test-framework/classes/java
   [smoker]     [javac] Note: /home/jenkins/jenkins-slave/workspace/Lucene-Solr-SmokeRelease-7.2/lucene/build/smokeTestRelease/tmp/unpack/solr-7.2.1/solr/test-framework/src/java/org/apache/solr/util/SSLTestConfig.java uses or overrides a deprecated API.
   [smoker]     [javac] Note: Recompile with -Xlint:deprecation for details.
   [smoker]     [javac] Note: Some input files use unchecked or unsafe operations.
   [smoker]     [javac] Note: Recompile with -Xlint:unchecked for details.
   [smoker]      [copy] Copying 1 file to /home/jenkins/jenkins-slave/workspace/Lucene-Solr-SmokeRelease-7.2/lucene/build/smokeTestRelease/tmp/unpack/solr-7.2.1/solr/build/solr-test-framework/classes/java
   [smoker]
   [smoker] compile-solrj:
   [smoker]
   [smoker] check-lucene-core-uptodate:
   [smoker]
   [smoker] jar-lucene-core:
   [smoker]
   [smoker] check-backward-codecs-uptodate:
   [smoker]
   [smoker] jar-backward-codecs:
   [smoker]
   [smoker] check-analyzers-phonetic-uptodate:
   [smoker]
   [smoker] jar-analyzers-phonetic:
   [smoker]
   [smoker] check-analyzers-kuromoji-uptodate:
   [smoker]
   [smoker] jar-analyzers-kuromoji:
   [smoker]
   [smoker] check-codecs-uptodate:
   [smoker]
   [smoker] jar-codecs:
   [smoker]
   [smoker] check-expressions-uptodate:
   [smoker]
   [smoker] jar-expressions:
   [smoker]
   [smoker] check-suggest-uptodate:
   [smoker]
   [smoker] jar-suggest:
   [smoker]
   [smoker] check-highlighter-uptodate:
   [smoker]
   [smoker] jar-highlighter:
   [smoker]
   [smoker] check-memory-uptodate:
   [smoker]
   [smoker] jar-memory:
   [smoker]
   [smoker] check-misc-uptodate:
   [smoker]
   [smoker] jar-misc:
   [smoker]
   [smoker] check-spatial-extras-uptodate:
   [smoker]
   [smoker] jar-spatial-extras:
   [smoker]
   [smoker] check-spatial3d-uptodate:
   [smoker]
   [smoker] jar-spatial3d:
   [smoker]
   [smoker] check-grouping-uptodate:
   [smoker]
   [smoker] jar-grouping:
   [smoker]
   [smoker] check-queries-uptodate:
   [smoker]
   [smoker] jar-queries:
   [smoker]
   [smoker] check-queryparser-uptodate:
   [smoker]
   [smoker] jar-queryparser:
   [smoker]
   [smoker] check-join-uptodate:
   [smoker]
   [smoker] jar-join:
   [smoker]
   [smoker] check-sandbox-uptodate:
   [smoker]
   [smoker] jar-sandbox:
   [smoker]
   [smoker] check-classification-uptodate:
   [smoker]
   [smoker] jar-classification:
   [smoker]
   [smoker] prep-lucene-jars:
   [smoker]
   [smoker] resolve-example:
   [smoker]
   [smoker] ivy-availability-check:
   [smoker] [loadresource] Do not set property disallowed.ivy.jars.list as its length is 0.
   [smoker]
   [smoker] -ivy-fail-disallowed-ivy-version:
   [smoker]
   [smoker] ivy-fail:
   [smoker]
   [smoker] ivy-configure:
   [smoker] [ivy:configure] :: loading settings :: file = /home/jenkins/jenkins-slave/workspace/Lucene-Solr-SmokeRelease-7.2/lucene/build/smokeTestRelease/tmp/unpack/solr-7.2.1/lucene/top-level-ivy-settings.xml
   [smoker]
   [smoker] resolve:
   [smoker]
   [smoker] resolve-server:
   [smoker]
   [smoker] ivy-availability-check:
   [smoker] [loadresource] Do not set property disallowed.ivy.jars.list as its length is 0.
   [smoker]
   [smoker] -ivy-fail-disallowed-ivy-version:
   [smoker]
   [smoker] ivy-fail:
   [smoker]
   [smoker] ivy-fail:
   [smoker]
   [smoker] ivy-configure:
   [smoker] [ivy:configure] :: loading settings :: file = /home/jenkins/jenkins-slave/workspace/Lucene-Solr-SmokeRelease-7.2/lucene/build/smokeTestRelease/tmp/unpack/solr-7.2.1/lucene/top-level-ivy-settings.xml
   [smoker]
   [smoker] resolve:
   [smoker]
   [smoker] -check-git-state:
   [smoker]
   [smoker] -git-cleanroot:
   [smoker]
   [smoker] -copy-git-state:
   [smoker]
   [smoker] git-autoclean:
   [smoker]
   [smoker] ivy-availability-check:
   [smoker] [loadresource] Do not set property disallowed.ivy.jars.list as its length is 0.
   [smoker]
   [smoker] -ivy-fail-disallowed-ivy-version:
   [smoker]
   [smoker] ivy-fail:
   [smoker]
   [smoker] ivy-fail:
   [smoker]
   [smoker] ivy-configure:
   [smoker] [ivy:configure] :: loading settings :: file = /home/jenkins/jenkins-slave/workspace/Lucene-Solr-SmokeRelease-7.2/lucene/build/smokeTestRelease/tmp/unpack/solr-7.2.1/lucene/top-level-ivy-settings.xml
   [smoker]
   [smoker] resolve:
   [smoker]
   [smoker] common.init:
   [smoker]
   [smoker] compile-lucene-core:
   [smoker]
   [smoker] -check-git-state:
   [smoker]
   [smoker] -git-cleanroot:
   [smoker]
   [smoker] -copy-git-state:
   [smoker]
   [smoker] git-autoclean:
   [smoker]
   [smoker] ivy-availability-check:
   [smoker] [loadresource] Do not set property disallowed.ivy.jars.list as its length is 0.
   [smoker]
   [smoker] -ivy-fail-disallowed-ivy-version:
   [smoker]
   [smoker] ivy-fail:
   [smoker]
   [smoker] ivy-configure:
   [smoker] [ivy:configure] :: loading settings :: file = /home/jenkins/jenkins-slave/workspace/Lucene-Solr-SmokeRelease-7.2/lucene/build/smokeTestRelease/tmp/unpack/solr-

[...truncated too long message...]

lDistributionEvaluatorTest
   [smoker]    [junit4] Completed [116/146 (1!)] on J0 in 0.23s, 1 test
   [smoker]    [junit4]
   [smoker]    [junit4] Suite: org.apache.solr.client.solrj.io.stream.eval.EqualToEvaluatorTest
   [smoker]    [junit4] Completed [117/146 (1!)] on J0 in 0.08s, 8 tests
   [smoker]    [junit4]
   [smoker]    [junit4] Suite: org.apache.solr.client.solrj.io.stream.eval.FieldValueEvaluatorTest
   [smoker]    [junit4] Completed [118/146 (1!)] on J0 in 0.07s, 3 tests
   [smoker]    [junit4]
   [smoker]    [junit4] Suite: org.apache.solr.client.solrj.io.stream.eval.FloorEvaluatorTest
   [smoker]    [junit4] Completed [119/146 (1!)] on J0 in 0.21s, 5 tests
   [smoker]    [junit4]
   [smoker]    [junit4] Suite: org.apache.solr.client.solrj.io.stream.eval.GreaterThanEvaluatorTest
   [smoker]    [junit4] Completed [120/146 (1!)] on J0 in 0.10s, 7 tests
   [smoker]    [junit4]
   [smoker]    [junit4] Suite: org.apache.solr.client.solrj.io.stream.eval.HyperbolicCosineEvaluatorTest
   [smoker]    [junit4] Completed [121/146 (1!)] on J0 in 0.04s, 5 tests
   [smoker]    [junit4]
   [smoker]    [junit4] Suite: org.apache.solr.client.solrj.io.stream.eval.HyperbolicTangentEvaluatorTest
   [smoker]    [junit4] Completed [122/146 (1!)] on J0 in 0.17s, 5 tests
   [smoker]    [junit4]
   [smoker]    [junit4] Suite: org.apache.solr.client.solrj.io.stream.eval.LengthEvaluatorTest
   [smoker]    [junit4] Completed [123/146 (1!)] on J0 in 0.22s, 7 tests
   [smoker]    [junit4]
   [smoker]    [junit4] Suite: org.apache.solr.client.solrj.io.stream.eval.LessThanEvaluatorTest
   [smoker]    [junit4] Completed [124/146 (1!)] on J0 in 0.09s, 7 tests
   [smoker]    [junit4]
   [smoker]    [junit4] Suite: org.apache.solr.client.solrj.io.stream.eval.NaturalLogEvaluatorTest
   [smoker]    [junit4] Completed [125/146 (1!)] on J0 in 0.08s, 6 tests
   [smoker]    [junit4]
   [smoker]    [junit4] Suite: org.apache.solr.client.solrj.io.stream.eval.NormalDistributionEvaluatorTest
   [smoker]    [junit4] Completed [126/146 (1!)] on J0 in 0.01s, 1 test
   [smoker]    [junit4]
   [smoker]    [junit4] Suite: org.apache.solr.client.solrj.io.stream.eval.RawValueEvaluatorTest
   [smoker]    [junit4] Completed [127/146 (1!)] on J0 in 0.01s, 1 test
   [smoker]    [junit4]
   [smoker]    [junit4] Suite: org.apache.solr.client.solrj.io.stream.eval.RegressionEvaluatorTest
   [smoker]    [junit4] Completed [128/146 (1!)] on J0 in 0.07s, 1 test
   [smoker]    [junit4]
   [smoker]    [junit4] Suite: org.apache.solr.client.solrj.io.stream.eval.TangentEvaluatorTest
   [smoker]    [junit4] Completed [129/146 (1!)] on J0 in 0.17s, 5 tests
   [smoker]    [junit4]
   [smoker]    [junit4] Suite: org.apache.solr.client.solrj.io.stream.eval.UniformDistributionEvaluatorTest
   [smoker]    [junit4] Completed [130/146 (1!)] on J0 in 0.04s, 1 test
   [smoker]    [junit4]
   [smoker]    [junit4] Suite: org.apache.solr.client.solrj.io.stream.ops.OperationsTest
   [smoker]    [junit4] Completed [131/146 (1!)] on J0 in 0.08s, 7 tests
   [smoker]    [junit4]
   [smoker]    [junit4] Suite: org.apache.solr.client.solrj.io.stream.JDBCStreamTest
   [smoker]    [junit4] Completed [132/146 (1!)] on J1 in 30.27s, 7 tests
   [smoker]    [junit4]
   [smoker]    [junit4] Suite: org.apache.solr.client.solrj.request.TestCollectionAdminRequest
   [smoker]    [junit4] Completed [133/146 (1!)] on J1 in 0.36s, 5 tests
   [smoker]    [junit4]
   [smoker]    [junit4] Suite: org.apache.solr.client.solrj.response.NoOpResponseParserTest
   [smoker]    [junit4] Completed [134/146 (1!)] on J1 in 5.22s, 3 tests
   [smoker]    [junit4]
   [smoker]    [junit4] Suite: org.apache.solr.client.solrj.response.TestClusteringResponse
   [smoker]    [junit4] Completed [135/146 (1!)] on J1 in 0.86s, 1 test
   [smoker]    [junit4]
   [smoker]    [junit4] Suite: org.apache.solr.client.solrj.response.TestDelegationTokenResponse
   [smoker]    [junit4] Completed [136/146 (1!)] on J1 in 0.26s, 3 tests
   [smoker]    [junit4]
   [smoker]    [junit4] Suite: org.apache.solr.common.TestToleratedUpdateError
   [smoker]    [junit4] Completed [137/146 (1!)] on J1 in 1.76s, 6 tests
   [smoker]    [junit4]
   [smoker]    [junit4] Suite: org.apache.solr.common.cloud.TestZkConfigManager
   [smoker]    [junit4] Completed [138/146 (1!)] on J1 in 1.96s, 3 tests
   [smoker]    [junit4]
   [smoker]    [junit4] Suite: org.apache.solr.common.params.CommonAdminParamsTest
   [smoker]    [junit4] Completed [139/146 (1!)] on J1 in 0.07s, 1 test
   [smoker]    [junit4]
   [smoker]    [junit4] Suite: org.apache.solr.common.params.CommonParamsTest
   [smoker]    [junit4] Completed [140/146 (1!)] on J1 in 0.16s, 5 tests
   [smoker]    [junit4]
   [smoker]    [junit4] Suite: org.apache.solr.common.params.ShardParamsTest
   [smoker]    [junit4] Completed [141/146 (1!)] on J1 in 0.12s, 12 tests
   [smoker]    [junit4]
   [smoker]    [junit4] Suite: org.apache.solr.common.util.JsonValidatorTest
   [smoker]    [junit4] Completed [142/146 (1!)] on J1 in 0.24s, 2 tests
   [smoker]    [junit4]
   [smoker]    [junit4] Suite: org.apache.solr.common.util.TestJsonRecordReader
   [smoker]    [junit4] Completed [143/146 (1!)] on J1 in 2.38s, 9 tests
   [smoker]    [junit4]
   [smoker]    [junit4] Suite: org.apache.solr.common.util.TestPathTrie
   [smoker]    [junit4] Completed [144/146 (1!)] on J1 in 0.18s, 1 test
   [smoker]    [junit4]
   [smoker]    [junit4] Suite: org.apache.solr.client.solrj.io.stream.StreamingTest
   [smoker]    [junit4] IGNOR/A 0.42s J2 | StreamingTest.testDaemonTopicStream
   [smoker]    [junit4]    > Assumption #1: got: <false>, expected: is <true>
   [smoker]    [junit4] Completed [145/146 (1!)] on J2 in 43.27s, 28 tests, 3 skipped
   [smoker]    [junit4]
   [smoker]    [junit4] Suite: org.apache.solr.client.solrj.request.SchemaTest
   [smoker]    [junit4] Completed [146/146 (1!)] on J0 in 48.27s, 35 tests
   [smoker]    [junit4]
   [smoker]    [junit4]
   [smoker]    [junit4] Tests with failures [seed: C7911E67CCC72F8B]:
   [smoker]    [junit4]   - org.apache.solr.common.cloud.TestCollectionStateWatchers.testWaitForStateWatcherIsRetainedOnPredicateFailure
   [smoker]    [junit4]
   [smoker]    [junit4]
   [smoker]    [junit4] JVM J0:     1.84 ..   324.90 =   323.06s
   [smoker]    [junit4] JVM J1:     2.13 ..   305.53 =   303.40s
   [smoker]    [junit4] JVM J2:     2.18 ..   311.65 =   309.47s
   [smoker]    [junit4] Execution time total: 5 minutes 24 seconds
   [smoker]    [junit4] Tests summary: 146 suites, 1053 tests, 1 failure, 251 ignored (248 assumptions)
   [smoker]
   [smoker] BUILD FAILED
   [smoker] /home/jenkins/jenkins-slave/workspace/Lucene-Solr-SmokeRelease-7.2/lucene/build/smokeTestRelease/tmp/unpack/solr-7.2.1/solr/build.xml:275: The following error occurred while executing this line:
   [smoker] /home/jenkins/jenkins-slave/workspace/Lucene-Solr-SmokeRelease-7.2/lucene/build/smokeTestRelease/tmp/unpack/solr-7.2.1/solr/common-build.xml:556: The following error occurred while executing this line:
   [smoker] /home/jenkins/jenkins-slave/workspace/Lucene-Solr-SmokeRelease-7.2/lucene/build/smokeTestRelease/tmp/unpack/solr-7.2.1/lucene/common-build.xml:1512: The following error occurred while executing this line:
   [smoker] /home/jenkins/jenkins-slave/workspace/Lucene-Solr-SmokeRelease-7.2/lucene/build/smokeTestRelease/tmp/unpack/solr-7.2.1/lucene/common-build.xml:1038: There were test failures: 146 suites, 1053 tests, 1 failure, 251 ignored (248 assumptions) [seed: C7911E67CCC72F8B]
   [smoker]
   [smoker] Total time: 51 minutes 27 seconds
   [smoker]
   [smoker]
   [smoker] Traceback (most recent call last):
   [smoker]   File "/home/jenkins/jenkins-slave/workspace/Lucene-Solr-SmokeRelease-7.2/dev-tools/scripts/smokeTestRelease.py", line 1484, in <module>
   [smoker]     main()
   [smoker]   File "/home/jenkins/jenkins-slave/workspace/Lucene-Solr-SmokeRelease-7.2/dev-tools/scripts/smokeTestRelease.py", line 1428, in main
   [smoker]     smokeTest(c.java, c.url, c.revision, c.version, c.tmp_dir, c.is_signed, ' '.join(c.test_args))
   [smoker]   File "/home/jenkins/jenkins-slave/workspace/Lucene-Solr-SmokeRelease-7.2/dev-tools/scripts/smokeTestRelease.py", line 1474, in smokeTest
   [smoker]     gitRevision, version, testArgs, baseURL)
   [smoker]   File "/home/jenkins/jenkins-slave/workspace/Lucene-Solr-SmokeRelease-7.2/dev-tools/scripts/smokeTestRelease.py", line 622, in unpackAndVerify
   [smoker]     verifyUnpacked(java, project, artifact, unpackPath, gitRevision, version, testArgs, tmpDir, baseURL)
   [smoker]   File "/home/jenkins/jenkins-slave/workspace/Lucene-Solr-SmokeRelease-7.2/dev-tools/scripts/smokeTestRelease.py", line 733, in verifyUnpacked
   [smoker]     java.run_java8('ant clean test -Dtests.slow=false %s' % testArgs, '%s/test.log' % unpackPath)
   [smoker]   File "/home/jenkins/jenkins-slave/workspace/Lucene-Solr-SmokeRelease-7.2/dev-tools/scripts/smokeTestRelease.py", line 1233, in run_java
   [smoker]     run('%s; %s' % (cmd_prefix, cmd), logfile)
   [smoker]   File "/home/jenkins/jenkins-slave/workspace/Lucene-Solr-SmokeRelease-7.2/dev-tools/scripts/smokeTestRelease.py", line 547, in run
   [smoker]     raise RuntimeError('command "%s" failed; see log file %s' % (command, logPath))
   [smoker] RuntimeError: command "export JAVA_HOME="/home/jenkins/tools/java/latest1.8" PATH="/home/jenkins/tools/java/latest1.8/bin:$PATH" JAVACMD="/home/jenkins/tools/java/latest1.8/bin/java"; ant clean test -Dtests.slow=false -Dtests.slow=false" failed; see log file /home/jenkins/jenkins-slave/workspace/Lucene-Solr-SmokeRelease-7.2/lucene/build/smokeTestRelease/tmp/unpack/solr-7.2.1/test.log

BUILD FAILED
/home/jenkins/jenkins-slave/workspace/Lucene-Solr-SmokeRelease-7.2/build.xml:631: exec returned: 1

Total time: 157 minutes 2 seconds
Build step 'Invoke Ant' marked build as failure
Email was triggered for: Failure - Any
Sending email for trigger: Failure - Any


---------------------------------------------------------------------
To unsubscribe, e-mail: [hidden email]
For additional commands, e-mail: [hidden email]