Quantcast

[JENKINS] Lucene-Solr-Tests-6.x - Build # 805 - Unstable

Previous Topic Next Topic
 
classic Classic list List threaded Threaded
1 message Options
Reply | Threaded
Open this post in threaded view
|  
Report Content as Inappropriate

[JENKINS] Lucene-Solr-Tests-6.x - Build # 805 - Unstable

Apache Jenkins Server-2
Build: https://builds.apache.org/job/Lucene-Solr-Tests-6.x/805/

1 tests failed.
FAILED:  org.apache.solr.cloud.MissingSegmentRecoveryTest.testLeaderRecovery

Error Message:
Expected a collection with one shard and two replicas null Last available state: DocCollection(MissingSegmentRecoveryTest//collections/MissingSegmentRecoveryTest/state.json/8)={   "replicationFactor":"2",   "shards":{"shard1":{       "range":"80000000-7fffffff",       "state":"active",       "replicas":{         "core_node1":{           "core":"MissingSegmentRecoveryTest_shard1_replica2",           "base_url":"https://127.0.0.1:55675/solr",           "node_name":"127.0.0.1:55675_solr",           "state":"active",           "leader":"true"},         "core_node2":{           "core":"MissingSegmentRecoveryTest_shard1_replica1",           "base_url":"https://127.0.0.1:43343/solr",           "node_name":"127.0.0.1:43343_solr",           "state":"down"}}}},   "router":{"name":"compositeId"},   "maxShardsPerNode":"1",   "autoAddReplicas":"false"}

Stack Trace:
java.lang.AssertionError: Expected a collection with one shard and two replicas
null
Last available state: DocCollection(MissingSegmentRecoveryTest//collections/MissingSegmentRecoveryTest/state.json/8)={
  "replicationFactor":"2",
  "shards":{"shard1":{
      "range":"80000000-7fffffff",
      "state":"active",
      "replicas":{
        "core_node1":{
          "core":"MissingSegmentRecoveryTest_shard1_replica2",
          "base_url":"https://127.0.0.1:55675/solr",
          "node_name":"127.0.0.1:55675_solr",
          "state":"active",
          "leader":"true"},
        "core_node2":{
          "core":"MissingSegmentRecoveryTest_shard1_replica1",
          "base_url":"https://127.0.0.1:43343/solr",
          "node_name":"127.0.0.1:43343_solr",
          "state":"down"}}}},
  "router":{"name":"compositeId"},
  "maxShardsPerNode":"1",
  "autoAddReplicas":"false"}
        at __randomizedtesting.SeedInfo.seed([92B16C9085CD04C2:C2E4F493DCECB2DF]:0)
        at org.junit.Assert.fail(Assert.java:93)
        at org.apache.solr.cloud.SolrCloudTestCase.waitForState(SolrCloudTestCase.java:265)
        at org.apache.solr.cloud.MissingSegmentRecoveryTest.testLeaderRecovery(MissingSegmentRecoveryTest.java:105)
        at sun.reflect.NativeMethodAccessorImpl.invoke0(Native Method)
        at sun.reflect.NativeMethodAccessorImpl.invoke(NativeMethodAccessorImpl.java:62)
        at sun.reflect.DelegatingMethodAccessorImpl.invoke(DelegatingMethodAccessorImpl.java:43)
        at java.lang.reflect.Method.invoke(Method.java:498)
        at com.carrotsearch.randomizedtesting.RandomizedRunner.invoke(RandomizedRunner.java:1713)
        at com.carrotsearch.randomizedtesting.RandomizedRunner$8.evaluate(RandomizedRunner.java:907)
        at com.carrotsearch.randomizedtesting.RandomizedRunner$9.evaluate(RandomizedRunner.java:943)
        at com.carrotsearch.randomizedtesting.RandomizedRunner$10.evaluate(RandomizedRunner.java:957)
        at com.carrotsearch.randomizedtesting.rules.SystemPropertiesRestoreRule$1.evaluate(SystemPropertiesRestoreRule.java:57)
        at org.apache.lucene.util.TestRuleSetupTeardownChained$1.evaluate(TestRuleSetupTeardownChained.java:49)
        at org.apache.lucene.util.AbstractBeforeAfterRule$1.evaluate(AbstractBeforeAfterRule.java:45)
        at org.apache.lucene.util.TestRuleThreadAndTestName$1.evaluate(TestRuleThreadAndTestName.java:48)
        at org.apache.lucene.util.TestRuleIgnoreAfterMaxFailures$1.evaluate(TestRuleIgnoreAfterMaxFailures.java:64)
        at org.apache.lucene.util.TestRuleMarkFailure$1.evaluate(TestRuleMarkFailure.java:47)
        at com.carrotsearch.randomizedtesting.rules.StatementAdapter.evaluate(StatementAdapter.java:36)
        at com.carrotsearch.randomizedtesting.ThreadLeakControl$StatementRunner.run(ThreadLeakControl.java:368)
        at com.carrotsearch.randomizedtesting.ThreadLeakControl.forkTimeoutingTask(ThreadLeakControl.java:817)
        at com.carrotsearch.randomizedtesting.ThreadLeakControl$3.evaluate(ThreadLeakControl.java:468)
        at com.carrotsearch.randomizedtesting.RandomizedRunner.runSingleTest(RandomizedRunner.java:916)
        at com.carrotsearch.randomizedtesting.RandomizedRunner$5.evaluate(RandomizedRunner.java:802)
        at com.carrotsearch.randomizedtesting.RandomizedRunner$6.evaluate(RandomizedRunner.java:852)
        at com.carrotsearch.randomizedtesting.RandomizedRunner$7.evaluate(RandomizedRunner.java:863)
        at com.carrotsearch.randomizedtesting.rules.StatementAdapter.evaluate(StatementAdapter.java:36)
        at com.carrotsearch.randomizedtesting.rules.SystemPropertiesRestoreRule$1.evaluate(SystemPropertiesRestoreRule.java:57)
        at org.apache.lucene.util.AbstractBeforeAfterRule$1.evaluate(AbstractBeforeAfterRule.java:45)
        at com.carrotsearch.randomizedtesting.rules.StatementAdapter.evaluate(StatementAdapter.java:36)
        at org.apache.lucene.util.TestRuleStoreClassName$1.evaluate(TestRuleStoreClassName.java:41)
        at com.carrotsearch.randomizedtesting.rules.NoShadowingOrOverridesOnMethodsRule$1.evaluate(NoShadowingOrOverridesOnMethodsRule.java:40)
        at com.carrotsearch.randomizedtesting.rules.NoShadowingOrOverridesOnMethodsRule$1.evaluate(NoShadowingOrOverridesOnMethodsRule.java:40)
        at com.carrotsearch.randomizedtesting.rules.StatementAdapter.evaluate(StatementAdapter.java:36)
        at com.carrotsearch.randomizedtesting.rules.StatementAdapter.evaluate(StatementAdapter.java:36)
        at com.carrotsearch.randomizedtesting.rules.StatementAdapter.evaluate(StatementAdapter.java:36)
        at org.apache.lucene.util.TestRuleAssertionsRequired$1.evaluate(TestRuleAssertionsRequired.java:53)
        at org.apache.lucene.util.TestRuleMarkFailure$1.evaluate(TestRuleMarkFailure.java:47)
        at org.apache.lucene.util.TestRuleIgnoreAfterMaxFailures$1.evaluate(TestRuleIgnoreAfterMaxFailures.java:64)
        at org.apache.lucene.util.TestRuleIgnoreTestSuites$1.evaluate(TestRuleIgnoreTestSuites.java:54)
        at com.carrotsearch.randomizedtesting.rules.StatementAdapter.evaluate(StatementAdapter.java:36)
        at com.carrotsearch.randomizedtesting.ThreadLeakControl$StatementRunner.run(ThreadLeakControl.java:368)
        at java.lang.Thread.run(Thread.java:745)




Build Log:
[...truncated 11737 lines...]
   [junit4] Suite: org.apache.solr.cloud.MissingSegmentRecoveryTest
   [junit4]   2> Creating dataDir: /x1/jenkins/jenkins-slave/workspace/Lucene-Solr-Tests-6.x/solr/build/solr-core/test/J0/temp/solr.cloud.MissingSegmentRecoveryTest_92B16C9085CD04C2-001/init-core-data-001
   [junit4]   2> 522994 WARN  (SUITE-MissingSegmentRecoveryTest-seed#[92B16C9085CD04C2]-worker) [    ] o.a.s.SolrTestCaseJ4 startTrackingSearchers: numOpens=34 numCloses=34
   [junit4]   2> 522994 INFO  (SUITE-MissingSegmentRecoveryTest-seed#[92B16C9085CD04C2]-worker) [    ] o.a.s.SolrTestCaseJ4 Using TrieFields
   [junit4]   2> 522995 INFO  (SUITE-MissingSegmentRecoveryTest-seed#[92B16C9085CD04C2]-worker) [    ] o.a.s.SolrTestCaseJ4 Randomized ssl (true) and clientAuth (false) via: @org.apache.solr.util.RandomizeSSL(reason=, ssl=NaN, value=NaN, clientAuth=NaN)
   [junit4]   2> 522996 INFO  (SUITE-MissingSegmentRecoveryTest-seed#[92B16C9085CD04C2]-worker) [    ] o.a.s.c.MiniSolrCloudCluster Starting cluster of 2 servers in /x1/jenkins/jenkins-slave/workspace/Lucene-Solr-Tests-6.x/solr/build/solr-core/test/J0/temp/solr.cloud.MissingSegmentRecoveryTest_92B16C9085CD04C2-001/tempDir-001
   [junit4]   2> 522996 INFO  (SUITE-MissingSegmentRecoveryTest-seed#[92B16C9085CD04C2]-worker) [    ] o.a.s.c.ZkTestServer STARTING ZK TEST SERVER
   [junit4]   2> 522996 INFO  (Thread-1139) [    ] o.a.s.c.ZkTestServer client port:0.0.0.0/0.0.0.0:0
   [junit4]   2> 522996 INFO  (Thread-1139) [    ] o.a.s.c.ZkTestServer Starting server
   [junit4]   2> 523096 INFO  (SUITE-MissingSegmentRecoveryTest-seed#[92B16C9085CD04C2]-worker) [    ] o.a.s.c.ZkTestServer start zk server on port:52140
   [junit4]   2> 523110 INFO  (jetty-launcher-614-thread-1) [    ] o.e.j.s.Server jetty-9.3.14.v20161028
   [junit4]   2> 523117 INFO  (jetty-launcher-614-thread-2) [    ] o.e.j.s.Server jetty-9.3.14.v20161028
   [junit4]   2> 523118 INFO  (jetty-launcher-614-thread-1) [    ] o.e.j.s.h.ContextHandler Started o.e.j.s.ServletContextHandler@8a96965{/solr,null,AVAILABLE}
   [junit4]   2> 523119 INFO  (jetty-launcher-614-thread-1) [    ] o.e.j.s.AbstractConnector Started ServerConnector@5f9ce513{SSL,[ssl, http/1.1]}{127.0.0.1:55675}
   [junit4]   2> 523119 INFO  (jetty-launcher-614-thread-1) [    ] o.e.j.s.Server Started @526012ms
   [junit4]   2> 523119 INFO  (jetty-launcher-614-thread-1) [    ] o.a.s.c.s.e.JettySolrRunner Jetty properties: {hostContext=/solr, hostPort=55675}
   [junit4]   2> 523119 ERROR (jetty-launcher-614-thread-1) [    ] o.a.s.s.StartupLoggingUtils Missing Java Option solr.log.dir. Logging may be missing or incomplete.
   [junit4]   2> 523119 INFO  (jetty-launcher-614-thread-1) [    ] o.a.s.s.SolrDispatchFilter  ___      _       Welcome to Apache Solr? version 6.6.0
   [junit4]   2> 523119 INFO  (jetty-launcher-614-thread-1) [    ] o.a.s.s.SolrDispatchFilter / __| ___| |_ _   Starting in cloud mode on port null
   [junit4]   2> 523119 INFO  (jetty-launcher-614-thread-1) [    ] o.a.s.s.SolrDispatchFilter \__ \/ _ \ | '_|  Install dir: null
   [junit4]   2> 523119 INFO  (jetty-launcher-614-thread-1) [    ] o.a.s.s.SolrDispatchFilter |___/\___/_|_|    Start time: 2017-03-19T00:34:57.033Z
   [junit4]   2> 523120 INFO  (jetty-launcher-614-thread-2) [    ] o.e.j.s.h.ContextHandler Started o.e.j.s.ServletContextHandler@2997f974{/solr,null,AVAILABLE}
   [junit4]   2> 523121 INFO  (jetty-launcher-614-thread-2) [    ] o.e.j.s.AbstractConnector Started ServerConnector@17275820{SSL,[ssl, http/1.1]}{127.0.0.1:43343}
   [junit4]   2> 523121 INFO  (jetty-launcher-614-thread-2) [    ] o.e.j.s.Server Started @526014ms
   [junit4]   2> 523121 INFO  (jetty-launcher-614-thread-2) [    ] o.a.s.c.s.e.JettySolrRunner Jetty properties: {hostContext=/solr, hostPort=43343}
   [junit4]   2> 523121 ERROR (jetty-launcher-614-thread-2) [    ] o.a.s.s.StartupLoggingUtils Missing Java Option solr.log.dir. Logging may be missing or incomplete.
   [junit4]   2> 523121 INFO  (jetty-launcher-614-thread-2) [    ] o.a.s.s.SolrDispatchFilter  ___      _       Welcome to Apache Solr? version 6.6.0
   [junit4]   2> 523121 INFO  (jetty-launcher-614-thread-2) [    ] o.a.s.s.SolrDispatchFilter / __| ___| |_ _   Starting in cloud mode on port null
   [junit4]   2> 523121 INFO  (jetty-launcher-614-thread-2) [    ] o.a.s.s.SolrDispatchFilter \__ \/ _ \ | '_|  Install dir: null
   [junit4]   2> 523121 INFO  (jetty-launcher-614-thread-2) [    ] o.a.s.s.SolrDispatchFilter |___/\___/_|_|    Start time: 2017-03-19T00:34:57.035Z
   [junit4]   2> 523134 INFO  (jetty-launcher-614-thread-2) [    ] o.a.s.s.SolrDispatchFilter solr.xml found in ZooKeeper. Loading...
   [junit4]   2> 523145 INFO  (jetty-launcher-614-thread-1) [    ] o.a.s.s.SolrDispatchFilter solr.xml found in ZooKeeper. Loading...
   [junit4]   2> 523148 INFO  (jetty-launcher-614-thread-2) [    ] o.a.s.u.UpdateShardHandler Creating UpdateShardHandler HTTP client with params: socketTimeout=340000&connTimeout=45000&retry=true
   [junit4]   2> 523149 INFO  (jetty-launcher-614-thread-2) [    ] o.a.s.c.ZkContainer Zookeeper client=127.0.0.1:52140/solr
   [junit4]   2> 523160 INFO  (jetty-launcher-614-thread-1) [    ] o.a.s.u.UpdateShardHandler Creating UpdateShardHandler HTTP client with params: socketTimeout=340000&connTimeout=45000&retry=true
   [junit4]   2> 523172 INFO  (jetty-launcher-614-thread-1) [    ] o.a.s.c.ZkContainer Zookeeper client=127.0.0.1:52140/solr
   [junit4]   2> 523190 INFO  (jetty-launcher-614-thread-2) [n:127.0.0.1:43343_solr    ] o.a.s.c.Overseer Overseer (id=null) closing
   [junit4]   2> 523204 INFO  (jetty-launcher-614-thread-2) [n:127.0.0.1:43343_solr    ] o.a.s.c.OverseerElectionContext I am going to be the leader 127.0.0.1:43343_solr
   [junit4]   2> 523205 INFO  (jetty-launcher-614-thread-2) [n:127.0.0.1:43343_solr    ] o.a.s.c.Overseer Overseer (id=97641017960759301-127.0.0.1:43343_solr-n_0000000000) starting
   [junit4]   2> 523406 INFO  (jetty-launcher-614-thread-1) [n:127.0.0.1:55675_solr    ] o.a.s.c.Overseer Overseer (id=null) closing
   [junit4]   2> 523407 INFO  (jetty-launcher-614-thread-1) [n:127.0.0.1:55675_solr    ] o.a.s.c.ZkController Register node as live in ZooKeeper:/live_nodes/127.0.0.1:55675_solr
   [junit4]   2> 523427 INFO  (zkCallback-625-thread-1-processing-n:127.0.0.1:43343_solr) [n:127.0.0.1:43343_solr    ] o.a.s.c.c.ZkStateReader Updated live nodes from ZooKeeper... (0) -> (1)
   [junit4]   2> 523427 INFO  (zkCallback-626-thread-1-processing-n:127.0.0.1:55675_solr) [n:127.0.0.1:55675_solr    ] o.a.s.c.c.ZkStateReader Updated live nodes from ZooKeeper... (0) -> (1)
   [junit4]   2> 523436 INFO  (jetty-launcher-614-thread-2) [n:127.0.0.1:43343_solr    ] o.a.s.c.ZkController Register node as live in ZooKeeper:/live_nodes/127.0.0.1:43343_solr
   [junit4]   2> 523437 INFO  (zkCallback-626-thread-1-processing-n:127.0.0.1:55675_solr) [n:127.0.0.1:55675_solr    ] o.a.s.c.c.ZkStateReader Updated live nodes from ZooKeeper... (1) -> (2)
   [junit4]   2> 523437 INFO  (zkCallback-625-thread-1-processing-n:127.0.0.1:43343_solr) [n:127.0.0.1:43343_solr    ] o.a.s.c.c.ZkStateReader Updated live nodes from ZooKeeper... (1) -> (2)
   [junit4]   2> 523494 INFO  (jetty-launcher-614-thread-1) [n:127.0.0.1:55675_solr    ] o.a.s.c.CorePropertiesLocator Found 0 core definitions underneath /x1/jenkins/jenkins-slave/workspace/Lucene-Solr-Tests-6.x/solr/build/solr-core/test/J0/temp/solr.cloud.MissingSegmentRecoveryTest_92B16C9085CD04C2-001/tempDir-001/node1/.
   [junit4]   2> 523627 INFO  (jetty-launcher-614-thread-2) [n:127.0.0.1:43343_solr    ] o.a.s.c.CorePropertiesLocator Found 0 core definitions underneath /x1/jenkins/jenkins-slave/workspace/Lucene-Solr-Tests-6.x/solr/build/solr-core/test/J0/temp/solr.cloud.MissingSegmentRecoveryTest_92B16C9085CD04C2-001/tempDir-001/node2/.
   [junit4]   2> 523992 INFO  (SUITE-MissingSegmentRecoveryTest-seed#[92B16C9085CD04C2]-worker) [    ] o.a.s.c.c.ZkStateReader Updated live nodes from ZooKeeper... (0) -> (2)
   [junit4]   2> 523993 INFO  (SUITE-MissingSegmentRecoveryTest-seed#[92B16C9085CD04C2]-worker) [    ] o.a.s.c.s.i.ZkClientClusterStateProvider Cluster at 127.0.0.1:52140/solr ready
   [junit4]   2> 524019 INFO  (TEST-MissingSegmentRecoveryTest.testLeaderRecovery-seed#[92B16C9085CD04C2]) [    ] o.a.s.SolrTestCaseJ4 ###Starting testLeaderRecovery
   [junit4]   2> 524090 INFO  (qtp1051442201-4420) [n:127.0.0.1:55675_solr    ] o.a.s.h.a.CollectionsHandler Invoked Collection Action :create with params replicationFactor=2&collection.configName=conf&maxShardsPerNode=1&name=MissingSegmentRecoveryTest&action=CREATE&numShards=1&wt=javabin&version=2 and sendToOCPQueue=true
   [junit4]   2> 524097 INFO  (OverseerThreadFactory-2261-thread-1-processing-n:127.0.0.1:43343_solr) [n:127.0.0.1:43343_solr    ] o.a.s.c.CreateCollectionCmd Create collection MissingSegmentRecoveryTest
   [junit4]   2> 524359 INFO  (qtp1051442201-4415) [n:127.0.0.1:55675_solr    ] o.a.s.h.a.CoreAdminOperation core create command qt=/admin/cores&collection.configName=conf&newCollection=true&name=MissingSegmentRecoveryTest_shard1_replica2&action=CREATE&numShards=1&collection=MissingSegmentRecoveryTest&shard=shard1&wt=javabin&version=2
   [junit4]   2> 524404 INFO  (qtp558857687-4429) [n:127.0.0.1:43343_solr    ] o.a.s.h.a.CoreAdminOperation core create command qt=/admin/cores&collection.configName=conf&newCollection=true&name=MissingSegmentRecoveryTest_shard1_replica1&action=CREATE&numShards=1&collection=MissingSegmentRecoveryTest&shard=shard1&wt=javabin&version=2
   [junit4]   2> 524506 INFO  (zkCallback-626-thread-1-processing-n:127.0.0.1:55675_solr) [n:127.0.0.1:55675_solr    ] o.a.s.c.c.ZkStateReader A cluster state change: [WatchedEvent state:SyncConnected type:NodeDataChanged path:/collections/MissingSegmentRecoveryTest/state.json] for collection [MissingSegmentRecoveryTest] has occurred - updating... (live nodes size: [2])
   [junit4]   2> 524506 INFO  (zkCallback-625-thread-3-processing-n:127.0.0.1:43343_solr) [n:127.0.0.1:43343_solr    ] o.a.s.c.c.ZkStateReader A cluster state change: [WatchedEvent state:SyncConnected type:NodeDataChanged path:/collections/MissingSegmentRecoveryTest/state.json] for collection [MissingSegmentRecoveryTest] has occurred - updating... (live nodes size: [2])
   [junit4]   2> 525382 INFO  (qtp1051442201-4415) [n:127.0.0.1:55675_solr c:MissingSegmentRecoveryTest s:shard1  x:MissingSegmentRecoveryTest_shard1_replica2] o.a.s.c.SolrConfig Using Lucene MatchVersion: 6.6.0
   [junit4]   2> 525389 INFO  (qtp1051442201-4415) [n:127.0.0.1:55675_solr c:MissingSegmentRecoveryTest s:shard1  x:MissingSegmentRecoveryTest_shard1_replica2] o.a.s.s.IndexSchema [MissingSegmentRecoveryTest_shard1_replica2] Schema name=minimal
   [junit4]   2> 525391 INFO  (qtp1051442201-4415) [n:127.0.0.1:55675_solr c:MissingSegmentRecoveryTest s:shard1  x:MissingSegmentRecoveryTest_shard1_replica2] o.a.s.s.IndexSchema Loaded schema minimal/1.1 with uniqueid field id
   [junit4]   2> 525391 INFO  (qtp1051442201-4415) [n:127.0.0.1:55675_solr c:MissingSegmentRecoveryTest s:shard1  x:MissingSegmentRecoveryTest_shard1_replica2] o.a.s.c.CoreContainer Creating SolrCore 'MissingSegmentRecoveryTest_shard1_replica2' using configuration from collection MissingSegmentRecoveryTest
   [junit4]   2> 525392 INFO  (qtp1051442201-4415) [n:127.0.0.1:55675_solr c:MissingSegmentRecoveryTest s:shard1  x:MissingSegmentRecoveryTest_shard1_replica2] o.a.s.c.SolrCore solr.RecoveryStrategy.Builder
   [junit4]   2> 525396 INFO  (qtp1051442201-4415) [n:127.0.0.1:55675_solr c:MissingSegmentRecoveryTest s:shard1  x:MissingSegmentRecoveryTest_shard1_replica2] o.a.s.c.SolrCore [[MissingSegmentRecoveryTest_shard1_replica2] ] Opening new SolrCore at [/x1/jenkins/jenkins-slave/workspace/Lucene-Solr-Tests-6.x/solr/build/solr-core/test/J0/temp/solr.cloud.MissingSegmentRecoveryTest_92B16C9085CD04C2-001/tempDir-001/node1/MissingSegmentRecoveryTest_shard1_replica2], dataDir=[/x1/jenkins/jenkins-slave/workspace/Lucene-Solr-Tests-6.x/solr/build/solr-core/test/J0/temp/solr.cloud.MissingSegmentRecoveryTest_92B16C9085CD04C2-001/tempDir-001/node1/./MissingSegmentRecoveryTest_shard1_replica2/data/]
   [junit4]   2> 525413 INFO  (qtp558857687-4429) [n:127.0.0.1:43343_solr c:MissingSegmentRecoveryTest s:shard1  x:MissingSegmentRecoveryTest_shard1_replica1] o.a.s.c.SolrConfig Using Lucene MatchVersion: 6.6.0
   [junit4]   2> 525420 INFO  (qtp558857687-4429) [n:127.0.0.1:43343_solr c:MissingSegmentRecoveryTest s:shard1  x:MissingSegmentRecoveryTest_shard1_replica1] o.a.s.s.IndexSchema [MissingSegmentRecoveryTest_shard1_replica1] Schema name=minimal
   [junit4]   2> 525422 INFO  (qtp558857687-4429) [n:127.0.0.1:43343_solr c:MissingSegmentRecoveryTest s:shard1  x:MissingSegmentRecoveryTest_shard1_replica1] o.a.s.s.IndexSchema Loaded schema minimal/1.1 with uniqueid field id
   [junit4]   2> 525426 INFO  (qtp558857687-4429) [n:127.0.0.1:43343_solr c:MissingSegmentRecoveryTest s:shard1  x:MissingSegmentRecoveryTest_shard1_replica1] o.a.s.c.CoreContainer Creating SolrCore 'MissingSegmentRecoveryTest_shard1_replica1' using configuration from collection MissingSegmentRecoveryTest
   [junit4]   2> 525427 INFO  (qtp558857687-4429) [n:127.0.0.1:43343_solr c:MissingSegmentRecoveryTest s:shard1  x:MissingSegmentRecoveryTest_shard1_replica1] o.a.s.c.SolrCore solr.RecoveryStrategy.Builder
   [junit4]   2> 525427 INFO  (qtp558857687-4429) [n:127.0.0.1:43343_solr c:MissingSegmentRecoveryTest s:shard1  x:MissingSegmentRecoveryTest_shard1_replica1] o.a.s.c.SolrCore [[MissingSegmentRecoveryTest_shard1_replica1] ] Opening new SolrCore at [/x1/jenkins/jenkins-slave/workspace/Lucene-Solr-Tests-6.x/solr/build/solr-core/test/J0/temp/solr.cloud.MissingSegmentRecoveryTest_92B16C9085CD04C2-001/tempDir-001/node2/MissingSegmentRecoveryTest_shard1_replica1], dataDir=[/x1/jenkins/jenkins-slave/workspace/Lucene-Solr-Tests-6.x/solr/build/solr-core/test/J0/temp/solr.cloud.MissingSegmentRecoveryTest_92B16C9085CD04C2-001/tempDir-001/node2/./MissingSegmentRecoveryTest_shard1_replica1/data/]
   [junit4]   2> 525530 INFO  (qtp1051442201-4415) [n:127.0.0.1:55675_solr c:MissingSegmentRecoveryTest s:shard1  x:MissingSegmentRecoveryTest_shard1_replica2] o.a.s.u.UpdateHandler Using UpdateLog implementation: org.apache.solr.update.UpdateLog
   [junit4]   2> 525530 INFO  (qtp1051442201-4415) [n:127.0.0.1:55675_solr c:MissingSegmentRecoveryTest s:shard1  x:MissingSegmentRecoveryTest_shard1_replica2] o.a.s.u.UpdateLog Initializing UpdateLog: dataDir=null defaultSyncLevel=FLUSH numRecordsToKeep=100 maxNumLogsToKeep=10 numVersionBuckets=65536
   [junit4]   2> 525531 INFO  (qtp1051442201-4415) [n:127.0.0.1:55675_solr c:MissingSegmentRecoveryTest s:shard1  x:MissingSegmentRecoveryTest_shard1_replica2] o.a.s.u.CommitTracker Hard AutoCommit: disabled
   [junit4]   2> 525531 INFO  (qtp1051442201-4415) [n:127.0.0.1:55675_solr c:MissingSegmentRecoveryTest s:shard1  x:MissingSegmentRecoveryTest_shard1_replica2] o.a.s.u.CommitTracker Soft AutoCommit: disabled
   [junit4]   2> 525532 INFO  (qtp1051442201-4415) [n:127.0.0.1:55675_solr c:MissingSegmentRecoveryTest s:shard1  x:MissingSegmentRecoveryTest_shard1_replica2] o.a.s.s.SolrIndexSearcher Opening [Searcher@2b9c15[MissingSegmentRecoveryTest_shard1_replica2] main]
   [junit4]   2> 525533 INFO  (qtp1051442201-4415) [n:127.0.0.1:55675_solr c:MissingSegmentRecoveryTest s:shard1  x:MissingSegmentRecoveryTest_shard1_replica2] o.a.s.r.ManagedResourceStorage Configured ZooKeeperStorageIO with znodeBase: /configs/conf
   [junit4]   2> 525533 INFO  (qtp1051442201-4415) [n:127.0.0.1:55675_solr c:MissingSegmentRecoveryTest s:shard1  x:MissingSegmentRecoveryTest_shard1_replica2] o.a.s.r.ManagedResourceStorage Loaded null at path _rest_managed.json using ZooKeeperStorageIO:path=/configs/conf
   [junit4]   2> 525533 INFO  (qtp1051442201-4415) [n:127.0.0.1:55675_solr c:MissingSegmentRecoveryTest s:shard1  x:MissingSegmentRecoveryTest_shard1_replica2] o.a.s.h.ReplicationHandler Commits will be reserved for  10000
   [junit4]   2> 525543 INFO  (qtp1051442201-4415) [n:127.0.0.1:55675_solr c:MissingSegmentRecoveryTest s:shard1  x:MissingSegmentRecoveryTest_shard1_replica2] o.a.s.u.UpdateLog Could not find max version in index or recent updates, using new clock 1562256290041823232
   [junit4]   2> 525543 INFO  (qtp558857687-4429) [n:127.0.0.1:43343_solr c:MissingSegmentRecoveryTest s:shard1  x:MissingSegmentRecoveryTest_shard1_replica1] o.a.s.u.UpdateHandler Using UpdateLog implementation: org.apache.solr.update.UpdateLog
   [junit4]   2> 525543 INFO  (qtp558857687-4429) [n:127.0.0.1:43343_solr c:MissingSegmentRecoveryTest s:shard1  x:MissingSegmentRecoveryTest_shard1_replica1] o.a.s.u.UpdateLog Initializing UpdateLog: dataDir=null defaultSyncLevel=FLUSH numRecordsToKeep=100 maxNumLogsToKeep=10 numVersionBuckets=65536
   [junit4]   2> 525578 INFO  (searcherExecutor-2266-thread-1-processing-n:127.0.0.1:55675_solr x:MissingSegmentRecoveryTest_shard1_replica2 s:shard1 c:MissingSegmentRecoveryTest) [n:127.0.0.1:55675_solr c:MissingSegmentRecoveryTest s:shard1  x:MissingSegmentRecoveryTest_shard1_replica2] o.a.s.c.SolrCore [MissingSegmentRecoveryTest_shard1_replica2] Registered new searcher Searcher@2b9c15[MissingSegmentRecoveryTest_shard1_replica2] main{ExitableDirectoryReader(UninvertingDirectoryReader())}
   [junit4]   2> 525581 INFO  (qtp1051442201-4415) [n:127.0.0.1:55675_solr c:MissingSegmentRecoveryTest s:shard1  x:MissingSegmentRecoveryTest_shard1_replica2] o.a.s.c.ShardLeaderElectionContext Waiting until we see more replicas up for shard shard1: total=2 found=1 timeoutin=9999ms
   [junit4]   2> 525581 INFO  (qtp558857687-4429) [n:127.0.0.1:43343_solr c:MissingSegmentRecoveryTest s:shard1  x:MissingSegmentRecoveryTest_shard1_replica1] o.a.s.u.CommitTracker Hard AutoCommit: disabled
   [junit4]   2> 525581 INFO  (qtp558857687-4429) [n:127.0.0.1:43343_solr c:MissingSegmentRecoveryTest s:shard1  x:MissingSegmentRecoveryTest_shard1_replica1] o.a.s.u.CommitTracker Soft AutoCommit: disabled
   [junit4]   2> 525583 INFO  (qtp558857687-4429) [n:127.0.0.1:43343_solr c:MissingSegmentRecoveryTest s:shard1  x:MissingSegmentRecoveryTest_shard1_replica1] o.a.s.s.SolrIndexSearcher Opening [Searcher@5019a9b3[MissingSegmentRecoveryTest_shard1_replica1] main]
   [junit4]   2> 525584 INFO  (qtp558857687-4429) [n:127.0.0.1:43343_solr c:MissingSegmentRecoveryTest s:shard1  x:MissingSegmentRecoveryTest_shard1_replica1] o.a.s.r.ManagedResourceStorage Configured ZooKeeperStorageIO with znodeBase: /configs/conf
   [junit4]   2> 525584 INFO  (qtp558857687-4429) [n:127.0.0.1:43343_solr c:MissingSegmentRecoveryTest s:shard1  x:MissingSegmentRecoveryTest_shard1_replica1] o.a.s.r.ManagedResourceStorage Loaded null at path _rest_managed.json using ZooKeeperStorageIO:path=/configs/conf
   [junit4]   2> 525584 INFO  (qtp558857687-4429) [n:127.0.0.1:43343_solr c:MissingSegmentRecoveryTest s:shard1  x:MissingSegmentRecoveryTest_shard1_replica1] o.a.s.h.ReplicationHandler Commits will be reserved for  10000
   [junit4]   2> 525584 INFO  (qtp558857687-4429) [n:127.0.0.1:43343_solr c:MissingSegmentRecoveryTest s:shard1  x:MissingSegmentRecoveryTest_shard1_replica1] o.a.s.u.UpdateLog Could not find max version in index or recent updates, using new clock 1562256290084814848
   [junit4]   2> 525586 INFO  (searcherExecutor-2267-thread-1-processing-n:127.0.0.1:43343_solr x:MissingSegmentRecoveryTest_shard1_replica1 s:shard1 c:MissingSegmentRecoveryTest) [n:127.0.0.1:43343_solr c:MissingSegmentRecoveryTest s:shard1  x:MissingSegmentRecoveryTest_shard1_replica1] o.a.s.c.SolrCore [MissingSegmentRecoveryTest_shard1_replica1] Registered new searcher Searcher@5019a9b3[MissingSegmentRecoveryTest_shard1_replica1] main{ExitableDirectoryReader(UninvertingDirectoryReader())}
   [junit4]   2> 525684 INFO  (zkCallback-626-thread-1-processing-n:127.0.0.1:55675_solr) [n:127.0.0.1:55675_solr    ] o.a.s.c.c.ZkStateReader A cluster state change: [WatchedEvent state:SyncConnected type:NodeDataChanged path:/collections/MissingSegmentRecoveryTest/state.json] for collection [MissingSegmentRecoveryTest] has occurred - updating... (live nodes size: [2])
   [junit4]   2> 525685 INFO  (zkCallback-625-thread-1-processing-n:127.0.0.1:43343_solr) [n:127.0.0.1:43343_solr    ] o.a.s.c.c.ZkStateReader A cluster state change: [WatchedEvent state:SyncConnected type:NodeDataChanged path:/collections/MissingSegmentRecoveryTest/state.json] for collection [MissingSegmentRecoveryTest] has occurred - updating... (live nodes size: [2])
   [junit4]   2> 526085 INFO  (qtp1051442201-4415) [n:127.0.0.1:55675_solr c:MissingSegmentRecoveryTest s:shard1  x:MissingSegmentRecoveryTest_shard1_replica2] o.a.s.c.ShardLeaderElectionContext Enough replicas found to continue.
   [junit4]   2> 526085 INFO  (qtp1051442201-4415) [n:127.0.0.1:55675_solr c:MissingSegmentRecoveryTest s:shard1  x:MissingSegmentRecoveryTest_shard1_replica2] o.a.s.c.ShardLeaderElectionContext I may be the new leader - try and sync
   [junit4]   2> 526085 INFO  (qtp1051442201-4415) [n:127.0.0.1:55675_solr c:MissingSegmentRecoveryTest s:shard1  x:MissingSegmentRecoveryTest_shard1_replica2] o.a.s.c.SyncStrategy Sync replicas to https://127.0.0.1:55675/solr/MissingSegmentRecoveryTest_shard1_replica2/
   [junit4]   2> 526085 INFO  (qtp1051442201-4415) [n:127.0.0.1:55675_solr c:MissingSegmentRecoveryTest s:shard1  x:MissingSegmentRecoveryTest_shard1_replica2] o.a.s.u.PeerSync PeerSync: core=MissingSegmentRecoveryTest_shard1_replica2 url=https://127.0.0.1:55675/solr START replicas=[https://127.0.0.1:43343/solr/MissingSegmentRecoveryTest_shard1_replica1/] nUpdates=100
   [junit4]   2> 526086 INFO  (qtp1051442201-4415) [n:127.0.0.1:55675_solr c:MissingSegmentRecoveryTest s:shard1  x:MissingSegmentRecoveryTest_shard1_replica2] o.a.s.u.PeerSync PeerSync: core=MissingSegmentRecoveryTest_shard1_replica2 url=https://127.0.0.1:55675/solr DONE.  We have no versions.  sync failed.
   [junit4]   2> 526101 INFO  (qtp558857687-4425) [n:127.0.0.1:43343_solr c:MissingSegmentRecoveryTest s:shard1 r:core_node2 x:MissingSegmentRecoveryTest_shard1_replica1] o.a.s.c.S.Request [MissingSegmentRecoveryTest_shard1_replica1]  webapp=/solr path=/get params={distrib=false&qt=/get&fingerprint=false&getVersions=100&wt=javabin&version=2} status=0 QTime=0
   [junit4]   2> 526109 INFO  (qtp1051442201-4415) [n:127.0.0.1:55675_solr c:MissingSegmentRecoveryTest s:shard1  x:MissingSegmentRecoveryTest_shard1_replica2] o.a.s.c.SyncStrategy Leader's attempt to sync with shard failed, moving to the next candidate
   [junit4]   2> 526109 INFO  (qtp1051442201-4415) [n:127.0.0.1:55675_solr c:MissingSegmentRecoveryTest s:shard1  x:MissingSegmentRecoveryTest_shard1_replica2] o.a.s.c.ShardLeaderElectionContext We failed sync, but we have no versions - we can't sync in that case - we were active before, so become leader anyway
   [junit4]   2> 526109 INFO  (qtp1051442201-4415) [n:127.0.0.1:55675_solr c:MissingSegmentRecoveryTest s:shard1  x:MissingSegmentRecoveryTest_shard1_replica2] o.a.s.c.ShardLeaderElectionContext Found all replicas participating in election, clear LIR
   [junit4]   2> 526111 INFO  (qtp1051442201-4415) [n:127.0.0.1:55675_solr c:MissingSegmentRecoveryTest s:shard1  x:MissingSegmentRecoveryTest_shard1_replica2] o.a.s.c.ShardLeaderElectionContext I am the new leader: https://127.0.0.1:55675/solr/MissingSegmentRecoveryTest_shard1_replica2/ shard1
   [junit4]   2> 526212 INFO  (zkCallback-626-thread-1-processing-n:127.0.0.1:55675_solr) [n:127.0.0.1:55675_solr    ] o.a.s.c.c.ZkStateReader A cluster state change: [WatchedEvent state:SyncConnected type:NodeDataChanged path:/collections/MissingSegmentRecoveryTest/state.json] for collection [MissingSegmentRecoveryTest] has occurred - updating... (live nodes size: [2])
   [junit4]   2> 526213 INFO  (zkCallback-625-thread-3-processing-n:127.0.0.1:43343_solr) [n:127.0.0.1:43343_solr    ] o.a.s.c.c.ZkStateReader A cluster state change: [WatchedEvent state:SyncConnected type:NodeDataChanged path:/collections/MissingSegmentRecoveryTest/state.json] for collection [MissingSegmentRecoveryTest] has occurred - updating... (live nodes size: [2])
   [junit4]   2> 526375 INFO  (qtp1051442201-4415) [n:127.0.0.1:55675_solr c:MissingSegmentRecoveryTest s:shard1  x:MissingSegmentRecoveryTest_shard1_replica2] o.a.s.c.ZkController I am the leader, no recovery necessary
   [junit4]   2> 526463 INFO  (qtp1051442201-4415) [n:127.0.0.1:55675_solr c:MissingSegmentRecoveryTest s:shard1  x:MissingSegmentRecoveryTest_shard1_replica2] o.a.s.s.HttpSolrCall [admin] webapp=null path=/admin/cores params={qt=/admin/cores&collection.configName=conf&newCollection=true&name=MissingSegmentRecoveryTest_shard1_replica2&action=CREATE&numShards=1&collection=MissingSegmentRecoveryTest&shard=shard1&wt=javabin&version=2} status=0 QTime=2103
   [junit4]   2> 526567 INFO  (zkCallback-626-thread-1-processing-n:127.0.0.1:55675_solr) [n:127.0.0.1:55675_solr    ] o.a.s.c.c.ZkStateReader A cluster state change: [WatchedEvent state:SyncConnected type:NodeDataChanged path:/collections/MissingSegmentRecoveryTest/state.json] for collection [MissingSegmentRecoveryTest] has occurred - updating... (live nodes size: [2])
   [junit4]   2> 526567 INFO  (zkCallback-625-thread-1-processing-n:127.0.0.1:43343_solr) [n:127.0.0.1:43343_solr    ] o.a.s.c.c.ZkStateReader A cluster state change: [WatchedEvent state:SyncConnected type:NodeDataChanged path:/collections/MissingSegmentRecoveryTest/state.json] for collection [MissingSegmentRecoveryTest] has occurred - updating... (live nodes size: [2])
   [junit4]   2> 526590 INFO  (qtp558857687-4429) [n:127.0.0.1:43343_solr c:MissingSegmentRecoveryTest s:shard1  x:MissingSegmentRecoveryTest_shard1_replica1] o.a.s.s.HttpSolrCall [admin] webapp=null path=/admin/cores params={qt=/admin/cores&collection.configName=conf&newCollection=true&name=MissingSegmentRecoveryTest_shard1_replica1&action=CREATE&numShards=1&collection=MissingSegmentRecoveryTest&shard=shard1&wt=javabin&version=2} status=0 QTime=2185
   [junit4]   2> 526598 INFO  (qtp1051442201-4420) [n:127.0.0.1:55675_solr    ] o.a.s.h.a.CollectionsHandler Wait for new collection to be active for at most 30 seconds. Check all shard replicas
   [junit4]   2> 526700 INFO  (zkCallback-625-thread-3-processing-n:127.0.0.1:43343_solr) [n:127.0.0.1:43343_solr    ] o.a.s.c.c.ZkStateReader A cluster state change: [WatchedEvent state:SyncConnected type:NodeDataChanged path:/collections/MissingSegmentRecoveryTest/state.json] for collection [MissingSegmentRecoveryTest] has occurred - updating... (live nodes size: [2])
   [junit4]   2> 526700 INFO  (zkCallback-626-thread-1-processing-n:127.0.0.1:55675_solr) [n:127.0.0.1:55675_solr    ] o.a.s.c.c.ZkStateReader A cluster state change: [WatchedEvent state:SyncConnected type:NodeDataChanged path:/collections/MissingSegmentRecoveryTest/state.json] for collection [MissingSegmentRecoveryTest] has occurred - updating... (live nodes size: [2])
   [junit4]   2> 527598 INFO  (qtp1051442201-4420) [n:127.0.0.1:55675_solr    ] o.a.s.s.HttpSolrCall [admin] webapp=null path=/admin/collections params={replicationFactor=2&collection.configName=conf&maxShardsPerNode=1&name=MissingSegmentRecoveryTest&action=CREATE&numShards=1&wt=javabin&version=2} status=0 QTime=3507
   [junit4]   2> 527636 INFO  (qtp558857687-4428) [n:127.0.0.1:43343_solr c:MissingSegmentRecoveryTest s:shard1 r:core_node2 x:MissingSegmentRecoveryTest_shard1_replica1] o.a.s.u.p.LogUpdateProcessorFactory [MissingSegmentRecoveryTest_shard1_replica1]  webapp=/solr path=/update params={update.distrib=FROMLEADER&distrib.from=https://127.0.0.1:55675/solr/MissingSegmentRecoveryTest_shard1_replica2/&wt=javabin&version=2}{add=[0 (1562256292214472704), 1 (1562256292216569856), 2 (1562256292216569857), 3 (1562256292216569858), 4 (1562256292217618432), 5 (1562256292217618433), 6 (1562256292217618434), 7 (1562256292217618435), 8 (1562256292217618436), 9 (1562256292217618437)]} 0 15
   [junit4]   2> 527643 INFO  (qtp1051442201-4421) [n:127.0.0.1:55675_solr c:MissingSegmentRecoveryTest s:shard1 r:core_node1 x:MissingSegmentRecoveryTest_shard1_replica2] o.a.s.u.p.LogUpdateProcessorFactory [MissingSegmentRecoveryTest_shard1_replica2]  webapp=/solr path=/update params={wt=javabin&version=2}{add=[0 (1562256292214472704), 1 (1562256292216569856), 2 (1562256292216569857), 3 (1562256292216569858), 4 (1562256292217618432), 5 (1562256292217618433), 6 (1562256292217618434), 7 (1562256292217618435), 8 (1562256292217618436), 9 (1562256292217618437)]} 0 28
   [junit4]   2> 527659 INFO  (qtp1051442201-4416) [n:127.0.0.1:55675_solr c:MissingSegmentRecoveryTest s:shard1 r:core_node1 x:MissingSegmentRecoveryTest_shard1_replica2] o.a.s.u.DirectUpdateHandler2 start commit{,optimize=false,openSearcher=true,waitSearcher=true,expungeDeletes=false,softCommit=false,prepareCommit=false}
   [junit4]   2> 527659 INFO  (qtp1051442201-4416) [n:127.0.0.1:55675_solr c:MissingSegmentRecoveryTest s:shard1 r:core_node1 x:MissingSegmentRecoveryTest_shard1_replica2] o.a.s.u.SolrIndexWriter Calling setCommitData with IW:org.apache.solr.update.SolrIndexWriter@c14ccdf
   [junit4]   2> 527661 INFO  (qtp558857687-4431) [n:127.0.0.1:43343_solr c:MissingSegmentRecoveryTest s:shard1 r:core_node2 x:MissingSegmentRecoveryTest_shard1_replica1] o.a.s.u.DirectUpdateHandler2 start commit{,optimize=false,openSearcher=true,waitSearcher=true,expungeDeletes=false,softCommit=false,prepareCommit=false}
   [junit4]   2> 527661 INFO  (qtp558857687-4431) [n:127.0.0.1:43343_solr c:MissingSegmentRecoveryTest s:shard1 r:core_node2 x:MissingSegmentRecoveryTest_shard1_replica1] o.a.s.u.SolrIndexWriter Calling setCommitData with IW:org.apache.solr.update.SolrIndexWriter@c461069
   [junit4]   2> 527693 INFO  (qtp558857687-4431) [n:127.0.0.1:43343_solr c:MissingSegmentRecoveryTest s:shard1 r:core_node2 x:MissingSegmentRecoveryTest_shard1_replica1] o.a.s.s.SolrIndexSearcher Opening [Searcher@2ac22d1c[MissingSegmentRecoveryTest_shard1_replica1] main]
   [junit4]   2> 527694 INFO  (qtp558857687-4431) [n:127.0.0.1:43343_solr c:MissingSegmentRecoveryTest s:shard1 r:core_node2 x:MissingSegmentRecoveryTest_shard1_replica1] o.a.s.u.DirectUpdateHandler2 end_commit_flush
   [junit4]   2> 527694 INFO  (searcherExecutor-2267-thread-1-processing-n:127.0.0.1:43343_solr x:MissingSegmentRecoveryTest_shard1_replica1 s:shard1 c:MissingSegmentRecoveryTest r:core_node2) [n:127.0.0.1:43343_solr c:MissingSegmentRecoveryTest s:shard1 r:core_node2 x:MissingSegmentRecoveryTest_shard1_replica1] o.a.s.c.SolrCore [MissingSegmentRecoveryTest_shard1_replica1] Registered new searcher Searcher@2ac22d1c[MissingSegmentRecoveryTest_shard1_replica1] main{ExitableDirectoryReader(UninvertingDirectoryReader(Uninverting(_0(6.6.0):C10)))}
   [junit4]   2> 527694 INFO  (qtp558857687-4431) [n:127.0.0.1:43343_solr c:MissingSegmentRecoveryTest s:shard1 r:core_node2 x:MissingSegmentRecoveryTest_shard1_replica1] o.a.s.u.p.LogUpdateProcessorFactory [MissingSegmentRecoveryTest_shard1_replica1]  webapp=/solr path=/update params={update.distrib=FROMLEADER&waitSearcher=true&openSearcher=true&commit=true&softCommit=false&distrib.from=https://127.0.0.1:55675/solr/MissingSegmentRecoveryTest_shard1_replica2/&commit_end_point=true&wt=javabin&version=2&expungeDeletes=false}{commit=} 0 33
   [junit4]   2> 527695 INFO  (qtp1051442201-4416) [n:127.0.0.1:55675_solr c:MissingSegmentRecoveryTest s:shard1 r:core_node1 x:MissingSegmentRecoveryTest_shard1_replica2] o.a.s.s.SolrIndexSearcher Opening [Searcher@12d9ab28[MissingSegmentRecoveryTest_shard1_replica2] main]
   [junit4]   2> 527695 INFO  (qtp1051442201-4416) [n:127.0.0.1:55675_solr c:MissingSegmentRecoveryTest s:shard1 r:core_node1 x:MissingSegmentRecoveryTest_shard1_replica2] o.a.s.u.DirectUpdateHandler2 end_commit_flush
   [junit4]   2> 527695 INFO  (searcherExecutor-2266-thread-1-processing-n:127.0.0.1:55675_solr x:MissingSegmentRecoveryTest_shard1_replica2 s:shard1 c:MissingSegmentRecoveryTest r:core_node1) [n:127.0.0.1:55675_solr c:MissingSegmentRecoveryTest s:shard1 r:core_node1 x:MissingSegmentRecoveryTest_shard1_replica2] o.a.s.c.SolrCore [MissingSegmentRecoveryTest_shard1_replica2] Registered new searcher Searcher@12d9ab28[MissingSegmentRecoveryTest_shard1_replica2] main{ExitableDirectoryReader(UninvertingDirectoryReader(Uninverting(_0(6.6.0):C10)))}
   [junit4]   2> 527695 INFO  (qtp1051442201-4416) [n:127.0.0.1:55675_solr c:MissingSegmentRecoveryTest s:shard1 r:core_node1 x:MissingSegmentRecoveryTest_shard1_replica2] o.a.s.u.p.LogUpdateProcessorFactory [MissingSegmentRecoveryTest_shard1_replica2]  webapp=/solr path=/update params={update.distrib=FROMLEADER&waitSearcher=true&openSearcher=true&commit=true&softCommit=false&distrib.from=https://127.0.0.1:55675/solr/MissingSegmentRecoveryTest_shard1_replica2/&commit_end_point=true&wt=javabin&version=2&expungeDeletes=false}{commit=} 0 36
   [junit4]   2> 527696 INFO  (qtp1051442201-4419) [n:127.0.0.1:55675_solr c:MissingSegmentRecoveryTest s:shard1 r:core_node1 x:MissingSegmentRecoveryTest_shard1_replica2] o.a.s.u.p.LogUpdateProcessorFactory [MissingSegmentRecoveryTest_shard1_replica2]  webapp=/solr path=/update params={_stateVer_=MissingSegmentRecoveryTest:5&waitSearcher=true&commit=true&softCommit=false&wt=javabin&version=2}{commit=} 0 50
   [junit4]   2> 527700 INFO  (TEST-MissingSegmentRecoveryTest.testLeaderRecovery-seed#[92B16C9085CD04C2]) [    ] o.e.j.s.AbstractConnector Stopped ServerConnector@17275820{SSL,[ssl, http/1.1]}{127.0.0.1:0}
   [junit4]   2> 527707 INFO  (TEST-MissingSegmentRecoveryTest.testLeaderRecovery-seed#[92B16C9085CD04C2]) [    ] o.a.s.c.CoreContainer Shutting down CoreContainer instance=488173948
   [junit4]   2> 527710 INFO  (coreCloseExecutor-2276-thread-1) [n:127.0.0.1:43343_solr c:MissingSegmentRecoveryTest s:shard1 r:core_node2 x:MissingSegmentRecoveryTest_shard1_replica1] o.a.s.c.SolrCore [MissingSegmentRecoveryTest_shard1_replica1]  CLOSING SolrCore org.apache.solr.core.SolrCore@4b2660aa
   [junit4]   2> 527712 INFO  (coreCloseExecutor-2276-thread-1) [n:127.0.0.1:43343_solr c:MissingSegmentRecoveryTest s:shard1 r:core_node2 x:MissingSegmentRecoveryTest_shard1_replica1] o.a.s.m.SolrMetricManager Closing metric reporters for: solr.core.MissingSegmentRecoveryTest.shard1.replica1
   [junit4]   2> 527713 INFO  (TEST-MissingSegmentRecoveryTest.testLeaderRecovery-seed#[92B16C9085CD04C2]) [    ] o.a.s.c.Overseer Overseer (id=97641017960759301-127.0.0.1:43343_solr-n_0000000000) closing
   [junit4]   2> 527713 INFO  (OverseerStateUpdate-97641017960759301-127.0.0.1:43343_solr-n_0000000000) [n:127.0.0.1:43343_solr    ] o.a.s.c.Overseer Overseer Loop exiting : 127.0.0.1:43343_solr
   [junit4]   2> 527720 INFO  (zkCallback-626-thread-1-processing-n:127.0.0.1:55675_solr) [n:127.0.0.1:55675_solr    ] o.a.s.c.OverseerElectionContext I am going to be the leader 127.0.0.1:55675_solr
   [junit4]   2> 527721 INFO  (zkCallback-632-thread-1) [    ] o.a.s.c.c.ZkStateReader Updated live nodes from ZooKeeper... (2) -> (1)
   [junit4]   2> 527721 INFO  (zkCallback-626-thread-1-processing-n:127.0.0.1:55675_solr) [n:127.0.0.1:55675_solr    ] o.a.s.c.Overseer Overseer (id=97641017960759302-127.0.0.1:55675_solr-n_0000000001) starting
   [junit4]   2> 527725 INFO  (zkCallback-626-thread-2-processing-n:127.0.0.1:55675_solr) [n:127.0.0.1:55675_solr    ] o.a.s.c.c.ZkStateReader Updated live nodes from ZooKeeper... (2) -> (1)
   [junit4]   2> 527764 INFO  (zkCallback-626-thread-2-processing-n:127.0.0.1:55675_solr) [n:127.0.0.1:55675_solr    ] o.a.s.c.c.ZkStateReader A cluster state change: [WatchedEvent state:SyncConnected type:NodeDataChanged path:/collections/MissingSegmentRecoveryTest/state.json] for collection [MissingSegmentRecoveryTest] has occurred - updating... (live nodes size: [1])
   [junit4]   2> 529220 WARN  (zkCallback-625-thread-1-processing-n:127.0.0.1:43343_solr) [n:127.0.0.1:43343_solr    ] o.a.s.c.c.ZkStateReader ZooKeeper watch triggered, but Solr cannot talk to ZK: [KeeperErrorCode = Session expired for /live_nodes]
   [junit4]   2> 529221 INFO  (TEST-MissingSegmentRecoveryTest.testLeaderRecovery-seed#[92B16C9085CD04C2]) [    ] o.a.s.m.SolrMetricManager Closing metric reporters for: solr.node
   [junit4]   2> 529221 INFO  (TEST-MissingSegmentRecoveryTest.testLeaderRecovery-seed#[92B16C9085CD04C2]) [    ] o.e.j.s.h.ContextHandler Stopped o.e.j.s.ServletContextHandler@2997f974{/solr,null,UNAVAILABLE}
   [junit4]   2> 529223 INFO  (TEST-MissingSegmentRecoveryTest.testLeaderRecovery-seed#[92B16C9085CD04C2]) [    ] o.e.j.s.Server jetty-9.3.14.v20161028
   [junit4]   2> 529228 INFO  (TEST-MissingSegmentRecoveryTest.testLeaderRecovery-seed#[92B16C9085CD04C2]) [    ] o.e.j.s.h.ContextHandler Started o.e.j.s.ServletContextHandler@2a6c6692{/solr,null,AVAILABLE}
   [junit4]   2> 529228 INFO  (TEST-MissingSegmentRecoveryTest.testLeaderRecovery-seed#[92B16C9085CD04C2]) [    ] o.e.j.s.AbstractConnector Started ServerConnector@618800c1{SSL,[ssl, http/1.1]}{127.0.0.1:43343}
   [junit4]   2> 529228 INFO  (TEST-MissingSegmentRecoveryTest.testLeaderRecovery-seed#[92B16C9085CD04C2]) [    ] o.e.j.s.Server Started @532122ms
   [junit4]   2> 529229 INFO  (TEST-MissingSegmentRecoveryTest.testLeaderRecovery-seed#[92B16C9085CD04C2]) [    ] o.a.s.c.s.e.JettySolrRunner Jetty properties: {hostContext=/solr, hostPort=43343}
   [junit4]   2> 529229 ERROR (TEST-MissingSegmentRecoveryTest.testLeaderRecovery-seed#[92B16C9085CD04C2]) [    ] o.a.s.s.StartupLoggingUtils Missing Java Option solr.log.dir. Logging may be missing or incomplete.
   [junit4]   2> 529229 INFO  (TEST-MissingSegmentRecoveryTest.testLeaderRecovery-seed#[92B16C9085CD04C2]) [    ] o.a.s.s.SolrDispatchFilter  ___      _       Welcome to Apache Solr? version 6.6.0
   [junit4]   2> 529229 INFO  (TEST-MissingSegmentRecoveryTest.testLeaderRecovery-seed#[92B16C9085CD04C2]) [    ] o.a.s.s.SolrDispatchFilter / __| ___| |_ _   Starting in cloud mode on port null
   [junit4]   2> 529229 INFO  (TEST-MissingSegmentRecoveryTest.testLeaderRecovery-seed#[92B16C9085CD04C2]) [    ] o.a.s.s.SolrDispatchFilter \__ \/ _ \ | '_|  Install dir: null
   [junit4]   2> 529229 INFO  (TEST-MissingSegmentRecoveryTest.testLeaderRecovery-seed#[92B16C9085CD04C2]) [    ] o.a.s.s.SolrDispatchFilter |___/\___/_|_|    Start time: 2017-03-19T00:35:03.143Z
   [junit4]   2> 529232 INFO  (TEST-MissingSegmentRecoveryTest.testLeaderRecovery-seed#[92B16C9085CD04C2]) [    ] o.a.s.s.SolrDispatchFilter solr.xml found in ZooKeeper. Loading...
   [junit4]   2> 529238 INFO  (TEST-MissingSegmentRecoveryTest.testLeaderRecovery-seed#[92B16C9085CD04C2]) [    ] o.a.s.u.UpdateShardHandler Creating UpdateShardHandler HTTP client with params: socketTimeout=340000&connTimeout=45000&retry=true
   [junit4]   2> 529238 INFO  (TEST-MissingSegmentRecoveryTest.testLeaderRecovery-seed#[92B16C9085CD04C2]) [    ] o.a.s.c.ZkContainer Zookeeper client=127.0.0.1:52140/solr
   [junit4]   2> 529249 INFO  (TEST-MissingSegmentRecoveryTest.testLeaderRecovery-seed#[92B16C9085CD04C2]) [n:127.0.0.1:43343_solr    ] o.a.s.c.c.ZkStateReader Updated live nodes from ZooKeeper... (0) -> (1)
   [junit4]   2> 529251 INFO  (TEST-MissingSegmentRecoveryTest.testLeaderRecovery-seed#[92B16C9085CD04C2]) [n:127.0.0.1:43343_solr    ] o.a.s.c.Overseer Overseer (id=null) closing
   [junit4]   2> 529253 INFO  (TEST-MissingSegmentRecoveryTest.testLeaderRecovery-seed#[92B16C9085CD04C2]) [n:127.0.0.1:43343_solr    ] o.a.s.c.ZkController Register node as live in ZooKeeper:/live_nodes/127.0.0.1:43343_solr
   [junit4]   2> 529254 INFO  (zkCallback-632-thread-1) [    ] o.a.s.c.c.ZkStateReader Updated live nodes from ZooKeeper... (1) -> (2)
   [junit4]   2> 529256 INFO  (zkCallback-637-thread-1-processing-n:127.0.0.1:43343_solr) [n:127.0.0.1:43343_solr    ] o.a.s.c.c.ZkStateReader Updated live nodes from ZooKeeper... (1) -> (2)
   [junit4]   2> 529257 INFO  (zkCallback-626-thread-2-processing-n:127.0.0.1:55675_solr) [n:127.0.0.1:55675_solr    ] o.a.s.c.c.ZkStateReader A cluster state change: [WatchedEvent state:SyncConnected type:NodeDataChanged path:/collections/MissingSegmentRecoveryTest/state.json] for collection [MissingSegmentRecoveryTest] has occurred - updating... (live nodes size: [1])
   [junit4]   2> 529267 INFO  (zkCallback-626-thread-1-processing-n:127.0.0.1:55675_solr) [n:127.0.0.1:55675_solr    ] o.a.s.c.c.ZkStateReader Updated live nodes from ZooKeeper... (1) -> (2)
   [junit4]   2> 529376 INFO  (TEST-MissingSegmentRecoveryTest.testLeaderRecovery-seed#[92B16C9085CD04C2]) [n:127.0.0.1:43343_solr    ] o.a.s.c.CorePropertiesLocator Found 1 core definitions underneath /x1/jenkins/jenkins-slave/workspace/Lucene-Solr-Tests-6.x/solr/build/solr-core/test/J0/temp/solr.cloud.MissingSegmentRecoveryTest_92B16C9085CD04C2-001/tempDir-001/node2/.
   [junit4]   2> 529376 INFO  (TEST-MissingSegmentRecoveryTest.testLeaderRecovery-seed#[92B16C9085CD04C2]) [n:127.0.0.1:43343_solr    ] o.a.s.c.CorePropertiesLocator Cores are: [MissingSegmentRecoveryTest_shard1_replica1]
   [junit4]   2> 529389 INFO  (coreLoadExecutor-2285-thread-1-processing-n:127.0.0.1:43343_solr) [n:127.0.0.1:43343_solr c:MissingSegmentRecoveryTest s:shard1 r:core_node2 x:MissingSegmentRecoveryTest_shard1_replica1] o.a.s.c.SolrConfig Using Lucene MatchVersion: 6.6.0
   [junit4]   2> 529396 INFO  (coreLoadExecutor-2285-thread-1-processing-n:127.0.0.1:43343_solr) [n:127.0.0.1:43343_solr c:MissingSegmentRecoveryTest s:shard1 r:core_node2 x:MissingSegmentRecoveryTest_shard1_replica1] o.a.s.s.IndexSchema [MissingSegmentRecoveryTest_shard1_replica1] Schema name=minimal
   [junit4]   2> 529398 INFO  (coreLoadExecutor-2285-thread-1-processing-n:127.0.0.1:43343_solr) [n:127.0.0.1:43343_solr c:MissingSegmentRecoveryTest s:shard1 r:core_node2 x:MissingSegmentRecoveryTest_shard1_replica1] o.a.s.s.IndexSchema Loaded schema minimal/1.1 with uniqueid field id
   [junit4]   2> 529399 INFO  (coreLoadExecutor-2285-thread-1-processing-n:127.0.0.1:43343_solr) [n:127.0.0.1:43343_solr c:MissingSegmentRecoveryTest s:shard1 r:core_node2 x:MissingSegmentRecoveryTest_shard1_replica1] o.a.s.c.CoreContainer Creating SolrCore 'MissingSegmentRecoveryTest_shard1_replica1' using configuration from collection MissingSegmentRecoveryTest
   [junit4]   2> 529399 INFO  (coreLoadExecutor-2285-thread-1-processing-n:127.0.0.1:43343_solr) [n:127.0.0.1:43343_solr c:MissingSegmentRecoveryTest s:shard1 r:core_node2 x:MissingSegmentRecoveryTest_shard1_replica1] o.a.s.c.SolrCore solr.RecoveryStrategy.Builder
   [junit4]   2> 529399 INFO  (coreLoadExecutor-2285-thread-1-processing-n:127.0.0.1:43343_solr) [n:127.0.0.1:43343_solr c:MissingSegmentRecoveryTest s:shard1 r:core_node2 x:MissingSegmentRecoveryTest_shard1_replica1] o.a.s.c.SolrCore [[MissingSegmentRecoveryTest_shard1_replica1] ] Opening new SolrCore at [/x1/jenkins/jenkins-slave/workspace/Lucene-Solr-Tests-6.x/solr/build/solr-core/test/J0/temp/solr.cloud.MissingSegmentRecoveryTest_92B16C9085CD04C2-001/tempDir-001/node2/MissingSegmentRecoveryTest_shard1_replica1], dataDir=[/x1/jenkins/jenkins-slave/workspace/Lucene-Solr-Tests-6.x/solr/build/solr-core/test/J0/temp/solr.cloud.MissingSegmentRecoveryTest_92B16C9085CD04C2-001/tempDir-001/node2/./MissingSegmentRecoveryTest_shard1_replica1/data/]
   [junit4]   2> 529428 INFO  (coreLoadExecutor-2285-thread-1-processing-n:127.0.0.1:43343_solr) [n:127.0.0.1:43343_solr c:MissingSegmentRecoveryTest s:shard1 r:core_node2 x:MissingSegmentRecoveryTest_shard1_replica1] o.a.s.u.UpdateHandler Using UpdateLog implementation: org.apache.solr.update.UpdateLog
   [junit4]   2> 529428 INFO  (coreLoadExecutor-2285-thread-1-processing-n:127.0.0.1:43343_solr) [n:127.0.0.1:43343_solr c:MissingSegmentRecoveryTest s:shard1 r:core_node2 x:MissingSegmentRecoveryTest_shard1_replica1] o.a.s.u.UpdateLog Initializing UpdateLog: dataDir=null defaultSyncLevel=FLUSH numRecordsToKeep=100 maxNumLogsToKeep=10 numVersionBuckets=65536
   [junit4]   2> 529429 INFO  (coreLoadExecutor-2285-thread-1-processing-n:127.0.0.1:43343_solr) [n:127.0.0.1:43343_solr c:MissingSegmentRecoveryTest s:shard1 r:core_node2 x:MissingSegmentRecoveryTest_shard1_replica1] o.a.s.u.CommitTracker Hard AutoCommit: disabled
   [junit4]   2> 529429 INFO  (coreLoadExecutor-2285-thread-1-processing-n:127.0.0.1:43343_solr) [n:127.0.0.1:43343_solr c:MissingSegmentRecoveryTest s:shard1 r:core_node2 x:MissingSegmentRecoveryTest_shard1_replica1] o.a.s.u.CommitTracker Soft AutoCommit: disabled
   [junit4]   2> 529431 INFO  (coreLoadExecutor-2285-thread-1-processing-n:127.0.0.1:43343_solr) [n:127.0.0.1:43343_solr c:MissingSegmentRecoveryTest s:shard1 r:core_node2 x:MissingSegmentRecoveryTest_shard1_replica1] o.a.s.c.SolrCore [MissingSegmentRecoveryTest_shard1_replica1]  CLOSING SolrCore org.apache.solr.core.SolrCore@27420ace
   [junit4]   2> 529432 INFO  (coreLoadExecutor-2285-thread-1-processing-n:127.0.0.1:43343_solr) [n:127.0.0.1:43343_solr c:MissingSegmentRecoveryTest s:shard1 r:core_node2 x:MissingSegmentRecoveryTest_shard1_replica1] o.a.s.m.SolrMetricManager Closing metric reporters for: solr.core.MissingSegmentRecoveryTest.shard1.replica1
   [junit4]   2> 529433 INFO  (coreLoadExecutor-2285-thread-1-processing-n:127.0.0.1:43343_solr) [n:127.0.0.1:43343_solr c:MissingSegmentRecoveryTest s:shard1 r:core_node2 x:MissingSegmentRecoveryTest_shard1_replica1] o.a.s.c.CoreContainer Found active leader, will attempt to create fresh core and recover.
   [junit4]   2> 529434 INFO  (coreLoadExecutor-2285-thread-1-processing-n:127.0.0.1:43343_solr) [n:127.0.0.1:43343_solr c:MissingSegmentRecoveryTest s:shard1 r:core_node2 x:MissingSegmentRecoveryTest_shard1_replica1] o.a.s.c.SolrCore Updating index properties... index=index.20170318173503348
   [junit4]   2> 529436 INFO  (coreLoadExecutor-2285-thread-1-processing-n:127.0.0.1:43343_solr) [n:127.0.0.1:43343_solr c:MissingSegmentRecoveryTest s:shard1 r:core_node2 x:MissingSegmentRecoveryTest_shard1_replica1] o.a.s.c.SolrCore solr.RecoveryStrategy.Builder
   [junit4]   2> 529437 INFO  (coreLoadExecutor-2285-thread-1-processing-n:127.0.0.1:43343_solr) [n:127.0.0.1:43343_solr c:MissingSegmentRecoveryTest s:shard1 r:core_node2 x:MissingSegmentRecoveryTest_shard1_replica1] o.a.s.c.SolrCore [[MissingSegmentRecoveryTest_shard1_replica1] ] Opening new SolrCore at [/x1/jenkins/jenkins-slave/workspace/Lucene-Solr-Tests-6.x/solr/build/solr-core/test/J0/temp/solr.cloud.MissingSegmentRecoveryTest_92B16C9085CD04C2-001/tempDir-001/node2/MissingSegmentRecoveryTest_shard1_replica1], dataDir=[/x1/jenkins/jenkins-slave/workspace/Lucene-Solr-Tests-6.x/solr/build/solr-core/test/J0/temp/solr.cloud.MissingSegmentRecoveryTest_92B16C9085CD04C2-001/tempDir-001/node2/./MissingSegmentRecoveryTest_shard1_replica1/data/]
   [junit4]   2> 529440 INFO  (OldIndexDirectoryCleanupThreadForCore-MissingSegmentRecoveryTest_shard1_replica1) [n:127.0.0.1:43343_solr c:MissingSegmentRecoveryTest s:shard1 r:core_node2 x:MissingSegmentRecoveryTest_shard1_replica1] o.a.s.c.DirectoryFactory Found 1 old index directories to clean-up under /x1/jenkins/jenkins-slave/workspace/Lucene-Solr-Tests-6.x/solr/build/solr-core/test/J0/temp/solr.cloud.MissingSegmentRecoveryTest_92B16C9085CD04C2-001/tempDir-001/node2/./MissingSegmentRecoveryTest_shard1_replica1/data/ afterReload=false
   [junit4]   2> 529440 INFO  (OldIndexDirectoryCleanupThreadForCore-MissingSegmentRecoveryTest_shard1_replica1) [n:127.0.0.1:43343_solr c:MissingSegmentRecoveryTest s:shard1 r:core_node2 x:MissingSegmentRecoveryTest_shard1_replica1] o.a.s.c.DirectoryFactory Deleted old index directory: /x1/jenkins/jenkins-slave/workspace/Lucene-Solr-Tests-6.x/solr/build/solr-core/test/J0/temp/solr.cloud.MissingSegmentRecoveryTest_92B16C9085CD04C2-001/tempDir-001/node2/./MissingSegmentRecoveryTest_shard1_replica1/data/index.20170318173503348
   [junit4]   2> 529441 ERROR (coreLoadExecutor-2285-thread-1-processing-n:127.0.0.1:43343_solr) [n:127.0.0.1:43343_solr c:MissingSegmentRecoveryTest s:shard1 r:core_node2 x:MissingSegmentRecoveryTest_shard1_replica1] o.a.s.u.SolrIndexWriter Error closing IndexWriter
   [junit4]   2> java.nio.file.NoSuchFileException: /x1/jenkins/jenkins-slave/workspace/Lucene-Solr-Tests-6.x/solr/build/solr-core/test/J0/temp/solr.cloud.MissingSegmentRecoveryTest_92B16C9085CD04C2-001/tempDir-001/node2/MissingSegmentRecoveryTest_shard1_replica1/data/index.20170318173503348/write.lock
   [junit4]   2> at sun.nio.fs.UnixException.translateToIOException(UnixException.java:86)
   [junit4]   2> at sun.nio.fs.UnixException.rethrowAsIOException(UnixException.java:102)
   [junit4]   2> at sun.nio.fs.UnixException.rethrowAsIOException(UnixException.java:107)
   [junit4]   2> at sun.nio.fs.UnixFileAttributeViews$Basic.readAttributes(UnixFileAttributeViews.java:55)
   [junit4]   2> at sun.nio.fs.UnixFileSystemProvider.readAttributes(UnixFileSystemProvider.java:144)
   [junit4]   2> at sun.nio.fs.LinuxFileSystemProvider.readAttributes(LinuxFileSystemProvider.java:99)
   [junit4]   2> at java.nio.file.Files.readAttributes(Files.java:1737)
   [junit4]   2> at org.apache.lucene.store.NativeFSLockFactory$NativeFSLock.ensureValid(NativeFSLockFactory.java:177)
   [junit4]   2> at org.apache.lucene.store.LockValidatingDirectoryWrapper.sync(LockValidatingDirectoryWrapper.java:67)
   [junit4]   2> at org.apache.lucene.index.IndexWriter.startCommit(IndexWriter.java:4721)
   [junit4]   2> at org.apache.lucene.index.IndexWriter.prepareCommitInternal(IndexWriter.java:3083)
   [junit4]   2> at org.apache.lucene.index.IndexWriter.commitInternal(IndexWriter.java:3242)
   [junit4]   2> at org.apache.lucene.index.IndexWriter.shutdown(IndexWriter.java:1126)
   [junit4]   2> at org.apache.lucene.index.IndexWriter.close(IndexWriter.java:1169)
   [junit4]   2> at org.apache.solr.update.SolrIndexWriter.close(SolrIndexWriter.java:278)
   [junit4]   2> at org.apache.solr.core.SolrCore.initIndex(SolrCore.java:731)
   [junit4]   2> at org.apache.solr.core.SolrCore.<init>(SolrCore.java:912)
   [junit4]   2> at org.apache.solr.core.SolrCore.<init>(SolrCore.java:831)
   [junit4]   2> at org.apache.solr.core.CoreContainer.processCoreCreateException(CoreContainer.java:992)
   [junit4]   2> at org.apache.solr.core.CoreContainer.create(CoreContainer.java:920)
   [junit4]   2> at org.apache.solr.core.CoreContainer.lambda$load$5(CoreContainer.java:553)
   [junit4]   2> at com.codahale.metrics.InstrumentedExecutorService$InstrumentedCallable.call(InstrumentedExecutorService.java:197)
   [junit4]   2> at java.util.concurrent.FutureTask.run(FutureTask.java:266)
   [junit4]   2> at org.apache.solr.common.util.ExecutorUtil$MDCAwareThreadPoolExecutor.lambda$execute$0(ExecutorUtil.java:229)
   [junit4]   2> at java.util.concurrent.ThreadPoolExecutor.runWorker(ThreadPoolExecutor.java:1142)
   [junit4]   2> at java.util.concurrent.ThreadPoolExecutor$Worker.run(ThreadPoolExecutor.java:617)
   [junit4]   2> at java.lang.Thread.run(Thread.java:745)
   [junit4]   2> 529444 INFO  (OldIndexDirectoryCleanupThreadForCore-MissingSegmentRecoveryTest_shard1_replica1) [n:127.0.0.1:43343_solr c:MissingSegmentRecoveryTest s:shard1 r:core_node2 x:MissingSegmentRecoveryTest_shard1_replica1] o.a.s.c.DirectoryFactory Found 1 old index directories to clean-up under /x1/jenkins/jenkins-slave/workspace/Lucene-Solr-Tests-6.x/solr/build/solr-core/test/J0/temp/solr.cloud.MissingSegmentRecoveryTest_92B16C9085CD04C2-001/tempDir-001/node2/./MissingSegmentRecoveryTest_shard1_replica1/data/ afterReload=false
   [junit4]   2> 529447 INFO  (OldIndexDirectoryCleanupThreadForCore-MissingSegmentRecoveryTest_shard1_replica1) [n:127.0.0.1:43343_solr c:MissingSegmentRecoveryTest s:shard1 r:core_node2 x:MissingSegmentRecoveryTest_shard1_replica1] o.a.s.c.DirectoryFactory Deleted old index directory: /x1/jenkins/jenkins-slave/workspace/Lucene-Solr-Tests-6.x/solr/build/solr-core/test/J0/temp/solr.cloud.MissingSegmentRecoveryTest_92B16C9085CD04C2-001/tempDir-001/node2/./MissingSegmentRecoveryTest_shard1_replica1/data/index
   [junit4]   2> 529467 INFO  (coreLoadExecutor-2285-thread-1-processing-n:127.0.0.1:43343_solr) [n:127.0.0.1:43343_solr c:MissingSegmentRecoveryTest s:shard1 r:core_node2 x:MissingSegmentRecoveryTest_shard1_replica1] o.a.s.u.UpdateHandler Using UpdateLog implementation: org.apache.solr.update.UpdateLog
   [junit4]   2> 529467 INFO  (coreLoadExecutor-2285-thread-1-processing-n:127.0.0.1:43343_solr) [n:127.0.0.1:43343_solr c:MissingSegmentRecoveryTest s:shard1 r:core_node2 x:MissingSegmentRecoveryTest_shard1_replica1] o.a.s.u.UpdateLog Initializing UpdateLog: dataDir=null defaultSyncLevel=FLUSH numRecordsToKeep=100 maxNumLogsToKeep=10 numVersionBuckets=65536
   [junit4]   2> 529476 INFO  (coreLoadExecutor-2285-thread-1-processing-n:127.0.0.1:43343_solr) [n:127.0.0.1:43343_solr c:MissingSegmentRecoveryTest s:shard1 r:core_node2 x:MissingSegmentRecoveryTest_shard1_replica1] o.a.s.u.CommitTracker Hard AutoCommit: disabled
   [junit4]   2> 529476 INFO  (coreLoadExecutor-2285-thread-1-processing-n:127.0.0.1:43343_solr) [n:127.0.0.1:43343_solr c:MissingSegmentRecoveryTest s:shard1 r:core_node2 x:MissingSegmentRecoveryTest_shard1_replica1] o.a.s.u.CommitTracker Soft AutoCommit: disabled
   [junit4]   2> 529478 INFO  (coreLoadExecutor-2285-thread-1-processing-n:127.0.0.1:43343_solr) [n:127.0.0.1:43343_solr c:MissingSegmentRecoveryTest s:shard1 r:core_node2 x:MissingSegmentRecoveryTest_shard1_replica1] o.a.s.c.SolrCore [MissingSegmentRecoveryTest_shard1_replica1]  CLOSING SolrCore org.apache.solr.core.SolrCore@2a1119a5
   [junit4]   2> 529480 INFO  (coreLoadExecutor-2285-thread-1-processing-n:127.0.0.1:43343_solr) [n:127.0.0.1:43343_solr c:MissingSegmentRecoveryTest s:shard1 r:core_node2 x:MissingSegmentRecoveryTest_shard1_replica1] o.a.s.m.SolrMetricManager Closing metric reporters for: solr.core.MissingSegmentRecoveryTest.shard1.replica1
   [junit4]   2> 529481 ERROR (coreContainerWorkExecutor-2281-thread-1-processing-n:127.0.0.1:43343_solr) [n:127.0.0.1:43343_solr    ] o.a.s.c.CoreContainer Error waiting for SolrCore to be created
   [junit4]   2> java.util.concurrent.ExecutionException: org.apache.solr.common.SolrException: Unable to create core [MissingSegmentRecoveryTest_shard1_replica1]
   [junit4]   2> at java.util.concurrent.FutureTask.report(FutureTask.java:122)
   [junit4]   2> at java.util.concurrent.FutureTask.get(FutureTask.java:192)
   [junit4]   2> at org.apache.solr.core.CoreContainer.lambda$load$6(CoreContainer.java:581)
   [junit4]   2> at com.codahale.metrics.InstrumentedExecutorService$InstrumentedRunnable.run(InstrumentedExecutorService.java:176)
   [junit4]   2> at java.util.concurrent.Executors$RunnableAdapter.call(Executors.java:511)
   [junit4]   2> at java.util.concurrent.FutureTask.run(FutureTask.java:266)
   [junit4]   2> at org.apache.solr.common.util.ExecutorUtil$MDCAwareThreadPoolExecutor.lambda$execute$0(ExecutorUtil.java:229)
   [junit4]   2> at java.util.concurrent.ThreadPoolExecutor.runWorker(ThreadPoolExecutor.java:1142)
   [junit4]   2> at java.util.concurrent.ThreadPoolExecutor$Worker.run(ThreadPoolExecutor.java:617)
   [junit4]   2> at java.lang.Thread.run(Thread.java:745)
   [junit4]   2> Caused by: org.apache.solr.common.SolrException: Unable to create core [MissingSegmentRecoveryTest_shard1_replica1]
   [junit4]   2> at org.apache.solr.core.CoreContainer.create(CoreContainer.java:933)
   [junit4]   2> at org.apache.solr.core.CoreContainer.lambda$load$5(CoreContainer.java:553)
   [junit4]   2> at com.codahale.metrics.InstrumentedExecutorService$InstrumentedCallable.call(InstrumentedExecutorService.java:197)
   [junit4]   2> ... 5 more
   [junit4]   2> Caused by: org.apache.solr.common.SolrException: Error opening new searcher
   [junit4]   2> at org.apache.solr.core.SolrCore.<init>(SolrCore.java:965)
   [junit4]   2> at org.apache.solr.core.SolrCore.<init>(SolrCore.java:831)
   [junit4]   2> at org.apache.solr.core.CoreContainer.processCoreCreateException(CoreContainer.java:992)
   [junit4]   2> at org.apache.solr.core.CoreContainer.create(CoreContainer.java:920)
   [junit4]   2> ... 7 more
   [junit4]   2> Suppressed: org.apache.solr.common.SolrException: Error opening new searcher
   [junit4]   2> at org.apache.solr.core.SolrCore.<init>(SolrCore.java:965)
   [junit4]   2> at org.apache.solr.core.SolrCore.<init>(SolrCore.java:831)
   [junit4]   2> at org.apache.solr.core.CoreContainer.create(CoreContainer.java:918)
   [junit4]   2> ... 7 more
   [junit4]   2> Caused by: org.apache.solr.common.SolrException: Error opening new searcher
   [junit4]   2> at org.apache.solr.core.SolrCore.openNewSearcher(SolrCore.java:2032)
   [junit4]   2> at org.apache.solr.core.SolrCore.getSearcher(SolrCore.java:2152)
   [junit4]   2> at org.apache.solr.core.SolrCore.initSearcher(SolrCore.java:1054)
   [junit4]   2> at org.apache.solr.core.SolrCore.<init>(SolrCore.java:938)
   [junit4]   2> ... 9 more
   [junit4]   2> Caused by: org.apache.lucene.index.CorruptIndexException: Unexpected file read error while reading index. (resource=BufferedChecksumIndexInput(MMapIndexInput(path="/x1/jenkins/jenkins-slave/workspace/Lucene-Solr-Tests-6.x/solr/build/solr-core/test/J0/temp/solr.cloud.MissingSegmentRecoveryTest_92B16C9085CD04C2-001/tempDir-001/node2/MissingSegmentRecoveryTest_shard1_replica1/data/index/segments_2")))
   [junit4]   2> at org.apache.lucene.index.SegmentInfos.readCommit(SegmentInfos.java:290)
   [junit4]   2> at org.apache.lucene.index.IndexWriter.<init>(IndexWriter.java:928)
   [junit4]   2> at org.apache.solr.update.SolrIndexWriter.<init>(SolrIndexWriter.java:118)
   [junit4]   2> at org.apache.solr.update.SolrIndexWriter.create(SolrIndexWriter.java:93)
   [junit4]   2> at org.apache.solr.update.DefaultSolrCoreState.createMainIndexWriter(DefaultSolrCoreState.java:248)
   [junit4]   2> at org.apache.solr.update.DefaultSolrCoreState.getIndexWriter(DefaultSolrCoreState.java:122)
   [junit4]   2> at org.apache.solr.core.SolrCore.openNewSearcher(SolrCore.java:1993)
   [junit4]   2> ... 12 more
   [junit4]   2> Caused by: java.io.EOFException: read past EOF: MMapIndexInput(path="/x1/jenkins/jenkins-slave/workspace/Lucene-Solr-Tests-6.x/solr/build/solr-core/test/J0/temp/solr.cloud.MissingSegmentRecoveryTest_92B16C9085CD04C2-001/tempDir-001/node2/MissingSegmentRecoveryTest_shard1_replica1/data/index/segments_2")
   [junit4]   2> at org.apache.lucene.store.ByteBufferIndexInput.readByte(ByteBufferIndexInput.java:75)
   [junit4]   2> at org.apache.lucene.store.BufferedChecksumIndexInput.readByte(BufferedChecksumIndexInput.java:41)
   [junit4]   2> at org.apache.lucene.store.DataInput.readInt(DataInput.java:101)
   [junit4]   2> at org.apache.lucene.index.SegmentInfos.readCommit(SegmentInfos.java:300)
   [junit4]   2> at org.apache.lucene.index.SegmentInfos.readCommit(SegmentInfos.java:288)
   [junit4]   2> ... 18 more
   [junit4]   2> Caused by: org.apache.solr.common.SolrException: Error opening new searcher
   [junit4]   2> at org.apache.solr.core.SolrCore.openNewSearcher(SolrCore.java:2032)
   [junit4]   2> at org.apache.solr.core.SolrCore.getSearcher(SolrCore.java:2152)
   [junit4]   2> at org.apache.solr.core.SolrCore.initSearcher(SolrCore.java:1054)
   [junit4]   2> at org.apache.solr.core.SolrCore.<init>(SolrCore.java:938)
   [junit4]   2> ... 10 more
   [junit4]   2> Caused by: org.apache.lucene.index.IndexNotFoundException: no segments* file found in LockValidatingDirectoryWrapper(MMapDirectory@/x1/jenkins/jenkins-slave/workspace/Lucene-Solr-Tests-6.x/solr/build/solr-core/test/J0/temp/solr.cloud.MissingSegmentRecoveryTest_92B16C9085CD04C2-001/tempDir-001/node2/MissingSegmentRecoveryTest_shard1_replica1/data/index.20170318173503348 lockFactory=org.apache.lucene.store.NativeFSLockFactory@165449c0): files: [write.lock]
   [junit4]   2> at org.apache.lucene.index.IndexWriter.<init>(IndexWriter.java:923)
   [junit4]   2> at org.apache.solr.update.SolrIndexWriter.<init>(SolrIndexWriter.java:118)
   [junit4]   2> at org.apache.solr.update.SolrIndexWriter.create(SolrIndexWriter.java:93)
   [junit4]   2> at org.apache.solr.update.DefaultSolrCoreState.createMainIndexWriter(DefaultSolrCoreState.java:248)
   [junit4]   2> at org.apache.solr.update.DefaultSolrCoreState.getIndexWriter(DefaultSolrCoreState.java:122)
   [junit4]   2> at org.apache.solr.core.SolrCore.openNewSearcher(SolrCore.java:1993)
   [junit4]   2> ... 13 more
   [junit4]   2> 529486 INFO  (zkCallback-637-thread-1-processing-n:127.0.0.1:43343_solr) [n:127.0.0.1:43343_solr    ] o.a.s.c.c.ZkStateReader A cluster state change: [WatchedEvent state:SyncConnected type:NodeDataChanged path:/collections/MissingSegmentRecoveryTest/state.json] for collection [MissingSegmentRecoveryTest] has occurred - updating... (live nodes size: [2])
   [junit4]   2> 529486 INFO  (zkCallback-626-thread-1-processing-n:127.0.0.1:55675_solr) [n:127.0.0.1:55675_solr    ] o.a.s.c.c.ZkStateReader A cluster state change: [WatchedEvent state:SyncConnected type:NodeDataChanged path:/collections/MissingSegmentRecoveryTest/state.json] for collection [MissingSegmentRecoveryTest] has occurred - updating... (live nodes size: [2])
   [junit4]   2> 619708 INFO  (qtp1051442201-4418) [n:127.0.0.1:55675_solr    ] o.a.s.h.a.CollectionsHandler Invoked Collection Action :delete with params name=MissingSegmentRecoveryTest&action=DELETE&wt=javabin&version=2 and sendToOCPQueue=true
   [junit4]   2> 619711 INFO  (OverseerThreadFactory-2279-thread-1-processing-n:127.0.0.1:55675_solr) [n:127.0.0.1:55675_solr    ] o.a.s.c.OverseerCollectionMessageHandler Executing Collection Cmd : action=UNLOAD&deleteInstanceDir=true&deleteDataDir=true
   [junit4]   2> 619725 INFO  (qtp1051442201-4421) [n:127.0.0.1:55675_solr    ] o.a.s.m.SolrMetricManager Closing metric reporters for: solr.core.MissingSegmentRecoveryTest.shard1.replica2
   [junit4]   2> 619725 INFO  (qtp1051442201-4421) [n:127.0.0.1:55675_solr    ] o.a.s.c.SolrCore [MissingSegmentRecoveryTest_shard1_replica2]  CLOSING SolrCore org.apache.solr.core.SolrCore@61b05398
   [junit4]   2> 619729 INFO  (qtp1051442201-4421) [n:127.0.0.1:55675_solr    ] o.a.s.m.SolrMetricManager Closing metric reporters for: solr.core.MissingSegmentRecoveryTest.shard1.replica2
   [junit4]   2> 619731 INFO  (qtp1051442201-4421) [n:127.0.0.1:55675_solr    ] o.a.s.s.HttpSolrCall [admin] webapp=null path=/admin/cores params={deleteInstanceDir=true&core=MissingSegmentRecoveryTest_shard1_replica2&qt=/admin/cores&deleteDataDir=true&action=UNLOAD&wt=javabin&version=2} status=0 QTime=6
   [junit4]   2> 619737 INFO  (zkCallback-637-thread-2-processing-n:127.0.0.1:43343_solr) [n:127.0.0.1:43343_solr    ] o.a.s.c.c.ZkStateReader A cluster state change: [WatchedEvent state:SyncConnected type:NodeDataChanged path:/collections/MissingSegmentRecoveryTest/state.json] for collection [MissingSegmentRecoveryTest] has occurred - updating... (live nodes size: [2])
   [junit4]   2> 619779 INFO  (qtp1309149309-4503) [n:127.0.0.1:43343_solr    ] o.a.s.s.HttpSolrCall [admin] webapp=null path=/admin/cores params={deleteInstanceDir=true&core=MissingSegmentRecoveryTest_shard1_replica1&qt=/admin/cores&deleteDataDir=true&action=UNLOAD&wt=javabin&version=2} status=0 QTime=1
   [junit4]   2> 619886 INFO  (zkCallback-637-thread-2-processing-n:127.0.0.1:43343_solr) [n:127.0.0.1:43343_solr    ] o.a.s.c.c.ZkStateReader A cluster state change: [WatchedEvent state:SyncConnected type:NodeDeleted path:/collections/MissingSegmentRecoveryTest/state.json] for collection [MissingSegmentRecoveryTest] has occurred - updating... (live nodes size: [2])
   [junit4]   2> 620486 INFO  (qtp1051442201-4418) [n:127.0.0.1:55675_solr    ] o.a.s.s.HttpSolrCall [admin] webapp=null path=/admin/collections params={name=MissingSegmentRecoveryTest&action=DELETE&wt=javabin&version=2} status=0 QTime=778
   [junit4]   2> 620486 INFO  (TEST-MissingSegmentRecoveryTest.testLeaderRecovery-seed#[92B16C9085CD04C2]) [    ] o.a.s.SolrTestCaseJ4 ###Ending testLeaderRecovery
   [junit4]   2> NOTE: reproduce with: ant test  -Dtestcase=MissingSegmentRecoveryTest -Dtests.method=testLeaderRecovery -Dtests.seed=92B16C9085CD04C2 -Dtests.multiplier=2 -Dtests.slow=true -Dtests.locale=es-MX -Dtests.timezone=America/Dawson_Creek -Dtests.asserts=true -Dtests.file.encoding=US-ASCII
   [junit4] FAILURE 96.5s J0 | MissingSegmentRecoveryTest.testLeaderRecovery <<<
   [junit4]    > Throwable #1: java.lang.AssertionError: Expected a collection with one shard and two replicas
   [junit4]    > null
   [junit4]    > Last available state: DocCollection(MissingSegmentRecoveryTest//collections/MissingSegmentRecoveryTest/state.json/8)={
   [junit4]    >   "replicationFactor":"2",
   [junit4]    >   "shards":{"shard1":{
   [junit4]    >       "range":"80000000-7fffffff",
   [junit4]    >       "state":"active",
   [junit4]    >       "replicas":{
   [junit4]    >         "core_node1":{
   [junit4]    >           "core":"MissingSegmentRecoveryTest_shard1_replica2",
   [junit4]    >           "base_url":"https://127.0.0.1:55675/solr",
   [junit4]    >           "node_name":"127.0.0.1:55675_solr",
   [junit4]    >           "state":"active",
   [junit4]    >           "leader":"true"},
   [junit4]    >         "core_node2":{
   [junit4]    >           "core":"MissingSegmentRecoveryTest_shard1_replica1",
   [junit4]    >           "base_url":"https://127.0.0.1:43343/solr",
   [junit4]    >           "node_name":"127.0.0.1:43343_solr",
   [junit4]    >           "state":"down"}}}},
   [junit4]    >   "router":{"name":"compositeId"},
   [junit4]    >   "maxShardsPerNode":"1",
   [junit4]    >   "autoAddReplicas":"false"}
   [junit4]    > at __randomizedtesting.SeedInfo.seed([92B16C9085CD04C2:C2E4F493DCECB2DF]:0)
   [junit4]    > at org.apache.solr.cloud.SolrCloudTestCase.waitForState(SolrCloudTestCase.java:265)
   [junit4]    > at org.apache.solr.cloud.MissingSegmentRecoveryTest.testLeaderRecovery(MissingSegmentRecoveryTest.java:105)
   [junit4]    > at java.lang.Thread.run(Thread.java:745)
   [junit4]   2> 620493 INFO  (jetty-closer-615-thread-2) [    ] o.e.j.s.AbstractConnector Stopped ServerConnector@618800c1{SSL,[ssl, http/1.1]}{127.0.0.1:43343}
   [junit4]   2> 620493 INFO  (jetty-closer-615-thread-2) [    ] o.a.s.c.CoreContainer Shutting down CoreContainer instance=779410556
   [junit4]   2> 620494 INFO  (jetty-closer-615-thread-1) [    ] o.e.j.s.AbstractConnector Stopped ServerConnector@5f9ce513{SSL,[ssl, http/1.1]}{127.0.0.1:0}
   [junit4]   2> 620496 INFO  (jetty-closer-615-thread-1) [    ] o.a.s.c.CoreContainer Shutting down CoreContainer instance=1112145285
   [junit4]   2> 620498 INFO  (jetty-closer-615-thread-1) [    ] o.a.s.c.Overseer Overseer (id=97641017960759302-127.0.0.1:55675_solr-n_0000000001) closing
   [junit4]   2> 620498 INFO  (OverseerStateUpdate-97641017960759302-127.0.0.1:55675_solr-n_0000000001) [n:127.0.0.1:55675_solr    ] o.a.s.c.Overseer Overseer Loop exiting : 127.0.0.1:55675_solr
   [junit4]   2> 620500 INFO  (jetty-closer-615-thread-1) [    ] o.a.s.m.SolrMetricManager Closing metric reporters for: solr.node
   [junit4]   2> 620501 INFO  (jetty-closer-615-thread-1) [    ] o.e.j.s.h.ContextHandler Stopped o.e.j.s.ServletContextHandler@8a96965{/solr,null,UNAVAILABLE}
   [junit4]   2> 620501 INFO  (zkCallback-637-thread-2-processing-n:127.0.0.1:43343_solr) [n:127.0.0.1:43343_solr    ] o.a.s.c.OverseerElectionContext I am going to be the leader 127.0.0.1:43343_solr
   [junit4]   2> 622008 WARN  (zkCallback-637-thread-3-processing-n:127.0.0.1:43343_solr) [n:127.0.0.1:43343_solr    ] o.a.s.c.c.ZkStateReader ZooKeeper watch triggered, but Solr cannot talk to ZK: [KeeperErrorCode = Session expired for /live_nodes]
   [junit4]   2> 622008 INFO  (jetty-closer-615-thread-2) [    ] o.a.s.m.SolrMetricManager Closing metric reporters for: solr.node
   [junit4]   2> 622009 INFO  (jetty-closer-615-thread-2) [    ] o.e.j.s.h.ContextHandler Stopped o.e.j.s.ServletContextHandler@2a6c6692{/solr,null,UNAVAILABLE}
   [junit4]   2> 622009 INFO  (SUITE-MissingSegmentRecoveryTest-seed#[92B16C9085CD04C2]-worker) [    ] o.a.s.c.ZkTestServer connecting to 127.0.0.1:52140 52140
   [junit4]   2> 622187 INFO  (Thread-1139) [    ] o.a.s.c.ZkTestServer connecting to 127.0.0.1:52140 52140
   [junit4]   2> 622188 WARN  (Thread-1139) [    ] o.a.s.c.ZkTestServer Watch limit violations:
   [junit4]   2> Maximum concurrent create/delete watches above limit:
   [junit4]   2>
   [junit4]   2> 4 /solr/aliases.json
   [junit4]   2> 3 /solr/security.json
   [junit4]   2> 2 /solr/configs/conf
   [junit4]   2>
   [junit4]   2> Maximum concurrent data watches above limit:
   [junit4]   2>
   [junit4]   2> 4 /solr/clusterstate.json
   [junit4]   2> 4 /solr/collections/MissingSegmentRecoveryTest/state.json
   [junit4]   2> 4 /solr/clusterprops.json
   [junit4]   2>
   [junit4]   2> Maximum concurrent children watches above limit:
   [junit4]   2>
   [junit4]   2> 92 /solr/overseer/collection-queue-work
   [junit4]   2> 19 /solr/overseer/queue
   [junit4]   2> 4 /solr/collections
   [junit4]   2> 4 /solr/overseer/queue-work
   [junit4]   2> 3 /solr/live_nodes
   [junit4]   2>
   [junit4]   2> 622188 INFO  (SUITE-MissingSegmentRecoveryTest-seed#[92B16C9085CD04C2]-worker) [    ] o.a.s.SolrTestCaseJ4 ###deleteCore
   [junit4]   2> NOTE: leaving temporary files on disk at: /x1/jenkins/jenkins-slave/workspace/Lucene-Solr-Tests-6.x/solr/build/solr-core/test/J0/temp/solr.cloud.MissingSegmentRecoveryTest_92B16C9085CD04C2-001
   [junit4]   2> NOTE: test params are: codec=Asserting(Lucene62): {_version_=Lucene50(blocksize=128), id=PostingsFormat(name=Memory doPackFST= true)}, docValues:{}, maxPointsInLeafNode=1856, maxMBSortInHeap=6.6268822456131815, sim=RandomSimilarity(queryNorm=true,coord=yes): {}, locale=es-MX, timezone=America/Dawson_Creek
   [junit4]   2> NOTE: Linux 3.13.0-85-generic amd64/Oracle Corporation 1.8.0_121 (64-bit)/cpus=4,threads=1,free=232306352,total=527433728
   [junit4]   2> NOTE: All tests run in this JVM: [TestJettySolrRunner, TestDocTermOrds, StandardRequestHandlerTest, TestAtomicUpdateErrorCases, TestObjectReleaseTracker, TestIBSimilarityFactory, TestDocumentBuilder, CurrencyFieldOpenExchangeTest, TestFieldResource, BlobRepositoryCloudTest, FullHLLTest, TestReRankQParserPlugin, TestSchemaVersionResource, DeleteStatusTest, TestTestInjection, MergeStrategyTest, TestReloadAndDeleteDocs, DocumentAnalysisRequestHandlerTest, TestPushWriter, TestPerFieldSimilarityWithDefaultOverride, TestManagedResourceStorage, CustomCollectionTest, HdfsBasicDistributedZk2Test, OverriddenZkACLAndCredentialsProvidersTest, RegexBoostProcessorTest, TestJsonFacets, TestSlowCompositeReaderWrapper, DistributedFacetPivotWhiteBoxTest, TestCloudInspectUtil, BlockJoinFacetRandomTest, TestHighlightDedupGrouping, TestUseDocValuesAsStored, DataDrivenBlockJoinTest, CoreAdminRequestStatusTest, SolrRequestParserTest, TestSortByMinMaxFunction, ZkNodePropsTest, TestSolr4Spatial, TestGeoJSONResponseWriter, RollingRestartTest, ChaosMonkeyNothingIsSafeTest, TestSolrCloudWithSecureImpersonation, TestFieldCacheSanityChecker, OutputWriterTest, DistributedSpellCheckComponentTest, OverseerRolesTest, TestStressRecovery, TestConfigReload, HdfsUnloadDistributedZkTest, TestAddFieldRealTimeGet, BufferStoreTest, TestCodecSupport, AnalyticsQueryTest, TestStressLucene, TestPointFields, TestNumericTerms32, TestJoin, TestSizeLimitedDistributedMap, CdcrReplicationHandlerTest, ExternalFileFieldSortTest, TestOmitPositions, TestSolrDeletionPolicy2, TestFieldCacheVsDocValues, ReplaceNodeTest, XsltUpdateRequestHandlerTest, TestReqParamsAPI, TestValueSourceCache, HdfsSyncSliceTest, DistributedSuggestComponentTest, TestFunctionQuery, VersionInfoTest, TestConfigsApi, TestInitQParser, PKIAuthenticationIntegrationTest, SolrGangliaReporterTest, TestPseudoReturnFields, UUIDFieldTest, BaseCdcrDistributedZkTest, SpatialRPTFieldTypeTest, HdfsRecoverLeaseTest, TestFastLRUCache, UniqFieldsUpdateProcessorFactoryTest, TestMacros, TestQuerySenderNoQuery, HighlighterConfigTest, QueryEqualityTest, TestSolrQueryParserResource, TestDynamicFieldCollectionResource, FileBasedSpellCheckerTest, TestSchemaNameResource, DocValuesNotIndexedTest, TestExpandComponent, CloudMLTQParserTest, SparseHLLTest, TestFaceting, MissingSegmentRecoveryTest]
   [junit4] Completed [249/700 (1!)] on J0 in 99.20s, 1 test, 1 failure <<< FAILURES!

[...truncated 64151 lines...]




---------------------------------------------------------------------
To unsubscribe, e-mail: [hidden email]
For additional commands, e-mail: [hidden email]
Loading...