Quantcast

[JENKINS] Lucene-Solr-Tests-6.x - Build # 811 - Unstable

Previous Topic Next Topic
 
classic Classic list List threaded Threaded
1 message Options
Reply | Threaded
Open this post in threaded view
|  
Report Content as Inappropriate

[JENKINS] Lucene-Solr-Tests-6.x - Build # 811 - Unstable

Apache Jenkins Server-2
Build: https://builds.apache.org/job/Lucene-Solr-Tests-6.x/811/

1 tests failed.
FAILED:  org.apache.solr.core.TestDynamicLoading.testDynamicLoading

Error Message:
Could not get expected value  'X val changed' for path 'x' full output: {   "responseHeader":{     "status":0,     "QTime":0},   "params":{"wt":"json"},   "context":{     "webapp":"",     "path":"/test1",     "httpMethod":"GET"},   "class":"org.apache.solr.core.BlobStoreTestRequestHandler",   "x":"X val"},  from server:  null

Stack Trace:
java.lang.AssertionError: Could not get expected value  'X val changed' for path 'x' full output: {
  "responseHeader":{
    "status":0,
    "QTime":0},
  "params":{"wt":"json"},
  "context":{
    "webapp":"",
    "path":"/test1",
    "httpMethod":"GET"},
  "class":"org.apache.solr.core.BlobStoreTestRequestHandler",
  "x":"X val"},  from server:  null
        at __randomizedtesting.SeedInfo.seed([70D4E1C3114B1529:A899CC94E696B089]:0)
        at org.junit.Assert.fail(Assert.java:93)
        at org.junit.Assert.assertTrue(Assert.java:43)
        at org.apache.solr.core.TestSolrConfigHandler.testForResponseElement(TestSolrConfigHandler.java:556)
        at org.apache.solr.core.TestDynamicLoading.testDynamicLoading(TestDynamicLoading.java:249)
        at sun.reflect.NativeMethodAccessorImpl.invoke0(Native Method)
        at sun.reflect.NativeMethodAccessorImpl.invoke(NativeMethodAccessorImpl.java:62)
        at sun.reflect.DelegatingMethodAccessorImpl.invoke(DelegatingMethodAccessorImpl.java:43)
        at java.lang.reflect.Method.invoke(Method.java:498)
        at com.carrotsearch.randomizedtesting.RandomizedRunner.invoke(RandomizedRunner.java:1713)
        at com.carrotsearch.randomizedtesting.RandomizedRunner$8.evaluate(RandomizedRunner.java:907)
        at com.carrotsearch.randomizedtesting.RandomizedRunner$9.evaluate(RandomizedRunner.java:943)
        at com.carrotsearch.randomizedtesting.RandomizedRunner$10.evaluate(RandomizedRunner.java:957)
        at org.apache.solr.BaseDistributedSearchTestCase$ShardsRepeatRule$ShardsFixedStatement.callStatement(BaseDistributedSearchTestCase.java:992)
        at org.apache.solr.BaseDistributedSearchTestCase$ShardsRepeatRule$ShardsStatement.evaluate(BaseDistributedSearchTestCase.java:967)
        at com.carrotsearch.randomizedtesting.rules.SystemPropertiesRestoreRule$1.evaluate(SystemPropertiesRestoreRule.java:57)
        at org.apache.lucene.util.TestRuleSetupTeardownChained$1.evaluate(TestRuleSetupTeardownChained.java:49)
        at org.apache.lucene.util.AbstractBeforeAfterRule$1.evaluate(AbstractBeforeAfterRule.java:45)
        at org.apache.lucene.util.TestRuleThreadAndTestName$1.evaluate(TestRuleThreadAndTestName.java:48)
        at org.apache.lucene.util.TestRuleIgnoreAfterMaxFailures$1.evaluate(TestRuleIgnoreAfterMaxFailures.java:64)
        at org.apache.lucene.util.TestRuleMarkFailure$1.evaluate(TestRuleMarkFailure.java:47)
        at com.carrotsearch.randomizedtesting.rules.StatementAdapter.evaluate(StatementAdapter.java:36)
        at com.carrotsearch.randomizedtesting.ThreadLeakControl$StatementRunner.run(ThreadLeakControl.java:368)
        at com.carrotsearch.randomizedtesting.ThreadLeakControl.forkTimeoutingTask(ThreadLeakControl.java:817)
        at com.carrotsearch.randomizedtesting.ThreadLeakControl$3.evaluate(ThreadLeakControl.java:468)
        at com.carrotsearch.randomizedtesting.RandomizedRunner.runSingleTest(RandomizedRunner.java:916)
        at com.carrotsearch.randomizedtesting.RandomizedRunner$5.evaluate(RandomizedRunner.java:802)
        at com.carrotsearch.randomizedtesting.RandomizedRunner$6.evaluate(RandomizedRunner.java:852)
        at com.carrotsearch.randomizedtesting.RandomizedRunner$7.evaluate(RandomizedRunner.java:863)
        at com.carrotsearch.randomizedtesting.rules.StatementAdapter.evaluate(StatementAdapter.java:36)
        at com.carrotsearch.randomizedtesting.rules.SystemPropertiesRestoreRule$1.evaluate(SystemPropertiesRestoreRule.java:57)
        at org.apache.lucene.util.AbstractBeforeAfterRule$1.evaluate(AbstractBeforeAfterRule.java:45)
        at com.carrotsearch.randomizedtesting.rules.StatementAdapter.evaluate(StatementAdapter.java:36)
        at org.apache.lucene.util.TestRuleStoreClassName$1.evaluate(TestRuleStoreClassName.java:41)
        at com.carrotsearch.randomizedtesting.rules.NoShadowingOrOverridesOnMethodsRule$1.evaluate(NoShadowingOrOverridesOnMethodsRule.java:40)
        at com.carrotsearch.randomizedtesting.rules.NoShadowingOrOverridesOnMethodsRule$1.evaluate(NoShadowingOrOverridesOnMethodsRule.java:40)
        at com.carrotsearch.randomizedtesting.rules.StatementAdapter.evaluate(StatementAdapter.java:36)
        at com.carrotsearch.randomizedtesting.rules.StatementAdapter.evaluate(StatementAdapter.java:36)
        at com.carrotsearch.randomizedtesting.rules.StatementAdapter.evaluate(StatementAdapter.java:36)
        at org.apache.lucene.util.TestRuleAssertionsRequired$1.evaluate(TestRuleAssertionsRequired.java:53)
        at org.apache.lucene.util.TestRuleMarkFailure$1.evaluate(TestRuleMarkFailure.java:47)
        at org.apache.lucene.util.TestRuleIgnoreAfterMaxFailures$1.evaluate(TestRuleIgnoreAfterMaxFailures.java:64)
        at org.apache.lucene.util.TestRuleIgnoreTestSuites$1.evaluate(TestRuleIgnoreTestSuites.java:54)
        at com.carrotsearch.randomizedtesting.rules.StatementAdapter.evaluate(StatementAdapter.java:36)
        at com.carrotsearch.randomizedtesting.ThreadLeakControl$StatementRunner.run(ThreadLeakControl.java:368)
        at java.lang.Thread.run(Thread.java:745)




Build Log:
[...truncated 11267 lines...]
   [junit4] Suite: org.apache.solr.core.TestDynamicLoading
   [junit4]   2> Creating dataDir: /x1/jenkins/jenkins-slave/workspace/Lucene-Solr-Tests-6.x/solr/build/solr-core/test/J1/temp/solr.core.TestDynamicLoading_70D4E1C3114B1529-001/init-core-data-001
   [junit4]   2> 298672 WARN  (SUITE-TestDynamicLoading-seed#[70D4E1C3114B1529]-worker) [    ] o.a.s.SolrTestCaseJ4 startTrackingSearchers: numOpens=68 numCloses=68
   [junit4]   2> 298672 INFO  (SUITE-TestDynamicLoading-seed#[70D4E1C3114B1529]-worker) [    ] o.a.s.SolrTestCaseJ4 Using TrieFields
   [junit4]   2> 298673 INFO  (SUITE-TestDynamicLoading-seed#[70D4E1C3114B1529]-worker) [    ] o.a.s.SolrTestCaseJ4 Randomized ssl (true) and clientAuth (true) via: @org.apache.solr.util.RandomizeSSL(reason=, ssl=NaN, value=NaN, clientAuth=NaN)
   [junit4]   2> 298674 INFO  (SUITE-TestDynamicLoading-seed#[70D4E1C3114B1529]-worker) [    ] o.a.s.BaseDistributedSearchTestCase Setting hostContext system property: /
   [junit4]   2> 298680 INFO  (TEST-TestDynamicLoading.testDynamicLoading-seed#[70D4E1C3114B1529]) [    ] o.a.s.c.ZkTestServer STARTING ZK TEST SERVER
   [junit4]   2> 298689 INFO  (Thread-2770) [    ] o.a.s.c.ZkTestServer client port:0.0.0.0/0.0.0.0:0
   [junit4]   2> 298689 INFO  (Thread-2770) [    ] o.a.s.c.ZkTestServer Starting server
   [junit4]   2> 298789 INFO  (TEST-TestDynamicLoading.testDynamicLoading-seed#[70D4E1C3114B1529]) [    ] o.a.s.c.ZkTestServer start zk server on port:35126
   [junit4]   2> 299051 INFO  (TEST-TestDynamicLoading.testDynamicLoading-seed#[70D4E1C3114B1529]) [    ] o.a.s.c.AbstractZkTestCase put /x1/jenkins/jenkins-slave/workspace/Lucene-Solr-Tests-6.x/solr/core/src/test-files/solr/collection1/conf/solrconfig-tlog.xml to /configs/conf1/solrconfig.xml
   [junit4]   2> 299052 INFO  (TEST-TestDynamicLoading.testDynamicLoading-seed#[70D4E1C3114B1529]) [    ] o.a.s.c.AbstractZkTestCase put /x1/jenkins/jenkins-slave/workspace/Lucene-Solr-Tests-6.x/solr/core/src/test-files/solr/collection1/conf/schema.xml to /configs/conf1/schema.xml
   [junit4]   2> 299053 INFO  (TEST-TestDynamicLoading.testDynamicLoading-seed#[70D4E1C3114B1529]) [    ] o.a.s.c.AbstractZkTestCase put /x1/jenkins/jenkins-slave/workspace/Lucene-Solr-Tests-6.x/solr/core/src/test-files/solr/collection1/conf/solrconfig.snippet.randomindexconfig.xml to /configs/conf1/solrconfig.snippet.randomindexconfig.xml
   [junit4]   2> 299054 INFO  (TEST-TestDynamicLoading.testDynamicLoading-seed#[70D4E1C3114B1529]) [    ] o.a.s.c.AbstractZkTestCase put /x1/jenkins/jenkins-slave/workspace/Lucene-Solr-Tests-6.x/solr/core/src/test-files/solr/collection1/conf/stopwords.txt to /configs/conf1/stopwords.txt
   [junit4]   2> 299055 INFO  (TEST-TestDynamicLoading.testDynamicLoading-seed#[70D4E1C3114B1529]) [    ] o.a.s.c.AbstractZkTestCase put /x1/jenkins/jenkins-slave/workspace/Lucene-Solr-Tests-6.x/solr/core/src/test-files/solr/collection1/conf/protwords.txt to /configs/conf1/protwords.txt
   [junit4]   2> 299056 INFO  (TEST-TestDynamicLoading.testDynamicLoading-seed#[70D4E1C3114B1529]) [    ] o.a.s.c.AbstractZkTestCase put /x1/jenkins/jenkins-slave/workspace/Lucene-Solr-Tests-6.x/solr/core/src/test-files/solr/collection1/conf/currency.xml to /configs/conf1/currency.xml
   [junit4]   2> 299057 INFO  (TEST-TestDynamicLoading.testDynamicLoading-seed#[70D4E1C3114B1529]) [    ] o.a.s.c.AbstractZkTestCase put /x1/jenkins/jenkins-slave/workspace/Lucene-Solr-Tests-6.x/solr/core/src/test-files/solr/collection1/conf/enumsConfig.xml to /configs/conf1/enumsConfig.xml
   [junit4]   2> 299057 INFO  (TEST-TestDynamicLoading.testDynamicLoading-seed#[70D4E1C3114B1529]) [    ] o.a.s.c.AbstractZkTestCase put /x1/jenkins/jenkins-slave/workspace/Lucene-Solr-Tests-6.x/solr/core/src/test-files/solr/collection1/conf/open-exchange-rates.json to /configs/conf1/open-exchange-rates.json
   [junit4]   2> 299058 INFO  (TEST-TestDynamicLoading.testDynamicLoading-seed#[70D4E1C3114B1529]) [    ] o.a.s.c.AbstractZkTestCase put /x1/jenkins/jenkins-slave/workspace/Lucene-Solr-Tests-6.x/solr/core/src/test-files/solr/collection1/conf/mapping-ISOLatin1Accent.txt to /configs/conf1/mapping-ISOLatin1Accent.txt
   [junit4]   2> 299059 INFO  (TEST-TestDynamicLoading.testDynamicLoading-seed#[70D4E1C3114B1529]) [    ] o.a.s.c.AbstractZkTestCase put /x1/jenkins/jenkins-slave/workspace/Lucene-Solr-Tests-6.x/solr/core/src/test-files/solr/collection1/conf/old_synonyms.txt to /configs/conf1/old_synonyms.txt
   [junit4]   2> 299060 INFO  (TEST-TestDynamicLoading.testDynamicLoading-seed#[70D4E1C3114B1529]) [    ] o.a.s.c.AbstractZkTestCase put /x1/jenkins/jenkins-slave/workspace/Lucene-Solr-Tests-6.x/solr/core/src/test-files/solr/collection1/conf/synonyms.txt to /configs/conf1/synonyms.txt
   [junit4]   2> 299293 INFO  (TEST-TestDynamicLoading.testDynamicLoading-seed#[70D4E1C3114B1529]) [    ] o.a.s.SolrTestCaseJ4 Writing core.properties file to /x1/jenkins/jenkins-slave/workspace/Lucene-Solr-Tests-6.x/solr/build/solr-core/test/J1/temp/solr.core.TestDynamicLoading_70D4E1C3114B1529-001/control-001/cores/collection1
   [junit4]   2> 299300 INFO  (TEST-TestDynamicLoading.testDynamicLoading-seed#[70D4E1C3114B1529]) [    ] o.e.j.s.Server jetty-9.3.14.v20161028
   [junit4]   2> 299367 INFO  (TEST-TestDynamicLoading.testDynamicLoading-seed#[70D4E1C3114B1529]) [    ] o.e.j.s.h.ContextHandler Started o.e.j.s.ServletContextHandler@70ee831f{/,null,AVAILABLE}
   [junit4]   2> 299369 INFO  (TEST-TestDynamicLoading.testDynamicLoading-seed#[70D4E1C3114B1529]) [    ] o.e.j.s.AbstractConnector Started ServerConnector@5f763227{SSL,[ssl, http/1.1]}{127.0.0.1:43677}
   [junit4]   2> 299369 INFO  (TEST-TestDynamicLoading.testDynamicLoading-seed#[70D4E1C3114B1529]) [    ] o.e.j.s.Server Started @302796ms
   [junit4]   2> 299369 INFO  (TEST-TestDynamicLoading.testDynamicLoading-seed#[70D4E1C3114B1529]) [    ] o.a.s.c.s.e.JettySolrRunner Jetty properties: {solr.data.dir=/x1/jenkins/jenkins-slave/workspace/Lucene-Solr-Tests-6.x/solr/build/solr-core/test/J1/temp/solr.core.TestDynamicLoading_70D4E1C3114B1529-001/tempDir-001/control/data, hostContext=/, hostPort=43677, coreRootDirectory=/x1/jenkins/jenkins-slave/workspace/Lucene-Solr-Tests-6.x/solr/build/solr-core/test/J1/../../../../../../../../../../x1/jenkins/jenkins-slave/workspace/Lucene-Solr-Tests-6.x/solr/build/solr-core/test/J1/temp/solr.core.TestDynamicLoading_70D4E1C3114B1529-001/control-001/cores}
   [junit4]   2> 299377 ERROR (TEST-TestDynamicLoading.testDynamicLoading-seed#[70D4E1C3114B1529]) [    ] o.a.s.s.StartupLoggingUtils Missing Java Option solr.log.dir. Logging may be missing or incomplete.
   [junit4]   2> 299377 INFO  (TEST-TestDynamicLoading.testDynamicLoading-seed#[70D4E1C3114B1529]) [    ] o.a.s.s.SolrDispatchFilter  ___      _       Welcome to Apache Solr™ version 6.6.0
   [junit4]   2> 299377 INFO  (TEST-TestDynamicLoading.testDynamicLoading-seed#[70D4E1C3114B1529]) [    ] o.a.s.s.SolrDispatchFilter / __| ___| |_ _   Starting in cloud mode on port null
   [junit4]   2> 299377 INFO  (TEST-TestDynamicLoading.testDynamicLoading-seed#[70D4E1C3114B1529]) [    ] o.a.s.s.SolrDispatchFilter \__ \/ _ \ | '_|  Install dir: null
   [junit4]   2> 299377 INFO  (TEST-TestDynamicLoading.testDynamicLoading-seed#[70D4E1C3114B1529]) [    ] o.a.s.s.SolrDispatchFilter |___/\___/_|_|    Start time: 2017-03-20T19:30:44.809Z
   [junit4]   2> 299394 INFO  (TEST-TestDynamicLoading.testDynamicLoading-seed#[70D4E1C3114B1529]) [    ] o.a.s.s.SolrDispatchFilter Loading solr.xml from SolrHome (not found in ZooKeeper)
   [junit4]   2> 299394 INFO  (TEST-TestDynamicLoading.testDynamicLoading-seed#[70D4E1C3114B1529]) [    ] o.a.s.c.SolrXmlConfig Loading container configuration from /x1/jenkins/jenkins-slave/workspace/Lucene-Solr-Tests-6.x/solr/build/solr-core/test/J1/temp/solr.core.TestDynamicLoading_70D4E1C3114B1529-001/control-001/solr.xml
   [junit4]   2> 299408 INFO  (TEST-TestDynamicLoading.testDynamicLoading-seed#[70D4E1C3114B1529]) [    ] o.a.s.u.UpdateShardHandler Creating UpdateShardHandler HTTP client with params: socketTimeout=340000&connTimeout=45000&retry=true
   [junit4]   2> 299411 INFO  (TEST-TestDynamicLoading.testDynamicLoading-seed#[70D4E1C3114B1529]) [    ] o.a.s.c.ZkContainer Zookeeper client=127.0.0.1:35126/solr
   [junit4]   2> 299479 INFO  (TEST-TestDynamicLoading.testDynamicLoading-seed#[70D4E1C3114B1529]) [n:127.0.0.1:43677_    ] o.a.s.c.Overseer Overseer (id=null) closing
   [junit4]   2> 299480 INFO  (TEST-TestDynamicLoading.testDynamicLoading-seed#[70D4E1C3114B1529]) [n:127.0.0.1:43677_    ] o.a.s.c.OverseerElectionContext I am going to be the leader 127.0.0.1:43677_
   [junit4]   2> 299480 INFO  (TEST-TestDynamicLoading.testDynamicLoading-seed#[70D4E1C3114B1529]) [n:127.0.0.1:43677_    ] o.a.s.c.Overseer Overseer (id=97651146367369221-127.0.0.1:43677_-n_0000000000) starting
   [junit4]   2> 299484 INFO  (TEST-TestDynamicLoading.testDynamicLoading-seed#[70D4E1C3114B1529]) [n:127.0.0.1:43677_    ] o.a.s.c.ZkController Register node as live in ZooKeeper:/live_nodes/127.0.0.1:43677_
   [junit4]   2> 299505 INFO  (zkCallback-336-thread-1-processing-n:127.0.0.1:43677_) [n:127.0.0.1:43677_    ] o.a.s.c.c.ZkStateReader Updated live nodes from ZooKeeper... (0) -> (1)
   [junit4]   2> 300182 INFO  (TEST-TestDynamicLoading.testDynamicLoading-seed#[70D4E1C3114B1529]) [n:127.0.0.1:43677_    ] o.a.s.c.CorePropertiesLocator Found 1 core definitions underneath /x1/jenkins/jenkins-slave/workspace/Lucene-Solr-Tests-6.x/solr/build/solr-core/test/J1/../../../../../../../../../../x1/jenkins/jenkins-slave/workspace/Lucene-Solr-Tests-6.x/solr/build/solr-core/test/J1/temp/solr.core.TestDynamicLoading_70D4E1C3114B1529-001/control-001/cores
   [junit4]   2> 300182 INFO  (TEST-TestDynamicLoading.testDynamicLoading-seed#[70D4E1C3114B1529]) [n:127.0.0.1:43677_    ] o.a.s.c.CorePropertiesLocator Cores are: [collection1]
   [junit4]   2> 300204 INFO  (OverseerStateUpdate-97651146367369221-127.0.0.1:43677_-n_0000000000) [n:127.0.0.1:43677_    ] o.a.s.c.o.ReplicaMutator Assigning new node to shard shard=shard1
   [junit4]   2> 301212 WARN  (coreLoadExecutor-827-thread-1-processing-n:127.0.0.1:43677_) [n:127.0.0.1:43677_ c:control_collection   x:collection1] o.a.s.c.Config Beginning with Solr 5.5, <mergePolicy> is deprecated, use <mergePolicyFactory> instead.
   [junit4]   2> 301213 INFO  (coreLoadExecutor-827-thread-1-processing-n:127.0.0.1:43677_) [n:127.0.0.1:43677_ c:control_collection   x:collection1] o.a.s.c.SolrConfig Using Lucene MatchVersion: 6.6.0
   [junit4]   2> 301241 INFO  (coreLoadExecutor-827-thread-1-processing-n:127.0.0.1:43677_) [n:127.0.0.1:43677_ c:control_collection   x:collection1] o.a.s.s.IndexSchema [collection1] Schema name=test
   [junit4]   2> 301572 WARN  (coreLoadExecutor-827-thread-1-processing-n:127.0.0.1:43677_) [n:127.0.0.1:43677_ c:control_collection   x:collection1] o.a.s.s.IndexSchema [collection1] default search field in schema is text. WARNING: Deprecated, please use 'df' on request instead.
   [junit4]   2> 301575 INFO  (coreLoadExecutor-827-thread-1-processing-n:127.0.0.1:43677_) [n:127.0.0.1:43677_ c:control_collection   x:collection1] o.a.s.s.IndexSchema Loaded schema test/1.0 with uniqueid field id
   [junit4]   2> 301612 INFO  (coreLoadExecutor-827-thread-1-processing-n:127.0.0.1:43677_) [n:127.0.0.1:43677_ c:control_collection   x:collection1] o.a.s.c.CoreContainer Creating SolrCore 'collection1' using configuration from collection control_collection
   [junit4]   2> 301612 INFO  (coreLoadExecutor-827-thread-1-processing-n:127.0.0.1:43677_) [n:127.0.0.1:43677_ c:control_collection   x:collection1] o.a.s.c.SolrCore solr.RecoveryStrategy.Builder
   [junit4]   2> 301612 INFO  (coreLoadExecutor-827-thread-1-processing-n:127.0.0.1:43677_) [n:127.0.0.1:43677_ c:control_collection   x:collection1] o.a.s.c.SolrCore [[collection1] ] Opening new SolrCore at [/x1/jenkins/jenkins-slave/workspace/Lucene-Solr-Tests-6.x/solr/build/solr-core/test/J1/temp/solr.core.TestDynamicLoading_70D4E1C3114B1529-001/control-001/cores/collection1], dataDir=[/x1/jenkins/jenkins-slave/workspace/Lucene-Solr-Tests-6.x/solr/build/solr-core/test/J1/../../../../../../../../../../x1/jenkins/jenkins-slave/workspace/Lucene-Solr-Tests-6.x/solr/build/solr-core/test/J1/temp/solr.core.TestDynamicLoading_70D4E1C3114B1529-001/control-001/cores/collection1/data/]
   [junit4]   2> 301612 INFO  (coreLoadExecutor-827-thread-1-processing-n:127.0.0.1:43677_) [n:127.0.0.1:43677_ c:control_collection   x:collection1] o.a.s.c.JmxMonitoredMap JMX monitoring is enabled. Adding Solr mbeans to JMX Server: com.sun.jmx.mbeanserver.JmxMBeanServer@4587528b
   [junit4]   2> 301614 INFO  (coreLoadExecutor-827-thread-1-processing-n:127.0.0.1:43677_) [n:127.0.0.1:43677_ c:control_collection   x:collection1] o.a.s.u.RandomMergePolicy RandomMergePolicy wrapping class org.apache.lucene.index.TieredMergePolicy: [TieredMergePolicy: maxMergeAtOnce=37, maxMergeAtOnceExplicit=24, maxMergedSegmentMB=80.6796875, floorSegmentMB=0.240234375, forceMergeDeletesPctAllowed=16.16658148703103, segmentsPerTier=48.0, maxCFSSegmentSizeMB=8.796093022207999E12, noCFSRatio=1.0
   [junit4]   2> 301649 WARN  (coreLoadExecutor-827-thread-1-processing-n:127.0.0.1:43677_) [n:127.0.0.1:43677_ c:control_collection   x:collection1] o.a.s.c.RequestHandlers INVALID paramSet a in requestHandler {type = requestHandler,name = /dump,class = DumpRequestHandler,attributes = {initParams=a, name=/dump, class=DumpRequestHandler},args = {defaults={a=A,b=B}}}
   [junit4]   2> 301777 INFO  (coreLoadExecutor-827-thread-1-processing-n:127.0.0.1:43677_) [n:127.0.0.1:43677_ c:control_collection   x:collection1] o.a.s.u.UpdateHandler Using UpdateLog implementation: org.apache.solr.update.UpdateLog
   [junit4]   2> 301777 INFO  (coreLoadExecutor-827-thread-1-processing-n:127.0.0.1:43677_) [n:127.0.0.1:43677_ c:control_collection   x:collection1] o.a.s.u.UpdateLog Initializing UpdateLog: dataDir= defaultSyncLevel=FLUSH numRecordsToKeep=100 maxNumLogsToKeep=10 numVersionBuckets=65536
   [junit4]   2> 301778 INFO  (coreLoadExecutor-827-thread-1-processing-n:127.0.0.1:43677_) [n:127.0.0.1:43677_ c:control_collection   x:collection1] o.a.s.u.CommitTracker Hard AutoCommit: disabled
   [junit4]   2> 301778 INFO  (coreLoadExecutor-827-thread-1-processing-n:127.0.0.1:43677_) [n:127.0.0.1:43677_ c:control_collection   x:collection1] o.a.s.u.CommitTracker Soft AutoCommit: disabled
   [junit4]   2> 301780 INFO  (coreLoadExecutor-827-thread-1-processing-n:127.0.0.1:43677_) [n:127.0.0.1:43677_ c:control_collection   x:collection1] o.a.s.u.RandomMergePolicy RandomMergePolicy wrapping class org.apache.lucene.index.LogByteSizeMergePolicy: [LogByteSizeMergePolicy: minMergeSize=1677721, mergeFactor=20, maxMergeSize=2147483648, maxMergeSizeForForcedMerge=9223372036854775807, calibrateSizeByDeletes=true, maxMergeDocs=2147483647, maxCFSSegmentSizeMB=8.796093022207999E12, noCFSRatio=0.47653993816636264]
   [junit4]   2> 301781 INFO  (coreLoadExecutor-827-thread-1-processing-n:127.0.0.1:43677_) [n:127.0.0.1:43677_ c:control_collection   x:collection1] o.a.s.s.SolrIndexSearcher Opening [Searcher@5d325a6d[collection1] main]
   [junit4]   2> 301782 INFO  (coreLoadExecutor-827-thread-1-processing-n:127.0.0.1:43677_) [n:127.0.0.1:43677_ c:control_collection   x:collection1] o.a.s.r.ManagedResourceStorage Configured ZooKeeperStorageIO with znodeBase: /configs/conf1
   [junit4]   2> 301782 INFO  (coreLoadExecutor-827-thread-1-processing-n:127.0.0.1:43677_) [n:127.0.0.1:43677_ c:control_collection   x:collection1] o.a.s.r.ManagedResourceStorage Loaded null at path _rest_managed.json using ZooKeeperStorageIO:path=/configs/conf1
   [junit4]   2> 301784 INFO  (coreLoadExecutor-827-thread-1-processing-n:127.0.0.1:43677_) [n:127.0.0.1:43677_ c:control_collection   x:collection1] o.a.s.h.ReplicationHandler Commits will be reserved for  10000
   [junit4]   2> 301785 INFO  (searcherExecutor-828-thread-1-processing-n:127.0.0.1:43677_ x:collection1 c:control_collection) [n:127.0.0.1:43677_ c:control_collection   x:collection1] o.a.s.c.SolrCore [collection1] Registered new searcher Searcher@5d325a6d[collection1] main{ExitableDirectoryReader(UninvertingDirectoryReader())}
   [junit4]   2> 301789 INFO  (coreLoadExecutor-827-thread-1-processing-n:127.0.0.1:43677_) [n:127.0.0.1:43677_ c:control_collection   x:collection1] o.a.s.u.UpdateLog Could not find max version in index or recent updates, using new clock 1562418345118007296
   [junit4]   2> 301834 INFO  (coreZkRegister-820-thread-1-processing-n:127.0.0.1:43677_ x:collection1 c:control_collection) [n:127.0.0.1:43677_ c:control_collection s:shard1 r:core_node1 x:collection1] o.a.s.c.ShardLeaderElectionContext Enough replicas found to continue.
   [junit4]   2> 301834 INFO  (coreZkRegister-820-thread-1-processing-n:127.0.0.1:43677_ x:collection1 c:control_collection) [n:127.0.0.1:43677_ c:control_collection s:shard1 r:core_node1 x:collection1] o.a.s.c.ShardLeaderElectionContext I may be the new leader - try and sync
   [junit4]   2> 301834 INFO  (coreZkRegister-820-thread-1-processing-n:127.0.0.1:43677_ x:collection1 c:control_collection) [n:127.0.0.1:43677_ c:control_collection s:shard1 r:core_node1 x:collection1] o.a.s.c.SyncStrategy Sync replicas to https://127.0.0.1:43677/collection1/
   [junit4]   2> 301834 INFO  (coreZkRegister-820-thread-1-processing-n:127.0.0.1:43677_ x:collection1 c:control_collection) [n:127.0.0.1:43677_ c:control_collection s:shard1 r:core_node1 x:collection1] o.a.s.c.SyncStrategy Sync Success - now sync replicas to me
   [junit4]   2> 301834 INFO  (coreZkRegister-820-thread-1-processing-n:127.0.0.1:43677_ x:collection1 c:control_collection) [n:127.0.0.1:43677_ c:control_collection s:shard1 r:core_node1 x:collection1] o.a.s.c.SyncStrategy https://127.0.0.1:43677/collection1/ has no replicas
   [junit4]   2> 301834 INFO  (coreZkRegister-820-thread-1-processing-n:127.0.0.1:43677_ x:collection1 c:control_collection) [n:127.0.0.1:43677_ c:control_collection s:shard1 r:core_node1 x:collection1] o.a.s.c.ShardLeaderElectionContext Found all replicas participating in election, clear LIR
   [junit4]   2> 302221 INFO  (coreZkRegister-820-thread-1-processing-n:127.0.0.1:43677_ x:collection1 c:control_collection) [n:127.0.0.1:43677_ c:control_collection s:shard1 r:core_node1 x:collection1] o.a.s.c.ShardLeaderElectionContext I am the new leader: https://127.0.0.1:43677/collection1/ shard1
   [junit4]   2> 302254 INFO  (TEST-TestDynamicLoading.testDynamicLoading-seed#[70D4E1C3114B1529]) [    ] o.a.s.c.c.ZkStateReader Updated live nodes from ZooKeeper... (0) -> (1)
   [junit4]   2> 302255 INFO  (TEST-TestDynamicLoading.testDynamicLoading-seed#[70D4E1C3114B1529]) [    ] o.a.s.c.s.i.ZkClientClusterStateProvider Cluster at 127.0.0.1:35126/solr ready
   [junit4]   2> 302255 INFO  (TEST-TestDynamicLoading.testDynamicLoading-seed#[70D4E1C3114B1529]) [    ] o.a.s.c.ChaosMonkey monkey: init - expire sessions:false cause connection loss:false
   [junit4]   2> 302255 INFO  (TEST-TestDynamicLoading.testDynamicLoading-seed#[70D4E1C3114B1529]) [    ] o.a.s.c.AbstractFullDistribZkTestBase Creating collection1 with stateFormat=2
   [junit4]   2> 302322 INFO  (coreZkRegister-820-thread-1-processing-n:127.0.0.1:43677_ x:collection1 c:control_collection) [n:127.0.0.1:43677_ c:control_collection s:shard1 r:core_node1 x:collection1] o.a.s.c.ZkController I am the leader, no recovery necessary
   [junit4]   2> 302633 INFO  (TEST-TestDynamicLoading.testDynamicLoading-seed#[70D4E1C3114B1529]) [    ] o.a.s.SolrTestCaseJ4 Writing core.properties file to /x1/jenkins/jenkins-slave/workspace/Lucene-Solr-Tests-6.x/solr/build/solr-core/test/J1/temp/solr.core.TestDynamicLoading_70D4E1C3114B1529-001/shard-1-001/cores/collection1
   [junit4]   2> 302633 INFO  (TEST-TestDynamicLoading.testDynamicLoading-seed#[70D4E1C3114B1529]) [    ] o.a.s.c.AbstractFullDistribZkTestBase create jetty 1 in directory /x1/jenkins/jenkins-slave/workspace/Lucene-Solr-Tests-6.x/solr/build/solr-core/test/J1/temp/solr.core.TestDynamicLoading_70D4E1C3114B1529-001/shard-1-001
   [junit4]   2> 302640 INFO  (TEST-TestDynamicLoading.testDynamicLoading-seed#[70D4E1C3114B1529]) [    ] o.e.j.s.Server jetty-9.3.14.v20161028
   [junit4]   2> 302697 INFO  (TEST-TestDynamicLoading.testDynamicLoading-seed#[70D4E1C3114B1529]) [    ] o.e.j.s.h.ContextHandler Started o.e.j.s.ServletContextHandler@737cbe04{/,null,AVAILABLE}
   [junit4]   2> 302698 INFO  (TEST-TestDynamicLoading.testDynamicLoading-seed#[70D4E1C3114B1529]) [    ] o.e.j.s.AbstractConnector Started ServerConnector@8fde1fd{SSL,[ssl, http/1.1]}{127.0.0.1:55822}
   [junit4]   2> 302698 INFO  (TEST-TestDynamicLoading.testDynamicLoading-seed#[70D4E1C3114B1529]) [    ] o.e.j.s.Server Started @306125ms
   [junit4]   2> 302698 INFO  (TEST-TestDynamicLoading.testDynamicLoading-seed#[70D4E1C3114B1529]) [    ] o.a.s.c.s.e.JettySolrRunner Jetty properties: {solr.data.dir=/x1/jenkins/jenkins-slave/workspace/Lucene-Solr-Tests-6.x/solr/build/solr-core/test/J1/temp/solr.core.TestDynamicLoading_70D4E1C3114B1529-001/tempDir-001/jetty1, solrconfig=solrconfig.xml, hostContext=/, hostPort=55822, coreRootDirectory=/x1/jenkins/jenkins-slave/workspace/Lucene-Solr-Tests-6.x/solr/build/solr-core/test/J1/temp/solr.core.TestDynamicLoading_70D4E1C3114B1529-001/shard-1-001/cores}
   [junit4]   2> 302698 ERROR (TEST-TestDynamicLoading.testDynamicLoading-seed#[70D4E1C3114B1529]) [    ] o.a.s.s.StartupLoggingUtils Missing Java Option solr.log.dir. Logging may be missing or incomplete.
   [junit4]   2> 302707 INFO  (TEST-TestDynamicLoading.testDynamicLoading-seed#[70D4E1C3114B1529]) [    ] o.a.s.s.SolrDispatchFilter  ___      _       Welcome to Apache Solr™ version 6.6.0
   [junit4]   2> 302707 INFO  (TEST-TestDynamicLoading.testDynamicLoading-seed#[70D4E1C3114B1529]) [    ] o.a.s.s.SolrDispatchFilter / __| ___| |_ _   Starting in cloud mode on port null
   [junit4]   2> 302707 INFO  (TEST-TestDynamicLoading.testDynamicLoading-seed#[70D4E1C3114B1529]) [    ] o.a.s.s.SolrDispatchFilter \__ \/ _ \ | '_|  Install dir: null
   [junit4]   2> 302707 INFO  (TEST-TestDynamicLoading.testDynamicLoading-seed#[70D4E1C3114B1529]) [    ] o.a.s.s.SolrDispatchFilter |___/\___/_|_|    Start time: 2017-03-20T19:30:48.139Z
   [junit4]   2> 302758 INFO  (TEST-TestDynamicLoading.testDynamicLoading-seed#[70D4E1C3114B1529]) [    ] o.a.s.s.SolrDispatchFilter Loading solr.xml from SolrHome (not found in ZooKeeper)
   [junit4]   2> 302758 INFO  (TEST-TestDynamicLoading.testDynamicLoading-seed#[70D4E1C3114B1529]) [    ] o.a.s.c.SolrXmlConfig Loading container configuration from /x1/jenkins/jenkins-slave/workspace/Lucene-Solr-Tests-6.x/solr/build/solr-core/test/J1/temp/solr.core.TestDynamicLoading_70D4E1C3114B1529-001/shard-1-001/solr.xml
   [junit4]   2> 302794 INFO  (TEST-TestDynamicLoading.testDynamicLoading-seed#[70D4E1C3114B1529]) [    ] o.a.s.u.UpdateShardHandler Creating UpdateShardHandler HTTP client with params: socketTimeout=340000&connTimeout=45000&retry=true
   [junit4]   2> 302801 INFO  (TEST-TestDynamicLoading.testDynamicLoading-seed#[70D4E1C3114B1529]) [    ] o.a.s.c.ZkContainer Zookeeper client=127.0.0.1:35126/solr
   [junit4]   2> 302936 INFO  (TEST-TestDynamicLoading.testDynamicLoading-seed#[70D4E1C3114B1529]) [n:127.0.0.1:55822_    ] o.a.s.c.c.ZkStateReader Updated live nodes from ZooKeeper... (0) -> (1)
   [junit4]   2> 302937 INFO  (TEST-TestDynamicLoading.testDynamicLoading-seed#[70D4E1C3114B1529]) [n:127.0.0.1:55822_    ] o.a.s.c.Overseer Overseer (id=null) closing
   [junit4]   2> 302939 INFO  (TEST-TestDynamicLoading.testDynamicLoading-seed#[70D4E1C3114B1529]) [n:127.0.0.1:55822_    ] o.a.s.c.ZkController Register node as live in ZooKeeper:/live_nodes/127.0.0.1:55822_
   [junit4]   2> 302940 INFO  (zkCallback-340-thread-1) [    ] o.a.s.c.c.ZkStateReader Updated live nodes from ZooKeeper... (1) -> (2)
   [junit4]   2> 302940 INFO  (zkCallback-336-thread-1-processing-n:127.0.0.1:43677_) [n:127.0.0.1:43677_    ] o.a.s.c.c.ZkStateReader Updated live nodes from ZooKeeper... (1) -> (2)
   [junit4]   2> 302973 INFO  (zkCallback-346-thread-1-processing-n:127.0.0.1:55822_) [n:127.0.0.1:55822_    ] o.a.s.c.c.ZkStateReader Updated live nodes from ZooKeeper... (1) -> (2)
   [junit4]   2> 303031 INFO  (TEST-TestDynamicLoading.testDynamicLoading-seed#[70D4E1C3114B1529]) [n:127.0.0.1:55822_    ] o.a.s.c.CorePropertiesLocator Found 1 core definitions underneath /x1/jenkins/jenkins-slave/workspace/Lucene-Solr-Tests-6.x/solr/build/solr-core/test/J1/temp/solr.core.TestDynamicLoading_70D4E1C3114B1529-001/shard-1-001/cores
   [junit4]   2> 303031 INFO  (TEST-TestDynamicLoading.testDynamicLoading-seed#[70D4E1C3114B1529]) [n:127.0.0.1:55822_    ] o.a.s.c.CorePropertiesLocator Cores are: [collection1]
   [junit4]   2> 303036 INFO  (OverseerStateUpdate-97651146367369221-127.0.0.1:43677_-n_0000000000) [n:127.0.0.1:43677_    ] o.a.s.c.o.ReplicaMutator Assigning new node to shard shard=shard2
   [junit4]   2> 303138 INFO  (zkCallback-346-thread-2-processing-n:127.0.0.1:55822_) [n:127.0.0.1:55822_    ] o.a.s.c.c.ZkStateReader A cluster state change: [WatchedEvent state:SyncConnected type:NodeDataChanged path:/collections/collection1/state.json] for collection [collection1] has occurred - updating... (live nodes size: [2])
   [junit4]   2> 304065 WARN  (coreLoadExecutor-838-thread-1-processing-n:127.0.0.1:55822_) [n:127.0.0.1:55822_ c:collection1   x:collection1] o.a.s.c.Config Beginning with Solr 5.5, <mergePolicy> is deprecated, use <mergePolicyFactory> instead.
   [junit4]   2> 304066 INFO  (coreLoadExecutor-838-thread-1-processing-n:127.0.0.1:55822_) [n:127.0.0.1:55822_ c:collection1   x:collection1] o.a.s.c.SolrConfig Using Lucene MatchVersion: 6.6.0
   [junit4]   2> 304099 INFO  (coreLoadExecutor-838-thread-1-processing-n:127.0.0.1:55822_) [n:127.0.0.1:55822_ c:collection1   x:collection1] o.a.s.s.IndexSchema [collection1] Schema name=test
   [junit4]   2> 304228 WARN  (coreLoadExecutor-838-thread-1-processing-n:127.0.0.1:55822_) [n:127.0.0.1:55822_ c:collection1   x:collection1] o.a.s.s.IndexSchema [collection1] default search field in schema is text. WARNING: Deprecated, please use 'df' on request instead.
   [junit4]   2> 304231 INFO  (coreLoadExecutor-838-thread-1-processing-n:127.0.0.1:55822_) [n:127.0.0.1:55822_ c:collection1   x:collection1] o.a.s.s.IndexSchema Loaded schema test/1.0 with uniqueid field id
   [junit4]   2> 304249 INFO  (coreLoadExecutor-838-thread-1-processing-n:127.0.0.1:55822_) [n:127.0.0.1:55822_ c:collection1   x:collection1] o.a.s.c.CoreContainer Creating SolrCore 'collection1' using configuration from collection collection1
   [junit4]   2> 304249 INFO  (coreLoadExecutor-838-thread-1-processing-n:127.0.0.1:55822_) [n:127.0.0.1:55822_ c:collection1   x:collection1] o.a.s.c.SolrCore solr.RecoveryStrategy.Builder
   [junit4]   2> 304249 INFO  (coreLoadExecutor-838-thread-1-processing-n:127.0.0.1:55822_) [n:127.0.0.1:55822_ c:collection1   x:collection1] o.a.s.c.SolrCore [[collection1] ] Opening new SolrCore at [/x1/jenkins/jenkins-slave/workspace/Lucene-Solr-Tests-6.x/solr/build/solr-core/test/J1/temp/solr.core.TestDynamicLoading_70D4E1C3114B1529-001/shard-1-001/cores/collection1], dataDir=[/x1/jenkins/jenkins-slave/workspace/Lucene-Solr-Tests-6.x/solr/build/solr-core/test/J1/temp/solr.core.TestDynamicLoading_70D4E1C3114B1529-001/shard-1-001/cores/collection1/data/]
   [junit4]   2> 304250 INFO  (coreLoadExecutor-838-thread-1-processing-n:127.0.0.1:55822_) [n:127.0.0.1:55822_ c:collection1   x:collection1] o.a.s.c.JmxMonitoredMap JMX monitoring is enabled. Adding Solr mbeans to JMX Server: com.sun.jmx.mbeanserver.JmxMBeanServer@4587528b
   [junit4]   2> 304251 INFO  (coreLoadExecutor-838-thread-1-processing-n:127.0.0.1:55822_) [n:127.0.0.1:55822_ c:collection1   x:collection1] o.a.s.u.RandomMergePolicy RandomMergePolicy wrapping class org.apache.lucene.index.TieredMergePolicy: [TieredMergePolicy: maxMergeAtOnce=37, maxMergeAtOnceExplicit=24, maxMergedSegmentMB=80.6796875, floorSegmentMB=0.240234375, forceMergeDeletesPctAllowed=16.16658148703103, segmentsPerTier=48.0, maxCFSSegmentSizeMB=8.796093022207999E12, noCFSRatio=1.0
   [junit4]   2> 304262 WARN  (coreLoadExecutor-838-thread-1-processing-n:127.0.0.1:55822_) [n:127.0.0.1:55822_ c:collection1   x:collection1] o.a.s.c.RequestHandlers INVALID paramSet a in requestHandler {type = requestHandler,name = /dump,class = DumpRequestHandler,attributes = {initParams=a, name=/dump, class=DumpRequestHandler},args = {defaults={a=A,b=B}}}
   [junit4]   2> 305761 INFO  (coreLoadExecutor-838-thread-1-processing-n:127.0.0.1:55822_) [n:127.0.0.1:55822_ c:collection1   x:collection1] o.a.s.u.UpdateHandler Using UpdateLog implementation: org.apache.solr.update.UpdateLog
   [junit4]   2> 305761 INFO  (coreLoadExecutor-838-thread-1-processing-n:127.0.0.1:55822_) [n:127.0.0.1:55822_ c:collection1   x:collection1] o.a.s.u.UpdateLog Initializing UpdateLog: dataDir= defaultSyncLevel=FLUSH numRecordsToKeep=100 maxNumLogsToKeep=10 numVersionBuckets=65536
   [junit4]   2> 305762 INFO  (coreLoadExecutor-838-thread-1-processing-n:127.0.0.1:55822_) [n:127.0.0.1:55822_ c:collection1   x:collection1] o.a.s.u.CommitTracker Hard AutoCommit: disabled
   [junit4]   2> 305762 INFO  (coreLoadExecutor-838-thread-1-processing-n:127.0.0.1:55822_) [n:127.0.0.1:55822_ c:collection1   x:collection1] o.a.s.u.CommitTracker Soft AutoCommit: disabled
   [junit4]   2> 305763 INFO  (coreLoadExecutor-838-thread-1-processing-n:127.0.0.1:55822_) [n:127.0.0.1:55822_ c:collection1   x:collection1] o.a.s.u.RandomMergePolicy RandomMergePolicy wrapping class org.apache.lucene.index.LogByteSizeMergePolicy: [LogByteSizeMergePolicy: minMergeSize=1677721, mergeFactor=20, maxMergeSize=2147483648, maxMergeSizeForForcedMerge=9223372036854775807, calibrateSizeByDeletes=true, maxMergeDocs=2147483647, maxCFSSegmentSizeMB=8.796093022207999E12, noCFSRatio=0.47653993816636264]
   [junit4]   2> 305763 INFO  (coreLoadExecutor-838-thread-1-processing-n:127.0.0.1:55822_) [n:127.0.0.1:55822_ c:collection1   x:collection1] o.a.s.s.SolrIndexSearcher Opening [Searcher@1efbd87a[collection1] main]
   [junit4]   2> 305764 INFO  (coreLoadExecutor-838-thread-1-processing-n:127.0.0.1:55822_) [n:127.0.0.1:55822_ c:collection1   x:collection1] o.a.s.r.ManagedResourceStorage Configured ZooKeeperStorageIO with znodeBase: /configs/conf1
   [junit4]   2> 305764 INFO  (coreLoadExecutor-838-thread-1-processing-n:127.0.0.1:55822_) [n:127.0.0.1:55822_ c:collection1   x:collection1] o.a.s.r.ManagedResourceStorage Loaded null at path _rest_managed.json using ZooKeeperStorageIO:path=/configs/conf1
   [junit4]   2> 305764 INFO  (coreLoadExecutor-838-thread-1-processing-n:127.0.0.1:55822_) [n:127.0.0.1:55822_ c:collection1   x:collection1] o.a.s.h.ReplicationHandler Commits will be reserved for  10000
   [junit4]   2> 305766 INFO  (searcherExecutor-839-thread-1-processing-n:127.0.0.1:55822_ x:collection1 c:collection1) [n:127.0.0.1:55822_ c:collection1   x:collection1] o.a.s.c.SolrCore [collection1] Registered new searcher Searcher@1efbd87a[collection1] main{ExitableDirectoryReader(UninvertingDirectoryReader())}
   [junit4]   2> 305766 INFO  (coreLoadExecutor-838-thread-1-processing-n:127.0.0.1:55822_) [n:127.0.0.1:55822_ c:collection1   x:collection1] o.a.s.u.UpdateLog Could not find max version in index or recent updates, using new clock 1562418349288194048
   [junit4]   2> 305772 INFO  (coreZkRegister-833-thread-1-processing-n:127.0.0.1:55822_ x:collection1 c:collection1) [n:127.0.0.1:55822_ c:collection1 s:shard2 r:core_node1 x:collection1] o.a.s.c.ShardLeaderElectionContext Enough replicas found to continue.
   [junit4]   2> 305772 INFO  (coreZkRegister-833-thread-1-processing-n:127.0.0.1:55822_ x:collection1 c:collection1) [n:127.0.0.1:55822_ c:collection1 s:shard2 r:core_node1 x:collection1] o.a.s.c.ShardLeaderElectionContext I may be the new leader - try and sync
   [junit4]   2> 305772 INFO  (coreZkRegister-833-thread-1-processing-n:127.0.0.1:55822_ x:collection1 c:collection1) [n:127.0.0.1:55822_ c:collection1 s:shard2 r:core_node1 x:collection1] o.a.s.c.SyncStrategy Sync replicas to https://127.0.0.1:55822/collection1/
   [junit4]   2> 305772 INFO  (coreZkRegister-833-thread-1-processing-n:127.0.0.1:55822_ x:collection1 c:collection1) [n:127.0.0.1:55822_ c:collection1 s:shard2 r:core_node1 x:collection1] o.a.s.c.SyncStrategy Sync Success - now sync replicas to me
   [junit4]   2> 305772 INFO  (coreZkRegister-833-thread-1-processing-n:127.0.0.1:55822_ x:collection1 c:collection1) [n:127.0.0.1:55822_ c:collection1 s:shard2 r:core_node1 x:collection1] o.a.s.c.SyncStrategy https://127.0.0.1:55822/collection1/ has no replicas
   [junit4]   2> 305772 INFO  (coreZkRegister-833-thread-1-processing-n:127.0.0.1:55822_ x:collection1 c:collection1) [n:127.0.0.1:55822_ c:collection1 s:shard2 r:core_node1 x:collection1] o.a.s.c.ShardLeaderElectionContext Found all replicas participating in election, clear LIR
   [junit4]   2> 305778 INFO  (zkCallback-346-thread-2-processing-n:127.0.0.1:55822_) [n:127.0.0.1:55822_    ] o.a.s.c.c.ZkStateReader A cluster state change: [WatchedEvent state:SyncConnected type:NodeDataChanged path:/collections/collection1/state.json] for collection [collection1] has occurred - updating... (live nodes size: [2])
   [junit4]   2> 305780 INFO  (coreZkRegister-833-thread-1-processing-n:127.0.0.1:55822_ x:collection1 c:collection1) [n:127.0.0.1:55822_ c:collection1 s:shard2 r:core_node1 x:collection1] o.a.s.c.ShardLeaderElectionContext I am the new leader: https://127.0.0.1:55822/collection1/ shard2
   [junit4]   2> 305992 INFO  (zkCallback-346-thread-2-processing-n:127.0.0.1:55822_) [n:127.0.0.1:55822_    ] o.a.s.c.c.ZkStateReader A cluster state change: [WatchedEvent state:SyncConnected type:NodeDataChanged path:/collections/collection1/state.json] for collection [collection1] has occurred - updating... (live nodes size: [2])
   [junit4]   2> 306042 INFO  (coreZkRegister-833-thread-1-processing-n:127.0.0.1:55822_ x:collection1 c:collection1) [n:127.0.0.1:55822_ c:collection1 s:shard2 r:core_node1 x:collection1] o.a.s.c.ZkController I am the leader, no recovery necessary
   [junit4]   2> 306145 INFO  (zkCallback-346-thread-2-processing-n:127.0.0.1:55822_) [n:127.0.0.1:55822_    ] o.a.s.c.c.ZkStateReader A cluster state change: [WatchedEvent state:SyncConnected type:NodeDataChanged path:/collections/collection1/state.json] for collection [collection1] has occurred - updating... (live nodes size: [2])
   [junit4]   2> 306380 INFO  (TEST-TestDynamicLoading.testDynamicLoading-seed#[70D4E1C3114B1529]) [    ] o.a.s.SolrTestCaseJ4 Writing core.properties file to /x1/jenkins/jenkins-slave/workspace/Lucene-Solr-Tests-6.x/solr/build/solr-core/test/J1/temp/solr.core.TestDynamicLoading_70D4E1C3114B1529-001/shard-2-001/cores/collection1
   [junit4]   2> 306380 INFO  (TEST-TestDynamicLoading.testDynamicLoading-seed#[70D4E1C3114B1529]) [    ] o.a.s.c.AbstractFullDistribZkTestBase create jetty 2 in directory /x1/jenkins/jenkins-slave/workspace/Lucene-Solr-Tests-6.x/solr/build/solr-core/test/J1/temp/solr.core.TestDynamicLoading_70D4E1C3114B1529-001/shard-2-001
   [junit4]   2> 306386 INFO  (TEST-TestDynamicLoading.testDynamicLoading-seed#[70D4E1C3114B1529]) [    ] o.e.j.s.Server jetty-9.3.14.v20161028
   [junit4]   2> 306470 INFO  (TEST-TestDynamicLoading.testDynamicLoading-seed#[70D4E1C3114B1529]) [    ] o.e.j.s.h.ContextHandler Started o.e.j.s.ServletContextHandler@32764d41{/,null,AVAILABLE}
   [junit4]   2> 306471 INFO  (TEST-TestDynamicLoading.testDynamicLoading-seed#[70D4E1C3114B1529]) [    ] o.e.j.s.AbstractConnector Started ServerConnector@4e0a51b9{SSL,[ssl, http/1.1]}{127.0.0.1:37953}
   [junit4]   2> 306471 INFO  (TEST-TestDynamicLoading.testDynamicLoading-seed#[70D4E1C3114B1529]) [    ] o.e.j.s.Server Started @309898ms
   [junit4]   2> 306471 INFO  (TEST-TestDynamicLoading.testDynamicLoading-seed#[70D4E1C3114B1529]) [    ] o.a.s.c.s.e.JettySolrRunner Jetty properties: {solr.data.dir=/x1/jenkins/jenkins-slave/workspace/Lucene-Solr-Tests-6.x/solr/build/solr-core/test/J1/temp/solr.core.TestDynamicLoading_70D4E1C3114B1529-001/tempDir-001/jetty2, solrconfig=solrconfig.xml, hostContext=/, hostPort=37953, coreRootDirectory=/x1/jenkins/jenkins-slave/workspace/Lucene-Solr-Tests-6.x/solr/build/solr-core/test/J1/temp/solr.core.TestDynamicLoading_70D4E1C3114B1529-001/shard-2-001/cores}
   [junit4]   2> 306471 ERROR (TEST-TestDynamicLoading.testDynamicLoading-seed#[70D4E1C3114B1529]) [    ] o.a.s.s.StartupLoggingUtils Missing Java Option solr.log.dir. Logging may be missing or incomplete.
   [junit4]   2> 306478 INFO  (TEST-TestDynamicLoading.testDynamicLoading-seed#[70D4E1C3114B1529]) [    ] o.a.s.s.SolrDispatchFilter  ___      _       Welcome to Apache Solr™ version 6.6.0
   [junit4]   2> 306478 INFO  (TEST-TestDynamicLoading.testDynamicLoading-seed#[70D4E1C3114B1529]) [    ] o.a.s.s.SolrDispatchFilter / __| ___| |_ _   Starting in cloud mode on port null
   [junit4]   2> 306478 INFO  (TEST-TestDynamicLoading.testDynamicLoading-seed#[70D4E1C3114B1529]) [    ] o.a.s.s.SolrDispatchFilter \__ \/ _ \ | '_|  Install dir: null
   [junit4]   2> 306479 INFO  (TEST-TestDynamicLoading.testDynamicLoading-seed#[70D4E1C3114B1529]) [    ] o.a.s.s.SolrDispatchFilter |___/\___/_|_|    Start time: 2017-03-20T19:30:51.910Z
   [junit4]   2> 306503 INFO  (TEST-TestDynamicLoading.testDynamicLoading-seed#[70D4E1C3114B1529]) [    ] o.a.s.s.SolrDispatchFilter Loading solr.xml from SolrHome (not found in ZooKeeper)
   [junit4]   2> 306503 INFO  (TEST-TestDynamicLoading.testDynamicLoading-seed#[70D4E1C3114B1529]) [    ] o.a.s.c.SolrXmlConfig Loading container configuration from /x1/jenkins/jenkins-slave/workspace/Lucene-Solr-Tests-6.x/solr/build/solr-core/test/J1/temp/solr.core.TestDynamicLoading_70D4E1C3114B1529-001/shard-2-001/solr.xml
   [junit4]   2> 306517 INFO  (TEST-TestDynamicLoading.testDynamicLoading-seed#[70D4E1C3114B1529]) [    ] o.a.s.u.UpdateShardHandler Creating UpdateShardHandler HTTP client with params: socketTimeout=340000&connTimeout=45000&retry=true
   [junit4]   2> 306518 INFO  (TEST-TestDynamicLoading.testDynamicLoading-seed#[70D4E1C3114B1529]) [    ] o.a.s.c.ZkContainer Zookeeper client=127.0.0.1:35126/solr
   [junit4]   2> 306571 INFO  (TEST-TestDynamicLoading.testDynamicLoading-seed#[70D4E1C3114B1529]) [n:127.0.0.1:37953_    ] o.a.s.c.c.ZkStateReader Updated live nodes from ZooKeeper... (0) -> (2)
   [junit4]   2> 306572 INFO  (TEST-TestDynamicLoading.testDynamicLoading-seed#[70D4E1C3114B1529]) [n:127.0.0.1:37953_    ] o.a.s.c.Overseer Overseer (id=null) closing
   [junit4]   2> 306576 INFO  (TEST-TestDynamicLoading.testDynamicLoading-seed#[70D4E1C3114B1529]) [n:127.0.0.1:37953_    ] o.a.s.c.ZkController Register node as live in ZooKeeper:/live_nodes/127.0.0.1:37953_
   [junit4]   2> 306576 INFO  (zkCallback-346-thread-2-processing-n:127.0.0.1:55822_) [n:127.0.0.1:55822_    ] o.a.s.c.c.ZkStateReader Updated live nodes from ZooKeeper... (2) -> (3)
   [junit4]   2> 306576 INFO  (zkCallback-340-thread-1) [    ] o.a.s.c.c.ZkStateReader Updated live nodes from ZooKeeper... (2) -> (3)
   [junit4]   2> 306577 INFO  (zkCallback-336-thread-3-processing-n:127.0.0.1:43677_) [n:127.0.0.1:43677_    ] o.a.s.c.c.ZkStateReader Updated live nodes from ZooKeeper... (2) -> (3)
   [junit4]   2> 306603 INFO  (zkCallback-352-thread-2-processing-n:127.0.0.1:37953_) [n:127.0.0.1:37953_    ] o.a.s.c.c.ZkStateReader Updated live nodes from ZooKeeper... (2) -> (3)
   [junit4]   2> 306676 INFO  (zkCallback-346-thread-2-processing-n:127.0.0.1:55822_) [n:127.0.0.1:55822_    ] o.a.s.c.c.ZkStateReader A cluster state change: [WatchedEvent state:SyncConnected type:NodeDataChanged path:/collections/collection1/state.json] for collection [collection1] has occurred - updating... (live nodes size: [3])
   [junit4]   2> 306715 INFO  (TEST-TestDynamicLoading.testDynamicLoading-seed#[70D4E1C3114B1529]) [n:127.0.0.1:37953_    ] o.a.s.c.CorePropertiesLocator Found 1 core definitions underneath /x1/jenkins/jenkins-slave/workspace/Lucene-Solr-Tests-6.x/solr/build/solr-core/test/J1/temp/solr.core.TestDynamicLoading_70D4E1C3114B1529-001/shard-2-001/cores
   [junit4]   2> 306716 INFO  (TEST-TestDynamicLoading.testDynamicLoading-seed#[70D4E1C3114B1529]) [n:127.0.0.1:37953_    ] o.a.s.c.CorePropertiesLocator Cores are: [collection1]
   [junit4]   2> 306726 INFO  (OverseerStateUpdate-97651146367369221-127.0.0.1:43677_-n_0000000000) [n:127.0.0.1:43677_    ] o.a.s.c.o.ReplicaMutator Assigning new node to shard shard=shard1
   [junit4]   2> 306828 INFO  (zkCallback-346-thread-2-processing-n:127.0.0.1:55822_) [n:127.0.0.1:55822_    ] o.a.s.c.c.ZkStateReader A cluster state change: [WatchedEvent state:SyncConnected type:NodeDataChanged path:/collections/collection1/state.json] for collection [collection1] has occurred - updating... (live nodes size: [3])
   [junit4]   2> 306828 INFO  (zkCallback-352-thread-2-processing-n:127.0.0.1:37953_) [n:127.0.0.1:37953_    ] o.a.s.c.c.ZkStateReader A cluster state change: [WatchedEvent state:SyncConnected type:NodeDataChanged path:/collections/collection1/state.json] for collection [collection1] has occurred - updating... (live nodes size: [3])
   [junit4]   2> 307757 WARN  (coreLoadExecutor-849-thread-1-processing-n:127.0.0.1:37953_) [n:127.0.0.1:37953_ c:collection1   x:collection1] o.a.s.c.Config Beginning with Solr 5.5, <mergePolicy> is deprecated, use <mergePolicyFactory> instead.
   [junit4]   2> 307758 INFO  (coreLoadExecutor-849-thread-1-processing-n:127.0.0.1:37953_) [n:127.0.0.1:37953_ c:collection1   x:collection1] o.a.s.c.SolrConfig Using Lucene MatchVersion: 6.6.0
   [junit4]   2> 307786 INFO  (coreLoadExecutor-849-thread-1-processing-n:127.0.0.1:37953_) [n:127.0.0.1:37953_ c:collection1   x:collection1] o.a.s.s.IndexSchema [collection1] Schema name=test
   [junit4]   2> 307997 WARN  (coreLoadExecutor-849-thread-1-processing-n:127.0.0.1:37953_) [n:127.0.0.1:37953_ c:collection1   x:collection1] o.a.s.s.IndexSchema [collection1] default search field in schema is text. WARNING: Deprecated, please use 'df' on request instead.
   [junit4]   2> 307999 INFO  (coreLoadExecutor-849-thread-1-processing-n:127.0.0.1:37953_) [n:127.0.0.1:37953_ c:collection1   x:collection1] o.a.s.s.IndexSchema Loaded schema test/1.0 with uniqueid field id
   [junit4]   2> 308007 INFO  (coreLoadExecutor-849-thread-1-processing-n:127.0.0.1:37953_) [n:127.0.0.1:37953_ c:collection1   x:collection1] o.a.s.c.CoreContainer Creating SolrCore 'collection1' using configuration from collection collection1
   [junit4]   2> 308008 INFO  (coreLoadExecutor-849-thread-1-processing-n:127.0.0.1:37953_) [n:127.0.0.1:37953_ c:collection1   x:collection1] o.a.s.c.SolrCore solr.RecoveryStrategy.Builder
   [junit4]   2> 308008 INFO  (coreLoadExecutor-849-thread-1-processing-n:127.0.0.1:37953_) [n:127.0.0.1:37953_ c:collection1   x:collection1] o.a.s.c.SolrCore [[collection1] ] Opening new SolrCore at [/x1/jenkins/jenkins-slave/workspace/Lucene-Solr-Tests-6.x/solr/build/solr-core/test/J1/temp/solr.core.TestDynamicLoading_70D4E1C3114B1529-001/shard-2-001/cores/collection1], dataDir=[/x1/jenkins/jenkins-slave/workspace/Lucene-Solr-Tests-6.x/solr/build/solr-core/test/J1/temp/solr.core.TestDynamicLoading_70D4E1C3114B1529-001/shard-2-001/cores/collection1/data/]
   [junit4]   2> 308008 INFO  (coreLoadExecutor-849-thread-1-processing-n:127.0.0.1:37953_) [n:127.0.0.1:37953_ c:collection1   x:collection1] o.a.s.c.JmxMonitoredMap JMX monitoring is enabled. Adding Solr mbeans to JMX Server: com.sun.jmx.mbeanserver.JmxMBeanServer@4587528b
   [junit4]   2> 308011 INFO  (coreLoadExecutor-849-thread-1-processing-n:127.0.0.1:37953_) [n:127.0.0.1:37953_ c:collection1   x:collection1] o.a.s.u.RandomMergePolicy RandomMergePolicy wrapping class org.apache.lucene.index.TieredMergePolicy: [TieredMergePolicy: maxMergeAtOnce=37, maxMergeAtOnceExplicit=24, maxMergedSegmentMB=80.6796875, floorSegmentMB=0.240234375, forceMergeDeletesPctAllowed=16.16658148703103, segmentsPerTier=48.0, maxCFSSegmentSizeMB=8.796093022207999E12, noCFSRatio=1.0
   [junit4]   2> 308015 WARN  (coreLoadExecutor-849-thread-1-processing-n:127.0.0.1:37953_) [n:127.0.0.1:37953_ c:collection1   x:collection1] o.a.s.c.RequestHandlers INVALID paramSet a in requestHandler {type = requestHandler,name = /dump,class = DumpRequestHandler,attributes = {initParams=a, name=/dump, class=DumpRequestHandler},args = {defaults={a=A,b=B}}}
   [junit4]   2> 308046 INFO  (coreLoadExecutor-849-thread-1-processing-n:127.0.0.1:37953_) [n:127.0.0.1:37953_ c:collection1   x:collection1] o.a.s.u.UpdateHandler Using UpdateLog implementation: org.apache.solr.update.UpdateLog
   [junit4]   2> 308046 INFO  (coreLoadExecutor-849-thread-1-processing-n:127.0.0.1:37953_) [n:127.0.0.1:37953_ c:collection1   x:collection1] o.a.s.u.UpdateLog Initializing UpdateLog: dataDir= defaultSyncLevel=FLUSH numRecordsToKeep=100 maxNumLogsToKeep=10 numVersionBuckets=65536
   [junit4]   2> 308047 INFO  (coreLoadExecutor-849-thread-1-processing-n:127.0.0.1:37953_) [n:127.0.0.1:37953_ c:collection1   x:collection1] o.a.s.u.CommitTracker Hard AutoCommit: disabled
   [junit4]   2> 308047 INFO  (coreLoadExecutor-849-thread-1-processing-n:127.0.0.1:37953_) [n:127.0.0.1:37953_ c:collection1   x:collection1] o.a.s.u.CommitTracker Soft AutoCommit: disabled
   [junit4]   2> 308054 INFO  (coreLoadExecutor-849-thread-1-processing-n:127.0.0.1:37953_) [n:127.0.0.1:37953_ c:collection1   x:collection1] o.a.s.u.RandomMergePolicy RandomMergePolicy wrapping class org.apache.lucene.index.LogByteSizeMergePolicy: [LogByteSizeMergePolicy: minMergeSize=1677721, mergeFactor=20, maxMergeSize=2147483648, maxMergeSizeForForcedMerge=9223372036854775807, calibrateSizeByDeletes=true, maxMergeDocs=2147483647, maxCFSSegmentSizeMB=8.796093022207999E12, noCFSRatio=0.47653993816636264]
   [junit4]   2> 308054 INFO  (coreLoadExecutor-849-thread-1-processing-n:127.0.0.1:37953_) [n:127.0.0.1:37953_ c:collection1   x:collection1] o.a.s.s.SolrIndexSearcher Opening [Searcher@6fad3994[collection1] main]
   [junit4]   2> 308057 INFO  (coreLoadExecutor-849-thread-1-processing-n:127.0.0.1:37953_) [n:127.0.0.1:37953_ c:collection1   x:collection1] o.a.s.r.ManagedResourceStorage Configured ZooKeeperStorageIO with znodeBase: /configs/conf1
   [junit4]   2> 308057 INFO  (coreLoadExecutor-849-thread-1-processing-n:127.0.0.1:37953_) [n:127.0.0.1:37953_ c:collection1   x:collection1] o.a.s.r.ManagedResourceStorage Loaded null at path _rest_managed.json using ZooKeeperStorageIO:path=/configs/conf1
   [junit4]   2> 308057 INFO  (coreLoadExecutor-849-thread-1-processing-n:127.0.0.1:37953_) [n:127.0.0.1:37953_ c:collection1   x:collection1] o.a.s.h.ReplicationHandler Commits will be reserved for  10000
   [junit4]   2> 308059 INFO  (coreLoadExecutor-849-thread-1-processing-n:127.0.0.1:37953_) [n:127.0.0.1:37953_ c:collection1   x:collection1] o.a.s.u.UpdateLog Could not find max version in index or recent updates, using new clock 1562418351692578816
   [junit4]   2> 308062 INFO  (searcherExecutor-850-thread-1-processing-n:127.0.0.1:37953_ x:collection1 c:collection1) [n:127.0.0.1:37953_ c:collection1   x:collection1] o.a.s.c.SolrCore [collection1] Registered new searcher Searcher@6fad3994[collection1] main{ExitableDirectoryReader(UninvertingDirectoryReader())}
   [junit4]   2> 308067 INFO  (coreZkRegister-844-thread-1-processing-n:127.0.0.1:37953_ x:collection1 c:collection1) [n:127.0.0.1:37953_ c:collection1 s:shard1 r:core_node2 x:collection1] o.a.s.c.ShardLeaderElectionContext Enough replicas found to continue.
   [junit4]   2> 308067 INFO  (coreZkRegister-844-thread-1-processing-n:127.0.0.1:37953_ x:collection1 c:collection1) [n:127.0.0.1:37953_ c:collection1 s:shard1 r:core_node2 x:collection1] o.a.s.c.ShardLeaderElectionContext I may be the new leader - try and sync
   [junit4]   2> 308067 INFO  (coreZkRegister-844-thread-1-processing-n:127.0.0.1:37953_ x:collection1 c:collection1) [n:127.0.0.1:37953_ c:collection1 s:shard1 r:core_node2 x:collection1] o.a.s.c.SyncStrategy Sync replicas to https://127.0.0.1:37953/collection1/
   [junit4]   2> 308067 INFO  (coreZkRegister-844-thread-1-processing-n:127.0.0.1:37953_ x:collection1 c:collection1) [n:127.0.0.1:37953_ c:collection1 s:shard1 r:core_node2 x:collection1] o.a.s.c.SyncStrategy Sync Success - now sync replicas to me
   [junit4]   2> 308067 INFO  (coreZkRegister-844-thread-1-processing-n:127.0.0.1:37953_ x:collection1 c:collection1) [n:127.0.0.1:37953_ c:collection1 s:shard1 r:core_node2 x:collection1] o.a.s.c.SyncStrategy https://127.0.0.1:37953/collection1/ has no replicas
   [junit4]   2> 308067 INFO  (coreZkRegister-844-thread-1-processing-n:127.0.0.1:37953_ x:collection1 c:collection1) [n:127.0.0.1:37953_ c:collection1 s:shard1 r:core_node2 x:collection1] o.a.s.c.ShardLeaderElectionContext Found all replicas participating in election, clear LIR
   [junit4]   2> 308070 INFO  (coreZkRegister-844-thread-1-processing-n:127.0.0.1:37953_ x:collection1 c:collection1) [n:127.0.0.1:37953_ c:collection1 s:shard1 r:core_node2 x:collection1] o.a.s.c.ShardLeaderElectionContext I am the new leader: https://127.0.0.1:37953/collection1/ shard1
   [junit4]   2> 308172 INFO  (zkCallback-346-thread-2-processing-n:127.0.0.1:55822_) [n:127.0.0.1:55822_    ] o.a.s.c.c.ZkStateReader A cluster state change: [WatchedEvent state:SyncConnected type:NodeDataChanged path:/collections/collection1/state.json] for collection [collection1] has occurred - updating... (live nodes size: [3])
   [junit4]   2> 308172 INFO  (zkCallback-352-thread-2-processing-n:127.0.0.1:37953_) [n:127.0.0.1:37953_    ] o.a.s.c.c.ZkStateReader A cluster state change: [WatchedEvent state:SyncConnected type:NodeDataChanged path:/collections/collection1/state.json] for collection [collection1] has occurred - updating... (live nodes size: [3])
   [junit4]   2> 308220 INFO  (coreZkRegister-844-thread-1-processing-n:127.0.0.1:37953_ x:collection1 c:collection1) [n:127.0.0.1:37953_ c:collection1 s:shard1 r:core_node2 x:collection1] o.a.s.c.ZkController I am the leader, no recovery necessary
   [junit4]   2> 308324 INFO  (zkCallback-346-thread-2-processing-n:127.0.0.1:55822_) [n:127.0.0.1:55822_    ] o.a.s.c.c.ZkStateReader A cluster state change: [WatchedEvent state:SyncConnected type:NodeDataChanged path:/collections/collection1/state.json] for collection [collection1] has occurred - updating... (live nodes size: [3])
   [junit4]   2> 308324 INFO  (zkCallback-352-thread-2-processing-n:127.0.0.1:37953_) [n:127.0.0.1:37953_    ] o.a.s.c.c.ZkStateReader A cluster state change: [WatchedEvent state:SyncConnected type:NodeDataChanged path:/collections/collection1/state.json] for collection [collection1] has occurred - updating... (live nodes size: [3])
   [junit4]   2> 308662 INFO  (TEST-TestDynamicLoading.testDynamicLoading-seed#[70D4E1C3114B1529]) [    ] o.a.s.SolrTestCaseJ4 Writing core.properties file to /x1/jenkins/jenkins-slave/workspace/Lucene-Solr-Tests-6.x/solr/build/solr-core/test/J1/temp/solr.core.TestDynamicLoading_70D4E1C3114B1529-001/shard-3-001/cores/collection1
   [junit4]   2> 308662 INFO  (TEST-TestDynamicLoading.testDynamicLoading-seed#[70D4E1C3114B1529]) [    ] o.a.s.c.AbstractFullDistribZkTestBase create jetty 3 in directory /x1/jenkins/jenkins-slave/workspace/Lucene-Solr-Tests-6.x/solr/build/solr-core/test/J1/temp/solr.core.TestDynamicLoading_70D4E1C3114B1529-001/shard-3-001
   [junit4]   2> 308669 INFO  (TEST-TestDynamicLoading.testDynamicLoading-seed#[70D4E1C3114B1529]) [    ] o.e.j.s.Server jetty-9.3.14.v20161028
   [junit4]   2> 308732 INFO  (TEST-TestDynamicLoading.testDynamicLoading-seed#[70D4E1C3114B1529]) [    ] o.e.j.s.h.ContextHandler Started o.e.j.s.ServletContextHandler@2da05e43{/,null,AVAILABLE}
   [junit4]   2> 308733 INFO  (TEST-TestDynamicLoading.testDynamicLoading-seed#[70D4E1C3114B1529]) [    ] o.e.j.s.AbstractConnector Started ServerConnector@695837c8{SSL,[ssl, http/1.1]}{127.0.0.1:42677}
   [junit4]   2> 308733 INFO  (TEST-TestDynamicLoading.testDynamicLoading-seed#[70D4E1C3114B1529]) [    ] o.e.j.s.Server Started @312160ms
   [junit4]   2> 308733 INFO  (TEST-TestDynamicLoading.testDynamicLoading-seed#[70D4E1C3114B1529]) [    ] o.a.s.c.s.e.JettySolrRunner Jetty properties: {solr.data.dir=/x1/jenkins/jenkins-slave/workspace/Lucene-Solr-Tests-6.x/solr/build/solr-core/test/J1/temp/solr.core.TestDynamicLoading_70D4E1C3114B1529-001/tempDir-001/jetty3, solrconfig=solrconfig.xml, hostContext=/, hostPort=42677, coreRootDirectory=/x1/jenkins/jenkins-slave/workspace/Lucene-Solr-Tests-6.x/solr/build/solr-core/test/J1/temp/solr.core.TestDynamicLoading_70D4E1C3114B1529-001/shard-3-001/cores}
   [junit4]   2> 308733 ERROR (TEST-TestDynamicLoading.testDynamicLoading-seed#[70D4E1C3114B1529]) [    ] o.a.s.s.StartupLoggingUtils Missing Java Option solr.log.dir. Logging may be missing or incomplete.
   [junit4]   2> 308747 INFO  (TEST-TestDynamicLoading.testDynamicLoading-seed#[70D4E1C3114B1529]) [    ] o.a.s.s.SolrDispatchFilter  ___      _       Welcome to Apache Solr™ version 6.6.0
   [junit4]   2> 308747 INFO  (TEST-TestDynamicLoading.testDynamicLoading-seed#[70D4E1C3114B1529]) [    ] o.a.s.s.SolrDispatchFilter / __| ___| |_ _   Starting in cloud mode on port null
   [junit4]   2> 308747 INFO  (TEST-TestDynamicLoading.testDynamicLoading-seed#[70D4E1C3114B1529]) [    ] o.a.s.s.SolrDispatchFilter \__ \/ _ \ | '_|  Install dir: null
   [junit4]   2> 308747 INFO  (TEST-TestDynamicLoading.testDynamicLoading-seed#[70D4E1C3114B1529]) [    ] o.a.s.s.SolrDispatchFilter |___/\___/_|_|    Start time: 2017-03-20T19:30:54.179Z
   [junit4]   2> 308771 INFO  (TEST-TestDynamicLoading.testDynamicLoading-seed#[70D4E1C3114B1529]) [    ] o.a.s.s.SolrDispatchFilter Loading solr.xml from SolrHome (not found in ZooKeeper)
   [junit4]   2> 308771 INFO  (TEST-TestDynamicLoading.testDynamicLoading-seed#[70D4E1C3114B1529]) [    ] o.a.s.c.SolrXmlConfig Loading container configuration from /x1/jenkins/jenkins-slave/workspace/Lucene-Solr-Tests-6.x/solr/build/solr-core/test/J1/temp/solr.core.TestDynamicLoading_70D4E1C3114B1529-001/shard-3-001/solr.xml
   [junit4]   2> 308789 INFO  (TEST-TestDynamicLoading.testDynamicLoading-seed#[70D4E1C3114B1529]) [    ] o.a.s.u.UpdateShardHandler Creating UpdateShardHandler HTTP client with params: socketTimeout=340000&connTimeout=45000&retry=true
   [junit4]   2> 308797 INFO  (TEST-TestDynamicLoading.testDynamicLoading-seed#[70D4E1C3114B1529]) [    ] o.a.s.c.ZkContainer Zookeeper client=127.0.0.1:35126/solr
   [junit4]   2> 308830 INFO  (TEST-TestDynamicLoading.testDynamicLoading-seed#[70D4E1C3114B1529]) [n:127.0.0.1:42677_    ] o.a.s.c.c.ZkStateReader Updated live nodes from ZooKeeper... (0) -> (3)
   [junit4]   2> 308831 INFO  (TEST-TestDynamicLoading.testDynamicLoading-seed#[70D4E1C3114B1529]) [n:127.0.0.1:42677_    ] o.a.s.c.Overseer Overseer (id=null) closing
   [junit4]   2> 308832 INFO  (TEST-TestDynamicLoading.testDynamicLoading-seed#[70D4E1C3114B1529]) [n:127.0.0.1:42677_    ] o.a.s.c.ZkController Register node as live in ZooKeeper:/live_nodes/127.0.0.1:42677_
   [junit4]   2> 308836 INFO  (zkCallback-346-thread-2-processing-n:127.0.0.1:55822_) [n:127.0.0.1:55822_    ] o.a.s.c.c.ZkStateReader Updated live nodes from ZooKeeper... (3) -> (4)
   [junit4]   2> 308836 INFO  (zkCallback-352-thread-2-processing-n:127.0.0.1:37953_) [n:127.0.0.1:37953_    ] o.a.s.c.c.ZkStateReader Updated live nodes from ZooKeeper... (3) -> (4)
   [junit4]   2> 308865 INFO  (zkCallback-336-thread-2-processing-n:127.0.0.1:43677_) [n:127.0.0.1:43677_    ] o.a.s.c.c.ZkStateReader Updated live nodes from ZooKeeper... (3) -> (4)
   [junit4]   2> 308865 INFO  (zkCallback-340-thread-1) [    ] o.a.s.c.c.ZkStateReader Updated live nodes from ZooKeeper... (3) -> (4)
   [junit4]   2> 309090 INFO  (zkCallback-358-thread-2-processing-n:127.0.0.1:42677_) [n:127.0.0.1:42677_    ] o.a.s.c.c.ZkStateReader Updated live nodes from ZooKeeper... (3) -> (4)
   [junit4]   2> 309090 INFO  (zkCallback-346-thread-2-processing-n:127.0.0.1:55822_) [n:127.0.0.1:55822_    ] o.a.s.c.c.ZkStateReader A cluster state change: [WatchedEvent state:SyncConnected type:NodeDataChanged path:/collections/collection1/state.json] for collection [collection1] has occurred - updating... (live nodes size: [4])
   [junit4]   2> 309090 INFO  (zkCallback-352-thread-2-processing-n:127.0.0.1:37953_) [n:127.0.0.1:37953_    ] o.a.s.c.c.ZkStateReader A cluster state change: [WatchedEvent state:SyncConnected type:NodeDataChanged path:/collections/collection1/state.json] for collection [collection1] has occurred - updating... (live nodes size: [4])
   [junit4]   2> 309145 INFO  (TEST-TestDynamicLoading.testDynamicLoading-seed#[70D4E1C3114B1529]) [n:127.0.0.1:42677_    ] o.a.s.c.CorePropertiesLocator Found 1 core definitions underneath /x1/jenkins/jenkins-slave/workspace/Lucene-Solr-Tests-6.x/solr/build/solr-core/test/J1/temp/solr.core.TestDynamicLoading_70D4E1C3114B1529-001/shard-3-001/cores
   [junit4]   2> 309145 INFO  (TEST-TestDynamicLoading.testDynamicLoading-seed#[70D4E1C3114B1529]) [n:127.0.0.1:42677_    ] o.a.s.c.CorePropertiesLocator Cores are: [collection1]
   [junit4]   2> 309146 INFO  (OverseerStateUpdate-97651146367369221-127.0.0.1:43677_-n_0000000000) [n:127.0.0.1:43677_    ] o.a.s.c.o.ReplicaMutator Assigning new node to shard shard=shard2
   [junit4]   2> 309248 INFO  (zkCallback-358-thread-1-processing-n:127.0.0.1:42677_) [n:127.0.0.1:42677_    ] o.a.s.c.c.ZkStateReader A cluster state change: [WatchedEvent state:SyncConnected type:NodeDataChanged path:/collections/collection1/state.json] for collection [collection1] has occurred - updating... (live nodes size: [4])
   [junit4]   2> 309248 INFO  (zkCallback-346-thread-2-processing-n:127.0.0.1:55822_) [n:127.0.0.1:55822_    ] o.a.s.c.c.ZkStateReader A cluster state change: [WatchedEvent state:SyncConnected type:NodeDataChanged path:/collections/collection1/state.json] for collection [collection1] has occurred - updating... (live nodes size: [4])
   [junit4]   2> 309248 INFO  (zkCallback-352-thread-2-processing-n:127.0.0.1:37953_) [n:127.0.0.1:37953_    ] o.a.s.c.c.ZkStateReader A cluster state change: [WatchedEvent state:SyncConnected type:NodeDataChanged path:/collections/collection1/state.json] for collection [collection1] has occurred - updating... (live nodes size: [4])
   [junit4]   2> 310162 WARN  (coreLoadExecutor-860-thread-1-processing-n:127.0.0.1:42677_) [n:127.0.0.1:42677_ c:collection1   x:collection1] o.a.s.c.Config Beginning with Solr 5.5, <mergePolicy> is deprecated, use <mergePolicyFactory> instead.
   [junit4]   2> 310163 INFO  (coreLoadExecutor-860-thread-1-processing-n:127.0.0.1:42677_) [n:127.0.0.1:42677_ c:collection1   x:collection1] o.a.s.c.SolrConfig Using Lucene MatchVersion: 6.6.0
   [junit4]   2> 310175 INFO  (coreLoadExecutor-860-thread-1-processing-n:127.0.0.1:42677_) [n:127.0.0.1:42677_ c:collection1   x:collection1] o.a.s.s.IndexSchema [collection1] Schema name=test
   [junit4]   2> 310325 WARN  (coreLoadExecutor-860-thread-1-processing-n:127.0.0.1:42677_) [n:127.0.0.1:42677_ c:collection1   x:collection1] o.a.s.s.IndexSchema [collection1] default search field in schema is text. WARNING: Deprecated, please use 'df' on request instead.
   [junit4]   2> 310327 INFO  (coreLoadExecutor-860-thread-1-processing-n:127.0.0.1:42677_) [n:127.0.0.1:42677_ c:collection1   x:collection1] o.a.s.s.IndexSchema Loaded schema test/1.0 with uniqueid field id
   [junit4]   2> 310350 INFO  (coreLoadExecutor-860-thread-1-processing-n:127.0.0.1:42677_) [n:127.0.0.1:42677_ c:collection1   x:collection1] o.a.s.c.CoreContainer Creating SolrCore 'collection1' using configuration from collection collection1
   [junit4]   2> 310350 INFO  (coreLoadExecutor-860-thread-1-processing-n:127.0.0.1:42677_) [n:127.0.0.1:42677_ c:collection1   x:collection1] o.a.s.c.SolrCore solr.RecoveryStrategy.Builder
   [junit4]   2> 310350 INFO  (coreLoadExecutor-860-thread-1-processing-n:127.0.0.1:42677_) [n:127.0.0.1:42677_ c:collection1   x:collection1] o.a.s.c.SolrCore [[collection1] ] Opening new SolrCore at [/x1/jenkins/jenkins-slave/workspace/Lucene-Solr-Tests-6.x/solr/build/solr-core/test/J1/temp/solr.core.TestDynamicLoading_70D4E1C3114B1529-001/shard-3-001/cores/collection1], dataDir=[/x1/jenkins/jenkins-slave/workspace/Lucene-Solr-Tests-6.x/solr/build/solr-core/test/J1/temp/solr.core.TestDynamicLoading_70D4E1C3114B1529-001/shard-3-001/cores/collection1/data/]
   [junit4]   2> 310350 INFO  (coreLoadExecutor-860-thread-1-processing-n:127.0.0.1:42677_) [n:127.0.0.1:42677_ c:collection1   x:collection1] o.a.s.c.JmxMonitoredMap JMX monitoring is enabled. Adding Solr mbeans to JMX Server: com.sun.jmx.mbeanserver.JmxMBeanServer@4587528b
   [junit4]   2> 310352 INFO  (coreLoadExecutor-860-thread-1-processing-n:127.0.0.1:42677_) [n:127.0.0.1:42677_ c:collection1   x:collection1] o.a.s.u.RandomMergePolicy RandomMergePolicy wrapping class org.apache.lucene.index.TieredMergePolicy: [TieredMergePolicy: maxMergeAtOnce=37, maxMergeAtOnceExplicit=24, maxMergedSegmentMB=80.6796875, floorSegmentMB=0.240234375, forceMergeDeletesPctAllowed=16.16658148703103, segmentsPerTier=48.0, maxCFSSegmentSizeMB=8.796093022207999E12, noCFSRatio=1.0
   [junit4]   2> 310371 WARN  (coreLoadExecutor-860-thread-1-processing-n:127.0.0.1:42677_) [n:127.0.0.1:42677_ c:collection1   x:collection1] o.a.s.c.RequestHandlers INVALID paramSet a in requestHandler {type = requestHandler,name = /dump,class = DumpRequestHandler,attributes = {initParams=a, name=/dump, class=DumpRequestHandler},args = {defaults={a=A,b=B}}}
   [junit4]   2> 310659 INFO  (coreLoadExecutor-860-thread-1-processing-n:127.0.0.1:42677_) [n:127.0.0.1:42677_ c:collection1   x:collection1] o.a.s.u.UpdateHandler Using UpdateLog implementation: org.apache.solr.update.UpdateLog
   [junit4]   2> 310659 INFO  (coreLoadExecutor-860-thread-1-processing-n:127.0.0.1:42677_) [n:127.0.0.1:42677_ c:collection1   x:collection1] o.a.s.u.UpdateLog Initializing UpdateLog: dataDir= defaultSyncLevel=FLUSH numRecordsToKeep=100 maxNumLogsToKeep=10 numVersionBuckets=65536
   [junit4]   2> 310660 INFO  (coreLoadExecutor-860-thread-1-processing-n:127.0.0.1:42677_) [n:127.0.0.1:42677_ c:collection1   x:collection1] o.a.s.u.CommitTracker Hard AutoCommit: disabled
   [junit4]   2> 310661 INFO  (coreLoadExecutor-860-thread-1-processing-n:127.0.0.1:42677_) [n:127.0.0.1:42677_ c:collection1   x:collection1] o.a.s.u.CommitTracker Soft AutoCommit: disabled
   [junit4]   2> 310664 INFO  (coreLoadExecutor-860-thread-1-processing-n:127.0.0.1:42677_) [n:127.0.0.1:42677_ c:collection1   x:collection1] o.a.s.u.RandomMergePolicy RandomMergePolicy wrapping class org.apache.lucene.index.LogByteSizeMergePolicy: [LogByteSizeMergePolicy: minMergeSize=1677721, mergeFactor=20, maxMergeSize=2147483648, maxMergeSizeForForcedMerge=9223372036854775807, calibrateSizeByDeletes=true, maxMergeDocs=2147483647, maxCFSSegmentSizeMB=8.796093022207999E12, noCFSRatio=0.47653993816636264]
   [junit4]   2> 310664 INFO  (coreLoadExecutor-860-thread-1-processing-n:127.0.0.1:42677_) [n:127.0.0.1:42677_ c:collection1   x:collection1] o.a.s.s.SolrIndexSearcher Opening [Searcher@5db51ef3[collection1] main]
   [junit4]   2> 310665 INFO  (coreLoadExecutor-860-thread-1-processing-n:127.0.0.1:42677_) [n:127.0.0.1:42677_ c:collection1   x:collection1] o.a.s.r.ManagedResourceStorage Configured ZooKeeperStorageIO with znodeBase: /configs/conf1
   [junit4]   2> 310666 INFO  (coreLoadExecutor-860-thread-1-processing-n:127.0.0.1:42677_) [n:127.0.0.1:42677_ c:collection1   x:collection1] o.a.s.r.ManagedResourceStorage Loaded null at path _rest_managed.json using ZooKeeperStorageIO:path=/configs/conf1
   [junit4]   2> 310666 INFO  (coreLoadExecutor-860-thread-1-processing-n:127.0.0.1:42677_) [n:127.0.0.1:42677_ c:collection1   x:collection1] o.a.s.h.ReplicationHandler Commits will be reserved for  10000
   [junit4]   2> 310667 INFO  (searcherExecutor-861-thread-1-processing-n:127.0.0.1:42677_ x:collection1 c:collection1) [n:127.0.0.1:42677_ c:collection1   x:collection1] o.a.s.c.SolrCore [collection1] Registered new searcher Searcher@5db51ef3[collection1] main{ExitableDirectoryReader(UninvertingDirectoryReader())}
   [junit4]   2> 310669 INFO  (coreLoadExecutor-860-thread-1-processing-n:127.0.0.1:42677_) [n:127.0.0.1:42677_ c:collection1   x:collection1] o.a.s.u.UpdateLog Could not find max version in index or recent updates, using new clock 1562418354429362176
   [junit4]   2> 310682 INFO  (coreZkRegister-855-thread-1-processing-n:127.0.0.1:42677_ x:collection1 c:collection1) [n:127.0.0.1:42677_ c:collection1 s:shard2 r:core_node3 x:collection1] o.a.s.c.ZkController Core needs to recover:collection1
   [junit4]   2> 310694 INFO  (updateExecutor-355-thread-1-processing-n:127.0.0.1:42677_ x:collection1 s:shard2 c:collection1 r:core_node3) [n:127.0.0.1:42677_ c:collection1 s:shard2 r:core_node3 x:collection1] o.a.s.u.DefaultSolrCoreState Running recovery
   [junit4]   2> 310697 INFO  (recoveryExecutor-356-thread-1-processing-n:127.0.0.1:42677_ x:collection1 s:shard2 c:collection1 r:core_node3) [n:127.0.0.1:42677_ c:collection1 s:shard2 r:core_node3 x:collection1] o.a.s.c.RecoveryStrategy Starting recovery process. recoveringAfterStartup=true
   [junit4]   2> 310697 INFO  (recoveryExecutor-356-thread-1-processing-n:127.0.0.1:42677_ x:collection1 s:shard2 c:collection1 r:core_node3) [n:127.0.0.1:42677_ c:collection1 s:shard2 r:core_node3 x:collection1] o.a.s.c.RecoveryStrategy ###### startupVersions=[[]]
   [junit4]   2> 310697 INFO  (recoveryExecutor-356-thread-1-processing-n:127.0.0.1:42677_ x:collection1 s:shard2 c:collection1 r:core_node3) [n:127.0.0.1:42677_ c:collection1 s:shard2 r:core_node3 x:collection1] o.a.s.c.RecoveryStrategy Begin buffering updates. core=[collection1]
   [junit4]   2> 310697 INFO  (recoveryExecutor-356-thread-1-processing-n:127.0.0.1:42677_ x:collection1 s:shard2 c:collection1 r:core_node3) [n:127.0.0.1:42677_ c:collection1 s:shard2 r:core_node3 x:collection1] o.a.s.u.UpdateLog Starting to buffer updates. FSUpdateLog{state=ACTIVE, tlog=null}
   [junit4]   2> 310697 INFO  (recoveryExecutor-356-thread-1-processing-n:127.0.0.1:42677_ x:collection1 s:shard2 c:collection1 r:core_node3) [n:127.0.0.1:42677_ c:collection1 s:shard2 r:core_node3 x:collection1] o.a.s.c.RecoveryStrategy Publishing state of core [collection1] as recovering, leader is [https://127.0.0.1:55822/collection1/] and I am [https://127.0.0.1:42677/collection1/]
   [junit4]   2> 310711 INFO  (recoveryExecutor-356-thread-1-processing-n:127.0.0.1:42677_ x:collection1 s:shard2 c:collection1 r:core_node3) [n:127.0.0.1:42677_ c:collection1 s:shard2 r:core_node3 x:collection1] o.a.s.c.RecoveryStrategy Sending prep recovery command to [https://127.0.0.1:55822]; [WaitForState: action=PREPRECOVERY&core=collection1&nodeName=127.0.0.1:42677_&coreNodeName=core_node3&state=recovering&checkLive=true&onlyIfLeader=true&onlyIfLeaderActive=true]
   [junit4]   2> 310800 INFO  (zkCallback-358-thread-1-processing-n:127.0.0.1:42677_) [n:127.0.0.1:42677_    ] o.a.s.c.c.ZkStateReader A cluster state change: [WatchedEvent state:SyncConnected type:NodeDataChanged path:/collections/collection1/state.json] for collection [collection1] has occurred - updating... (live nodes size: [4])
   [junit4]   2> 310800 INFO  (zkCallback-346-thread-2-processing-n:127.0.0.1:55822_) [n:127.0.0.1:55822_    ] o.a.s.c.c.ZkStateReader A cluster state change: [WatchedEvent state:SyncConnected type:NodeDataChanged path:/collections/collection1/state.json] for collection [collection1] has occurred - updating... (live nodes size: [4])
   [junit4]   2> 310800 INFO  (zkCallback-352-thread-2-processing-n:127.0.0.1:37953_) [n:127.0.0.1:37953_    ] o.a.s.c.c.ZkStateReader A cluster state change: [WatchedEvent state:SyncConnected type:NodeDataChanged path:/collections/collection1/state.json] for collection [collection1] has occurred - updating... (live nodes size: [4])
   [junit4]   2> 310803 INFO  (qtp1158561338-4224) [n:127.0.0.1:55822_    ] o.a.s.h.a.PrepRecoveryOp Going to wait for coreNodeName: core_node3, state: recovering, checkLive: true, onlyIfLeader: true, onlyIfLeaderActive: true
   [junit4]   2> 310804 INFO  (qtp1158561338-4224) [n:127.0.0.1:55822_    ] o.a.s.h.a.PrepRecoveryOp Will wait a max of 183 seconds to see collection1 (shard2 of collection1) have state: recovering
   [junit4]   2> 310804 INFO  (qtp1158561338-4224) [n:127.0.0.1:55822_    ] o.a.s.h.a.PrepRecoveryOp In WaitForState(recovering): collection=collection1, shard=shard2, thisCore=collection1, leaderDoesNotNeedRecovery=false, isLeader? true, live=true, checkLive=true, currentState=recovering, localState=active, nodeName=127.0.0.1:42677_, coreNodeName=core_node3, onlyIfActiveCheckResult=false, nodeProps: core_node3:{"core":"collection1","base_url":"https://127.0.0.1:42677","node_name":"127.0.0.1:42677_","state":"recovering"}
   [junit4]   2> 310804 INFO  (qtp1158561338-4224) [n:127.0.0.1:55822_    ] o.a.s.h.a.PrepRecoveryOp Waited coreNodeName: core_node3, state: recovering, checkLive: true, onlyIfLeader: true for: 0 seconds.
   [junit4]   2> 310804 INFO  (qtp1158561338-4224) [n:127.0.0.1:55822_    ] o.a.s.s.HttpSolrCall [admin] webapp=null path=/admin/cores params={nodeName=127.0.0.1:42677_&onlyIfLeaderActive=true&core=collection1&coreNodeName=core_node3&action=PREPRECOVERY&checkLive=true&state=recovering&onlyIfLeader=true&wt=javabin&version=2} status=0 QTime=1
   [junit4]   2> 311244 INFO  (TEST-TestDynamicLoading.testDynamicLoading-seed#[70D4E1C3114B1529]) [    ] o.a.s.SolrTestCaseJ4 Writing core.properties file to /x1/jenkins/jenkins-slave/workspace/Lucene-Solr-Tests-6.x/solr/build/solr-core/test/J1/temp/solr.core.TestDynamicLoading_70D4E1C3114B1529-001/shard-4-001/cores/collection1
   [junit4]   2> 311245 INFO  (TEST-TestDynamicLoading.testDynamicLoading-seed#[70D4E1C3114B1529]) [    ] o.a.s.c.AbstractFullDistribZkTestBase create jetty 4 in directory /x1/jenkins/jenkins-slave/workspace/Lucene-Solr-Tests-6.x/solr/build/solr-core/test/J1/temp/solr.core.TestDynamicLoading_70D4E1C3114B1529-001/shard-4-001
   [junit4]   2> 311246 INFO  (TEST-TestDynamicLoading.testDynamicLoading-seed#[70D4E1C3114B1529]) [    ] o.e.j.s.Server jetty-9.3.14.v20161028
   [junit4]   2> 311305 INFO  (recoveryExecutor-356-thread-1-processing-n:127.0.0.1:42677_ x:collection1 s:shard2 c:collection1 r:core_node3) [n:127.0.0.1:42677_ c:collection1 s:shard2 r:core_node3 x:collection1] o.a.s.c.RecoveryStrategy Attempting to PeerSync from [https://127.0.0.1:55822/collection1/] - recoveringAfterStartup=[true]
   [junit4]   2> 311305 INFO  (recoveryExecutor-356-thread-1-processing-n:127.0.0.1:42677_ x:collection1 s:shard2 c:collection1 r:core_node3) [n:127.0.0.1:42677_ c:collection1 s:shard2 r:core_node3 x:collection1] o.a.s.u.PeerSync PeerSync: core=collection1 url=https://127.0.0.1:42677 START replicas=[https://127.0.0.1:55822/collection1/] nUpdates=100
   [junit4]   2> 311326 INFO  (TEST-TestDynamicLoading.testDynamicLoading-seed#[70D4E1C3114B1529]) [    ] o.e.j.s.h.ContextHandler Started o.e.j.s.ServletContextHandler@45b41ffd{/,null,AVAILABLE}
   [junit4]   2> 311327 INFO  (TEST-TestDynamicLoading.testDynamicLoading-seed#[70D4E1C3114B1529]) [    ] o.e.j.s.AbstractConnector Started ServerConnector@70b2e6f8{SSL,[ssl, http/1.1]}{127.0.0.1:44448}
   [junit4]   2> 311327 INFO  (TEST-TestDynamicLoading.testDynamicLoading-seed#[70D4E1C3114B1529]) [    ] o.e.j.s.Server Started @314754ms
   [junit4]   2> 311327 INFO  (TEST-TestDynamicLoading.testDynamicLoading-seed#[70D4E1C3114B1529]) [    ] o.a.s.c.s.e.JettySolrRunner Jetty properties: {solr.data.dir=/x1/jenkins/jenkins-slave/workspace/Lucene-Solr-Tests-6.x/solr/build/solr-core/test/J1/temp/solr.core.TestDynamicLoading_70D4E1C3114B1529-001/tempDir-001/jetty4, solrconfig=solrconfig.xml, hostContext=/, hostPort=44448, coreRootDirectory=/x1/jenkins/jenkins-slave/workspace/Lucene-Solr-Tests-6.x/solr/build/solr-core/test/J1/../../../../../../../../../../x1/jenkins/jenkins-slave/workspace/Lucene-Solr-Tests-6.x/solr/build/solr-core/test/J1/temp/solr.core.TestDynamicLoading_70D4E1C3114B1529-001/shard-4-001/cores}
   [junit4]   2> 311327 ERROR (TEST-TestDynamicLoading.testDynamicLoading-seed#[70D4E1C3114B1529]) [    ] o.a.s.s.StartupLoggingUtils Missing Java Option solr.log.dir. Logging may be missing or incomplete.
   [junit4]   2> 311338 INFO  (TEST-TestDynamicLoading.testDynamicLoading-seed#[70D4E1C3114B1529]) [    ] o.a.s.s.SolrDispatchFilter  ___      _       Welcome to Apache Solr™ version 6.6.0
   [junit4]   2> 311338 INFO  (TEST-TestDynamicLoading.testDynamicLoading-seed#[70D4E1C3114B1529]) [    ] o.a.s.s.SolrDispatchFilter / __| ___| |_ _   Starting in cloud mode on port null
   [junit4]   2> 311338 INFO  (TEST-TestDynamicLoading.testDynamicLoading-seed#[70D4E1C3114B1529]) [    ] o.a.s.s.SolrDispatchFilter \__ \/ _ \ | '_|  Install dir: null
   [junit4]   2> 311338 INFO  (TEST-TestDynamicLoading.testDynamicLoading-seed#[70D4E1C3114B1529]) [    ] o.a.s.s.SolrDispatchFilter |___/\___/_|_|    Start time: 2017-03-20T19:30:56.770Z
   [junit4]   2> 311499 INFO  (TEST-TestDynamicLoading.testDynamicLoading-seed#[70D4E1C3114B1529]) [    ] o.a.s.s.SolrDispatchFilter Loading solr.xml from SolrHome (not found in ZooKeeper)
   [junit4]   2> 311499 INFO  (TEST-TestDynamicLoading.testDynamicLoading-seed#[70D4E1C3114B1529]) [    ] o.a.s.c.SolrXmlConfig Loading container configuration from /x1/jenkins/jenkins-slave/workspace/Lucene-Solr-Tests-6.x/solr/build/solr-core/test/J1/temp/solr.core.TestDynamicLoading_70D4E1C3114B1529-001/shard-4-001/solr.xml
   [junit4]   2> 311501 INFO  (qtp1158561338-4222) [n:127.0.0.1:55822_ c:collection1 s:shard2 r:core_node1 x:collection1] o.a.s.u.IndexFingerprint IndexFingerprint millis:1.0 result:{maxVersionSpecified=9223372036854775807, maxVersionEncountered=0, maxInHash=0, versionsHash=0, numVersions=0, numDocs=0, maxDoc=0}
   [junit4]   2> 311501 INFO  (qtp1158561338-4222) [n:127.0.0.1:55822_ c:collection1 s:shard2 r:core_node1 x:collection1] o.a.s.c.S.Request [collection1]  webapp= path=/get params={distrib=false&qt=/get&getFingerprint=9223372036854775807&wt=javabin&version=2} status=0 QTime=2
   [junit4]   2> 311517 INFO  (TEST-TestDynamicLoading.testDynamicLoading-seed#[70D4E1C3114B1529]) [    ] o.a.s.u.UpdateShardHandler Creating UpdateShardHandler HTTP client with params: socketTimeout=340000&connTimeout=45000&retry=true
   [junit4]   2> 311520 INFO  (TEST-TestDynamicLoading.testDynamicLoading-seed#[70D4E1C3114B1529]) [    ] o.a.s.c.ZkContainer Zookeeper client=127.0.0.1:35126/solr
   [junit4]   2> 311538 INFO  (recoveryExecutor-356-thread-1-processing-n:127.0.0.1:42677_ x:collection1 s:shard2 c:collection1 r:core_node3) [n:127.0.0.1:42677_ c:collection1 s:shard2 r:core_node3 x:collection1] o.a.s.u.IndexFingerprint IndexFingerprint millis:21.0 result:{maxVersionSpecified=9223372036854775807, maxVersionEncountered=0, maxInHash=0, versionsHash=0, numVersions=0, numDocs=0, maxDoc=0}
   [junit4]   2> 311539 INFO  (recoveryExecutor-356-thread-1-processing-n:127.0.0.1:42677_ x:collection1 s:shard2 c:collection1 r:core_node3) [n:127.0.0.1:42677_ c:collection1 s:shard2 r:core_node3 x:collection1] o.a.s.u.PeerSync We are already in sync. No need to do a PeerSync
   [junit4]   2> 311539 INFO  (recoveryExecutor-356-thread-1-processing-n:127.0.0.1:42677_ x:collection1 s:shard2 c:collection1 r:core_node3) [n:127.0.0.1:42677_ c:collection1 s:shard2 r:core_node3 x:collection1] o.a.s.u.DirectUpdateHandler2 start commit{,optimize=false,openSearcher=true,waitSearcher=true,expungeDeletes=false,softCommit=false,prepareCommit=false}
   [junit4]   2> 311539 INFO  (recoveryExecutor-356-thread-1-processing-n:127.0.0.1:42677_ x:collection1 s:shard2 c:collection1 r:core_node3) [n:127.0.0.1:42677_ c:collection1 s:shard2 r:core_node3 x:collection1] o.a.s.u.DirectUpdateHandler2 No uncommitted changes. Skipping IW.commit.
   [junit4]   2> 311540 INFO  (recoveryExecutor-356-thread-1-processing-n:127.0.0.1:42677_ x:collection1 s:shard2 c:collection1 r:core_node3) [n:127.0.0.1:42677_ c:collection1 s:shard2 r:core_node3 x:collection1] o.a.s.u.DirectUpdateHandler2 end_commit_flush
   [junit4]   2> 311546 INFO  (recoveryExecutor-356-thread-1-processing-n:127.0.0.1:42677_ x:collection1 s:shard2 c:collection1 r:core_node3) [n:127.0.0.1:42677_ c:collection1 s:shard2 r:core_node3 x:collection1] o.a.s.c.RecoveryStrategy PeerSync stage of recovery was successful.
   [junit4]   2> 311546 INFO  (recoveryExecutor-356-thread-1-processing-n:127.0.0.1:42677_ x:collection1 s:shard2 c:collection1 r:core_node3) [n:127.0.0.1:42677_ c:collection1 s:shard2 r:core_node3 x:collection1] o.a.s.c.RecoveryStrategy Replaying updates buffered during PeerSync.
   [junit4]   2> 311546 INFO  (recoveryExecutor-356-thread-1-processing-n:127.0.0.1:42677_ x:collection1 s:shard2 c:collection1 r:core_node3) [n:127.0.0.1:42677_ c:collection1 s:shard2 r:core_node3 x:collection1] o.a.s.c.RecoveryStrategy No replay needed.
   [junit4]   2> 311546 INFO  (recoveryExecutor-356-thread-1-processing-n:127.0.0.1:42677_ x:collection1 s:shard2 c:collection1 r:core_node3) [n:127.0.0.1:42677_ c:collection1 s:shard2 r:core_node3 x:collection1] o.a.s.c.RecoveryStrategy Registering as Active after recovery.
   [junit4]   2> 311552 INFO  (TEST-TestDynamicLoading.testDynamicLoading-seed#[70D4E1C3114B1529]) [n:127.0.0.1:44448_    ] o.a.s.c.c.ZkStateReader Updated live nodes from ZooKeeper... (0) -> (4)
   [junit4]   2> 311553 INFO  (TEST-TestDynamicLoading.testDynamicLoading-seed#[70D4E1C3114B1529]) [n:127.0.0.1:44448_    ] o.a.s.c.Overseer Overseer (id=null) closing
   [junit4]   2> 311555 INFO  (zkCallback-346-thread-2-processing-n:127.0.0.1:55822_) [n:127.0.0.1:55822_    ] o.a.s.c.c.ZkStateReader A cluster state change: [WatchedEvent state:SyncConnected type:NodeDataChanged path:/collections/collection1/state.json] for collection [collection1] has occurred - updating... (live nodes size: [4])
   [junit4]   2> 311555 INFO  (zkCallback-358-thread-1-processing-n:127.0.0.1:42677_) [n:127.0.0.1:42677_    ] o.a.s.c.c.ZkStateReader A cluster state change: [WatchedEvent state:SyncConnected type:NodeDataChanged path:/collections/collection1/state.json] for collection [collection1] has occurred - updating... (live nodes size: [4])
   [junit4]   2> 311555 INFO  (zkCallback-352-thread-2-processing-n:127.0.0.1:37953_) [n:127.0.0.1:37953_    ] o.a.s.c.c.ZkStateReader A cluster state change: [WatchedEvent state:SyncConnected type:NodeDataChanged path:/collections/collection1/state.json] for collection [collection1] has occurred - updating... (live nodes size: [4])
   [junit4]   2> 311559 INFO  (TEST-TestDynamicLoading.testDynamicLoading-seed#[70D4E1C3114B1529]) [n:127.0.0.1:44448_    ] o.a.s.c.ZkController Register node as live in ZooKeeper:/live_nodes/127.0.0.1:44448_
   [junit4]   2> 311560 INFO  (zkCallback-340-thread-1) [    ] o.a.s.c.c.ZkStateReader Updated live nodes from ZooKeeper... (4) -> (5)
   [junit4]   2> 311560 INFO  (zkCallback-358-thread-1-processing-n:127.0.0.1:42677_) [n:127.0.0.1:42677_    ] o.a.s.c.c.ZkStateReader Updated live nodes from ZooKeeper... (4) -> (5)
   [junit4]   2> 311560 INFO  (zkCallback-352-thread-2-processing-n:127.0.0.1:37953_) [n:127.0.0.1:37953_    ] o.a.s.c.c.ZkStateReader Updated live nodes from ZooKeeper... (4) -> (5)
   [junit4]   2> 311560 INFO  (zkCallback-346-thread-2-processing-n:127.0.0.1:55822_) [n:127.0.0.1:55822_    ] o.a.s.c.c.ZkStateReader Updated live nodes from ZooKeeper... (4) -> (5)
   [junit4]   2> 311560 INFO  (zkCallback-336-thread-1-processing-n:127.0.0.1:43677_) [n:127.0.0.1:43677_    ] o.a.s.c.c.ZkStateReader Updated live nodes from ZooKeeper... (4) -> (5)
   [junit4]   2> 311578 INFO  (zkCallback-365-thread-3-processing-n:127.0.0.1:44448_) [n:127.0.0.1:44448_    ] o.a.s.c.c.ZkStateReader Updated live nodes from ZooKeeper... (4) -> (5)
   [junit4]   2> 311625 INFO  (TEST-TestDynamicLoading.testDynamicLoading-seed#[70D4E1C3114B1529]) [n:127.0.0.1:44448_    ] o.a.s.c.CorePropertiesLocator Found 1 core definitions underneath /x1/jenkins/jenkins-slave/workspace/Lucene-Solr-Tests-6.x/solr/build/solr-core/test/J1/../../../../../../../../../../x1/jenkins/jenkins-slave/workspace/Lucene-Solr-Tests-6.x/solr/build/solr-core/test/J1/temp/solr.core.TestDynamicLoading_70D4E1C3114B1529-001/shard-4-001/cores
   [junit4]   2> 311625 INFO  (TEST-TestDynamicLoading.testDynamicLoading-seed#[70D4E1C3114B1529]) [n:127.0.0.1:44448_    ] o.a.s.c.CorePropertiesLocator Cores are: [collection1]
   [junit4]   2> 311638 INFO  (OverseerStateUpdate-97651146367369221-127.0.0.1:43677_-n_0000000000) [n:127.0.0.1:43677_    ] o.a.s.c.o.ReplicaMutator Assigning new node to shard shard=shard1
   [junit4]   2> 311740 WARN  (OverseerStateUpdate-97651146367369221-127.0.0.1:43677_-n_0000000000) [n:127.0.0.1:43677_    ] o.a.s.c.Overseer Bad version writing to ZK using compare-and-set, will force refresh cluster state: KeeperErrorCode = BadVersion for /collections/collection1/state.json
   [junit4]   2> 311743 INFO  (zkCallback-346-thread-2-processing-n:127.0.0.1:55822_) [n:127.0.0.1:55822_    ] o.a.s.c.c.ZkStateReader A cluster state change: [WatchedEvent state:SyncConnected type:NodeDataChanged path:/collections/collection1/state.json] for collection [collection1] has occurred - updating... (live nodes size: [5])
   [junit4]   2> 311743 INFO  (zkCallback-365-thread-3-processing-n:127.0.0.1:44448_) [n:127.0.0.1:44448_    ] o.a.s.c.c.ZkStateReader A cluster state change: [WatchedEvent state:SyncConnected type:NodeDataChanged path:/collections/collection1/state.json] for collection [collection1] has occurred - updating... (live nodes size: [5])
   [junit4]   2> 311745 INFO  (zkCallback-352-thread-2-processing-n:127.0.0.1:37953_) [n:127.0.0.1:37953_    ] o.a.s.c.c.ZkStateReader A cluster state change: [WatchedEvent state:SyncConnected type:NodeDataChanged path:/collections/collection1/state.json] for collection [collection1] has occurred - updating... (live nodes size: [5])
   [junit4]   2> 311745 INFO  (zkCallback-358-thread-1-processing-n:127.0.0.1:42677_) [n:127.0.0.1:42677_    ] o.a.s.c.c.ZkStateReader A cluster state change: [WatchedEvent state:SyncConnected type:NodeDataChanged path:/collections/collection1/state.json] for collection [collection1] has occurred - updating... (live nodes size: [5])
   [junit4]   2> 311746 INFO  (OverseerStateUpdate-97651146367369221-127.0.0.1:43677_-n_0000000000) [n:127.0.0.1:43677_    ] o.a.s.c.o.ReplicaMutator Assigning new node to shard shard=shard1
   [junit4]   2> 311746 INFO  (zkCallback-358-thread-1-processing-n:127.0.0.1:42677_) [n:127.0.0.1:42677_    ] o.a.s.c.c.ZkStateReader A cluster state change: [WatchedEvent state:SyncConnected type:NodeDataChanged path:/collections/collection1/state.json] for collection [collection1] has occurred - updating... (live nodes size: [5])
   [junit4]   2> 311746 INFO  (zkCallback-365-thread-3-processing-n:127.0.0.1:44448_) [n:127.0.0.1:44448_    ] o.a.s.c.c.ZkStateReader A cluster state change: [WatchedEvent state:SyncConnected type:NodeDataChanged path:/collections/collection1/state.json] for collection [collection1] has occurred - updating... (live nodes size: [5])
   [junit4]   2> 311747 INFO  (zkCallback-346-thread-2-processing-n:127.0.0.1:55822_) [n:127.0.0.1:55822_    ] o.a.s.c.c.ZkStateReader A cluster state change: [WatchedEvent state:SyncConnected type:NodeDataChanged path:/collections/collection1/state.json] for collection [collection1] has occurred - updating... (live nodes size: [5])
   [junit4]   2> 311747 INFO  (zkCallback-352-thread-2-processing-n:127.0.0.1:37953_) [n:127.0.0.1:37953_    ] o.a.s.c.c.ZkStateReader A cluster state change: [WatchedEvent state:SyncConnected type:NodeDataChanged path:/collections/collection1/state.json] for collection [collection1] has occurred - updating... (live nodes size: [5])
   [junit4]   2> 312698 WARN  (coreLoadExecutor-871-thread-1-processing-n:127.0.0.1:44448_) [n:127.0.0.1:44448_ c:collection1   x:collection1] o.a.s.c.Config Beginning with Solr 5.5, <mergePolicy> is deprecated, use <mergePolicyFactory> instead.
   [junit4]   2> 312699 INFO  (coreLoadExecutor-871-thread-1-processing-n:127.0.0.1:44448_) [n:127.0.0.1:44448_ c:collection1   x:collection1] o.a.s.c.SolrConfig Using Lucene MatchVersion: 6.6.0
   [junit4]   2> 312710 INFO  (coreLoadExecutor-871-thread-1-

[...truncated too long message...]

ynamicLoading-seed#[70D4E1C3114B1529]) [    ] o.a.s.c.Overseer Overseer (id=97651146367369232-127.0.0.1:42677_-n_0000000003) closing
   [junit4]   2> 364573 INFO  (OverseerStateUpdate-97651146367369232-127.0.0.1:42677_-n_0000000003) [n:127.0.0.1:42677_    ] o.a.s.c.Overseer Overseer Loop exiting : 127.0.0.1:42677_
   [junit4]   2> 364578 INFO  (zkCallback-365-thread-3-processing-n:127.0.0.1:44448_) [n:127.0.0.1:44448_    ] o.a.s.c.OverseerElectionContext I am going to be the leader 127.0.0.1:44448_
   [junit4]   2> 364578 INFO  (TEST-TestDynamicLoading.testDynamicLoading-seed#[70D4E1C3114B1529]) [    ] o.a.s.m.SolrMetricManager Closing metric reporters for: solr.node
   [junit4]   2> 364578 INFO  (zkCallback-365-thread-1-processing-n:127.0.0.1:44448_) [n:127.0.0.1:44448_    ] o.a.s.c.c.ZkStateReader Updated live nodes from ZooKeeper... (2) -> (1)
   [junit4]   2> 364579 INFO  (zkCallback-365-thread-3-processing-n:127.0.0.1:44448_) [n:127.0.0.1:44448_    ] o.a.s.c.Overseer Overseer (id=97651146367369235-127.0.0.1:44448_-n_0000000004) starting
   [junit4]   2> 364579 INFO  (TEST-TestDynamicLoading.testDynamicLoading-seed#[70D4E1C3114B1529]) [    ] o.e.j.s.AbstractConnector Stopped ServerConnector@695837c8{SSL,[ssl, http/1.1]}{127.0.0.1:0}
   [junit4]   2> 364579 INFO  (TEST-TestDynamicLoading.testDynamicLoading-seed#[70D4E1C3114B1529]) [    ] o.e.j.s.h.ContextHandler Stopped o.e.j.s.ServletContextHandler@2da05e43{/,null,UNAVAILABLE}
   [junit4]   2> 364582 INFO  (TEST-TestDynamicLoading.testDynamicLoading-seed#[70D4E1C3114B1529]) [    ] o.a.s.c.ChaosMonkey monkey: stop shard! 44448
   [junit4]   2> 364582 INFO  (TEST-TestDynamicLoading.testDynamicLoading-seed#[70D4E1C3114B1529]) [    ] o.a.s.c.CoreContainer Shutting down CoreContainer instance=1822131865
   [junit4]   2> 364590 INFO  (TEST-TestDynamicLoading.testDynamicLoading-seed#[70D4E1C3114B1529]) [    ] o.a.s.c.Overseer Overseer (id=97651146367369235-127.0.0.1:44448_-n_0000000004) closing
   [junit4]   2> 364590 INFO  (OverseerStateUpdate-97651146367369235-127.0.0.1:44448_-n_0000000004) [n:127.0.0.1:44448_    ] o.a.s.c.Overseer Overseer Loop exiting : 127.0.0.1:44448_
   [junit4]   2> 364591 ERROR (OverseerCollectionConfigSetProcessor-97651146367369235-127.0.0.1:44448_-n_0000000004) [n:127.0.0.1:44448_    ] o.a.s.c.OverseerTaskProcessor Unable to prioritize overseer
   [junit4]   2> java.lang.InterruptedException
   [junit4]   2> at java.lang.Object.wait(Native Method)
   [junit4]   2> at java.lang.Object.wait(Object.java:502)
   [junit4]   2> at org.apache.zookeeper.ClientCnxn.submitRequest(ClientCnxn.java:1342)
   [junit4]   2> at org.apache.zookeeper.ZooKeeper.exists(ZooKeeper.java:1040)
   [junit4]   2> at org.apache.solr.common.cloud.SolrZkClient$5.execute(SolrZkClient.java:322)
   [junit4]   2> at org.apache.solr.common.cloud.SolrZkClient$5.execute(SolrZkClient.java:319)
   [junit4]   2> at org.apache.solr.common.cloud.ZkCmdExecutor.retryOperation(ZkCmdExecutor.java:60)
   [junit4]   2> at org.apache.solr.common.cloud.SolrZkClient.exists(SolrZkClient.java:319)
   [junit4]   2> at org.apache.solr.cloud.OverseerNodePrioritizer.prioritizeOverseerNodes(OverseerNodePrioritizer.java:60)
   [junit4]   2> at org.apache.solr.cloud.OverseerTaskProcessor.run(OverseerTaskProcessor.java:177)
   [junit4]   2> at java.lang.Thread.run(Thread.java:745)
   [junit4]   2> 364601 WARN  (NIOServerCxn.Factory:0.0.0.0/0.0.0.0:0) [    ] o.a.z.s.NIOServerCnxn caught end of stream exception
   [junit4]   2> EndOfStreamException: Unable to read additional data from client sessionid 0x15aed3343230013, likely client has closed socket
   [junit4]   2> at org.apache.zookeeper.server.NIOServerCnxn.doIO(NIOServerCnxn.java:228)
   [junit4]   2> at org.apache.zookeeper.server.NIOServerCnxnFactory.run(NIOServerCnxnFactory.java:208)
   [junit4]   2> at java.lang.Thread.run(Thread.java:745)
   [junit4]   2> 365534 WARN  (zkCallback-365-thread-2-processing-n:127.0.0.1:44448_) [n:127.0.0.1:44448_ c:collection1 s:shard1 r:core_node4 x:collection1] o.a.s.c.SyncStrategy Closed, skipping sync up.
   [junit4]   2> 365534 INFO  (zkCallback-365-thread-2-processing-n:127.0.0.1:44448_) [n:127.0.0.1:44448_ c:collection1 s:shard1 r:core_node4 x:collection1] o.a.s.c.ShardLeaderElectionContext We failed sync, but we have no versions - we can't sync in that case - we were active before, so become leader anyway
   [junit4]   2> 365534 INFO  (zkCallback-365-thread-2-processing-n:127.0.0.1:44448_) [n:127.0.0.1:44448_ c:collection1 s:shard1 r:core_node4 x:collection1] o.a.s.c.SolrCore [collection1]  CLOSING SolrCore org.apache.solr.core.SolrCore@60dfad6c
   [junit4]   2> 365554 INFO  (zkCallback-365-thread-2-processing-n:127.0.0.1:44448_) [n:127.0.0.1:44448_ c:collection1 s:shard1 r:core_node4 x:collection1] o.a.s.m.SolrMetricManager Closing metric reporters for: solr.core.collection1
   [junit4]   2> 366101 WARN  (zkCallback-365-thread-3-processing-n:127.0.0.1:44448_) [n:127.0.0.1:44448_    ] o.a.s.c.c.ZkStateReader ZooKeeper watch triggered, but Solr cannot talk to ZK: [KeeperErrorCode = Session expired for /live_nodes]
   [junit4]   2> 366101 INFO  (TEST-TestDynamicLoading.testDynamicLoading-seed#[70D4E1C3114B1529]) [    ] o.a.s.m.SolrMetricManager Closing metric reporters for: solr.node
   [junit4]   2> 366113 INFO  (TEST-TestDynamicLoading.testDynamicLoading-seed#[70D4E1C3114B1529]) [    ] o.e.j.s.AbstractConnector Stopped ServerConnector@70b2e6f8{SSL,[ssl, http/1.1]}{127.0.0.1:0}
   [junit4]   2> 366114 INFO  (TEST-TestDynamicLoading.testDynamicLoading-seed#[70D4E1C3114B1529]) [    ] o.e.j.s.h.ContextHandler Stopped o.e.j.s.ServletContextHandler@45b41ffd{/,null,UNAVAILABLE}
   [junit4]   2> 366121 INFO  (TEST-TestDynamicLoading.testDynamicLoading-seed#[70D4E1C3114B1529]) [    ] o.a.s.c.ZkTestServer connecting to 127.0.0.1:35126 35126
   [junit4]   2> 366222 INFO  (Thread-2770) [    ] o.a.s.c.ZkTestServer connecting to 127.0.0.1:35126 35126
   [junit4]   2> 366223 WARN  (Thread-2770) [    ] o.a.s.c.ZkTestServer Watch limit violations:
   [junit4]   2> Maximum concurrent create/delete watches above limit:
   [junit4]   2>
   [junit4]   2> 40 /solr/configs/conf1
   [junit4]   2> 6 /solr/aliases.json
   [junit4]   2> 5 /solr/security.json
   [junit4]   2> 2 /solr/configs/.system
   [junit4]   2> 2 /solr/configs/.system/managed-schema
   [junit4]   2>
   [junit4]   2> Maximum concurrent data watches above limit:
   [junit4]   2>
   [junit4]   2> 6 /solr/clusterstate.json
   [junit4]   2> 6 /solr/clusterprops.json
   [junit4]   2> 4 /solr/collections/collection1/state.json
   [junit4]   2> 2 /solr/collections/.system/state.json
   [junit4]   2>
   [junit4]   2> Maximum concurrent children watches above limit:
   [junit4]   2>
   [junit4]   2> 60 /solr/overseer/collection-queue-work
   [junit4]   2> 37 /solr/overseer/queue
   [junit4]   2> 13 /solr/overseer/queue-work
   [junit4]   2> 6 /solr/live_nodes
   [junit4]   2> 6 /solr/collections
   [junit4]   2>
   [junit4]   2> NOTE: reproduce with: ant test  -Dtestcase=TestDynamicLoading -Dtests.method=testDynamicLoading -Dtests.seed=70D4E1C3114B1529 -Dtests.multiplier=2 -Dtests.slow=true -Dtests.locale=ga-IE -Dtests.timezone=ART -Dtests.asserts=true -Dtests.file.encoding=UTF-8
   [junit4] FAILURE 67.6s J1 | TestDynamicLoading.testDynamicLoading <<<
   [junit4]    > Throwable #1: java.lang.AssertionError: Could not get expected value  'X val changed' for path 'x' full output: {
   [junit4]    >   "responseHeader":{
   [junit4]    >     "status":0,
   [junit4]    >     "QTime":0},
   [junit4]    >   "params":{"wt":"json"},
   [junit4]    >   "context":{
   [junit4]    >     "webapp":"",
   [junit4]    >     "path":"/test1",
   [junit4]    >     "httpMethod":"GET"},
   [junit4]    >   "class":"org.apache.solr.core.BlobStoreTestRequestHandler",
   [junit4]    >   "x":"X val"},  from server:  null
   [junit4]    > at __randomizedtesting.SeedInfo.seed([70D4E1C3114B1529:A899CC94E696B089]:0)
   [junit4]    > at org.apache.solr.core.TestSolrConfigHandler.testForResponseElement(TestSolrConfigHandler.java:556)
   [junit4]    > at org.apache.solr.core.TestDynamicLoading.testDynamicLoading(TestDynamicLoading.java:249)
   [junit4]    > at org.apache.solr.BaseDistributedSearchTestCase$ShardsRepeatRule$ShardsFixedStatement.callStatement(BaseDistributedSearchTestCase.java:992)
   [junit4]    > at org.apache.solr.BaseDistributedSearchTestCase$ShardsRepeatRule$ShardsStatement.evaluate(BaseDistributedSearchTestCase.java:967)
   [junit4]    > at java.lang.Thread.run(Thread.java:745)
   [junit4]   2> 366230 INFO  (SUITE-TestDynamicLoading-seed#[70D4E1C3114B1529]-worker) [    ] o.a.s.SolrTestCaseJ4 ###deleteCore
   [junit4]   2> NOTE: leaving temporary files on disk at: /x1/jenkins/jenkins-slave/workspace/Lucene-Solr-Tests-6.x/solr/build/solr-core/test/J1/temp/solr.core.TestDynamicLoading_70D4E1C3114B1529-001
   [junit4]   2> Mar 20, 2017 7:31:51 PM com.carrotsearch.randomizedtesting.ThreadLeakControl checkThreadLeaks
   [junit4]   2> WARNING: Will linger awaiting termination of 1 leaked thread(s).
   [junit4]   2> NOTE: test params are: codec=Lucene62, sim=RandomSimilarity(queryNorm=true,coord=yes): {}, locale=ga-IE, timezone=ART
   [junit4]   2> NOTE: Linux 3.13.0-85-generic amd64/Oracle Corporation 1.8.0_121 (64-bit)/cpus=4,threads=1,free=202056920,total=517472256
   [junit4]   2> NOTE: All tests run in this JVM: [SuggesterFSTTest, ClusterStateUpdateTest, DateRangeFieldTest, HighlighterTest, MoreLikeThisHandlerTest, CSVRequestHandlerTest, TestStressUserVersions, SolrGraphiteReporterTest, TestPartialUpdateDeduplication, SpellCheckCollatorTest, DocValuesTest, TestCloudSchemaless, UtilsToolTest, TestWordDelimiterFilterFactory, TestMiniSolrCloudClusterSSL, SolrCLIZkUtilsTest, TestRecoveryHdfs, BitVectorTest, TestDynamicLoading]
   [junit4] Completed [101/700 (1!)] on J1 in 68.13s, 1 test, 1 failure <<< FAILURES!

[...truncated 64606 lines...]




---------------------------------------------------------------------
To unsubscribe, e-mail: [hidden email]
For additional commands, e-mail: [hidden email]
Loading...